test packages.x86_64-linux.nix-ci-check-gammaloop-nextest-core

Reproduce this run
Original Run
  1. 0.83 s $ /nix/store/9ypz3flqsrl5xl495mm8h645gadjsxi1-coreutils-9.11/bin/timeout --kill-after=15s 7200s /nix/store/23zk8sgzamrbmj1fday15szf7f2279s8-nix-2.34.7/bin/nix --extra-experimental-features nix-command --extra-experimental-features flakes flake clone git+https://github.com/alphal00p/gammaloop --dest /tmp/nix-ci-worker/stable-pwd/repo/
  2. 0.91 s Cloning into '/tmp/nix-ci-worker/stable-pwd/repo'...
  3. 1.30 s remote: Enumerating objects: 65060, done.
  4. 1.41 s remote: Counting objects: 0% (1/7711) remote: Counting objects: 1% (78/7711) remote: Counting objects: 2% (155/7711) remote: Counting objects: 3% (232/7711) remote: Counting objects: 4% (309/7711) remote: Counting objects: 5% (386/7711) remote: Counting objects: 6% (463/7711) remote: Counting objects: 7% (540/7711) remote: Counting objects: 8% (617/7711) remote: Counting objects: 9% (694/7711) remote: Counting objects: 10% (772/7711) remote: Counting objects: 11% (849/7711) remote: Counting objects: 12% (926/7711) remote: Counting objects: 13% (1003/7711) remote: Counting objects: 14% (1080/7711) remote: Counting objects: 15% (1157/7711) remote: Counting objects: 16% (1234/7711) remote: Counting objects: 17% (1311/7711) remote: Counting objects: 18% (1388/7711) remote: Counting objects: 19% (1466/7711) remote: Counting objects: 20% (1543/7711) remote: Counting objects: 21% (1620/7711) remote: Counting objects: 22% (1697/7711) remote: Counting objects: 23% (1774/7711) remote: Counting objects: 24% (1851/7711) remote: Counting objects: 25% (1928/7711) remote: Counting objects: 26% (2005/7711) remote: Counting objects: 27% (2082/7711) remote: Counting objects: 28% (2160/7711) remote: Counting objects: 29% (2237/7711) remote: Counting objects: 30% (2314/7711) remote: Counting objects: 31% (2391/7711) remote: Counting objects: 32% (2468/7711) remote: Counting objects: 33% (2545/7711) remote: Counting objects: 34% (2622/7711) remote: Counting objects: 35% (2699/7711) remote: Counting objects: 36% (2776/7711) remote: Counting objects: 37% (2854/7711) remote: Counting objects: 38% (2931/7711) remote: Counting objects: 39% (3008/7711) remote: Counting objects: 40% (3085/7711) remote: Counting objects: 41% (3162/7711) remote: Counting objects: 42% (3239/7711) remote: Counting objects: 43% (3316/7711) remote: Counting objects: 44% (3393/7711) remote: Counting objects: 45% (3470/7711) remote: Counting objects: 46% (3548/7711) remote: Counting objects: 47% (3625/7711) remote: Counting objects: 48% (3702/7711) remote: Counting objects: 49% (3779/7711) remote: Counting objects: 50% (3856/7711) remote: Counting objects: 51% (3933/7711) remote: Counting objects: 52% (4010/7711) remote: Counting objects: 53% (4087/7711) remote: Counting objects: 54% (4164/7711) remote: Counting objects: 55% (4242/7711) remote: Counting objects: 56% (4319/7711) remote: Counting objects: 57% (4396/7711) remote: Counting objects: 58% (4473/7711) remote: Counting objects: 59% (4550/7711) remote: Counting objects: 60% (4627/7711) remote: Counting objects: 61% (4704/7711) remote: Counting objects: 62% (4781/7711) remote: Counting objects: 63% (4858/7711) remote: Counting objects: 64% (4936/7711) remote: Counting objects: 65% (5013/7711) remote: Counting objects: 66% (5090/7711) remote: Counting objects: 67% (5167/7711) remote: Counting objects: 68% (5244/7711) remote: Counting objects: 69% (5321/7711) remote: Counting objects: 70% (5398/7711) remote: Counting objects: 71% (5475/7711) remote: Counting objects: 72% (5552/7711) remote: Counting objects: 73% (5630/7711) remote: Counting objects: 74% (5707/7711) remote: Counting objects: 75% (5784/7711) remote: Counting objects: 76% (5861/7711) remote: Counting objects: 77% (5938/7711) remote: Counting objects: 78% (6015/7711) remote: Counting objects: 79% (6092/7711) remote: Counting objects: 80% (6169/7711) remote: Counting objects: 81% (6246/7711) remote: Counting objects: 82% (6324/7711) remote: Counting objects: 83% (6401/7711) remote: Counting objects: 84% (6478/7711) remote: Counting objects: 85% (6555/7711) remote: Counting objects: 86% (6632/7711) remote: Counting objects: 87% (6709/7711) remote: Counting objects: 88% (6786/7711) remote: Counting objects: 89% (6863/7711) remote: Counting objects: 90% (6940/7711) remote: Counting objects: 91% (7018/7711) remote: Counting objects: 92% (7095/7711) remote: Counting objects: 93% (7172/7711) remote: Counting objects: 94% (7249/7711) remote: Counting objects: 95% (7326/7711) remote: Counting objects: 96% (7403/7711) remote: Counting objects: 97% (7480/7711) remote: Counting objects: 98% (7557/7711) remote: Counting objects: 99% (7634/7711) remote: Counting objects: 100% (7711/7711) remote: Counting objects: 100% (7711/7711), done.
  5. 2.83 s remote: Compressing objects: 0% (1/1432) remote: Compressing objects: 1% (15/1432) remote: Compressing objects: 2% (29/1432) remote: Compressing objects: 3% (43/1432) remote: Compressing objects: 4% (58/1432) remote: Compressing objects: 5% (72/1432) remote: Compressing objects: 6% (86/1432) remote: Compressing objects: 7% (101/1432) remote: Compressing objects: 8% (115/1432) remote: Compressing objects: 9% (129/1432) remote: Compressing objects: 10% (144/1432) remote: Compressing objects: 11% (158/1432) remote: Compressing objects: 12% (172/1432) remote: Compressing objects: 12% (185/1432) remote: Compressing objects: 13% (187/1432) remote: Compressing objects: 14% (201/1432) remote: Compressing objects: 15% (215/1432) remote: Compressing objects: 16% (230/1432) remote: Compressing objects: 17% (244/1432) remote: Compressing objects: 18% (258/1432) remote: Compressing objects: 19% (273/1432) remote: Compressing objects: 20% (287/1432) remote: Compressing objects: 21% (301/1432) remote: Compressing objects: 22% (316/1432) remote: Compressing objects: 23% (330/1432) remote: Compressing objects: 24% (344/1432) remote: Compressing objects: 25% (358/1432) remote: Compressing objects: 26% (373/1432) remote: Compressing objects: 27% (387/1432) remote: Compressing objects: 28% (401/1432) remote: Compressing objects: 29% (416/1432) remote: Compressing objects: 30% (430/1432) remote: Compressing objects: 31% (444/1432) remote: Compressing objects: 32% (459/1432) remote: Compressing objects: 33% (473/1432) remote: Compressing objects: 34% (487/1432) remote: Compressing objects: 35% (502/1432) remote: Compressing objects: 36% (516/1432) remote: Compressing objects: 37% (530/1432) remote: Compressing objects: 38% (545/1432) remote: Compressing objects: 39% (559/1432) remote: Compressing objects: 40% (573/1432) remote: Compressing objects: 41% (588/1432) remote: Compressing objects: 42% (602/1432) remote: Compressing objects: 43% (616/1432) remote: Compressing objects: 44% (631/1432) remote: Compressing objects: 45% (645/1432) remote: Compressing objects: 46% (659/1432) remote: Compressing objects: 47% (674/1432) remote: Compressing objects: 48% (688/1432) remote: Compressing objects: 49% (702/1432) remote: Compressing objects: 50% (716/1432) remote: Compressing objects: 51% (731/1432) remote: Compressing objects: 52% (745/1432) remote: Compressing objects: 53% (759/1432) remote: Compressing objects: 54% (774/1432) remote: Compressing objects: 55% (788/1432) remote: Compressing objects: 56% (802/1432) remote: Compressing objects: 57% (817/1432) remote: Compressing objects: 58% (831/1432) remote: Compressing objects: 59% (845/1432) remote: Compressing objects: 60% (860/1432) remote: Compressing objects: 61% (874/1432) remote: Compressing objects: 62% (888/1432) remote: Compressing objects: 63% (903/1432) remote: Compressing objects: 64% (917/1432) remote: Compressing objects: 65% (931/1432) remote: Compressing objects: 66% (946/1432) remote: Compressing objects: 67% (960/1432) remote: Compressing objects: 68% (974/1432) remote: Compressing objects: 69% (989/1432) remote: Compressing objects: 70% (1003/1432) remote: Compressing objects: 71% (1017/1432) remote: Compressing objects: 72% (1032/1432) remote: Compressing objects: 73% (1046/1432) remote: Compressing objects: 74% (1060/1432) remote: Compressing objects: 75% (1074/1432) remote: Compressing objects: 76% (1089/1432) remote: Compressing objects: 77% (1103/1432) remote: Compressing objects: 78% (1117/1432) remote: Compressing objects: 79% (1132/1432) remote: Compressing objects: 80% (1146/1432) remote: Compressing objects: 81% (1160/1432) remote: Compressing objects: 82% (1175/1432) remote: Compressing objects: 83% (1189/1432) remote: Compressing objects: 84% (1203/1432) remote: Compressing objects: 85% (1218/1432) remote: Compressing objects: 86% (1232/1432) remote: Compressing objects: 87% (1246/1432) remote: Compressing objects: 88% (1261/1432) remote: Compressing objects: 89% (1275/1432) remote: Compressing objects: 90% (1289/1432) remote: Compressing objects: 91% (1304/1432) remote: Compressing objects: 92% (1318/1432) remote: Compressing objects: 93% (1332/1432) remote: Compressing objects: 94% (1347/1432) remote: Compressing objects: 95% (1361/1432) remote: Compressing objects: 96% (1375/1432) remote: Compressing objects: 97% (1390/1432) remote: Compressing objects: 98% (1404/1432) remote: Compressing objects: 99% (1418/1432) remote: Compressing objects: 100% (1432/1432) remote: Compressing objects: 100% (1432/1432), done.
  6. 5.40 s Receiving objects: 0% (1/65060) Receiving objects: 1% (651/65060) Receiving objects: 2% (1302/65060) Receiving objects: 3% (1952/65060) Receiving objects: 4% (2603/65060) Receiving objects: 5% (3253/65060) Receiving objects: 6% (3904/65060) Receiving objects: 7% (4555/65060) Receiving objects: 8% (5205/65060) Receiving objects: 9% (5856/65060) Receiving objects: 10% (6506/65060) Receiving objects: 11% (7157/65060) Receiving objects: 12% (7808/65060), 16.54 MiB | 33.05 MiB/s Receiving objects: 13% (8458/65060), 16.54 MiB | 33.05 MiB/s Receiving objects: 14% (9109/65060), 16.54 MiB | 33.05 MiB/s Receiving objects: 15% (9759/65060), 16.54 MiB | 33.05 MiB/s Receiving objects: 16% (10410/65060), 16.54 MiB | 33.05 MiB/s Receiving objects: 17% (11061/65060), 16.54 MiB | 33.05 MiB/s Receiving objects: 18% (11711/65060), 16.54 MiB | 33.05 MiB/s Receiving objects: 19% (12362/65060), 16.54 MiB | 33.05 MiB/s Receiving objects: 20% (13012/65060), 16.54 MiB | 33.05 MiB/s Receiving objects: 21% (13663/65060), 16.54 MiB | 33.05 MiB/s Receiving objects: 22% (14314/65060), 16.54 MiB | 33.05 MiB/s Receiving objects: 23% (14964/65060), 16.54 MiB | 33.05 MiB/s Receiving objects: 24% (15615/65060), 16.54 MiB | 33.05 MiB/s Receiving objects: 25% (16265/65060), 16.54 MiB | 33.05 MiB/s Receiving objects: 26% (16916/65060), 16.54 MiB | 33.05 MiB/s Receiving objects: 27% (17567/65060), 16.54 MiB | 33.05 MiB/s Receiving objects: 28% (18217/65060), 16.54 MiB | 33.05 MiB/s Receiving objects: 29% (18868/65060), 16.54 MiB | 33.05 MiB/s Receiving objects: 30% (19518/65060), 16.54 MiB | 33.05 MiB/s Receiving objects: 31% (20169/65060), 16.54 MiB | 33.05 MiB/s Receiving objects: 32% (20820/65060), 16.54 MiB | 33.05 MiB/s Receiving objects: 33% (21470/65060), 16.54 MiB | 33.05 MiB/s Receiving objects: 34% (22121/65060), 16.54 MiB | 33.05 MiB/s Receiving objects: 35% (22771/65060), 16.54 MiB | 33.05 MiB/s Receiving objects: 36% (23422/65060), 16.54 MiB | 33.05 MiB/s Receiving objects: 37% (24073/65060), 16.54 MiB | 33.05 MiB/s Receiving objects: 38% (24723/65060), 16.54 MiB | 33.05 MiB/s Receiving objects: 39% (25374/65060), 16.54 MiB | 33.05 MiB/s Receiving objects: 40% (26024/65060), 16.54 MiB | 33.05 MiB/s Receiving objects: 41% (26675/65060), 16.54 MiB | 33.05 MiB/s Receiving objects: 42% (27326/65060), 16.54 MiB | 33.05 MiB/s Receiving objects: 43% (27976/65060), 16.54 MiB | 33.05 MiB/s Receiving objects: 44% (28627/65060), 16.54 MiB | 33.05 MiB/s Receiving objects: 45% (29277/65060), 16.54 MiB | 33.05 MiB/s Receiving objects: 46% (29928/65060), 16.54 MiB | 33.05 MiB/s Receiving objects: 47% (30579/65060), 16.54 MiB | 33.05 MiB/s Receiving objects: 48% (31229/65060), 16.54 MiB | 33.05 MiB/s Receiving objects: 49% (31880/65060), 16.54 MiB | 33.05 MiB/s Receiving objects: 50% (32530/65060), 16.54 MiB | 33.05 MiB/s Receiving objects: 51% (33181/65060), 16.54 MiB | 33.05 MiB/s Receiving objects: 52% (33832/65060), 16.54 MiB | 33.05 MiB/s Receiving objects: 53% (34482/65060), 16.54 MiB | 33.05 MiB/s Receiving objects: 53% (34502/65060), 33.48 MiB | 33.47 MiB/s Receiving objects: 54% (35133/65060), 33.48 MiB | 33.47 MiB/s Receiving objects: 55% (35783/65060), 33.48 MiB | 33.47 MiB/s Receiving objects: 56% (36434/65060), 33.48 MiB | 33.47 MiB/s Receiving objects: 57% (37085/65060), 33.48 MiB | 33.47 MiB/s Receiving objects: 58% (37735/65060), 33.48 MiB | 33.47 MiB/s Receiving objects: 59% (38386/65060), 33.48 MiB | 33.47 MiB/s Receiving objects: 60% (39036/65060), 33.48 MiB | 33.47 MiB/s Receiving objects: 61% (39687/65060), 33.48 MiB | 33.47 MiB/s Receiving objects: 62% (40338/65060), 33.48 MiB | 33.47 MiB/s Receiving objects: 63% (40988/65060), 33.48 MiB | 33.47 MiB/s Receiving objects: 64% (41639/65060), 33.48 MiB | 33.47 MiB/s Receiving objects: 65% (42289/65060), 33.48 MiB | 33.47 MiB/s Receiving objects: 66% (42940/65060), 33.48 MiB | 33.47 MiB/s Receiving objects: 67% (43591/65060), 51.81 MiB | 33.72 MiB/s Receiving objects: 68% (44241/65060), 51.81 MiB | 33.72 MiB/s Receiving objects: 69% (44892/65060), 51.81 MiB | 33.72 MiB/s Receiving objects: 70% (45542/65060), 51.81 MiB | 33.72 MiB/s Receiving objects: 71% (46193/65060), 51.81 MiB | 33.72 MiB/s Receiving objects: 72% (46844/65060), 51.81 MiB | 33.72 MiB/s Receiving objects: 73% (47494/65060), 51.81 MiB | 33.72 MiB/s Receiving objects: 74% (48145/65060), 51.81 MiB | 33.72 MiB/s Receiving objects: 75% (48795/65060), 51.81 MiB | 33.72 MiB/s Receiving objects: 75% (49298/65060), 51.81 MiB | 33.72 MiB/s Receiving objects: 76% (49446/65060), 51.81 MiB | 33.72 MiB/s Receiving objects: 77% (50097/65060), 51.81 MiB | 33.72 MiB/s Receiving objects: 78% (50747/65060), 69.82 MiB | 34.30 MiB/s Receiving objects: 79% (51398/65060), 69.82 MiB | 34.30 MiB/s Receiving objects: 80% (52048/65060), 69.82 MiB | 34.30 MiB/s Receiving objects: 81% (52699/65060), 69.82 MiB | 34.30 MiB/s Receiving objects: 82% (53350/65060), 69.82 MiB | 34.30 MiB/s Receiving objects: 83% (54000/65060), 69.82 MiB | 34.30 MiB/s Receiving objects: 84% (54651/65060), 69.82 MiB | 34.30 MiB/s Receiving objects: 85% (55301/65060), 69.82 MiB | 34.30 MiB/s Receiving objects: 86% (55952/65060), 69.82 MiB | 34.30 MiB/s Receiving objects: 87% (56603/65060), 69.82 MiB | 34.30 MiB/s Receiving objects: 88% (57253/65060), 69.82 MiB | 34.30 MiB/s Receiving objects: 89% (57904/65060), 69.82 MiB | 34.30 MiB/s Receiving objects: 90% (58554/65060), 69.82 MiB | 34.30 MiB/s Receiving objects: 91% (59205/65060), 69.82 MiB | 34.30 MiB/s Receiving objects: 92% (59856/65060), 69.82 MiB | 34.30 MiB/s Receiving objects: 93% (60506/65060), 69.82 MiB | 34.30 MiB/s Receiving objects: 94% (61157/65060), 69.82 MiB | 34.30 MiB/s Receiving objects: 95% (61807/65060), 69.82 MiB | 34.30 MiB/s Receiving objects: 96% (62458/65060), 69.82 MiB | 34.30 MiB/s Receiving objects: 97% (63109/65060), 69.82 MiB | 34.30 MiB/s Receiving objects: 98% (63759/65060), 69.82 MiB | 34.30 MiB/s Receiving objects: 99% (64410/65060), 69.82 MiB | 34.30 MiB/s remote: Total 65060 (delta 6804), reused 6297 (delta 6278), pack-reused 57349 (from 1)
  7. 5.40 s Receiving objects: 100% (65060/65060), 86.53 MiB | 34.05 MiB/s Receiving objects: 100% (65060/65060), 87.00 MiB | 33.91 MiB/s, done.
  8. 6.08 s Resolving deltas: 0% (0/45922) Resolving deltas: 1% (460/45922) Resolving deltas: 2% (919/45922) Resolving deltas: 3% (1378/45922) Resolving deltas: 4% (1837/45922) Resolving deltas: 5% (2297/45922) Resolving deltas: 6% (2757/45922) Resolving deltas: 7% (3216/45922) Resolving deltas: 8% (3674/45922) Resolving deltas: 9% (4133/45922) Resolving deltas: 10% (4593/45922) Resolving deltas: 11% (5052/45922) Resolving deltas: 12% (5511/45922) Resolving deltas: 13% (5970/45922) Resolving deltas: 14% (6431/45922) Resolving deltas: 15% (6889/45922) Resolving deltas: 16% (7348/45922) Resolving deltas: 17% (7807/45922) Resolving deltas: 18% (8266/45922) Resolving deltas: 19% (8726/45922) Resolving deltas: 20% (9185/45922) Resolving deltas: 21% (9644/45922) Resolving deltas: 22% (10103/45922) Resolving deltas: 23% (10563/45922) Resolving deltas: 24% (11022/45922) Resolving deltas: 25% (11481/45922) Resolving deltas: 26% (11940/45922) Resolving deltas: 27% (12399/45922) Resolving deltas: 28% (12859/45922) Resolving deltas: 29% (13318/45922) Resolving deltas: 30% (13777/45922) Resolving deltas: 31% (14239/45922) Resolving deltas: 32% (14696/45922) Resolving deltas: 33% (15155/45922) Resolving deltas: 34% (15614/45922) Resolving deltas: 35% (16073/45922) Resolving deltas: 36% (16532/45922) Resolving deltas: 37% (16992/45922) Resolving deltas: 38% (17451/45922) Resolving deltas: 39% (17910/45922) Resolving deltas: 40% (18369/45922) Resolving deltas: 41% (18829/45922) Resolving deltas: 42% (19289/45922) Resolving deltas: 43% (19747/45922) Resolving deltas: 44% (20206/45922) Resolving deltas: 45% (20665/45922) Resolving deltas: 46% (21126/45922) Resolving deltas: 47% (21584/45922) Resolving deltas: 48% (22043/45922) Resolving deltas: 49% (22507/45922) Resolving deltas: 50% (22962/45922) Resolving deltas: 51% (23421/45922) Resolving deltas: 52% (23880/45922) Resolving deltas: 53% (24339/45922) Resolving deltas: 54% (24798/45922) Resolving deltas: 55% (25259/45922) Resolving deltas: 56% (25718/45922) Resolving deltas: 57% (26176/45922) Resolving deltas: 58% (26635/45922) Resolving deltas: 59% (27094/45922) Resolving deltas: 60% (27554/45922) Resolving deltas: 61% (28013/45922) Resolving deltas: 62% (28472/45922) Resolving deltas: 63% (28931/45922) Resolving deltas: 64% (29391/45922) Resolving deltas: 65% (29850/45922) Resolving deltas: 66% (30309/45922) Resolving deltas: 67% (30768/45922) Resolving deltas: 68% (31228/45922) Resolving deltas: 69% (31687/45922) Resolving deltas: 70% (32146/45922) Resolving deltas: 71% (32605/45922) Resolving deltas: 72% (33064/45922) Resolving deltas: 73% (33524/45922) Resolving deltas: 74% (33983/45922) Resolving deltas: 75% (34446/45922) Resolving deltas: 76% (34901/45922) Resolving deltas: 77% (35360/45922) Resolving deltas: 78% (35820/45922) Resolving deltas: 79% (36279/45922) Resolving deltas: 80% (36738/45922) Resolving deltas: 81% (37197/45922) Resolving deltas: 82% (37657/45922) Resolving deltas: 83% (38116/45922) Resolving deltas: 84% (38576/45922) Resolving deltas: 85% (39035/45922) Resolving deltas: 86% (39493/45922) Resolving deltas: 87% (39953/45922) Resolving deltas: 88% (40412/45922) Resolving deltas: 89% (40871/45922) Resolving deltas: 90% (41330/45922) Resolving deltas: 91% (41790/45922) Resolving deltas: 92% (42249/45922) Resolving deltas: 93% (42708/45922) Resolving deltas: 94% (43167/45922) Resolving deltas: 95% (43626/45922) Resolving deltas: 96% (44086/45922) Resolving deltas: 97% (44545/45922) Resolving deltas: 98% (45004/45922) Resolving deltas: 99% (45463/45922) Resolving deltas: 100% (45922/45922) Resolving deltas: 100% (45922/45922), done.
  9. 6.39 s Fetching commit c1745ddd5ccecc94c54a846b90ea9a0e89de4682 for vakint_rustred ...
  10. 6.39 s $ /nix/store/bcnisk3ydfgv26v2gw3zlky24g00yww2-git-2.54.0/bin/git fetch origin c1745ddd5ccecc94c54a846b90ea9a0e89de4682
  11. 7.01 s From https://github.com/alphal00p/gammaloop
  12. 7.01 s * branch c1745ddd5ccecc94c54a846b90ea9a0e89de4682 -> FETCH_HEAD
  13. 7.03 s $ /nix/store/9ypz3flqsrl5xl495mm8h645gadjsxi1-coreutils-9.11/bin/timeout --kill-after=15s 7200s /nix/store/bcnisk3ydfgv26v2gw3zlky24g00yww2-git-2.54.0/bin/git -c advice.detachedHead=false checkout c1745ddd5ccecc94c54a846b90ea9a0e89de4682
  14. 7.19 s HEAD is now at c1745ddd Validate explicit RustRed tensor routings
  15. 7.19 s $ /nix/store/9ypz3flqsrl5xl495mm8h645gadjsxi1-coreutils-9.11/bin/timeout --kill-after=15s 7200s /nix/store/23zk8sgzamrbmj1fday15szf7f2279s8-nix-2.34.7/bin/nix --extra-experimental-features nix-command --extra-experimental-features flakes --log-format internal-json run .#packages.x86_64-linux.nix-ci-check-gammaloop-nextest-core --print-build-logs
  16. 12.23 s
  17. 12.44 s Downloading cached gammaloop-nextest-binaries-core-gammaloop-api from https://cache.nix-ci.com
  18. 12.46 s Downloading cached gammaloop-nextest-binaries-core-gammaloop-tracing-filter from https://cache.nix-ci.com
  19. 12.46 s Downloading cached gammaloop-nextest-binaries-core-gammaloop-tracing-filter-macros from https://cache.nix-ci.com
  20. 12.46 s Downloading cached gammaloop-nextest-binaries-core-gammalooprs from https://cache.nix-ci.com
  21. 12.49 s Downloaded cached gammaloop-nextest-binaries-core-gammaloop-tracing-filter-macros (1.7 MiB) in 33ms
  22. 12.49 s Progress: 0 of 6 built, 1 of 4 downloaded from cache (3 downloading)
  23. 12.57 s Downloaded cached gammaloop-nextest-binaries-core-gammaloop-tracing-filter (6.6 MiB) in 108ms
  24. 12.57 s Progress: 0 of 5 built, 2 of 4 downloaded from cache (2 downloading)
  25. 13.22 s Downloaded cached gammaloop-nextest-binaries-core-gammaloop-api (66.7 MiB) in 784ms
  26. 13.22 s Progress: 0 of 4 built, 3 of 4 downloaded from cache (1 downloading)
  27. 13.28 s Downloaded cached gammaloop-nextest-binaries-core-gammalooprs (76.8 MiB) in 821ms
  28. 13.28 s Progress: 0 of 3 built, 4 of 4 downloaded from cache
  29. 13.31 s Building /nix/store/yyrv5zg3p2xmc90iwfbbml4c93dd1p5l-gammaloop-nextest-binaries-core.drv
  30. 13.37 s [gammaloop-nextest-binaries-core:post-build] Uploading to the NixCI cache: /nix/store/mwgvv7wlnq52pi7j1dhcb6j6733k5ji7-gammaloop-nextest-binaries-core
  31. 13.41 s [gammaloop-nextest-binaries-core:post-build] warning: 'warn-short-path-literals' is deprecated, use 'lint-short-path-literals = ignore' instead
  32. 13.42 s [gammaloop-nextest-binaries-core:post-build] copying 1 paths...
  33. 13.42 s [gammaloop-nextest-binaries-core:post-build] copying path '/nix/store/mwgvv7wlnq52pi7j1dhcb6j6733k5ji7-gammaloop-nextest-binaries-core' to 'https://cache.nix-ci.com'...
  34. 13.49 s [gammaloop-nextest-binaries-core:post-build] warning: 'warn-short-path-literals' is deprecated, use 'lint-short-path-literals = ignore' instead
  35. 13.61 s [gammaloop-nextest-binaries-core:post-build] copying 0 paths...
  36. 13.63 s Uploaded gammaloop-nextest-binaries-core in 268ms
  37. 13.63 s Progress: 1 of 3 built, 4 of 4 downloaded from cache
  38. 13.63 s Built gammaloop-nextest-binaries-core in 319ms
  39. 13.72 s Building /nix/store/hsq101qfzv6vfp68r06fzk6094yf32vw-nix-ci-check-gammaloop-nextest-core.drv
  40. 13.79 s [nix-ci-check-gammaloop-nextest-core:post-build] Uploading to the NixCI cache: /nix/store/6mpzxs0zyc28jfigw0897hyqc3cmd7bd-nix-ci-check-gammaloop-nextest-core
  41. 13.83 s [nix-ci-check-gammaloop-nextest-core:post-build] warning: 'warn-short-path-literals' is deprecated, use 'lint-short-path-literals = ignore' instead
  42. 13.84 s [nix-ci-check-gammaloop-nextest-core:post-build] copying 1 paths...
  43. 13.84 s [nix-ci-check-gammaloop-nextest-core:post-build] copying path '/nix/store/6mpzxs0zyc28jfigw0897hyqc3cmd7bd-nix-ci-check-gammaloop-nextest-core' to 'https://cache.nix-ci.com'...
  44. 13.91 s [nix-ci-check-gammaloop-nextest-core:post-build] warning: 'warn-short-path-literals' is deprecated, use 'lint-short-path-literals = ignore' instead
  45. 14.10 s [nix-ci-check-gammaloop-nextest-core:post-build] copying 0 paths...
  46. 14.13 s Uploaded nix-ci-check-gammaloop-nextest-core in 353ms
  47. 14.13 s Progress: 2 of 3 built, 4 of 4 downloaded from cache
  48. 14.13 s Built nix-ci-check-gammaloop-nextest-core in 413ms
  49. 14.13 s Progress: 3 of 3 built, 4 of 4 downloaded from cache
  50. 19.98 s evaluating derivation 'g copying '/nix/store/1zhf evaluating derivation 'g copying '/nix/store/1zhf evaluating derivation 'g copying '/nix/store/1zhf evaluating derivation 'g copying '/nix/store/1zhf evaluating derivation 'g querying gammaloop-nexte querying info about miss querying gammaloop-nexte [0/1 built, 0.0 KiB DL] [1/0/1 built, 0.0 KiB DLgammaloop-nextest-core> Extracting 3 binaries (including 1 non-test binary), 1 build script output directory, and 2 linked paths to /build/nextest-archive-Db1sa3
  51. 20.44 s gammaloop-nextest-core> Extracted 18 files to /build/nextest-archive-Db1sa3 in 0.46s
  52. 20.46 s gammaloop-nextest-core> ------------
  53. 20.46 s gammaloop-nextest-core> Nextest run ID 025fe5d4-26a1-4cdb-9aab-9ed17ff4fc89 with nextest profile: ci_gammaloop
  54. 20.46 s gammaloop-nextest-core> Starting 339 tests across 2 binaries
  55. 20.97 s gammaloop-nextest-core> ------------
  56. 20.97 s gammaloop-nextest-core> Summary [ 0.514s] 339 tests run: 339 passed, 0 skipped
  57. 21.09 s gammaloop-nextest-core>
  58. 21.09 s gammaloop-nextest-core> ========== nextest test summary ==========
  59. 21.09 s gammaloop-nextest-core> report: target/nextest/ci_gammaloop/junit.xml
  60. 21.09 s gammaloop-nextest-core> tests: 339, failures: 0, errors: 0
  61. 21.09 s gammaloop-nextest-core> No failing testcases found.
  62. 21.09 s gammaloop-nextest-core> =========================================
  63. 21.11 s gammaloop-nextest-core> Extracting 1 binary and 1 linked path to /build/nextest-archive-AAGvmf
  64. 21.17 s gammaloop-nextest-core> Extracted 7 files to /build/nextest-archive-AAGvmf in 0.06s
  65. 21.18 s gammaloop-nextest-core> ------------
  66. 21.18 s gammaloop-nextest-core> Nextest run ID 00d651af-2e59-4c3e-ab18-3c5152cc6a0a with nextest profile: ci_gammaloop
  67. 21.18 s gammaloop-nextest-core> Starting 19 tests across 1 binary
  68. 21.20 s gammaloop-nextest-core> ------------
  69. 21.20 s gammaloop-nextest-core> Summary [ 0.015s] 19 tests run: 19 passed, 0 skipped
  70. 21.25 s gammaloop-nextest-core>
  71. 21.25 s gammaloop-nextest-core> ========== nextest test summary ==========
  72. 21.25 s gammaloop-nextest-core> report: target/nextest/ci_gammaloop/junit.xml
  73. 21.25 s gammaloop-nextest-core> tests: 19, failures: 0, errors: 0
  74. 21.25 s gammaloop-nextest-core> No failing testcases found.
  75. 21.25 s gammaloop-nextest-core> =========================================
  76. 21.26 s gammaloop-nextest-core> Extracting 1 binary to /build/nextest-archive-ru0p3j
  77. 21.30 s gammaloop-nextest-core> Extracted 4 files to /build/nextest-archive-ru0p3j in 0.04s
  78. 21.31 s gammaloop-nextest-core> ------------
  79. 21.31 s gammaloop-nextest-core> Nextest run ID 014080bc-dce8-4238-b3e2-8aa175317c64 with nextest profile: ci_gammaloop
  80. 21.31 s gammaloop-nextest-core> Starting 0 tests across 1 binary
  81. 21.31 s gammaloop-nextest-core> ------------
  82. 21.31 s gammaloop-nextest-core> Summary [ 0.000s] 0 tests run: 0 passed, 0 skipped
  83. 21.34 s gammaloop-nextest-core>
  84. 21.34 s gammaloop-nextest-core> ========== nextest test summary ==========
  85. 21.34 s gammaloop-nextest-core> report: target/nextest/ci_gammaloop/junit.xml
  86. 21.34 s gammaloop-nextest-core> tests: 0, failures: 0, errors: 0
  87. 21.34 s gammaloop-nextest-core> No failing testcases found.
  88. 21.34 s gammaloop-nextest-core> =========================================
  89. 21.36 s gammaloop-nextest-core> Extracting 4 binaries, 1 build script output directory, and 2 linked paths to /build/nextest-archive-CQEwE4
  90. 21.82 s gammaloop-nextest-core> Extracted 18 files to /build/nextest-archive-CQEwE4 in 0.46s
  91. 21.84 s gammaloop-nextest-core> ------------
  92. 21.84 s gammaloop-nextest-core> Nextest run ID 5ccedf9e-e08a-4b54-a7f1-6beac3abb89d with nextest profile: ci_gammaloop
  93. 21.84 s gammaloop-nextest-core> Starting 456 tests across 4 binaries (61 tests skipped, including 60 tests via profile.ci_gammaloop.default-filter)
  94. 23.51 s gammaloop-nextest-core> FAIL [ 0.528s] (444/456) gammalooprs::test_renormalization finit_part_ghlo
  95. 23.51 s gammaloop-nextest-core> stdout ---
  96. 23.51 s gammaloop-nextest-core>
  97. 23.51 s gammaloop-nextest-core> running 1 test
  98. 23.51 s gammaloop-nextest-core> ren part: 1/2*GC_10^2*dot(P(0,mink(dim)),P(0,mink(dim)))*cas(2,coad(8))/ε
  99. 23.51 s gammaloop-nextest-core> ━━━━━━━━━━━━━━━━━━━━━━━━━━━━━━━ Snapshot Summary ━━━━━━━━━━━━━━━━━━━━━━━━━━━━━━━
  100. 23.51 s gammaloop-nextest-core> Snapshot: finit_part_ghlo
  101. 23.51 s gammaloop-nextest-core> Source: crates/gammalooprs/tests/test_renormalization.rs:557
  102. 23.51 s gammaloop-nextest-core> ────────────────────────────────────────────────────────────────────────────────
  103. 23.51 s gammaloop-nextest-core> Expression: align_to_rqft(&a, &model).to_bare_ordered_string()
  104. 23.51 s gammaloop-nextest-core> ────────────────────────────────────────────────────────────────────────────────
  105. 23.51 s gammaloop-nextest-core> -old snapshot
  106. 23.51 s gammaloop-nextest-core> +new results
  107. 23.51 s gammaloop-nextest-core> ────────────┬───────────────────────────────────────────────────────────────────
  108. 23.51 s gammaloop-nextest-core> 1 │--1/2*cas(2,coad(8))*dot(P(0,mink(4)),P(0,mink(4)))*gs^2*ε^(-1)
  109. 23.51 s gammaloop-nextest-core> 1 │+1/2*cas(2,coad(8))*dot(P(0,mink(4)),P(0,mink(4)))*gs^2*ε^(-1)
  110. 23.51 s gammaloop-nextest-core> ────────────┴───────────────────────────────────────────────────────────────────
  111. 23.51 s gammaloop-nextest-core> To update snapshots run `cargo insta review`
  112. 23.51 s gammaloop-nextest-core> Stopped on the first failure. Run `cargo insta test` to run all snapshots.
  113. 23.51 s gammaloop-nextest-core> test finit_part_ghlo ... FAILED
  114. 23.51 s gammaloop-nextest-core>
  115. 23.51 s gammaloop-nextest-core> failures:
  116. 23.51 s gammaloop-nextest-core>
  117. 23.51 s gammaloop-nextest-core> failures:
  118. 23.51 s gammaloop-nextest-core> finit_part_ghlo
  119. 23.51 s gammaloop-nextest-core>
  120. 23.51 s gammaloop-nextest-core> test result: FAILED. 0 passed; 1 failed; 0 ignored; 0 measured; 5 filtered out; finished in 0.51s
  121. 23.51 s gammaloop-nextest-core>
  122. 23.51 s gammaloop-nextest-core> stderr ---
  123. 23.51 s gammaloop-nextest-core> The application panicked (crashed).
  124. 23.51 s gammaloop-nextest-core> Message: snapshot assertion for 'finit_part_ghlo' failed in line 557
  125. 23.51 s gammaloop-nextest-core> Location: /nix/store/30svmzr0z0zpcqjyynjn7w21wgx18y4b-vendor-cargo-deps/c19b7c6f923b580ac259164a89f2577984ad5ab09ee9d583b888f934adbbe8d0/insta-1.47.2/src/runtime.rs:719
  126. 23.51 s gammaloop-nextest-core>
  127. 23.51 s gammaloop-nextest-core> ━━━━━━━━━━━━━━━━━━━━━━━━━━━━━━━━━━ BACKTRACE ━━━━━━━━━━━━━━━━━━━━━━━━━━━━━━━━━━━
  128. 23.51 s gammaloop-nextest-core> 1: <color_eyre[51793ea62743adbd]::config::PanicHook>::panic_report<unknown>
  129. 23.51 s gammaloop-nextest-core> at <unknown source file>:<unknown line>
  130. 23.51 s gammaloop-nextest-core> 2: <color_eyre[51793ea62743adbd]::config::PanicHook>::into_panic_hook::{closure#0}<unknown>
  131. 23.51 s gammaloop-nextest-core> at <unknown source file>:<unknown line>
  132. 23.51 s gammaloop-nextest-core> 3: std[bcb96dfbba0ab899]::panicking::panic_with_hook<unknown>
  133. 23.51 s gammaloop-nextest-core> at <unknown source file>:<unknown line>
  134. 23.51 s gammaloop-nextest-core> 4: std[bcb96dfbba0ab899]::panicking::panic_handler::{closure#0}<unknown>
  135. 23.51 s gammaloop-nextest-core> at <unknown source file>:<unknown line>
  136. 23.51 s gammaloop-nextest-core> 5: std[bcb96dfbba0ab899]::sys::backtrace::__rust_end_short_backtrace::<std[bcb96dfbba0ab899]::panicking::panic_handler::{closure#0}, !><unknown>
  137. 23.51 s gammaloop-nextest-core> at <unknown source file>:<unknown line>
  138. 23.51 s gammaloop-nextest-core> 6: __rustc[6c289b9f9c454d21]::rust_begin_unwind<unknown>
  139. 23.51 s gammaloop-nextest-core> at <unknown source file>:<unknown line>
  140. 23.51 s gammaloop-nextest-core> 7: core[940e698046960fd5]::panicking::panic_fmt<unknown>
  141. 23.51 s gammaloop-nextest-core> at <unknown source file>:<unknown line>
  142. 23.51 s gammaloop-nextest-core> 8: insta[307a548ac79ef4d9]::runtime::assert_snapshot<unknown>
  143. 23.51 s gammaloop-nextest-core> at <unknown source file>:<unknown line>
  144. 23.51 s gammaloop-nextest-core> 9: <test_renormalization[9b33d9b78f5a79c8]::finit_part_ghlo::{closure#0} as core[940e698046960fd5]::ops::function::FnOnce<()>>::call_once<unknown>
  145. 23.51 s gammaloop-nextest-core> at <unknown source file>:<unknown line>
  146. 23.51 s gammaloop-nextest-core> 10: test[75d6903177b1d7e9]::__rust_begin_short_backtrace::<core[940e698046960fd5]::result::Result<(), alloc[2ea6bcb46fca0c42]::string::String>, fn() -> core[940e698046960fd5]::result::Result<(), alloc[2ea6bcb46fca0c42]::string::String>><unknown>
  147. 23.51 s gammaloop-nextest-core> at <unknown source file>:<unknown line>
  148. 23.51 s gammaloop-nextest-core> 11: test[75d6903177b1d7e9]::run_test::{closure#0}<unknown>
  149. 23.51 s gammaloop-nextest-core> at <unknown source file>:<unknown line>
  150. 23.51 s gammaloop-nextest-core> 12: std[bcb96dfbba0ab899]::sys::backtrace::__rust_begin_short_backtrace::<test[75d6903177b1d7e9]::run_test::{closure#1}, ()><unknown>
  151. 23.51 s gammaloop-nextest-core> at <unknown source file>:<unknown line>
  152. 23.51 s gammaloop-nextest-core> 13: <std[bcb96dfbba0ab899]::thread::lifecycle::spawn_unchecked<test[75d6903177b1d7e9]::run_test::{closure#1}, ()>::{closure#1} as core[940e698046960fd5]::ops::function::FnOnce<()>>::call_once::{shim:vtable#0}<unknown>
  153. 23.51 s gammaloop-nextest-core> at <unknown source file>:<unknown line>
  154. 23.51 s gammaloop-nextest-core> 14: <std[bcb96dfbba0ab899]::sys::thread::unix::Thread>::new::thread_start<unknown>
  155. 23.51 s gammaloop-nextest-core> at <unknown source file>:<unknown line>
  156. 23.51 s gammaloop-nextest-core> 15: start_thread<unknown>
  157. 23.51 s gammaloop-nextest-core> at <unknown source file>:<unknown line>
  158. 23.51 s gammaloop-nextest-core> 16: __clone3<unknown>
  159. 23.51 s gammaloop-nextest-core> at <unknown source file>:<unknown line>
  160. 23.51 s gammaloop-nextest-core>
  161. 23.51 s gammaloop-nextest-core> Run with COLORBT_SHOW_HIDDEN=1 environment variable to disable frame filtering.
  162. 23.51 s gammaloop-nextest-core> Run with RUST_BACKTRACE=full to include source snippets.
  163. 23.51 s gammaloop-nextest-core>
  164. 26.47 s gammaloop-nextest-core> FAIL [ 3.481s] (452/456) gammalooprs::test_renormalization finite_part_ghost_2loop
  165. 26.49 s gammaloop-nextest-core> stdout ---
  166. 26.49 s gammaloop-nextest-core>
  167. 26.49 s gammaloop-nextest-core> running 1 test
  168. 26.49 s gammaloop-nextest-core> ━━━━━━━━━━━━━━━━━━━━━━━━━━━━━━━ Snapshot Summary ━━━━━━━━━━━━━━━━━━━━━━━━━━━━━━━
  169. 26.49 s gammaloop-nextest-core> Snapshot: finite_part_ghost_2loop-3
  170. 26.49 s gammaloop-nextest-core> Source: crates/gammalooprs/tests/test_renormalization.rs:464
  171. 26.49 s gammaloop-nextest-core> ────────────────────────────────────────────────────────────────────────────────
  172. 26.49 s gammaloop-nextest-core> Expression: align_to_rqft(&a, &model).to_bare_ordered_string()
  173. 26.49 s gammaloop-nextest-core> ────────────────────────────────────────────────────────────────────────────────
  174. 26.49 s gammaloop-nextest-core> -old snapshot
  175. 26.49 s gammaloop-nextest-core> +new results
  176. 26.49 s gammaloop-nextest-core> ────────────┬───────────────────────────────────────────────────────────────────
  177. 26.49 s gammaloop-nextest-core> 1 │-(-1𝑖/32*ε+1𝑖/16)*(cas(2,coad(8)))^2*dot(P(0,mink(4)),P(0,mink(4)))*gs^4*ε^(-2)
  178. 26.49 s gammaloop-nextest-core> 1 │+(-1𝑖/16+1𝑖/32*ε)*(cas(2,coad(8)))^2*dot(P(0,mink(4)),P(0,mink(4)))*gs^4*ε^(-2)
  179. 26.49 s gammaloop-nextest-core> ────────────┴───────────────────────────────────────────────────────────────────
  180. 26.49 s gammaloop-nextest-core> To update snapshots run `cargo insta review`
  181. 26.49 s gammaloop-nextest-core> Stopped on the first failure. Run `cargo insta test` to run all snapshots.
  182. 26.49 s gammaloop-nextest-core> test finite_part_ghost_2loop ... FAILED
  183. 26.49 s gammaloop-nextest-core>
  184. 26.49 s gammaloop-nextest-core> failures:
  185. 26.49 s gammaloop-nextest-core>
  186. 26.49 s gammaloop-nextest-core> failures:
  187. 26.49 s gammaloop-nextest-core> finite_part_ghost_2loop
  188. 26.49 s gammaloop-nextest-core>
  189. 26.49 s gammaloop-nextest-core> test result: FAILED. 0 passed; 1 failed; 0 ignored; 0 measured; 5 filtered out; finished in 3.47s
  190. 26.49 s gammaloop-nextest-core>
  191. 26.49 s gammaloop-nextest-core> stderr ---
  192. 26.49 s gammaloop-nextest-core> The application panicked (crashed).
  193. 26.49 s gammaloop-nextest-core> Message: snapshot assertion for 'finite_part_ghost_2loop-3' failed in line 464
  194. 26.49 s gammaloop-nextest-core> Location: /nix/store/30svmzr0z0zpcqjyynjn7w21wgx18y4b-vendor-cargo-deps/c19b7c6f923b580ac259164a89f2577984ad5ab09ee9d583b888f934adbbe8d0/insta-1.47.2/src/runtime.rs:719
  195. 26.49 s gammaloop-nextest-core>
  196. 26.49 s gammaloop-nextest-core> ━━━━━━━━━━━━━━━━━━━━━━━━━━━━━━━━━━ BACKTRACE ━━━━━━━━━━━━━━━━━━━━━━━━━━━━━━━━━━━
  197. 26.49 s gammaloop-nextest-core> 1: <color_eyre[51793ea62743adbd]::config::PanicHook>::panic_report<unknown>
  198. 26.49 s gammaloop-nextest-core> at <unknown source file>:<unknown line>
  199. 26.49 s gammaloop-nextest-core> 2: <color_eyre[51793ea62743adbd]::config::PanicHook>::into_panic_hook::{closure#0}<unknown>
  200. 26.49 s gammaloop-nextest-core> at <unknown source file>:<unknown line>
  201. 26.49 s gammaloop-nextest-core> 3: std[bcb96dfbba0ab899]::panicking::panic_with_hook<unknown>
  202. 26.49 s gammaloop-nextest-core> at <unknown source file>:<unknown line>
  203. 26.49 s gammaloop-nextest-core> 4: std[bcb96dfbba0ab899]::panicking::panic_handler::{closure#0}<unknown>
  204. 26.49 s gammaloop-nextest-core> at <unknown source file>:<unknown line>
  205. 26.49 s gammaloop-nextest-core> 5: std[bcb96dfbba0ab899]::sys::backtrace::__rust_end_short_backtrace::<std[bcb96dfbba0ab899]::panicking::panic_handler::{closure#0}, !><unknown>
  206. 26.49 s gammaloop-nextest-core> at <unknown source file>:<unknown line>
  207. 26.49 s gammaloop-nextest-core> 6: __rustc[6c289b9f9c454d21]::rust_begin_unwind<unknown>
  208. 26.49 s gammaloop-nextest-core> at <unknown source file>:<unknown line>
  209. 26.49 s gammaloop-nextest-core> 7: core[940e698046960fd5]::panicking::panic_fmt<unknown>
  210. 26.49 s gammaloop-nextest-core> at <unknown source file>:<unknown line>
  211. 26.49 s gammaloop-nextest-core> 8: insta[307a548ac79ef4d9]::runtime::assert_snapshot<unknown>
  212. 26.49 s gammaloop-nextest-core> at <unknown source file>:<unknown line>
  213. 26.49 s gammaloop-nextest-core> 9: test_renormalization[9b33d9b78f5a79c8]::finite_part_ghost_2loop<unknown>
  214. 26.49 s gammaloop-nextest-core> at <unknown source file>:<unknown line>
  215. 26.49 s gammaloop-nextest-core> 10: <test_renormalization[9b33d9b78f5a79c8]::finite_part_ghost_2loop::{closure#0} as core[940e698046960fd5]::ops::function::FnOnce<()>>::call_once<unknown>
  216. 26.49 s gammaloop-nextest-core> at <unknown source file>:<unknown line>
  217. 26.49 s gammaloop-nextest-core> 11: test[75d6903177b1d7e9]::__rust_begin_short_backtrace::<core[940e698046960fd5]::result::Result<(), alloc[2ea6bcb46fca0c42]::string::String>, fn() -> core[940e698046960fd5]::result::Result<(), alloc[2ea6bcb46fca0c42]::string::String>><unknown>
  218. 26.49 s gammaloop-nextest-core> at <unknown source file>:<unknown line>
  219. 26.49 s gammaloop-nextest-core> 12: test[75d6903177b1d7e9]::run_test::{closure#0}<unknown>
  220. 26.49 s gammaloop-nextest-core> at <unknown source file>:<unknown line>
  221. 26.49 s gammaloop-nextest-core> 13: std[bcb96dfbba0ab899]::sys::backtrace::__rust_begin_short_backtrace::<test[75d6903177b1d7e9]::run_test::{closure#1}, ()><unknown>
  222. 26.49 s gammaloop-nextest-core> at <unknown source file>:<unknown line>
  223. 26.49 s gammaloop-nextest-core> 14: <std[bcb96dfbba0ab899]::thread::lifecycle::spawn_unchecked<test[75d6903177b1d7e9]::run_test::{closure#1}, ()>::{closure#1} as core[940e698046960fd5]::ops::function::FnOnce<()>>::call_once::{shim:vtable#0}<unknown>
  224. 26.49 s gammaloop-nextest-core> at <unknown source file>:<unknown line>
  225. 26.49 s gammaloop-nextest-core> 15: <std[bcb96dfbba0ab899]::sys::thread::unix::Thread>::new::thread_start<unknown>
  226. 26.49 s gammaloop-nextest-core> at <unknown source file>:<unknown line>
  227. 26.49 s gammaloop-nextest-core> 16: start_thread<unknown>
  228. 26.49 s gammaloop-nextest-core> at <unknown source file>:<unknown line>
  229. 26.49 s gammaloop-nextest-core> 17: __clone3<unknown>
  230. 26.49 s gammaloop-nextest-core> at <unknown source file>:<unknown line>
  231. 26.49 s gammaloop-nextest-core>
  232. 26.49 s gammaloop-nextest-core> Run with COLORBT_SHOW_HIDDEN=1 environment variable to disable frame filtering.
  233. 26.49 s gammaloop-nextest-core> Run with RUST_BACKTRACE=full to include source snippets.
  234. 26.49 s gammaloop-nextest-core>
  235. 32.26 s gammaloop-nextest-core> ------------
  236. 32.27 s gammaloop-nextest-core> Summary [ 10.428s] 456 tests run: 454 passed, 2 failed, 61 skipped
  237. 32.27 s gammaloop-nextest-core> FAIL [ 0.528s] (444/456) gammalooprs::test_renormalization finit_part_ghlo
  238. 32.27 s gammaloop-nextest-core> stdout ---
  239. 32.27 s gammaloop-nextest-core>
  240. 32.27 s gammaloop-nextest-core> running 1 test
  241. 32.27 s gammaloop-nextest-core> ren part: 1/2*GC_10^2*dot(P(0,mink(dim)),P(0,mink(dim)))*cas(2,coad(8))/ε
  242. 32.27 s gammaloop-nextest-core> ━━━━━━━━━━━━━━━━━━━━━━━━━━━━━━━ Snapshot Summary ━━━━━━━━━━━━━━━━━━━━━━━━━━━━━━━
  243. 32.27 s gammaloop-nextest-core> Snapshot: finit_part_ghlo
  244. 32.27 s gammaloop-nextest-core> Source: crates/gammalooprs/tests/test_renormalization.rs:557
  245. 32.27 s gammaloop-nextest-core> ────────────────────────────────────────────────────────────────────────────────
  246. 32.27 s gammaloop-nextest-core> Expression: align_to_rqft(&a, &model).to_bare_ordered_string()
  247. 32.27 s gammaloop-nextest-core> ────────────────────────────────────────────────────────────────────────────────
  248. 32.27 s gammaloop-nextest-core> -old snapshot
  249. 32.27 s gammaloop-nextest-core> +new results
  250. 32.27 s gammaloop-nextest-core> ────────────┬───────────────────────────────────────────────────────────────────
  251. 32.27 s gammaloop-nextest-core> 1 │--1/2*cas(2,coad(8))*dot(P(0,mink(4)),P(0,mink(4)))*gs^2*ε^(-1)
  252. 32.27 s gammaloop-nextest-core> 1 │+1/2*cas(2,coad(8))*dot(P(0,mink(4)),P(0,mink(4)))*gs^2*ε^(-1)
  253. 32.27 s gammaloop-nextest-core> ────────────┴───────────────────────────────────────────────────────────────────
  254. 32.27 s gammaloop-nextest-core> To update snapshots run `cargo insta review`
  255. 32.27 s gammaloop-nextest-core> Stopped on the first failure. Run `cargo insta test` to run all snapshots.
  256. 32.27 s gammaloop-nextest-core> test finit_part_ghlo ... FAILED
  257. 32.27 s gammaloop-nextest-core>
  258. 32.27 s gammaloop-nextest-core> failures:
  259. 32.27 s gammaloop-nextest-core>
  260. 32.27 s gammaloop-nextest-core> failures:
  261. 32.27 s gammaloop-nextest-core> finit_part_ghlo
  262. 32.27 s gammaloop-nextest-core>
  263. 32.27 s gammaloop-nextest-core> test result: FAILED. 0 passed; 1 failed; 0 ignored; 0 measured; 5 filtered out; finished in 0.51s
  264. 32.27 s gammaloop-nextest-core>
  265. 32.28 s gammaloop-nextest-core> stderr ---
  266. 32.28 s gammaloop-nextest-core> The application panicked (crashed).
  267. 32.28 s gammaloop-nextest-core> Message: snapshot assertion for 'finit_part_ghlo' failed in line 557
  268. 32.28 s gammaloop-nextest-core> Location: /nix/store/30svmzr0z0zpcqjyynjn7w21wgx18y4b-vendor-cargo-deps/c19b7c6f923b580ac259164a89f2577984ad5ab09ee9d583b888f934adbbe8d0/insta-1.47.2/src/runtime.rs:719
  269. 32.28 s gammaloop-nextest-core>
  270. 32.28 s gammaloop-nextest-core> ━━━━━━━━━━━━━━━━━━━━━━━━━━━━━━━━━━ BACKTRACE ━━━━━━━━━━━━━━━━━━━━━━━━━━━━━━━━━━━
  271. 32.28 s gammaloop-nextest-core> 1: <color_eyre[51793ea62743adbd]::config::PanicHook>::panic_report<unknown>
  272. 32.28 s gammaloop-nextest-core> at <unknown source file>:<unknown line>
  273. 32.28 s gammaloop-nextest-core> 2: <color_eyre[51793ea62743adbd]::config::PanicHook>::into_panic_hook::{closure#0}<unknown>
  274. 32.28 s gammaloop-nextest-core> at <unknown source file>:<unknown line>
  275. 32.28 s gammaloop-nextest-core> 3: std[bcb96dfbba0ab899]::panicking::panic_with_hook<unknown>
  276. 32.28 s gammaloop-nextest-core> at <unknown source file>:<unknown line>
  277. 32.28 s gammaloop-nextest-core> 4: std[bcb96dfbba0ab899]::panicking::panic_handler::{closure#0}<unknown>
  278. 32.28 s gammaloop-nextest-core> at <unknown source file>:<unknown line>
  279. 32.28 s gammaloop-nextest-core> 5: std[bcb96dfbba0ab899]::sys::backtrace::__rust_end_short_backtrace::<std[bcb96dfbba0ab899]::panicking::panic_handler::{closure#0}, !><unknown>
  280. 32.28 s gammaloop-nextest-core> at <unknown source file>:<unknown line>
  281. 32.28 s gammaloop-nextest-core> 6: __rustc[6c289b9f9c454d21]::rust_begin_unwind<unknown>
  282. 32.28 s gammaloop-nextest-core> at <unknown source file>:<unknown line>
  283. 32.28 s gammaloop-nextest-core> 7: core[940e698046960fd5]::panicking::panic_fmt<unknown>
  284. 32.28 s gammaloop-nextest-core> at <unknown source file>:<unknown line>
  285. 32.28 s gammaloop-nextest-core> 8: insta[307a548ac79ef4d9]::runtime::assert_snapshot<unknown>
  286. 32.28 s gammaloop-nextest-core> at <unknown source file>:<unknown line>
  287. 32.28 s gammaloop-nextest-core> 9: <test_renormalization[9b33d9b78f5a79c8]::finit_part_ghlo::{closure#0} as core[940e698046960fd5]::ops::function::FnOnce<()>>::call_once<unknown>
  288. 32.28 s gammaloop-nextest-core> at <unknown source file>:<unknown line>
  289. 32.28 s gammaloop-nextest-core> 10: test[75d6903177b1d7e9]::__rust_begin_short_backtrace::<core[940e698046960fd5]::result::Result<(), alloc[2ea6bcb46fca0c42]::string::String>, fn() -> core[940e698046960fd5]::result::Result<(), alloc[2ea6bcb46fca0c42]::string::String>><unknown>
  290. 32.28 s gammaloop-nextest-core> at <unknown source file>:<unknown line>
  291. 32.28 s gammaloop-nextest-core> 11: test[75d6903177b1d7e9]::run_test::{closure#0}<unknown>
  292. 32.28 s gammaloop-nextest-core> at <unknown source file>:<unknown line>
  293. 32.28 s gammaloop-nextest-core> 12: std[bcb96dfbba0ab899]::sys::backtrace::__rust_begin_short_backtrace::<test[75d6903177b1d7e9]::run_test::{closure#1}, ()><unknown>
  294. 32.28 s gammaloop-nextest-core> at <unknown source file>:<unknown line>
  295. 32.28 s gammaloop-nextest-core> 13: <std[bcb96dfbba0ab899]::thread::lifecycle::spawn_unchecked<test[75d6903177b1d7e9]::run_test::{closure#1}, ()>::{closure#1} as core[940e698046960fd5]::ops::function::FnOnce<()>>::call_once::{shim:vtable#0}<unknown>
  296. 32.28 s gammaloop-nextest-core> at <unknown source file>:<unknown line>
  297. 32.28 s gammaloop-nextest-core> 14: <std[bcb96dfbba0ab899]::sys::thread::unix::Thread>::new::thread_start<unknown>
  298. 32.28 s gammaloop-nextest-core> at <unknown source file>:<unknown line>
  299. 32.28 s gammaloop-nextest-core> 15: start_thread<unknown>
  300. 32.28 s gammaloop-nextest-core> at <unknown source file>:<unknown line>
  301. 32.28 s gammaloop-nextest-core> 16: __clone3<unknown>
  302. 32.28 s gammaloop-nextest-core> at <unknown source file>:<unknown line>
  303. 32.28 s gammaloop-nextest-core>
  304. 32.28 s gammaloop-nextest-core> Run with COLORBT_SHOW_HIDDEN=1 environment variable to disable frame filtering.
  305. 32.28 s gammaloop-nextest-core> Run with RUST_BACKTRACE=full to include source snippets.
  306. 32.28 s gammaloop-nextest-core>
  307. 32.28 s gammaloop-nextest-core> FAIL [ 3.481s] (452/456) gammalooprs::test_renormalization finite_part_ghost_2loop
  308. 32.28 s gammaloop-nextest-core> stdout ---
  309. 32.28 s gammaloop-nextest-core>
  310. 32.28 s gammaloop-nextest-core> running 1 test
  311. 32.28 s gammaloop-nextest-core> ━━━━━━━━━━━━━━━━━━━━━━━━━━━━━━━ Snapshot Summary ━━━━━━━━━━━━━━━━━━━━━━━━━━━━━━━
  312. 32.28 s gammaloop-nextest-core> Snapshot: finite_part_ghost_2loop-3
  313. 32.28 s gammaloop-nextest-core> Source: crates/gammalooprs/tests/test_renormalization.rs:464
  314. 32.28 s gammaloop-nextest-core> ────────────────────────────────────────────────────────────────────────────────
  315. 32.28 s gammaloop-nextest-core> Expression: align_to_rqft(&a, &model).to_bare_ordered_string()
  316. 32.28 s gammaloop-nextest-core> ────────────────────────────────────────────────────────────────────────────────
  317. 32.28 s gammaloop-nextest-core> -old snapshot
  318. 32.28 s gammaloop-nextest-core> +new results
  319. 32.28 s gammaloop-nextest-core> ────────────┬───────────────────────────────────────────────────────────────────
  320. 32.28 s gammaloop-nextest-core> 1 │-(-1𝑖/32*ε+1𝑖/16)*(cas(2,coad(8)))^2*dot(P(0,mink(4)),P(0,mink(4)))*gs^4*ε^(-2)
  321. 32.28 s gammaloop-nextest-core> 1 │+(-1𝑖/16+1𝑖/32*ε)*(cas(2,coad(8)))^2*dot(P(0,mink(4)),P(0,mink(4)))*gs^4*ε^(-2)
  322. 32.28 s gammaloop-nextest-core> ────────────┴───────────────────────────────────────────────────────────────────
  323. 32.28 s gammaloop-nextest-core> To update snapshots run `cargo insta review`
  324. 32.28 s gammaloop-nextest-core> Stopped on the first failure. Run `cargo insta test` to run all snapshots.
  325. 32.28 s gammaloop-nextest-core> test finite_part_ghost_2loop ... FAILED
  326. 32.28 s gammaloop-nextest-core>
  327. 32.28 s gammaloop-nextest-core> failures:
  328. 32.28 s gammaloop-nextest-core>
  329. 32.28 s gammaloop-nextest-core> failures:
  330. 32.28 s gammaloop-nextest-core> finite_part_ghost_2loop
  331. 32.28 s gammaloop-nextest-core>
  332. 32.28 s gammaloop-nextest-core> test result: FAILED. 0 passed; 1 failed; 0 ignored; 0 measured; 5 filtered out; finished in 3.47s
  333. 32.28 s gammaloop-nextest-core>
  334. 32.28 s gammaloop-nextest-core> stderr ---
  335. 32.28 s gammaloop-nextest-core> The application panicked (crashed).
  336. 32.28 s gammaloop-nextest-core> Message: snapshot assertion for 'finite_part_ghost_2loop-3' failed in line 464
  337. 32.28 s gammaloop-nextest-core> Location: /nix/store/30svmzr0z0zpcqjyynjn7w21wgx18y4b-vendor-cargo-deps/c19b7c6f923b580ac259164a89f2577984ad5ab09ee9d583b888f934adbbe8d0/insta-1.47.2/src/runtime.rs:719
  338. 32.28 s gammaloop-nextest-core>
  339. 32.28 s gammaloop-nextest-core> ━━━━━━━━━━━━━━━━━━━━━━━━━━━━━━━━━━ BACKTRACE ━━━━━━━━━━━━━━━━━━━━━━━━━━━━━━━━━━━
  340. 32.28 s gammaloop-nextest-core> 1: <color_eyre[51793ea62743adbd]::config::PanicHook>::panic_report<unknown>
  341. 32.28 s gammaloop-nextest-core> at <unknown source file>:<unknown line>
  342. 32.28 s gammaloop-nextest-core> 2: <color_eyre[51793ea62743adbd]::config::PanicHook>::into_panic_hook::{closure#0}<unknown>
  343. 32.28 s gammaloop-nextest-core> at <unknown source file>:<unknown line>
  344. 32.28 s gammaloop-nextest-core> 3: std[bcb96dfbba0ab899]::panicking::panic_with_hook<unknown>
  345. 32.28 s gammaloop-nextest-core> at <unknown source file>:<unknown line>
  346. 32.28 s gammaloop-nextest-core> 4: std[bcb96dfbba0ab899]::panicking::panic_handler::{closure#0}<unknown>
  347. 32.28 s gammaloop-nextest-core> at <unknown source file>:<unknown line>
  348. 32.28 s gammaloop-nextest-core> 5: std[bcb96dfbba0ab899]::sys::backtrace::__rust_end_short_backtrace::<std[bcb96dfbba0ab899]::panicking::panic_handler::{closure#0}, !><unknown>
  349. 32.28 s gammaloop-nextest-core> at <unknown source file>:<unknown line>
  350. 32.28 s gammaloop-nextest-core> 6: __rustc[6c289b9f9c454d21]::rust_begin_unwind<unknown>
  351. 32.28 s gammaloop-nextest-core> at <unknown source file>:<unknown line>
  352. 32.28 s gammaloop-nextest-core> 7: core[940e698046960fd5]::panicking::panic_fmt<unknown>
  353. 32.28 s gammaloop-nextest-core> at <unknown source file>:<unknown line>
  354. 32.28 s gammaloop-nextest-core> 8: insta[307a548ac79ef4d9]::runtime::assert_snapshot<unknown>
  355. 32.28 s gammaloop-nextest-core> at <unknown source file>:<unknown line>
  356. 32.28 s gammaloop-nextest-core> 9: test_renormalization[9b33d9b78f5a79c8]::finite_part_ghost_2loop<unknown>
  357. 32.28 s gammaloop-nextest-core> at <unknown source file>:<unknown line>
  358. 32.28 s gammaloop-nextest-core> 10: <test_renormalization[9b33d9b78f5a79c8]::finite_part_ghost_2loop::{closure#0} as core[940e698046960fd5]::ops::function::FnOnce<()>>::call_once<unknown>
  359. 32.28 s gammaloop-nextest-core> at <unknown source file>:<unknown line>
  360. 32.28 s gammaloop-nextest-core> 11: test[75d6903177b1d7e9]::__rust_begin_short_backtrace::<core[940e698046960fd5]::result::Result<(), alloc[2ea6bcb46fca0c42]::string::String>, fn() -> core[940e698046960fd5]::result::Result<(), alloc[2ea6bcb46fca0c42]::string::String>><unknown>
  361. 32.28 s gammaloop-nextest-core> at <unknown source file>:<unknown line>
  362. 32.28 s gammaloop-nextest-core> 12: test[75d6903177b1d7e9]::run_test::{closure#0}<unknown>
  363. 32.28 s gammaloop-nextest-core> at <unknown source file>:<unknown line>
  364. 32.28 s gammaloop-nextest-core> 13: std[bcb96dfbba0ab899]::sys::backtrace::__rust_begin_short_backtrace::<test[75d6903177b1d7e9]::run_test::{closure#1}, ()><unknown>
  365. 32.28 s gammaloop-nextest-core> at <unknown source file>:<unknown line>
  366. 32.28 s gammaloop-nextest-core> 14: <std[bcb96dfbba0ab899]::thread::lifecycle::spawn_unchecked<test[75d6903177b1d7e9]::run_test::{closure#1}, ()>::{closure#1} as core[940e698046960fd5]::ops::function::FnOnce<()>>::call_once::{shim:vtable#0}<unknown>
  367. 32.28 s gammaloop-nextest-core> at <unknown source file>:<unknown line>
  368. 32.28 s gammaloop-nextest-core> 15: <std[bcb96dfbba0ab899]::sys::thread::unix::Thread>::new::thread_start<unknown>
  369. 32.28 s gammaloop-nextest-core> at <unknown source file>:<unknown line>
  370. 32.28 s gammaloop-nextest-core> 16: start_thread<unknown>
  371. 32.28 s gammaloop-nextest-core> at <unknown source file>:<unknown line>
  372. 32.28 s gammaloop-nextest-core> 17: __clone3<unknown>
  373. 32.28 s gammaloop-nextest-core> at <unknown source file>:<unknown line>
  374. 32.28 s gammaloop-nextest-core>
  375. 32.28 s gammaloop-nextest-core> Run with COLORBT_SHOW_HIDDEN=1 environment variable to disable frame filtering.
  376. 32.28 s gammaloop-nextest-core> Run with RUST_BACKTRACE=full to include source snippets.
  377. 32.28 s gammaloop-nextest-core>
  378. 32.33 s gammaloop-nextest-core> error: test run failed
  379. 32.35 s gammaloop-nextest-core>
  380. 32.35 s gammaloop-nextest-core> ========== nextest test summary ==========
  381. 32.35 s gammaloop-nextest-core> report: target/nextest/ci_gammaloop/junit.xml
  382. 32.35 s gammaloop-nextest-core> tests: 456, failures: 2, errors: 0
  383. 32.35 s gammaloop-nextest-core>
  384. 32.35 s gammaloop-nextest-core> 1. gammalooprs::test_renormalization::finit_part_ghlo
  385. 32.35 s gammaloop-nextest-core> failure: test failure with exit code 101
  386. 32.35 s gammaloop-nextest-core> system-out
  387. 32.35 s gammaloop-nextest-core> running 1 test
  388. 32.35 s gammaloop-nextest-core> ren part: 1/2*GC_10^2*dot(P(0,mink(dim)),P(0,mink(dim)))*cas(2,coad(8))/ε
  389. 32.35 s gammaloop-nextest-core> ━━━━━━━━━━━━━━━━━━━━━━━━━━━━━━━ Snapshot Summary ━━━━━━━━━━━━━━━━━━━━━━━━━━━━━━━
  390. 32.35 s gammaloop-nextest-core> Snapshot: finit_part_ghlo
  391. 32.35 s gammaloop-nextest-core> Source: crates/gammalooprs/tests/test_renormalization.rs:557
  392. 32.35 s gammaloop-nextest-core> ────────────────────────────────────────────────────────────────────────────────
  393. 32.35 s gammaloop-nextest-core> Expression: align_to_rqft(&a, &model).to_bare_ordered_string()
  394. 32.35 s gammaloop-nextest-core> ────────────────────────────────────────────────────────────────────────────────
  395. 32.35 s gammaloop-nextest-core> -old snapshot
  396. 32.35 s gammaloop-nextest-core> +new results
  397. 32.35 s gammaloop-nextest-core> ────────────┬───────────────────────────────────────────────────────────────────
  398. 32.35 s gammaloop-nextest-core> 1 │--1/2*cas(2,coad(8))*dot(P(0,mink(4)),P(0,mink(4)))*gs^2*ε^(-1)
  399. 32.35 s gammaloop-nextest-core> 1 │+1/2*cas(2,coad(8))*dot(P(0,mink(4)),P(0,mink(4)))*gs^2*ε^(-1)
  400. 32.35 s gammaloop-nextest-core> ────────────┴───────────────────────────────────────────────────────────────────
  401. 32.35 s gammaloop-nextest-core> To update snapshots run `cargo insta review`
  402. 32.35 s gammaloop-nextest-core> Stopped on the first failure. Run `cargo insta test` to run all snapshots.
  403. 32.35 s gammaloop-nextest-core> test finit_part_ghlo ... FAILED
  404. 32.35 s gammaloop-nextest-core>
  405. 32.35 s gammaloop-nextest-core> failures:
  406. 32.35 s gammaloop-nextest-core>
  407. 32.35 s gammaloop-nextest-core> failures:
  408. 32.35 s gammaloop-nextest-core> finit_part_ghlo
  409. 32.35 s gammaloop-nextest-core>
  410. 32.35 s gammaloop-nextest-core> test result: FAILED. 0 passed; 1 failed; 0 ignored; 0 measured; 5 filtered out; finished in 0.51s
  411. 32.35 s gammaloop-nextest-core> system-err
  412. 32.35 s gammaloop-nextest-core> The application panicked (crashed).
  413. 32.35 s gammaloop-nextest-core> Message: snapshot assertion for 'finit_part_ghlo' failed in line 557
  414. 32.35 s gammaloop-nextest-core> Location: /nix/store/30svmzr0z0zpcqjyynjn7w21wgx18y4b-vendor-cargo-deps/c19b7c6f923b580ac259164a89f2577984ad5ab09ee9d583b888f934adbbe8d0/insta-1.47.2/src/runtime.rs:719
  415. 32.35 s gammaloop-nextest-core>
  416. 32.35 s gammaloop-nextest-core> ━━━━━━━━━━━━━━━━━━━━━━━━━━━━━━━━━━ BACKTRACE ━━━━━━━━━━━━━━━━━━━━━━━━━━━━━━━━━━━
  417. 32.35 s gammaloop-nextest-core> 1: <color_eyre[51793ea62743adbd]::config::PanicHook>::panic_report<unknown>
  418. 32.35 s gammaloop-nextest-core> at <unknown source file>:<unknown line>
  419. 32.35 s gammaloop-nextest-core> 2: <color_eyre[51793ea62743adbd]::config::PanicHook>::into_panic_hook::{closure#0}<unknown>
  420. 32.35 s gammaloop-nextest-core> at <unknown source file>:<unknown line>
  421. 32.35 s gammaloop-nextest-core> 3: std[bcb96dfbba0ab899]::panicking::panic_with_hook<unknown>
  422. 32.35 s gammaloop-nextest-core> at <unknown source file>:<unknown line>
  423. 32.35 s gammaloop-nextest-core> 4: std[bcb96dfbba0ab899]::panicking::panic_handler::{closure#0}<unknown>
  424. 32.35 s gammaloop-nextest-core> at <unknown source file>:<unknown line>
  425. 32.35 s gammaloop-nextest-core> 5: std[bcb96dfbba0ab899]::sys::backtrace::__rust_end_short_backtrace::<std[bcb96dfbba0ab899]::panicking::panic_handler::{closure#0}, !><unknown>
  426. 32.35 s gammaloop-nextest-core> at <unknown source file>:<unknown line>
  427. 32.35 s gammaloop-nextest-core> 6: __rustc[6c289b9f9c454d21]::rust_begin_unwind<unknown>
  428. 32.35 s gammaloop-nextest-core> at <unknown source file>:<unknown line>
  429. 32.35 s gammaloop-nextest-core> 7: core[940e698046960fd5]::panicking::panic_fmt<unknown>
  430. 32.35 s gammaloop-nextest-core> at <unknown source file>:<unknown line>
  431. 32.35 s gammaloop-nextest-core> 8: insta[307a548ac79ef4d9]::runtime::assert_snapshot<unknown>
  432. 32.35 s gammaloop-nextest-core> at <unknown source file>:<unknown line>
  433. 32.35 s gammaloop-nextest-core> 9: <test_renormalization[9b33d9b78f5a79c8]::finit_part_ghlo::{closure#0} as core[940e698046960fd5]::ops::function::FnOnce<()>>::call_once<unknown>
  434. 32.35 s gammaloop-nextest-core> at <unknown source file>:<unknown line>
  435. 32.35 s gammaloop-nextest-core> 10: test[75d6903177b1d7e9]::__rust_begin_short_backtrace::<core[940e698046960fd5]::result::Result<(), alloc[2ea6bcb46fca0c42]::string::String>, fn() -> core[940e698046960fd5]::result::Result<(), alloc[2ea6bcb46fca0c42]::string::String>><unknown>
  436. 32.35 s gammaloop-nextest-core> at <unknown source file>:<unknown line>
  437. 32.35 s gammaloop-nextest-core> 11: test[75d6903177b1d7e9]::run_test::{closure#0}<unknown>
  438. 32.35 s gammaloop-nextest-core> at <unknown source file>:<unknown line>
  439. 32.35 s gammaloop-nextest-core> 12: std[bcb96dfbba0ab899]::sys::backtrace::__rust_begin_short_backtrace::<test[75d6903177b1d7e9]::run_test::{closure#1}, ()><unknown>
  440. 32.36 s gammaloop-nextest-core> at <unknown source file>:<unknown line>
  441. 32.36 s gammaloop-nextest-core> 13: <std[bcb96dfbba0ab899]::thread::lifecycle::spawn_unchecked<test[75d6903177b1d7e9]::run_test::{closure#1}, ()>::{closure#1} as core[940e698046960fd5]::ops::function::FnOnce<()>>::call_once::{shim:vtable#0}<unknown>
  442. 32.36 s gammaloop-nextest-core> at <unknown source file>:<unknown line>
  443. 32.36 s gammaloop-nextest-core> 14: <std[bcb96dfbba0ab899]::sys::thread::unix::Thread>::new::thread_start<unknown>
  444. 32.36 s gammaloop-nextest-core> at <unknown source file>:<unknown line>
  445. 32.36 s gammaloop-nextest-core> 15: start_thread<unknown>
  446. 32.36 s gammaloop-nextest-core> at <unknown source file>:<unknown line>
  447. 32.36 s gammaloop-nextest-core> 16: __clone3<unknown>
  448. 32.36 s gammaloop-nextest-core> at <unknown source file>:<unknown line>
  449. 32.36 s gammaloop-nextest-core>
  450. 32.36 s gammaloop-nextest-core> Run with COLORBT_SHOW_HIDDEN=1 environment variable to disable frame filtering.
  451. 32.36 s gammaloop-nextest-core> Run with RUST_BACKTRACE=full to include source snippets.
  452. 32.36 s gammaloop-nextest-core>
  453. 32.36 s gammaloop-nextest-core> 2. gammalooprs::test_renormalization::finite_part_ghost_2loop
  454. 32.36 s gammaloop-nextest-core> failure: test failure with exit code 101
  455. 32.36 s gammaloop-nextest-core> system-out
  456. 32.36 s gammaloop-nextest-core> running 1 test
  457. 32.36 s gammaloop-nextest-core> ━━━━━━━━━━━━━━━━━━━━━━━━━━━━━━━ Snapshot Summary ━━━━━━━━━━━━━━━━━━━━━━━━━━━━━━━
  458. 32.36 s gammaloop-nextest-core> Snapshot: finite_part_ghost_2loop-3
  459. 32.36 s gammaloop-nextest-core> Source: crates/gammalooprs/tests/test_renormalization.rs:464
  460. 32.36 s gammaloop-nextest-core> ────────────────────────────────────────────────────────────────────────────────
  461. 32.36 s gammaloop-nextest-core> Expression: align_to_rqft(&a, &model).to_bare_ordered_string()
  462. 32.36 s gammaloop-nextest-core> ────────────────────────────────────────────────────────────────────────────────
  463. 32.36 s gammaloop-nextest-core> -old snapshot
  464. 32.36 s gammaloop-nextest-core> +new results
  465. 32.36 s gammaloop-nextest-core> ────────────┬───────────────────────────────────────────────────────────────────
  466. 32.36 s gammaloop-nextest-core> 1 │-(-1𝑖/32*ε+1𝑖/16)*(cas(2,coad(8)))^2*dot(P(0,mink(4)),P(0,mink(4)))*gs^4*ε^(-2)
  467. 32.36 s gammaloop-nextest-core> 1 │+(-1𝑖/16+1𝑖/32*ε)*(cas(2,coad(8)))^2*dot(P(0,mink(4)),P(0,mink(4)))*gs^4*ε^(-2)
  468. 32.36 s gammaloop-nextest-core> ────────────┴───────────────────────────────────────────────────────────────────
  469. 32.36 s gammaloop-nextest-core> To update snapshots run `cargo insta review`
  470. 32.36 s gammaloop-nextest-core> Stopped on the first failure. Run `cargo insta test` to run all snapshots.
  471. 32.36 s gammaloop-nextest-core> test finite_part_ghost_2loop ... FAILED
  472. 32.36 s gammaloop-nextest-core>
  473. 32.36 s gammaloop-nextest-core> failures:
  474. 32.36 s gammaloop-nextest-core>
  475. 32.36 s gammaloop-nextest-core> failures:
  476. 32.36 s gammaloop-nextest-core> finite_part_ghost_2loop
  477. 32.36 s gammaloop-nextest-core>
  478. 32.36 s gammaloop-nextest-core> test result: FAILED. 0 passed; 1 failed; 0 ignored; 0 measured; 5 filtered out; finished in 3.47s
  479. 32.36 s gammaloop-nextest-core> system-err
  480. 32.36 s gammaloop-nextest-core> The application panicked (crashed).
  481. 32.36 s gammaloop-nextest-core> Message: snapshot assertion for 'finite_part_ghost_2loop-3' failed in line 464
  482. 32.36 s gammaloop-nextest-core> Location: /nix/store/30svmzr0z0zpcqjyynjn7w21wgx18y4b-vendor-cargo-deps/c19b7c6f923b580ac259164a89f2577984ad5ab09ee9d583b888f934adbbe8d0/insta-1.47.2/src/runtime.rs:719
  483. 32.36 s gammaloop-nextest-core>
  484. 32.36 s gammaloop-nextest-core> ━━━━━━━━━━━━━━━━━━━━━━━━━━━━━━━━━━ BACKTRACE ━━━━━━━━━━━━━━━━━━━━━━━━━━━━━━━━━━━
  485. 32.36 s gammaloop-nextest-core> 1: <color_eyre[51793ea62743adbd]::config::PanicHook>::panic_report<unknown>
  486. 32.36 s gammaloop-nextest-core> at <unknown source file>:<unknown line>
  487. 32.36 s gammaloop-nextest-core> 2: <color_eyre[51793ea62743adbd]::config::PanicHook>::into_panic_hook::{closure#0}<unknown>
  488. 32.36 s gammaloop-nextest-core> at <unknown source file>:<unknown line>
  489. 32.36 s gammaloop-nextest-core> 3: std[bcb96dfbba0ab899]::panicking::panic_with_hook<unknown>
  490. 32.36 s gammaloop-nextest-core> at <unknown source file>:<unknown line>
  491. 32.36 s gammaloop-nextest-core> 4: std[bcb96dfbba0ab899]::panicking::panic_handler::{closure#0}<unknown>
  492. 32.36 s gammaloop-nextest-core> at <unknown source file>:<unknown line>
  493. 32.36 s gammaloop-nextest-core> 5: std[bcb96dfbba0ab899]::sys::backtrace::__rust_end_short_backtrace::<std[bcb96dfbba0ab899]::panicking::panic_handler::{closure#0}, !><unknown>
  494. 32.36 s gammaloop-nextest-core> at <unknown source file>:<unknown line>
  495. 32.36 s gammaloop-nextest-core> 6: __rustc[6c289b9f9c454d21]::rust_begin_unwind<unknown>
  496. 32.36 s gammaloop-nextest-core> at <unknown source file>:<unknown line>
  497. 32.36 s gammaloop-nextest-core> 7: core[940e698046960fd5]::panicking::panic_fmt<unknown>
  498. 32.36 s gammaloop-nextest-core> at <unknown source file>:<unknown line>
  499. 32.36 s gammaloop-nextest-core> 8: insta[307a548ac79ef4d9]::runtime::assert_snapshot<unknown>
  500. 32.36 s gammaloop-nextest-core> at <unknown source file>:<unknown line>
  501. 32.36 s gammaloop-nextest-core> 9: test_renormalization[9b33d9b78f5a79c8]::finite_part_ghost_2loop<unknown>
  502. 32.36 s gammaloop-nextest-core> at <unknown source file>:<unknown line>
  503. 32.36 s gammaloop-nextest-core> 10: <test_renormalization[9b33d9b78f5a79c8]::finite_part_ghost_2loop::{closure#0} as core[940e698046960fd5]::ops::function::FnOnce<()>>::call_once<unknown>
  504. 32.36 s gammaloop-nextest-core> at <unknown source file>:<unknown line>
  505. 32.36 s gammaloop-nextest-core> 11: test[75d6903177b1d7e9]::__rust_begin_short_backtrace::<core[940e698046960fd5]::result::Result<(), alloc[2ea6bcb46fca0c42]::string::String>, fn() -> core[940e698046960fd5]::result::Result<(), alloc[2ea6bcb46fca0c42]::string::String>><unknown>
  506. 32.36 s gammaloop-nextest-core> at <unknown source file>:<unknown line>
  507. 32.36 s gammaloop-nextest-core> 12: test[75d6903177b1d7e9]::run_test::{closure#0}<unknown>
  508. 32.36 s gammaloop-nextest-core> at <unknown source file>:<unknown line>
  509. 32.36 s gammaloop-nextest-core> 13: std[bcb96dfbba0ab899]::sys::backtrace::__rust_begin_short_backtrace::<test[75d6903177b1d7e9]::run_test::{closure#1}, ()><unknown>
  510. 32.36 s gammaloop-nextest-core> at <unknown source file>:<unknown line>
  511. 32.36 s gammaloop-nextest-core> 14: <std[bcb96dfbba0ab899]::thread::lifecycle::spawn_unchecked<test[75d6903177b1d7e9]::run_test::{closure#1}, ()>::{closure#1} as core[940e698046960fd5]::ops::function::FnOnce<()>>::call_once::{shim:vtable#0}<unknown>
  512. 32.36 s gammaloop-nextest-core> at <unknown source file>:<unknown line>
  513. 32.36 s gammaloop-nextest-core> 15: <std[bcb96dfbba0ab899]::sys::thread::unix::Thread>::new::thread_start<unknown>
  514. 32.36 s gammaloop-nextest-core> at <unknown source file>:<unknown line>
  515. 32.36 s gammaloop-nextest-core> 16: start_thread<unknown>
  516. 32.36 s gammaloop-nextest-core> at <unknown source file>:<unknown line>
  517. 32.36 s gammaloop-nextest-core> 17: __clone3<unknown>
  518. 32.36 s gammaloop-nextest-core> at <unknown source file>:<unknown line>
  519. 32.36 s gammaloop-nextest-core>
  520. 32.36 s gammaloop-nextest-core> Run with COLORBT_SHOW_HIDDEN=1 environment variable to disable frame filtering.
  521. 32.36 s gammaloop-nextest-core> Run with RUST_BACKTRACE=full to include source snippets.
  522. 32.36 s gammaloop-nextest-core> =========================================
  523. 32.40 s error: Cannot build '/nix/store/xv6l7wp14z4xm05gkaqsp0kipvyasvyi-gammaloop-nextest-core.drv'.
  524. 32.40 s Reason: builder failed with exit code 100.
  525. 32.40 s Output paths:
  526. 32.40 s /nix/store/g869clijr55vrmm4yficyx8bc82mc3as-gammaloop-nextest-core
  527. 32.40 s Last 473 log lines:
  528. 32.40 s > Extracting 3 binaries (including 1 non-test binary), 1 build script output directory, and 2 linked paths to /build/nextest-archive-Db1sa3
  529. 32.40 s > Extracted 18 files to /build/nextest-archive-Db1sa3 in 0.46s
  530. 32.40 s > ------------
  531. 32.40 s > Nextest run ID 025fe5d4-26a1-4cdb-9aab-9ed17ff4fc89 with nextest profile: ci_gammaloop
  532. 32.40 s > Starting 339 tests across 2 binaries
  533. 32.40 s > ------------
  534. 32.40 s > Summary [ 0.514s] 339 tests run: 339 passed, 0 skipped
  535. 32.40 s >
  536. 32.40 s > ========== nextest test summary ==========
  537. 32.40 s > report: target/nextest/ci_gammaloop/junit.xml
  538. 32.40 s > tests: 339, failures: 0, errors: 0
  539. 32.40 s > No failing testcases found.
  540. 32.40 s > =========================================
  541. 32.40 s > Extracting 1 binary and 1 linked path to /build/nextest-archive-AAGvmf
  542. 32.40 s > Extracted 7 files to /build/nextest-archive-AAGvmf in 0.06s
  543. 32.40 s > ------------
  544. 32.40 s > Nextest run ID 00d651af-2e59-4c3e-ab18-3c5152cc6a0a with nextest profile: ci_gammaloop
  545. 32.40 s > Starting 19 tests across 1 binary
  546. 32.40 s > ------------
  547. 32.40 s > Summary [ 0.015s] 19 tests run: 19 passed, 0 skipped
  548. 32.40 s >
  549. 32.40 s > ========== nextest test summary ==========
  550. 32.40 s > report: target/nextest/ci_gammaloop/junit.xml
  551. 32.40 s > tests: 19, failures: 0, errors: 0
  552. 32.40 s > No failing testcases found.
  553. 32.40 s > =========================================
  554. 32.40 s > Extracting 1 binary to /build/nextest-archive-ru0p3j
  555. 32.40 s > Extracted 4 files to /build/nextest-archive-ru0p3j in 0.04s
  556. 32.40 s > ------------
  557. 32.40 s > Nextest run ID 014080bc-dce8-4238-b3e2-8aa175317c64 with nextest profile: ci_gammaloop
  558. 32.40 s > Starting 0 tests across 1 binary
  559. 32.40 s > ------------
  560. 32.40 s > Summary [ 0.000s] 0 tests run: 0 passed, 0 skipped
  561. 32.40 s >
  562. 32.40 s > ========== nextest test summary ==========
  563. 32.40 s > report: target/nextest/ci_gammaloop/junit.xml
  564. 32.40 s > tests: 0, failures: 0, errors: 0
  565. 32.40 s > No failing testcases found.
  566. 32.40 s > =========================================
  567. 32.40 s > Extracting 4 binaries, 1 build script output directory, and 2 linked paths to /build/nextest-archive-CQEwE4
  568. 32.40 s > Extracted 18 files to /build/nextest-archive-CQEwE4 in 0.46s
  569. 32.40 s > ------------
  570. 32.40 s > Nextest run ID 5ccedf9e-e08a-4b54-a7f1-6beac3abb89d with nextest profile: ci_gammaloop
  571. 32.40 s > Starting 456 tests across 4 binaries (61 tests skipped, including 60 tests via profile.ci_gammaloop.default-filter)
  572. 32.40 s > FAIL [ 0.528s] (444/456) gammalooprs::test_renormalization finit_part_ghlo
  573. 32.40 s > stdout ---
  574. 32.40 s >
  575. 32.40 s > running 1 test
  576. 32.40 s > ren part: 1/2*GC_10^2*dot(P(0,mink(dim)),P(0,mink(dim)))*cas(2,coad(8))/ε
  577. 32.40 s > ━━━━━━━━━━━━━━━━━━━━━━━━━━━━━━━ Snapshot Summary ━━━━━━━━━━━━━━━━━━━━━━━━━━━━━━━
  578. 32.40 s > Snapshot: finit_part_ghlo
  579. 32.40 s > Source: crates/gammalooprs/tests/test_renormalization.rs:557
  580. 32.40 s > ────────────────────────────────────────────────────────────────────────────────
  581. 32.40 s > Expression: align_to_rqft(&a, &model).to_bare_ordered_string()
  582. 32.40 s > ────────────────────────────────────────────────────────────────────────────────
  583. 32.40 s > -old snapshot
  584. 32.40 s > +new results
  585. 32.40 s > ────────────┬───────────────────────────────────────────────────────────────────
  586. 32.40 s > 1 │--1/2*cas(2,coad(8))*dot(P(0,mink(4)),P(0,mink(4)))*gs^2*ε^(-1)
  587. 32.40 s > 1 │+1/2*cas(2,coad(8))*dot(P(0,mink(4)),P(0,mink(4)))*gs^2*ε^(-1)
  588. 32.40 s > ────────────┴───────────────────────────────────────────────────────────────────
  589. 32.40 s > To update snapshots run `cargo insta review`
  590. 32.40 s > Stopped on the first failure. Run `cargo insta test` to run all snapshots.
  591. 32.40 s > test finit_part_ghlo ... FAILED
  592. 32.40 s >
  593. 32.40 s > failures:
  594. 32.40 s >
  595. 32.40 s > failures:
  596. 32.40 s > finit_part_ghlo
  597. 32.40 s >
  598. 32.40 s > test result: FAILED. 0 passed; 1 failed; 0 ignored; 0 measured; 5 filtered out; finished in 0.51s
  599. 32.40 s >
  600. 32.40 s > stderr ---
  601. 32.40 s > The application panicked (crashed).
  602. 32.40 s > Message: snapshot assertion for 'finit_part_ghlo' failed in line 557
  603. 32.40 s > Location: /nix/store/30svmzr0z0zpcqjyynjn7w21wgx18y4b-vendor-cargo-deps/c19b7c6f923b580ac259164a89f2577984ad5ab09ee9d583b888f934adbbe8d0/insta-1.47.2/src/runtime.rs:719
  604. 32.40 s >
  605. 32.40 s > ━━━━━━━━━━━━━━━━━━━━━━━━━━━━━━━━━━ BACKTRACE ━━━━━━━━━━━━━━━━━━━━━━━━━━━━━━━━━━━
  606. 32.40 s > 1: <color_eyre[51793ea62743adbd]::config::PanicHook>::panic_report<unknown>
  607. 32.40 s > at <unknown source file>:<unknown line>
  608. 32.40 s > 2: <color_eyre[51793ea62743adbd]::config::PanicHook>::into_panic_hook::{closure#0}<unknown>
  609. 32.40 s > at <unknown source file>:<unknown line>
  610. 32.40 s > 3: std[bcb96dfbba0ab899]::panicking::panic_with_hook<unknown>
  611. 32.40 s > at <unknown source file>:<unknown line>
  612. 32.40 s > 4: std[bcb96dfbba0ab899]::panicking::panic_handler::{closure#0}<unknown>
  613. 32.40 s > at <unknown source file>:<unknown line>
  614. 32.40 s > 5: std[bcb96dfbba0ab899]::sys::backtrace::__rust_end_short_backtrace::<std[bcb96dfbba0ab899]::panicking::panic_handler::{closure#0}, !><unknown>
  615. 32.40 s > at <unknown source file>:<unknown line>
  616. 32.40 s > 6: __rustc[6c289b9f9c454d21]::rust_begin_unwind<unknown>
  617. 32.40 s > at <unknown source file>:<unknown line>
  618. 32.40 s > 7: core[940e698046960fd5]::panicking::panic_fmt<unknown>
  619. 32.40 s > at <unknown source file>:<unknown line>
  620. 32.40 s > 8: insta[307a548ac79ef4d9]::runtime::assert_snapshot<unknown>
  621. 32.40 s > at <unknown source file>:<unknown line>
  622. 32.40 s > 9: <test_renormalization[9b33d9b78f5a79c8]::finit_part_ghlo::{closure#0} as core[940e698046960fd5]::ops::function::FnOnce<()>>::call_once<unknown>
  623. 32.40 s > at <unknown source file>:<unknown line>
  624. 32.40 s > 10: test[75d6903177b1d7e9]::__rust_begin_short_backtrace::<core[940e698046960fd5]::result::Result<(), alloc[2ea6bcb46fca0c42]::string::String>, fn() -> core[940e698046960fd5]::result::Result<(), alloc[2ea6bcb46fca0c42]::string::String>><unknown>
  625. 32.40 s > at <unknown source file>:<unknown line>
  626. 32.40 s > 11: test[75d6903177b1d7e9]::run_test::{closure#0}<unknown>
  627. 32.40 s > at <unknown source file>:<unknown line>
  628. 32.40 s > 12: std[bcb96dfbba0ab899]::sys::backtrace::__rust_begin_short_backtrace::<test[75d6903177b1d7e9]::run_test::{closure#1}, ()><unknown>
  629. 32.40 s > at <unknown source file>:<unknown line>
  630. 32.40 s > 13: <std[bcb96dfbba0ab899]::thread::lifecycle::spawn_unchecked<test[75d6903177b1d7e9]::run_test::{closure#1}, ()>::{closure#1} as core[940e698046960fd5]::ops::function::FnOnce<()>>::call_once::{shim:vtable#0}<unknown>
  631. 32.40 s > at <unknown source file>:<unknown line>
  632. 32.40 s > 14: <std[bcb96dfbba0ab899]::sys::thread::unix::Thread>::new::thread_start<unknown>
  633. 32.40 s > at <unknown source file>:<unknown line>
  634. 32.40 s > 15: start_thread<unknown>
  635. 32.40 s > at <unknown source file>:<unknown line>
  636. 32.40 s > 16: __clone3<unknown>
  637. 32.40 s > at <unknown source file>:<unknown line>
  638. 32.40 s >
  639. 32.40 s > Run with COLORBT_SHOW_HIDDEN=1 environment variable to disable frame filtering.
  640. 32.40 s > Run with RUST_BACKTRACE=full to include source snippets.
  641. 32.40 s >
  642. 32.40 s > FAIL [ 3.481s] (452/456) gammalooprs::test_renormalization finite_part_ghost_2loop
  643. 32.40 s > stdout ---
  644. 32.40 s >
  645. 32.40 s > running 1 test
  646. 32.40 s > ━━━━━━━━━━━━━━━━━━━━━━━━━━━━━━━ Snapshot Summary ━━━━━━━━━━━━━━━━━━━━━━━━━━━━━━━
  647. 32.40 s > Snapshot: finite_part_ghost_2loop-3
  648. 32.40 s > Source: crates/gammalooprs/tests/test_renormalization.rs:464
  649. 32.40 s > ────────────────────────────────────────────────────────────────────────────────
  650. 32.40 s > Expression: align_to_rqft(&a, &model).to_bare_ordered_string()
  651. 32.40 s > ────────────────────────────────────────────────────────────────────────────────
  652. 32.40 s > -old snapshot
  653. 32.40 s > +new results
  654. 32.40 s > ────────────┬───────────────────────────────────────────────────────────────────
  655. 32.40 s > 1 │-(-1𝑖/32*ε+1𝑖/16)*(cas(2,coad(8)))^2*dot(P(0,mink(4)),P(0,mink(4)))*gs^4*ε^(-2)
  656. 32.40 s > 1 │+(-1𝑖/16+1𝑖/32*ε)*(cas(2,coad(8)))^2*dot(P(0,mink(4)),P(0,mink(4)))*gs^4*ε^(-2)
  657. 32.40 s > ────────────┴───────────────────────────────────────────────────────────────────
  658. 32.40 s > To update snapshots run `cargo insta review`
  659. 32.40 s > Stopped on the first failure. Run `cargo insta test` to run all snapshots.
  660. 32.40 s > test finite_part_ghost_2loop ... FAILED
  661. 32.40 s >
  662. 32.40 s > failures:
  663. 32.40 s >
  664. 32.40 s > failures:
  665. 32.40 s > finite_part_ghost_2loop
  666. 32.40 s >
  667. 32.40 s > test result: FAILED. 0 passed; 1 failed; 0 ignored; 0 measured; 5 filtered out; finished in 3.47s
  668. 32.40 s >
  669. 32.40 s > stderr ---
  670. 32.40 s > The application panicked (crashed).
  671. 32.40 s > Message: snapshot assertion for 'finite_part_ghost_2loop-3' failed in line 464
  672. 32.40 s > Location: /nix/store/30svmzr0z0zpcqjyynjn7w21wgx18y4b-vendor-cargo-deps/c19b7c6f923b580ac259164a89f2577984ad5ab09ee9d583b888f934adbbe8d0/insta-1.47.2/src/runtime.rs:719
  673. 32.40 s >
  674. 32.40 s > ━━━━━━━━━━━━━━━━━━━━━━━━━━━━━━━━━━ BACKTRACE ━━━━━━━━━━━━━━━━━━━━━━━━━━━━━━━━━━━
  675. 32.40 s > 1: <color_eyre[51793ea62743adbd]::config::PanicHook>::panic_report<unknown>
  676. 32.40 s > at <unknown source file>:<unknown line>
  677. 32.40 s > 2: <color_eyre[51793ea62743adbd]::config::PanicHook>::into_panic_hook::{closure#0}<unknown>
  678. 32.40 s > at <unknown source file>:<unknown line>
  679. 32.40 s > 3: std[bcb96dfbba0ab899]::panicking::panic_with_hook<unknown>
  680. 32.40 s > at <unknown source file>:<unknown line>
  681. 32.40 s > 4: std[bcb96dfbba0ab899]::panicking::panic_handler::{closure#0}<unknown>
  682. 32.40 s > at <unknown source file>:<unknown line>
  683. 32.40 s > 5: std[bcb96dfbba0ab899]::sys::backtrace::__rust_end_short_backtrace::<std[bcb96dfbba0ab899]::panicking::panic_handler::{closure#0}, !><unknown>
  684. 32.40 s > at <unknown source file>:<unknown line>
  685. 32.40 s > 6: __rustc[6c289b9f9c454d21]::rust_begin_unwind<unknown>
  686. 32.40 s > at <unknown source file>:<unknown line>
  687. 32.40 s > 7: core[940e698046960fd5]::panicking::panic_fmt<unknown>
  688. 32.40 s > at <unknown source file>:<unknown line>
  689. 32.40 s > 8: insta[307a548ac79ef4d9]::runtime::assert_snapshot<unknown>
  690. 32.40 s > at <unknown source file>:<unknown line>
  691. 32.40 s > 9: test_renormalization[9b33d9b78f5a79c8]::finite_part_ghost_2loop<unknown>
  692. 32.40 s > at <unknown source file>:<unknown line>
  693. 32.40 s > 10: <test_renormalization[9b33d9b78f5a79c8]::finite_part_ghost_2loop::{closure#0} as core[940e698046960fd5]::ops::function::FnOnce<()>>::call_once<unknown>
  694. 32.40 s > at <unknown source file>:<unknown line>
  695. 32.40 s > 11: test[75d6903177b1d7e9]::__rust_begin_short_backtrace::<core[940e698046960fd5]::result::Result<(), alloc[2ea6bcb46fca0c42]::string::String>, fn() -> core[940e698046960fd5]::result::Result<(), alloc[2ea6bcb46fca0c42]::string::String>><unknown>
  696. 32.40 s > at <unknown source file>:<unknown line>
  697. 32.40 s > 12: test[75d6903177b1d7e9]::run_test::{closure#0}<unknown>
  698. 32.40 s > at <unknown source file>:<unknown line>
  699. 32.40 s > 13: std[bcb96dfbba0ab899]::sys::backtrace::__rust_begin_short_backtrace::<test[75d6903177b1d7e9]::run_test::{closure#1}, ()><unknown>
  700. 32.40 s > at <unknown source file>:<unknown line>
  701. 32.40 s > 14: <std[bcb96dfbba0ab899]::thread::lifecycle::spawn_unchecked<test[75d6903177b1d7e9]::run_test::{closure#1}, ()>::{closure#1} as core[940e698046960fd5]::ops::function::FnOnce<()>>::call_once::{shim:vtable#0}<unknown>
  702. 32.40 s > at <unknown source file>:<unknown line>
  703. 32.40 s > 15: <std[bcb96dfbba0ab899]::sys::thread::unix::Thread>::new::thread_start<unknown>
  704. 32.40 s > at <unknown source file>:<unknown line>
  705. 32.40 s > 16: start_thread<unknown>
  706. 32.40 s > at <unknown source file>:<unknown line>
  707. 32.40 s > 17: __clone3<unknown>
  708. 32.40 s > at <unknown source file>:<unknown line>
  709. 32.40 s >
  710. 32.40 s > Run with COLORBT_SHOW_HIDDEN=1 environment variable to disable frame filtering.
  711. 32.40 s > Run with RUST_BACKTRACE=full to include source snippets.
  712. 32.40 s >
  713. 32.40 s > ------------
  714. 32.40 s > Summary [ 10.428s] 456 tests run: 454 passed, 2 failed, 61 skipped
  715. 32.40 s > FAIL [ 0.528s] (444/456) gammalooprs::test_renormalization finit_part_ghlo
  716. 32.40 s > stdout ---
  717. 32.40 s >
  718. 32.40 s > running 1 test
  719. 32.40 s > ren part: 1/2*GC_10^2*dot(P(0,mink(dim)),P(0,mink(dim)))*cas(2,coad(8))/ε
  720. 32.40 s > ━━━━━━━━━━━━━━━━━━━━━━━━━━━━━━━ Snapshot Summary ━━━━━━━━━━━━━━━━━━━━━━━━━━━━━━━
  721. 32.40 s > Snapshot: finit_part_ghlo
  722. 32.40 s > Source: crates/gammalooprs/tests/test_renormalization.rs:557
  723. 32.40 s > ────────────────────────────────────────────────────────────────────────────────
  724. 32.40 s > Expression: align_to_rqft(&a, &model).to_bare_ordered_string()
  725. 32.40 s > ────────────────────────────────────────────────────────────────────────────────
  726. 32.40 s > -old snapshot
  727. 32.40 s > +new results
  728. 32.40 s > ────────────┬───────────────────────────────────────────────────────────────────
  729. 32.40 s > 1 │--1/2*cas(2,coad(8))*dot(P(0,mink(4)),P(0,mink(4)))*gs^2*ε^(-1)
  730. 32.40 s > 1 │+1/2*cas(2,coad(8))*dot(P(0,mink(4)),P(0,mink(4)))*gs^2*ε^(-1)
  731. 32.40 s > ────────────┴───────────────────────────────────────────────────────────────────
  732. 32.40 s > To update snapshots run `cargo insta review`
  733. 32.40 s > Stopped on the first failure. Run `cargo insta test` to run all snapshots.
  734. 32.40 s > test finit_part_ghlo ... FAILED
  735. 32.40 s >
  736. 32.40 s > failures:
  737. 32.40 s >
  738. 32.40 s > failures:
  739. 32.40 s > finit_part_ghlo
  740. 32.40 s >
  741. 32.40 s > test result: FAILED. 0 passed; 1 failed; 0 ignored; 0 measured; 5 filtered out; finished in 0.51s
  742. 32.40 s >
  743. 32.40 s > stderr ---
  744. 32.40 s > The application panicked (crashed).
  745. 32.40 s > Message: snapshot assertion for 'finit_part_ghlo' failed in line 557
  746. 32.40 s > Location: /nix/store/30svmzr0z0zpcqjyynjn7w21wgx18y4b-vendor-cargo-deps/c19b7c6f923b580ac259164a89f2577984ad5ab09ee9d583b888f934adbbe8d0/insta-1.47.2/src/runtime.rs:719
  747. 32.40 s >
  748. 32.40 s > ━━━━━━━━━━━━━━━━━━━━━━━━━━━━━━━━━━ BACKTRACE ━━━━━━━━━━━━━━━━━━━━━━━━━━━━━━━━━━━
  749. 32.40 s > 1: <color_eyre[51793ea62743adbd]::config::PanicHook>::panic_report<unknown>
  750. 32.40 s > at <unknown source file>:<unknown line>
  751. 32.40 s > 2: <color_eyre[51793ea62743adbd]::config::PanicHook>::into_panic_hook::{closure#0}<unknown>
  752. 32.40 s > at <unknown source file>:<unknown line>
  753. 32.40 s > 3: std[bcb96dfbba0ab899]::panicking::panic_with_hook<unknown>
  754. 32.40 s > at <unknown source file>:<unknown line>
  755. 32.40 s > 4: std[bcb96dfbba0ab899]::panicking::panic_handler::{closure#0}<unknown>
  756. 32.40 s > at <unknown source file>:<unknown line>
  757. 32.40 s > 5: std[bcb96dfbba0ab899]::sys::backtrace::__rust_end_short_backtrace::<std[bcb96dfbba0ab899]::panicking::panic_handler::{closure#0}, !><unknown>
  758. 32.40 s > at <unknown source file>:<unknown line>
  759. 32.40 s > 6: __rustc[6c289b9f9c454d21]::rust_begin_unwind<unknown>
  760. 32.40 s > at <unknown source file>:<unknown line>
  761. 32.40 s > 7: core[940e698046960fd5]::panicking::panic_fmt<unknown>
  762. 32.40 s > at <unknown source file>:<unknown line>
  763. 32.40 s > 8: insta[307a548ac79ef4d9]::runtime::assert_snapshot<unknown>
  764. 32.40 s > at <unknown source file>:<unknown line>
  765. 32.40 s > 9: <test_renormalization[9b33d9b78f5a79c8]::finit_part_ghlo::{closure#0} as core[940e698046960fd5]::ops::function::FnOnce<()>>::call_once<unknown>
  766. 32.40 s > at <unknown source file>:<unknown line>
  767. 32.40 s > 10: test[75d6903177b1d7e9]::__rust_begin_short_backtrace::<core[940e698046960fd5]::result::Result<(), alloc[2ea6bcb46fca0c42]::string::String>, fn() -> core[940e698046960fd5]::result::Result<(), alloc[2ea6bcb46fca0c42]::string::String>><unknown>
  768. 32.40 s > at <unknown source file>:<unknown line>
  769. 32.40 s > 11: test[75d6903177b1d7e9]::run_test::{closure#0}<unknown>
  770. 32.40 s > at <unknown source file>:<unknown line>
  771. 32.40 s > 12: std[bcb96dfbba0ab899]::sys::backtrace::__rust_begin_short_backtrace::<test[75d6903177b1d7e9]::run_test::{closure#1}, ()><unknown>
  772. 32.40 s > at <unknown source file>:<unknown line>
  773. 32.40 s > 13: <std[bcb96dfbba0ab899]::thread::lifecycle::spawn_unchecked<test[75d6903177b1d7e9]::run_test::{closure#1}, ()>::{closure#1} as core[940e698046960fd5]::ops::function::FnOnce<()>>::call_once::{shim:vtable#0}<unknown>
  774. 32.40 s > at <unknown source file>:<unknown line>
  775. 32.40 s > 14: <std[bcb96dfbba0ab899]::sys::thread::unix::Thread>::new::thread_start<unknown>
  776. 32.40 s > at <unknown source file>:<unknown line>
  777. 32.40 s > 15: start_thread<unknown>
  778. 32.40 s > at <unknown source file>:<unknown line>
  779. 32.40 s > 16: __clone3<unknown>
  780. 32.40 s > at <unknown source file>:<unknown line>
  781. 32.40 s >
  782. 32.40 s > Run with COLORBT_SHOW_HIDDEN=1 environment variable to disable frame filtering.
  783. 32.40 s > Run with RUST_BACKTRACE=full to include source snippets.
  784. 32.40 s >
  785. 32.40 s > FAIL [ 3.481s] (452/456) gammalooprs::test_renormalization finite_part_ghost_2loop
  786. 32.40 s > stdout ---
  787. 32.40 s >
  788. 32.40 s > running 1 test
  789. 32.40 s > ━━━━━━━━━━━━━━━━━━━━━━━━━━━━━━━ Snapshot Summary ━━━━━━━━━━━━━━━━━━━━━━━━━━━━━━━
  790. 32.40 s > Snapshot: finite_part_ghost_2loop-3
  791. 32.40 s > Source: crates/gammalooprs/tests/test_renormalization.rs:464
  792. 32.40 s > ────────────────────────────────────────────────────────────────────────────────
  793. 32.40 s > Expression: align_to_rqft(&a, &model).to_bare_ordered_string()
  794. 32.40 s > ────────────────────────────────────────────────────────────────────────────────
  795. 32.40 s > -old snapshot
  796. 32.40 s > +new results
  797. 32.40 s > ────────────┬───────────────────────────────────────────────────────────────────
  798. 32.40 s > 1 │-(-1𝑖/32*ε+1𝑖/16)*(cas(2,coad(8)))^2*dot(P(0,mink(4)),P(0,mink(4)))*gs^4*ε^(-2)
  799. 32.40 s > 1 │+(-1𝑖/16+1𝑖/32*ε)*(cas(2,coad(8)))^2*dot(P(0,mink(4)),P(0,mink(4)))*gs^4*ε^(-2)
  800. 32.40 s > ────────────┴───────────────────────────────────────────────────────────────────
  801. 32.40 s > To update snapshots run `cargo insta review`
  802. 32.40 s > Stopped on the first failure. Run `cargo insta test` to run all snapshots.
  803. 32.40 s > test finite_part_ghost_2loop ... FAILED
  804. 32.40 s >
  805. 32.40 s > failures:
  806. 32.40 s >
  807. 32.40 s > failures:
  808. 32.40 s > finite_part_ghost_2loop
  809. 32.40 s >
  810. 32.40 s > test result: FAILED. 0 passed; 1 failed; 0 ignored; 0 measured; 5 filtered out; finished in 3.47s
  811. 32.40 s >
  812. 32.40 s > stderr ---
  813. 32.40 s > The application panicked (crashed).
  814. 32.40 s > Message: snapshot assertion for 'finite_part_ghost_2loop-3' failed in line 464
  815. 32.40 s > Location: /nix/store/30svmzr0z0zpcqjyynjn7w21wgx18y4b-vendor-cargo-deps/c19b7c6f923b580ac259164a89f2577984ad5ab09ee9d583b888f934adbbe8d0/insta-1.47.2/src/runtime.rs:719
  816. 32.40 s >
  817. 32.40 s > ━━━━━━━━━━━━━━━━━━━━━━━━━━━━━━━━━━ BACKTRACE ━━━━━━━━━━━━━━━━━━━━━━━━━━━━━━━━━━━
  818. 32.40 s > 1: <color_eyre[51793ea62743adbd]::config::PanicHook>::panic_report<unknown>
  819. 32.40 s > at <unknown source file>:<unknown line>
  820. 32.40 s > 2: <color_eyre[51793ea62743adbd]::config::PanicHook>::into_panic_hook::{closure#0}<unknown>
  821. 32.40 s > at <unknown source file>:<unknown line>
  822. 32.40 s > 3: std[bcb96dfbba0ab899]::panicking::panic_with_hook<unknown>
  823. 32.40 s > at <unknown source file>:<unknown line>
  824. 32.40 s > 4: std[bcb96dfbba0ab899]::panicking::panic_handler::{closure#0}<unknown>
  825. 32.40 s > at <unknown source file>:<unknown line>
  826. 32.40 s > 5: std[bcb96dfbba0ab899]::sys::backtrace::__rust_end_short_backtrace::<std[bcb96dfbba0ab899]::panicking::panic_handler::{closure#0}, !><unknown>
  827. 32.40 s > at <unknown source file>:<unknown line>
  828. 32.40 s > 6: __rustc[6c289b9f9c454d21]::rust_begin_unwind<unknown>
  829. 32.40 s > at <unknown source file>:<unknown line>
  830. 32.40 s > 7: core[940e698046960fd5]::panicking::panic_fmt<unknown>
  831. 32.40 s > at <unknown source file>:<unknown line>
  832. 32.40 s > 8: insta[307a548ac79ef4d9]::runtime::assert_snapshot<unknown>
  833. 32.40 s > at <unknown source file>:<unknown line>
  834. 32.40 s > 9: test_renormalization[9b33d9b78f5a79c8]::finite_part_ghost_2loop<unknown>
  835. 32.40 s > at <unknown source file>:<unknown line>
  836. 32.40 s > 10: <test_renormalization[9b33d9b78f5a79c8]::finite_part_ghost_2loop::{closure#0} as core[940e698046960fd5]::ops::function::FnOnce<()>>::call_once<unknown>
  837. 32.40 s > at <unknown source file>:<unknown line>
  838. 32.40 s > 11: test[75d6903177b1d7e9]::__rust_begin_short_backtrace::<core[940e698046960fd5]::result::Result<(), alloc[2ea6bcb46fca0c42]::string::String>, fn() -> core[940e698046960fd5]::result::Result<(), alloc[2ea6bcb46fca0c42]::string::String>><unknown>
  839. 32.40 s > at <unknown source file>:<unknown line>
  840. 32.40 s > 12: test[75d6903177b1d7e9]::run_test::{closure#0}<unknown>
  841. 32.40 s > at <unknown source file>:<unknown line>
  842. 32.40 s > 13: std[bcb96dfbba0ab899]::sys::backtrace::__rust_begin_short_backtrace::<test[75d6903177b1d7e9]::run_test::{closure#1}, ()><unknown>
  843. 32.40 s > at <unknown source file>:<unknown line>
  844. 32.40 s > 14: <std[bcb96dfbba0ab899]::thread::lifecycle::spawn_unchecked<test[75d6903177b1d7e9]::run_test::{closure#1}, ()>::{closure#1} as core[940e698046960fd5]::ops::function::FnOnce<()>>::call_once::{shim:vtable#0}<unknown>
  845. 32.40 s > at <unknown source file>:<unknown line>
  846. 32.40 s > 15: <std[bcb96dfbba0ab899]::sys::thread::unix::Thread>::new::thread_start<unknown>
  847. 32.40 s > at <unknown source file>:<unknown line>
  848. 32.40 s > 16: start_thread<unknown>
  849. 32.40 s > at <unknown source file>:<unknown line>
  850. 32.40 s > 17: __clone3<unknown>
  851. 32.40 s > at <unknown source file>:<unknown line>
  852. 32.40 s >
  853. 32.40 s > Run with COLORBT_SHOW_HIDDEN=1 environment variable to disable frame filtering.
  854. 32.40 s > Run with RUST_BACKTRACE=full to include source snippets.
  855. 32.40 s >
  856. 32.40 s > error: test run failed
  857. 32.40 s >
  858. 32.40 s > ========== nextest test summary ==========
  859. 32.40 s > report: target/nextest/ci_gammaloop/junit.xml
  860. 32.40 s > tests: 456, failures: 2, errors: 0
  861. 32.40 s >
  862. 32.40 s > 1. gammalooprs::test_renormalization::finit_part_ghlo
  863. 32.40 s > failure: test failure with exit code 101
  864. 32.40 s > system-out
  865. 32.40 s > running 1 test
  866. 32.40 s > ren part: 1/2*GC_10^2*dot(P(0,mink(dim)),P(0,mink(dim)))*cas(2,coad(8))/ε
  867. 32.40 s > ━━━━━━━━━━━━━━━━━━━━━━━━━━━━━━━ Snapshot Summary ━━━━━━━━━━━━━━━━━━━━━━━━━━━━━━━
  868. 32.40 s > Snapshot: finit_part_ghlo
  869. 32.40 s > Source: crates/gammalooprs/tests/test_renormalization.rs:557
  870. 32.40 s > ────────────────────────────────────────────────────────────────────────────────
  871. 32.40 s > Expression: align_to_rqft(&a, &model).to_bare_ordered_string()
  872. 32.40 s > ────────────────────────────────────────────────────────────────────────────────
  873. 32.40 s > -old snapshot
  874. 32.40 s > +new results
  875. 32.40 s > ────────────┬───────────────────────────────────────────────────────────────────
  876. 32.40 s > 1 │--1/2*cas(2,coad(8))*dot(P(0,mink(4)),P(0,mink(4)))*gs^2*ε^(-1)
  877. 32.40 s > 1 │+1/2*cas(2,coad(8))*dot(P(0,mink(4)),P(0,mink(4)))*gs^2*ε^(-1)
  878. 32.40 s > ────────────┴───────────────────────────────────────────────────────────────────
  879. 32.40 s > To update snapshots run `cargo insta review`
  880. 32.40 s > Stopped on the first failure. Run `cargo insta test` to run all snapshots.
  881. 32.40 s > test finit_part_ghlo ... FAILED
  882. 32.40 s >
  883. 32.40 s > failures:
  884. 32.40 s >
  885. 32.40 s > failures:
  886. 32.40 s > finit_part_ghlo
  887. 32.40 s >
  888. 32.40 s > test result: FAILED. 0 passed; 1 failed; 0 ignored; 0 measured; 5 filtered out; finished in 0.51s
  889. 32.40 s > system-err
  890. 32.40 s > The application panicked (crashed).
  891. 32.40 s > Message: snapshot assertion for 'finit_part_ghlo' failed in line 557
  892. 32.40 s > Location: /nix/store/30svmzr0z0zpcqjyynjn7w21wgx18y4b-vendor-cargo-deps/c19b7c6f923b580ac259164a89f2577984ad5ab09ee9d583b888f934adbbe8d0/insta-1.47.2/src/runtime.rs:719
  893. 32.40 s >
  894. 32.40 s > ━━━━━━━━━━━━━━━━━━━━━━━━━━━━━━━━━━ BACKTRACE ━━━━━━━━━━━━━━━━━━━━━━━━━━━━━━━━━━━
  895. 32.40 s > 1: <color_eyre[51793ea62743adbd]::config::PanicHook>::panic_report<unknown>
  896. 32.40 s > at <unknown source file>:<unknown line>
  897. 32.40 s > 2: <color_eyre[51793ea62743adbd]::config::PanicHook>::into_panic_hook::{closure#0}<unknown>
  898. 32.40 s > at <unknown source file>:<unknown line>
  899. 32.40 s > 3: std[bcb96dfbba0ab899]::panicking::panic_with_hook<unknown>
  900. 32.40 s > at <unknown source file>:<unknown line>
  901. 32.40 s > 4: std[bcb96dfbba0ab899]::panicking::panic_handler::{closure#0}<unknown>
  902. 32.40 s > at <unknown source file>:<unknown line>
  903. 32.40 s > 5: std[bcb96dfbba0ab899]::sys::backtrace::__rust_end_short_backtrace::<std[bcb96dfbba0ab899]::panicking::panic_handler::{closure#0}, !><unknown>
  904. 32.40 s > at <unknown source file>:<unknown line>
  905. 32.40 s > 6: __rustc[6c289b9f9c454d21]::rust_begin_unwind<unknown>
  906. 32.40 s > at <unknown source file>:<unknown line>
  907. 32.40 s > 7: core[940e698046960fd5]::panicking::panic_fmt<unknown>
  908. 32.40 s > at <unknown source file>:<unknown line>
  909. 32.40 s > 8: insta[307a548ac79ef4d9]::runtime::assert_snapshot<unknown>
  910. 32.40 s > at <unknown source file>:<unknown line>
  911. 32.40 s > 9: <test_renormalization[9b33d9b78f5a79c8]::finit_part_ghlo::{closure#0} as core[940e698046960fd5]::ops::function::FnOnce<()>>::call_once<unknown>
  912. 32.40 s > at <unknown source file>:<unknown line>
  913. 32.40 s > 10: test[75d6903177b1d7e9]::__rust_begin_short_backtrace::<core[940e698046960fd5]::result::Result<(), alloc[2ea6bcb46fca0c42]::string::String>, fn() -> core[940e698046960fd5]::result::Result<(), alloc[2ea6bcb46fca0c42]::string::String>><unknown>
  914. 32.40 s > at <unknown source file>:<unknown line>
  915. 32.40 s > 11: test[75d6903177b1d7e9]::run_test::{closure#0}<unknown>
  916. 32.40 s > at <unknown source file>:<unknown line>
  917. 32.40 s > 12: std[bcb96dfbba0ab899]::sys::backtrace::__rust_begin_short_backtrace::<test[75d6903177b1d7e9]::run_test::{closure#1}, ()><unknown>
  918. 32.40 s > at <unknown source file>:<unknown line>
  919. 32.40 s > 13: <std[bcb96dfbba0ab899]::thread::lifecycle::spawn_unchecked<test[75d6903177b1d7e9]::run_test::{closure#1}, ()>::{closure#1} as core[940e698046960fd5]::ops::function::FnOnce<()>>::call_once::{shim:vtable#0}<unknown>
  920. 32.40 s > at <unknown source file>:<unknown line>
  921. 32.40 s > 14: <std[bcb96dfbba0ab899]::sys::thread::unix::Thread>::new::thread_start<unknown>
  922. 32.40 s > at <unknown source file>:<unknown line>
  923. 32.40 s > 15: start_thread<unknown>
  924. 32.40 s > at <unknown source file>:<unknown line>
  925. 32.40 s > 16: __clone3<unknown>
  926. 32.40 s > at <unknown source file>:<unknown line>
  927. 32.40 s >
  928. 32.40 s > Run with COLORBT_SHOW_HIDDEN=1 environment variable to disable frame filtering.
  929. 32.40 s > Run with RUST_BACKTRACE=full to include source snippets.
  930. 32.40 s >
  931. 32.40 s > 2. gammalooprs::test_renormalization::finite_part_ghost_2loop
  932. 32.40 s > failure: test failure with exit code 101
  933. 32.40 s > system-out
  934. 32.40 s > running 1 test
  935. 32.40 s > ━━━━━━━━━━━━━━━━━━━━━━━━━━━━━━━ Snapshot Summary ━━━━━━━━━━━━━━━━━━━━━━━━━━━━━━━
  936. 32.40 s > Snapshot: finite_part_ghost_2loop-3
  937. 32.40 s > Source: crates/gammalooprs/tests/test_renormalization.rs:464
  938. 32.40 s > ────────────────────────────────────────────────────────────────────────────────
  939. 32.40 s > Expression: align_to_rqft(&a, &model).to_bare_ordered_string()
  940. 32.40 s > ────────────────────────────────────────────────────────────────────────────────
  941. 32.40 s > -old snapshot
  942. 32.40 s > +new results
  943. 32.40 s > ────────────┬───────────────────────────────────────────────────────────────────
  944. 32.40 s > 1 │-(-1𝑖/32*ε+1𝑖/16)*(cas(2,coad(8)))^2*dot(P(0,mink(4)),P(0,mink(4)))*gs^4*ε^(-2)
  945. 32.40 s > 1 │+(-1𝑖/16+1𝑖/32*ε)*(cas(2,coad(8)))^2*dot(P(0,mink(4)),P(0,mink(4)))*gs^4*ε^(-2)
  946. 32.40 s > ────────────┴───────────────────────────────────────────────────────────────────
  947. 32.40 s > To update snapshots run `cargo insta review`
  948. 32.40 s > Stopped on the first failure. Run `cargo insta test` to run all snapshots.
  949. 32.40 s > test finite_part_ghost_2loop ... FAILED
  950. 32.40 s >
  951. 32.40 s > failures:
  952. 32.40 s >
  953. 32.40 s > failures:
  954. 32.40 s > finite_part_ghost_2loop
  955. 32.40 s >
  956. 32.40 s > test result: FAILED. 0 passed; 1 failed; 0 ignored; 0 measured; 5 filtered out; finished in 3.47s
  957. 32.40 s > system-err
  958. 32.40 s > The application panicked (crashed).
  959. 32.40 s > Message: snapshot assertion for 'finite_part_ghost_2loop-3' failed in line 464
  960. 32.40 s > Location: /nix/store/30svmzr0z0zpcqjyynjn7w21wgx18y4b-vendor-cargo-deps/c19b7c6f923b580ac259164a89f2577984ad5ab09ee9d583b888f934adbbe8d0/insta-1.47.2/src/runtime.rs:719
  961. 32.40 s >
  962. 32.40 s > ━━━━━━━━━━━━━━━━━━━━━━━━━━━━━━━━━━ BACKTRACE ━━━━━━━━━━━━━━━━━━━━━━━━━━━━━━━━━━━
  963. 32.40 s > 1: <color_eyre[51793ea62743adbd]::config::PanicHook>::panic_report<unknown>
  964. 32.40 s > at <unknown source file>:<unknown line>
  965. 32.40 s > 2: <color_eyre[51793ea62743adbd]::config::PanicHook>::into_panic_hook::{closure#0}<unknown>
  966. 32.40 s > at <unknown source file>:<unknown line>
  967. 32.40 s > 3: std[bcb96dfbba0ab899]::panicking::panic_with_hook<unknown>
  968. 32.40 s > at <unknown source file>:<unknown line>
  969. 32.40 s > 4: std[bcb96dfbba0ab899]::panicking::panic_handler::{closure#0}<unknown>
  970. 32.40 s > at <unknown source file>:<unknown line>
  971. 32.40 s > 5: std[bcb96dfbba0ab899]::sys::backtrace::__rust_end_short_backtrace::<std[bcb96dfbba0ab899]::panicking::panic_handler::{closure#0}, !><unknown>
  972. 32.40 s > at <unknown source file>:<unknown line>
  973. 32.40 s > 6: __rustc[6c289b9f9c454d21]::rust_begin_unwind<unknown>
  974. 32.40 s > at <unknown source file>:<unknown line>
  975. 32.40 s > 7: core[940e698046960fd5]::panicking::panic_fmt<unknown>
  976. 32.40 s > at <unknown source file>:<unknown line>
  977. 32.40 s > 8: insta[307a548ac79ef4d9]::runtime::assert_snapshot<unknown>
  978. 32.40 s > at <unknown source file>:<unknown line>
  979. 32.40 s > 9: test_renormalization[9b33d9b78f5a79c8]::finite_part_ghost_2loop<unknown>
  980. 32.40 s > at <unknown source file>:<unknown line>
  981. 32.40 s > 10: <test_renormalization[9b33d9b78f5a79c8]::finite_part_ghost_2loop::{closure#0} as core[940e698046960fd5]::ops::function::FnOnce<()>>::call_once<unknown>
  982. 32.40 s > at <unknown source file>:<unknown line>
  983. 32.40 s > 11: test[75d6903177b1d7e9]::__rust_begin_short_backtrace::<core[940e698046960fd5]::result::Result<(), alloc[2ea6bcb46fca0c42]::string::String>, fn() -> core[940e698046960fd5]::result::Result<(), alloc[2ea6bcb46fca0c42]::string::String>><unknown>
  984. 32.40 s > at <unknown source file>:<unknown line>
  985. 32.40 s > 12: test[75d6903177b1d7e9]::run_test::{closure#0}<unknown>
  986. 32.40 s > at <unknown source file>:<unknown line>
  987. 32.40 s > 13: std[bcb96dfbba0ab899]::sys::backtrace::__rust_begin_short_backtrace::<test[75d6903177b1d7e9]::run_test::{closure#1}, ()><unknown>
  988. 32.40 s > at <unknown source file>:<unknown line>
  989. 32.40 s > 14: <std[bcb96dfbba0ab899]::thread::lifecycle::spawn_unchecked<test[75d6903177b1d7e9]::run_test::{closure#1}, ()>::{closure#1} as core[940e698046960fd5]::ops::function::FnOnce<()>>::call_once::{shim:vtable#0}<unknown>
  990. 32.40 s > at <unknown source file>:<unknown line>
  991. 32.40 s > 15: <std[bcb96dfbba0ab899]::sys::thread::unix::Thread>::new::thread_start<unknown>
  992. 32.40 s > at <unknown source file>:<unknown line>
  993. 32.40 s > 16: start_thread<unknown>
  994. 32.40 s > at <unknown source file>:<unknown line>
  995. 32.40 s > 17: __clone3<unknown>
  996. 32.40 s > at <unknown source file>:<unknown line>
  997. 32.40 s >
  998. 32.40 s > Run with COLORBT_SHOW_HIDDEN=1 environment variable to disable frame filtering.
  999. 32.40 s > Run with RUST_BACKTRACE=full to include source snippets.
  1000. 32.40 s > =========================================
  1001. 32.40 s For full logs, run:
  1002. 32.40 s nix log /nix/store/xv6l7wp14z4xm05gkaqsp0kipvyasvyi-gammaloop-nextest-core.drv
  1003. 32.51 s [0 built (1 failed), 0.0Run failed.