test packages.x86_64-linux.nix-ci-check-gammaloop-nextest-spenso

Reproduce this run
Original Run
  1. 0.22 s $ /nix/store/9ypz3flqsrl5xl495mm8h645gadjsxi1-coreutils-9.11/bin/timeout --kill-after=15s 7200s /nix/store/23zk8sgzamrbmj1fday15szf7f2279s8-nix-2.34.7/bin/nix --extra-experimental-features nix-command --extra-experimental-features flakes flake clone git+https://github.com/alphal00p/gammaloop --dest /tmp/nix-ci-worker/stable-pwd/repo/
  2. 0.23 s Cloning into '/tmp/nix-ci-worker/stable-pwd/repo'...
  3. 0.98 s remote: Enumerating objects: 65283, done.
  4. 1.20 s remote: Counting objects: 0% (1/7934) remote: Counting objects: 1% (80/7934) remote: Counting objects: 2% (159/7934) remote: Counting objects: 3% (239/7934) remote: Counting objects: 4% (318/7934) remote: Counting objects: 5% (397/7934) remote: Counting objects: 6% (477/7934) remote: Counting objects: 7% (556/7934) remote: Counting objects: 8% (635/7934) remote: Counting objects: 9% (715/7934) remote: Counting objects: 10% (794/7934) remote: Counting objects: 11% (873/7934) remote: Counting objects: 12% (953/7934) remote: Counting objects: 13% (1032/7934) remote: Counting objects: 14% (1111/7934) remote: Counting objects: 15% (1191/7934) remote: Counting objects: 16% (1270/7934) remote: Counting objects: 17% (1349/7934) remote: Counting objects: 18% (1429/7934) remote: Counting objects: 19% (1508/7934) remote: Counting objects: 20% (1587/7934) remote: Counting objects: 21% (1667/7934) remote: Counting objects: 22% (1746/7934) remote: Counting objects: 23% (1825/7934) remote: Counting objects: 24% (1905/7934) remote: Counting objects: 25% (1984/7934) remote: Counting objects: 26% (2063/7934) remote: Counting objects: 27% (2143/7934) remote: Counting objects: 28% (2222/7934) remote: Counting objects: 29% (2301/7934) remote: Counting objects: 30% (2381/7934) remote: Counting objects: 31% (2460/7934) remote: Counting objects: 32% (2539/7934) remote: Counting objects: 33% (2619/7934) remote: Counting objects: 34% (2698/7934) remote: Counting objects: 35% (2777/7934) remote: Counting objects: 36% (2857/7934) remote: Counting objects: 37% (2936/7934) remote: Counting objects: 38% (3015/7934) remote: Counting objects: 39% (3095/7934) remote: Counting objects: 40% (3174/7934) remote: Counting objects: 41% (3253/7934) remote: Counting objects: 42% (3333/7934) remote: Counting objects: 43% (3412/7934) remote: Counting objects: 44% (3491/7934) remote: Counting objects: 45% (3571/7934) remote: Counting objects: 46% (3650/7934) remote: Counting objects: 47% (3729/7934) remote: Counting objects: 48% (3809/7934) remote: Counting objects: 49% (3888/7934) remote: Counting objects: 50% (3967/7934) remote: Counting objects: 51% (4047/7934) remote: Counting objects: 52% (4126/7934) remote: Counting objects: 53% (4206/7934) remote: Counting objects: 54% (4285/7934) remote: Counting objects: 55% (4364/7934) remote: Counting objects: 56% (4444/7934) remote: Counting objects: 57% (4523/7934) remote: Counting objects: 58% (4602/7934) remote: Counting objects: 59% (4682/7934) remote: Counting objects: 60% (4761/7934) remote: Counting objects: 61% (4840/7934) remote: Counting objects: 62% (4920/7934) remote: Counting objects: 63% (4999/7934) remote: Counting objects: 64% (5078/7934) remote: Counting objects: 65% (5158/7934) remote: Counting objects: 66% (5237/7934) remote: Counting objects: 67% (5316/7934) remote: Counting objects: 68% (5396/7934) remote: Counting objects: 69% (5475/7934) remote: Counting objects: 70% (5554/7934) remote: Counting objects: 71% (5634/7934) remote: Counting objects: 72% (5713/7934) remote: Counting objects: 73% (5792/7934) remote: Counting objects: 74% (5872/7934) remote: Counting objects: 75% (5951/7934) remote: Counting objects: 76% (6030/7934) remote: Counting objects: 77% (6110/7934) remote: Counting objects: 78% (6189/7934) remote: Counting objects: 79% (6268/7934) remote: Counting objects: 80% (6348/7934) remote: Counting objects: 81% (6427/7934) remote: Counting objects: 82% (6506/7934) remote: Counting objects: 83% (6586/7934) remote: Counting objects: 84% (6665/7934) remote: Counting objects: 85% (6744/7934) remote: Counting objects: 86% (6824/7934) remote: Counting objects: 87% (6903/7934) remote: Counting objects: 88% (6982/7934) remote: Counting objects: 89% (7062/7934) remote: Counting objects: 90% (7141/7934) remote: Counting objects: 91% (7220/7934) remote: Counting objects: 92% (7300/7934) remote: Counting objects: 93% (7379/7934) remote: Counting objects: 94% (7458/7934) remote: Counting objects: 95% (7538/7934) remote: Counting objects: 96% (7617/7934) remote: Counting objects: 97% (7696/7934) remote: Counting objects: 98% (7776/7934) remote: Counting objects: 99% (7855/7934) remote: Counting objects: 100% (7934/7934) remote: Counting objects: 100% (7934/7934), done.
  5. 2.55 s remote: Compressing objects: 0% (1/1600) remote: Compressing objects: 1% (16/1600) remote: Compressing objects: 2% (32/1600) remote: Compressing objects: 3% (48/1600) remote: Compressing objects: 4% (64/1600) remote: Compressing objects: 5% (80/1600) remote: Compressing objects: 6% (96/1600) remote: Compressing objects: 7% (112/1600) remote: Compressing objects: 8% (128/1600) remote: Compressing objects: 9% (144/1600) remote: Compressing objects: 10% (160/1600) remote: Compressing objects: 11% (176/1600) remote: Compressing objects: 12% (192/1600) remote: Compressing objects: 13% (208/1600) remote: Compressing objects: 14% (224/1600) remote: Compressing objects: 15% (240/1600) remote: Compressing objects: 16% (256/1600) remote: Compressing objects: 16% (262/1600) remote: Compressing objects: 17% (272/1600) remote: Compressing objects: 18% (288/1600) remote: Compressing objects: 19% (304/1600) remote: Compressing objects: 20% (320/1600) remote: Compressing objects: 21% (336/1600) remote: Compressing objects: 22% (352/1600) remote: Compressing objects: 23% (368/1600) remote: Compressing objects: 24% (384/1600) remote: Compressing objects: 25% (400/1600) remote: Compressing objects: 26% (416/1600) remote: Compressing objects: 27% (432/1600) remote: Compressing objects: 28% (448/1600) remote: Compressing objects: 29% (464/1600) remote: Compressing objects: 30% (480/1600) remote: Compressing objects: 31% (496/1600) remote: Compressing objects: 32% (512/1600) remote: Compressing objects: 33% (528/1600) remote: Compressing objects: 34% (544/1600) remote: Compressing objects: 35% (560/1600) remote: Compressing objects: 36% (576/1600) remote: Compressing objects: 37% (592/1600) remote: Compressing objects: 38% (608/1600) remote: Compressing objects: 39% (624/1600) remote: Compressing objects: 40% (640/1600) remote: Compressing objects: 41% (656/1600) remote: Compressing objects: 42% (672/1600) remote: Compressing objects: 43% (688/1600) remote: Compressing objects: 44% (704/1600) remote: Compressing objects: 45% (720/1600) remote: Compressing objects: 46% (736/1600) remote: Compressing objects: 47% (752/1600) remote: Compressing objects: 48% (768/1600) remote: Compressing objects: 49% (784/1600) remote: Compressing objects: 50% (800/1600) remote: Compressing objects: 51% (816/1600) remote: Compressing objects: 52% (832/1600) remote: Compressing objects: 53% (848/1600) remote: Compressing objects: 54% (864/1600) remote: Compressing objects: 55% (880/1600) remote: Compressing objects: 56% (896/1600) remote: Compressing objects: 57% (912/1600) remote: Compressing objects: 58% (928/1600) remote: Compressing objects: 59% (944/1600) remote: Compressing objects: 60% (960/1600) remote: Compressing objects: 61% (976/1600) remote: Compressing objects: 62% (992/1600) remote: Compressing objects: 63% (1008/1600) remote: Compressing objects: 64% (1024/1600) remote: Compressing objects: 65% (1040/1600) remote: Compressing objects: 66% (1056/1600) remote: Compressing objects: 67% (1072/1600) remote: Compressing objects: 68% (1088/1600) remote: Compressing objects: 69% (1104/1600) remote: Compressing objects: 70% (1120/1600) remote: Compressing objects: 71% (1136/1600) remote: Compressing objects: 72% (1152/1600) remote: Compressing objects: 73% (1168/1600) remote: Compressing objects: 74% (1184/1600) remote: Compressing objects: 75% (1200/1600) remote: Compressing objects: 76% (1216/1600) remote: Compressing objects: 77% (1232/1600) remote: Compressing objects: 78% (1248/1600) remote: Compressing objects: 79% (1264/1600) remote: Compressing objects: 80% (1280/1600) remote: Compressing objects: 81% (1296/1600) remote: Compressing objects: 82% (1312/1600) remote: Compressing objects: 83% (1328/1600) remote: Compressing objects: 84% (1344/1600) remote: Compressing objects: 85% (1360/1600) remote: Compressing objects: 86% (1376/1600) remote: Compressing objects: 87% (1392/1600) remote: Compressing objects: 88% (1408/1600) remote: Compressing objects: 89% (1424/1600) remote: Compressing objects: 90% (1440/1600) remote: Compressing objects: 91% (1456/1600) remote: Compressing objects: 92% (1472/1600) remote: Compressing objects: 93% (1488/1600) remote: Compressing objects: 94% (1504/1600) remote: Compressing objects: 95% (1520/1600) remote: Compressing objects: 96% (1536/1600) remote: Compressing objects: 97% (1552/1600) remote: Compressing objects: 98% (1568/1600) remote: Compressing objects: 99% (1584/1600) remote: Compressing objects: 100% (1600/1600) remote: Compressing objects: 100% (1600/1600), done.
  6. 5.14 s Receiving objects: 0% (1/65283) Receiving objects: 1% (653/65283) Receiving objects: 2% (1306/65283) Receiving objects: 3% (1959/65283) Receiving objects: 4% (2612/65283) Receiving objects: 5% (3265/65283) Receiving objects: 6% (3917/65283) Receiving objects: 7% (4570/65283) Receiving objects: 8% (5223/65283) Receiving objects: 9% (5876/65283) Receiving objects: 10% (6529/65283) Receiving objects: 11% (7182/65283) Receiving objects: 12% (7834/65283), 12.67 MiB | 25.32 MiB/s Receiving objects: 13% (8487/65283), 12.67 MiB | 25.32 MiB/s Receiving objects: 14% (9140/65283), 12.67 MiB | 25.32 MiB/s Receiving objects: 15% (9793/65283), 12.67 MiB | 25.32 MiB/s Receiving objects: 16% (10446/65283), 12.67 MiB | 25.32 MiB/s Receiving objects: 17% (11099/65283), 12.67 MiB | 25.32 MiB/s Receiving objects: 18% (11751/65283), 12.67 MiB | 25.32 MiB/s Receiving objects: 19% (12404/65283), 12.67 MiB | 25.32 MiB/s Receiving objects: 20% (13057/65283), 12.67 MiB | 25.32 MiB/s Receiving objects: 21% (13710/65283), 12.67 MiB | 25.32 MiB/s Receiving objects: 22% (14363/65283), 12.67 MiB | 25.32 MiB/s Receiving objects: 23% (15016/65283), 12.67 MiB | 25.32 MiB/s Receiving objects: 24% (15668/65283), 12.67 MiB | 25.32 MiB/s Receiving objects: 25% (16321/65283), 12.67 MiB | 25.32 MiB/s Receiving objects: 26% (16974/65283), 12.67 MiB | 25.32 MiB/s Receiving objects: 27% (17627/65283), 12.67 MiB | 25.32 MiB/s Receiving objects: 28% (18280/65283), 12.67 MiB | 25.32 MiB/s Receiving objects: 29% (18933/65283), 12.67 MiB | 25.32 MiB/s Receiving objects: 30% (19585/65283), 12.67 MiB | 25.32 MiB/s Receiving objects: 31% (20238/65283), 12.67 MiB | 25.32 MiB/s Receiving objects: 32% (20891/65283), 12.67 MiB | 25.32 MiB/s Receiving objects: 33% (21544/65283), 12.67 MiB | 25.32 MiB/s Receiving objects: 34% (22197/65283), 12.67 MiB | 25.32 MiB/s Receiving objects: 35% (22850/65283), 12.67 MiB | 25.32 MiB/s Receiving objects: 36% (23502/65283), 12.67 MiB | 25.32 MiB/s Receiving objects: 37% (24155/65283), 12.67 MiB | 25.32 MiB/s Receiving objects: 38% (24808/65283), 12.67 MiB | 25.32 MiB/s Receiving objects: 39% (25461/65283), 12.67 MiB | 25.32 MiB/s Receiving objects: 40% (26114/65283), 12.67 MiB | 25.32 MiB/s Receiving objects: 41% (26767/65283), 12.67 MiB | 25.32 MiB/s Receiving objects: 42% (27419/65283), 12.67 MiB | 25.32 MiB/s Receiving objects: 43% (28072/65283), 12.67 MiB | 25.32 MiB/s Receiving objects: 44% (28725/65283), 12.67 MiB | 25.32 MiB/s Receiving objects: 45% (29378/65283), 12.67 MiB | 25.32 MiB/s Receiving objects: 46% (30031/65283), 12.67 MiB | 25.32 MiB/s Receiving objects: 47% (30684/65283), 12.67 MiB | 25.32 MiB/s Receiving objects: 48% (31336/65283), 12.67 MiB | 25.32 MiB/s Receiving objects: 49% (31989/65283), 12.67 MiB | 25.32 MiB/s Receiving objects: 50% (32642/65283), 12.67 MiB | 25.32 MiB/s Receiving objects: 51% (33295/65283), 12.67 MiB | 25.32 MiB/s Receiving objects: 52% (33948/65283), 12.67 MiB | 25.32 MiB/s Receiving objects: 52% (34509/65283), 33.51 MiB | 33.50 MiB/s Receiving objects: 53% (34600/65283), 33.51 MiB | 33.50 MiB/s Receiving objects: 54% (35253/65283), 33.51 MiB | 33.50 MiB/s Receiving objects: 55% (35906/65283), 33.51 MiB | 33.50 MiB/s Receiving objects: 56% (36559/65283), 33.51 MiB | 33.50 MiB/s Receiving objects: 57% (37212/65283), 33.51 MiB | 33.50 MiB/s Receiving objects: 58% (37865/65283), 33.51 MiB | 33.50 MiB/s Receiving objects: 59% (38517/65283), 33.51 MiB | 33.50 MiB/s Receiving objects: 60% (39170/65283), 33.51 MiB | 33.50 MiB/s Receiving objects: 61% (39823/65283), 33.51 MiB | 33.50 MiB/s Receiving objects: 62% (40476/65283), 33.51 MiB | 33.50 MiB/s Receiving objects: 63% (41129/65283), 33.51 MiB | 33.50 MiB/s Receiving objects: 64% (41782/65283), 33.51 MiB | 33.50 MiB/s Receiving objects: 65% (42434/65283), 33.51 MiB | 33.50 MiB/s Receiving objects: 66% (43087/65283), 50.72 MiB | 33.81 MiB/s Receiving objects: 67% (43740/65283), 50.72 MiB | 33.81 MiB/s Receiving objects: 68% (44393/65283), 50.72 MiB | 33.81 MiB/s Receiving objects: 69% (45046/65283), 50.72 MiB | 33.81 MiB/s Receiving objects: 70% (45699/65283), 50.72 MiB | 33.81 MiB/s Receiving objects: 71% (46351/65283), 50.72 MiB | 33.81 MiB/s Receiving objects: 72% (47004/65283), 50.72 MiB | 33.81 MiB/s Receiving objects: 73% (47657/65283), 50.72 MiB | 33.81 MiB/s Receiving objects: 74% (48310/65283), 50.72 MiB | 33.81 MiB/s Receiving objects: 75% (48963/65283), 50.72 MiB | 33.81 MiB/s Receiving objects: 75% (49230/65283), 67.70 MiB | 33.84 MiB/s Receiving objects: 76% (49616/65283), 67.70 MiB | 33.84 MiB/s Receiving objects: 77% (50268/65283), 67.70 MiB | 33.84 MiB/s Receiving objects: 78% (50921/65283), 67.70 MiB | 33.84 MiB/s Receiving objects: 79% (51574/65283), 67.70 MiB | 33.84 MiB/s Receiving objects: 80% (52227/65283), 67.70 MiB | 33.84 MiB/s Receiving objects: 81% (52880/65283), 67.70 MiB | 33.84 MiB/s Receiving objects: 82% (53533/65283), 67.70 MiB | 33.84 MiB/s Receiving objects: 83% (54185/65283), 67.70 MiB | 33.84 MiB/s Receiving objects: 84% (54838/65283), 67.70 MiB | 33.84 MiB/s Receiving objects: 85% (55491/65283), 67.70 MiB | 33.84 MiB/s Receiving objects: 86% (56144/65283), 67.70 MiB | 33.84 MiB/s Receiving objects: 87% (56797/65283), 67.70 MiB | 33.84 MiB/s Receiving objects: 88% (57450/65283), 67.70 MiB | 33.84 MiB/s Receiving objects: 89% (58102/65283), 67.70 MiB | 33.84 MiB/s Receiving objects: 90% (58755/65283), 67.70 MiB | 33.84 MiB/s Receiving objects: 91% (59408/65283), 67.70 MiB | 33.84 MiB/s Receiving objects: 92% (60061/65283), 67.70 MiB | 33.84 MiB/s Receiving objects: 93% (60714/65283), 67.70 MiB | 33.84 MiB/s Receiving objects: 94% (61367/65283), 67.70 MiB | 33.84 MiB/s Receiving objects: 95% (62019/65283), 84.76 MiB | 33.90 MiB/s Receiving objects: 96% (62672/65283), 84.76 MiB | 33.90 MiB/s Receiving objects: 97% (63325/65283), 84.76 MiB | 33.90 MiB/s Receiving objects: 98% (63978/65283), 84.76 MiB | 33.90 MiB/s Receiving objects: 99% (64631/65283), 84.76 MiB | 33.90 MiB/s remote: Total 65283 (delta 6877), reused 6420 (delta 6324), pack-reused 57349 (from 1)
  7. 5.15 s Receiving objects: 100% (65283/65283), 84.76 MiB | 33.90 MiB/s Receiving objects: 100% (65283/65283), 87.60 MiB | 33.80 MiB/s, done.
  8. 6.59 s Resolving deltas: 0% (0/45995) Resolving deltas: 1% (460/45995) Resolving deltas: 2% (920/45995) Resolving deltas: 3% (1380/45995) Resolving deltas: 4% (1840/45995) Resolving deltas: 5% (2300/45995) Resolving deltas: 6% (2760/45995) Resolving deltas: 7% (3220/45995) Resolving deltas: 8% (3680/45995) Resolving deltas: 9% (4140/45995) Resolving deltas: 10% (4600/45995) Resolving deltas: 11% (5061/45995) Resolving deltas: 12% (5520/45995) Resolving deltas: 13% (5980/45995) Resolving deltas: 14% (6440/45995) Resolving deltas: 15% (6900/45995) Resolving deltas: 16% (7360/45995) Resolving deltas: 17% (7820/45995) Resolving deltas: 18% (8280/45995) Resolving deltas: 19% (8740/45995) Resolving deltas: 20% (9200/45995) Resolving deltas: 21% (9659/45995) Resolving deltas: 22% (10119/45995) Resolving deltas: 23% (10581/45995) Resolving deltas: 24% (11039/45995) Resolving deltas: 25% (11499/45995) Resolving deltas: 26% (11959/45995) Resolving deltas: 27% (12419/45995) Resolving deltas: 28% (12879/45995) Resolving deltas: 29% (13339/45995) Resolving deltas: 30% (13799/45995) Resolving deltas: 31% (14259/45995) Resolving deltas: 32% (14719/45995) Resolving deltas: 33% (15181/45995) Resolving deltas: 34% (15639/45995) Resolving deltas: 35% (16100/45995) Resolving deltas: 36% (16559/45995) Resolving deltas: 37% (17019/45995) Resolving deltas: 38% (17479/45995) Resolving deltas: 39% (17939/45995) Resolving deltas: 40% (18399/45995) Resolving deltas: 41% (18858/45995) Resolving deltas: 42% (19318/45995) Resolving deltas: 43% (19778/45995) Resolving deltas: 44% (20238/45995) Resolving deltas: 45% (20698/45995) Resolving deltas: 46% (21158/45995) Resolving deltas: 47% (21618/45995) Resolving deltas: 48% (22079/45995) Resolving deltas: 49% (22538/45995) Resolving deltas: 50% (22998/45995) Resolving deltas: 51% (23458/45995) Resolving deltas: 52% (23918/45995) Resolving deltas: 53% (24378/45995) Resolving deltas: 54% (24839/45995) Resolving deltas: 55% (25298/45995) Resolving deltas: 56% (25758/45995) Resolving deltas: 57% (26218/45995) Resolving deltas: 58% (26678/45995) Resolving deltas: 59% (27138/45995) Resolving deltas: 60% (27597/45995) Resolving deltas: 61% (28057/45995) Resolving deltas: 62% (28517/45995) Resolving deltas: 63% (28978/45995) Resolving deltas: 64% (29437/45995) Resolving deltas: 65% (29897/45995) Resolving deltas: 66% (30357/45995) Resolving deltas: 67% (30818/45995) Resolving deltas: 68% (31277/45995) Resolving deltas: 69% (31737/45995) Resolving deltas: 70% (32198/45995) Resolving deltas: 71% (32657/45995) Resolving deltas: 72% (33117/45995) Resolving deltas: 73% (33577/45995) Resolving deltas: 74% (34037/45995) Resolving deltas: 75% (34497/45995) Resolving deltas: 75% (34888/45995) Resolving deltas: 76% (34957/45995) Resolving deltas: 77% (35417/45995) Resolving deltas: 78% (35877/45995) Resolving deltas: 79% (36337/45995) Resolving deltas: 80% (36798/45995) Resolving deltas: 81% (37256/45995) Resolving deltas: 82% (37716/45995) Resolving deltas: 83% (38176/45995) Resolving deltas: 84% (38636/45995) Resolving deltas: 85% (39096/45995) Resolving deltas: 86% (39556/45995) Resolving deltas: 87% (40016/45995) Resolving deltas: 88% (40476/45995) Resolving deltas: 89% (40936/45995) Resolving deltas: 90% (41396/45995) Resolving deltas: 91% (41856/45995) Resolving deltas: 92% (42316/45995) Resolving deltas: 93% (42777/45995) Resolving deltas: 94% (43236/45995) Resolving deltas: 95% (43696/45995) Resolving deltas: 96% (44156/45995) Resolving deltas: 97% (44616/45995) Resolving deltas: 98% (45076/45995) Resolving deltas: 99% (45536/45995) Resolving deltas: 100% (45995/45995) Resolving deltas: 100% (45995/45995), done.
  9. 7.22 s Fetching commit da217bcc31bb1b48f1e3e2a2ac0fb15dd06d1801 for vakint_rustred ...
  10. 7.22 s $ /nix/store/bcnisk3ydfgv26v2gw3zlky24g00yww2-git-2.54.0/bin/git fetch origin da217bcc31bb1b48f1e3e2a2ac0fb15dd06d1801
  11. 7.72 s From https://github.com/alphal00p/gammaloop
  12. 7.72 s * branch da217bcc31bb1b48f1e3e2a2ac0fb15dd06d1801 -> FETCH_HEAD
  13. 7.77 s $ /nix/store/9ypz3flqsrl5xl495mm8h645gadjsxi1-coreutils-9.11/bin/timeout --kill-after=15s 7200s /nix/store/bcnisk3ydfgv26v2gw3zlky24g00yww2-git-2.54.0/bin/git -c advice.detachedHead=false checkout da217bcc31bb1b48f1e3e2a2ac0fb15dd06d1801
  14. 8.07 s HEAD is now at da217bcc Reject obsolete RustRed artifact schemas
  15. 8.08 s $ /nix/store/9ypz3flqsrl5xl495mm8h645gadjsxi1-coreutils-9.11/bin/timeout --kill-after=15s 7200s /nix/store/23zk8sgzamrbmj1fday15szf7f2279s8-nix-2.34.7/bin/nix --extra-experimental-features nix-command --extra-experimental-features flakes --log-format internal-json run .#packages.x86_64-linux.nix-ci-check-gammaloop-nextest-spenso --print-build-logs
  16. 15.61 s
  17. 15.96 s Downloading cached gammaloop-nextest-binaries-spenso-idenso from https://cache.nix-ci.com
  18. 15.98 s Downloading cached gammaloop-nextest-binaries-spenso-symbolica-utils from https://cache.nix-ci.com
  19. 15.98 s Downloading cached gammaloop-nextest-binaries-spenso-spenso-hep-lib from https://cache.nix-ci.com
  20. 15.98 s Downloading cached gammaloop-nextest-binaries-spenso-spenso-macros from https://cache.nix-ci.com
  21. 15.98 s Downloading cached gammaloop-nextest-binaries-spenso-spenso from https://cache.nix-ci.com
  22. 16.23 s Downloaded cached gammaloop-nextest-binaries-spenso-symbolica-utils (6.3 MiB) in 252ms
  23. 16.23 s Progress: 0 of 7 built, 1 of 5 downloaded from cache (4 downloading)
  24. 16.30 s Downloaded cached gammaloop-nextest-binaries-spenso-spenso-macros (6.5 MiB) in 321ms
  25. 16.30 s Progress: 0 of 6 built, 2 of 5 downloaded from cache (3 downloading)
  26. 16.51 s Downloaded cached gammaloop-nextest-binaries-spenso-spenso (10.2 MiB) in 539ms
  27. 16.51 s Progress: 0 of 5 built, 3 of 5 downloaded from cache (2 downloading)
  28. 16.85 s Downloaded cached gammaloop-nextest-binaries-spenso-idenso (29.3 MiB) in 889ms
  29. 16.86 s Progress: 0 of 4 built, 4 of 5 downloaded from cache (1 downloading)
  30. 16.89 s Downloaded cached gammaloop-nextest-binaries-spenso-spenso-hep-lib (34 MiB) in 913ms
  31. 16.89 s Progress: 0 of 3 built, 5 of 5 downloaded from cache
  32. 16.95 s Building /nix/store/3p4fn4i4vqgmgv7zh3x465l1mx1cl3cx-gammaloop-nextest-binaries-spenso.drv
  33. 17.18 s [gammaloop-nextest-binaries-spenso:post-build] Uploading to the NixCI cache: /nix/store/4laxqpbm80hrj4aa8xy12wjxlg1l7li5-gammaloop-nextest-binaries-spenso
  34. 17.58 s [gammaloop-nextest-binaries-spenso:post-build] warning: 'warn-short-path-literals' is deprecated, use 'lint-short-path-literals = ignore' instead
  35. 17.73 s [gammaloop-nextest-binaries-spenso:post-build] copying 0 paths...
  36. 18.42 s [gammaloop-nextest-binaries-spenso:post-build] warning: 'warn-short-path-literals' is deprecated, use 'lint-short-path-literals = ignore' instead
  37. 18.72 s [gammaloop-nextest-binaries-spenso:post-build] copying 0 paths...
  38. 18.93 s Uploaded gammaloop-nextest-binaries-spenso in 1.8s
  39. 18.93 s Progress: 1 of 3 built, 5 of 5 downloaded from cache
  40. 18.93 s Built gammaloop-nextest-binaries-spenso in 1.9s
  41. 19.51 s Building /nix/store/cdfkv2x2iwy8s1n2s2hpszdfgqk6z9kk-nix-ci-check-gammaloop-nextest-spenso.drv
  42. 19.72 s [nix-ci-check-gammaloop-nextest-spenso:post-build] Uploading to the NixCI cache: /nix/store/0samdkv017j4fn125mc17rxd6cv4i25v-nix-ci-check-gammaloop-nextest-spenso
  43. 20.17 s [nix-ci-check-gammaloop-nextest-spenso:post-build] warning: 'warn-short-path-literals' is deprecated, use 'lint-short-path-literals = ignore' instead
  44. 20.22 s [nix-ci-check-gammaloop-nextest-spenso:post-build] copying 1 paths...
  45. 20.22 s [nix-ci-check-gammaloop-nextest-spenso:post-build] copying path '/nix/store/0samdkv017j4fn125mc17rxd6cv4i25v-nix-ci-check-gammaloop-nextest-spenso' to 'https://cache.nix-ci.com'...
  46. 21.09 s [nix-ci-check-gammaloop-nextest-spenso:post-build] warning: 'warn-short-path-literals' is deprecated, use 'lint-short-path-literals = ignore' instead
  47. 21.57 s [nix-ci-check-gammaloop-nextest-spenso:post-build] copying 1 paths...
  48. 21.57 s [nix-ci-check-gammaloop-nextest-spenso:post-build] copying path '/nix/store/cdfkv2x2iwy8s1n2s2hpszdfgqk6z9kk-nix-ci-check-gammaloop-nextest-spenso.drv' to 'https://cache.nix-ci.com'...
  49. 21.93 s Uploaded nix-ci-check-gammaloop-nextest-spenso in 2.2s
  50. 21.93 s Progress: 2 of 3 built, 5 of 5 downloaded from cache
  51. 21.93 s Built nix-ci-check-gammaloop-nextest-spenso in 2.4s
  52. 21.93 s Progress: 3 of 3 built, 5 of 5 downloaded from cache
  53. 30.06 s evaluating derivation 'g copying '/nix/store/kl70 evaluating derivation 'g copying '/nix/store/kl70 evaluating derivation 'g copying '/nix/store/kl70 evaluating derivation 'g copying '/nix/store/kl70 evaluating derivation 'g querying gammaloop-nexte [0/1 built, 0.0 KiB DL] [1/0/1 built, 0.0 KiB DLgammaloop-nextest-spenso> Extracting 5 binaries and 2 linked paths to /build/nextest-archive-t1huKV
  54. 30.37 s gammaloop-nextest-spenso> Extracted 19 files to /build/nextest-archive-t1huKV in 0.33s
  55. 30.44 s gammaloop-nextest-spenso> ------------
  56. 30.44 s gammaloop-nextest-spenso> Nextest run ID 9d0939b7-b4f5-4490-aa1b-97458a072b43 with nextest profile: ci_gammaloop
  57. 30.44 s gammaloop-nextest-spenso> Starting 224 tests across 5 binaries (26 tests skipped, including 2 tests via profile.ci_gammaloop.default-filter)
  58. 30.71 s gammaloop-nextest-spenso> FAIL [ 0.025s] ( 41/224) idenso color::test::form_reference::metric_contraction_respects_antisymmetric_normalization
  59. 30.71 s gammaloop-nextest-spenso> stdout ---
  60. 30.71 s gammaloop-nextest-spenso>
  61. 30.71 s gammaloop-nextest-spenso> running 1 test
  62. 30.71 s gammaloop-nextest-spenso> test color::test::form_reference::metric_contraction_respects_antisymmetric_normalization ... FAILED
  63. 30.71 s gammaloop-nextest-spenso>
  64. 30.71 s gammaloop-nextest-spenso> failures:
  65. 30.71 s gammaloop-nextest-spenso>
  66. 30.71 s gammaloop-nextest-spenso> failures:
  67. 30.71 s gammaloop-nextest-spenso> color::test::form_reference::metric_contraction_respects_antisymmetric_normalization
  68. 30.71 s gammaloop-nextest-spenso>
  69. 30.71 s gammaloop-nextest-spenso> test result: FAILED. 0 passed; 1 failed; 0 ignored; 0 measured; 240 filtered out; finished in 0.01s
  70. 30.71 s gammaloop-nextest-spenso>
  71. 30.71 s gammaloop-nextest-spenso> stderr ---
  72. 30.71 s gammaloop-nextest-spenso>
  73. 30.71 s gammaloop-nextest-spenso> thread 'color::test::form_reference::metric_contraction_respects_antisymmetric_normalization' (334) panicked at crates/idenso/src/color/test/form_reference.rs:171:5:
  74. 30.71 s gammaloop-nextest-spenso> assertion `left == right` failed
  75. 30.71 s gammaloop-nextest-spenso> left: "-1*f(coad(8,standalone_metric_j),coad(8,standalone_metric_s),coad(8,standalone_metric_u))"
  76. 30.71 s gammaloop-nextest-spenso> right: "f(coad(8,standalone_metric_j),coad(8,standalone_metric_s),coad(8,standalone_metric_u))"
  77. 30.71 s gammaloop-nextest-spenso> stack backtrace:
  78. 30.71 s gammaloop-nextest-spenso> 0: __rustc::rust_begin_unwind
  79. 30.71 s gammaloop-nextest-spenso> 1: core::panicking::panic_fmt
  80. 30.71 s gammaloop-nextest-spenso> 2: core::panicking::assert_failed_inner
  81. 30.71 s gammaloop-nextest-spenso> 3: core::panicking::assert_failed::<alloc::string::String, alloc::string::String>
  82. 30.71 s gammaloop-nextest-spenso> 4: idenso::color::test::form_reference::metric_contraction_respects_antisymmetric_normalization
  83. 30.71 s gammaloop-nextest-spenso> 5: <idenso::color::test::form_reference::metric_contraction_respects_antisymmetric_normalization::{closure#0} as core::ops::function::FnOnce<()>>::call_once
  84. 30.71 s gammaloop-nextest-spenso> note: Some details are omitted, run with `RUST_BACKTRACE=full` for a verbose backtrace.
  85. 30.71 s gammaloop-nextest-spenso>
  86. 31.68 s gammaloop-nextest-spenso> FAIL [ 0.323s] (221/224) idenso tensor::tests::parsing::infinite_execution
  87. 31.68 s gammaloop-nextest-spenso> stdout ---
  88. 31.68 s gammaloop-nextest-spenso>
  89. 31.68 s gammaloop-nextest-spenso> running 1 test
  90. 31.68 s gammaloop-nextest-spenso> ━━━━━━━━━━━━━━━━━━━━━━━━━━━━━━━ Snapshot Summary ━━━━━━━━━━━━━━━━━━━━━━━━━━━━━━━
  91. 31.68 s gammaloop-nextest-spenso> Snapshot: infinite_execution
  92. 31.68 s gammaloop-nextest-spenso> Source: crates/idenso/src/tensor/tests/parsing.rs:910
  93. 31.68 s gammaloop-nextest-spenso> ────────────────────────────────────────────────────────────────────────────────
  94. 31.68 s gammaloop-nextest-spenso> Expression: net_iter.snapshot_dot()
  95. 31.68 s gammaloop-nextest-spenso> ────────────────────────────────────────────────────────────────────────────────
  96. 31.68 s gammaloop-nextest-spenso> -old snapshot
  97. 31.68 s gammaloop-nextest-spenso> +new results
  98. 31.68 s gammaloop-nextest-spenso> ────────────┬───────────────────────────────────────────────────────────────────
  99. 31.68 s gammaloop-nextest-spenso> 8 8 │ 0:0:s -> ext0 [id=0 color="red"];
  100. 31.68 s gammaloop-nextest-spenso> 9 9 │ ext1 [style=invis];
  101. 31.68 s gammaloop-nextest-spenso> 10 10 │ 0:5:s -> ext1 [id=1 dir=none color="red" label="mink4|l_0"];
  102. 31.68 s gammaloop-nextest-spenso> 11 11 │ ext2 [style=invis];
  103. 31.68 s gammaloop-nextest-spenso> 12 │- 0:4:s -> ext2 [id=2 dir=none color="red" label="bis4|l_2"];
  104. 31.68 s gammaloop-nextest-spenso> 12 │+ 0:3:s -> ext2 [id=2 dir=none color="red" label="mink4|l_1"];
  105. 31.68 s gammaloop-nextest-spenso> 13 13 │ ext3 [style=invis];
  106. 31.68 s gammaloop-nextest-spenso> 14 │- 0:3:s -> ext3 [id=3 dir=none color="red" label="bis4|l_3"];
  107. 31.68 s gammaloop-nextest-spenso> 14 │+ 0:1:s -> ext3 [id=3 dir=none color="red" label="bis4|l_2"];
  108. 31.68 s gammaloop-nextest-spenso> 15 15 │ ext4 [style=invis];
  109. 31.68 s gammaloop-nextest-spenso> 16 │- 0:1:s -> ext4 [id=4 dir=none color="red" label="mink4|l_1"];
  110. 31.68 s gammaloop-nextest-spenso> 16 │+ 0:2:s -> ext4 [id=4 dir=none color="red" label="mink4|l_4"];
  111. 31.68 s gammaloop-nextest-spenso> 17 17 │ ext5 [style=invis];
  112. 31.68 s gammaloop-nextest-spenso> 18 │- 0:2:s -> ext5 [id=5 dir=none color="red" label="mink4|l_4"];
  113. 31.68 s gammaloop-nextest-spenso> 18 │+ 0:4:s -> ext5 [id=5 dir=none color="red" label="bis4|l_3"];
  114. 31.68 s gammaloop-nextest-spenso> 19 19 │ }
  115. 31.68 s gammaloop-nextest-spenso> ────────────┴───────────────────────────────────────────────────────────────────
  116. 31.68 s gammaloop-nextest-spenso> To update snapshots run `cargo insta review`
  117. 31.68 s gammaloop-nextest-spenso> Stopped on the first failure. Run `cargo insta test` to run all snapshots.
  118. 31.68 s gammaloop-nextest-spenso> test tensor::tests::parsing::infinite_execution ... FAILED
  119. 31.68 s gammaloop-nextest-spenso>
  120. 31.68 s gammaloop-nextest-spenso> failures:
  121. 31.68 s gammaloop-nextest-spenso>
  122. 31.68 s gammaloop-nextest-spenso> failures:
  123. 31.68 s gammaloop-nextest-spenso> tensor::tests::parsing::infinite_execution
  124. 31.68 s gammaloop-nextest-spenso>
  125. 31.68 s gammaloop-nextest-spenso> test result: FAILED. 0 passed; 1 failed; 0 ignored; 0 measured; 240 filtered out; finished in 0.30s
  126. 31.68 s gammaloop-nextest-spenso>
  127. 31.68 s gammaloop-nextest-spenso> stderr ---
  128. 31.68 s gammaloop-nextest-spenso>
  129. 31.68 s gammaloop-nextest-spenso> thread 'tensor::tests::parsing::infinite_execution' (850) panicked at /nix/store/hvwd4qqiaadc4s871lfyylxrciqrvlgs-vendor-cargo-deps/c19b7c6f923b580ac259164a89f2577984ad5ab09ee9d583b888f934adbbe8d0/insta-1.47.2/src/runtime.rs:719:13:
  130. 31.68 s gammaloop-nextest-spenso> snapshot assertion for 'infinite_execution' failed in line 910
  131. 31.68 s gammaloop-nextest-spenso> stack backtrace:
  132. 31.68 s gammaloop-nextest-spenso> 0: __rustc::rust_begin_unwind
  133. 31.68 s gammaloop-nextest-spenso> 1: core::panicking::panic_fmt
  134. 31.68 s gammaloop-nextest-spenso> 2: insta::runtime::assert_snapshot
  135. 31.68 s gammaloop-nextest-spenso> 3: idenso::tensor::tests::parsing::infinite_execution
  136. 31.68 s gammaloop-nextest-spenso> 4: <idenso::tensor::tests::parsing::infinite_execution::{closure#0} as core::ops::function::FnOnce<()>>::call_once
  137. 31.68 s gammaloop-nextest-spenso> note: Some details are omitted, run with `RUST_BACKTRACE=full` for a verbose backtrace.
  138. 31.68 s gammaloop-nextest-spenso>
  139. 33.10 s gammaloop-nextest-spenso> ------------
  140. 33.10 s gammaloop-nextest-spenso> Summary [ 2.652s] 224 tests run: 222 passed, 2 failed, 26 skipped
  141. 33.10 s gammaloop-nextest-spenso> FAIL [ 0.025s] ( 41/224) idenso color::test::form_reference::metric_contraction_respects_antisymmetric_normalization
  142. 33.10 s gammaloop-nextest-spenso> stdout ---
  143. 33.10 s gammaloop-nextest-spenso>
  144. 33.10 s gammaloop-nextest-spenso> running 1 test
  145. 33.10 s gammaloop-nextest-spenso> test color::test::form_reference::metric_contraction_respects_antisymmetric_normalization ... FAILED
  146. 33.10 s gammaloop-nextest-spenso>
  147. 33.10 s gammaloop-nextest-spenso> failures:
  148. 33.10 s gammaloop-nextest-spenso>
  149. 33.10 s gammaloop-nextest-spenso> failures:
  150. 33.10 s gammaloop-nextest-spenso> color::test::form_reference::metric_contraction_respects_antisymmetric_normalization
  151. 33.10 s gammaloop-nextest-spenso>
  152. 33.10 s gammaloop-nextest-spenso> test result: FAILED. 0 passed; 1 failed; 0 ignored; 0 measured; 240 filtered out; finished in 0.01s
  153. 33.10 s gammaloop-nextest-spenso>
  154. 33.10 s gammaloop-nextest-spenso> stderr ---
  155. 33.10 s gammaloop-nextest-spenso>
  156. 33.10 s gammaloop-nextest-spenso> thread 'color::test::form_reference::metric_contraction_respects_antisymmetric_normalization' (334) panicked at crates/idenso/src/color/test/form_reference.rs:171:5:
  157. 33.10 s gammaloop-nextest-spenso> assertion `left == right` failed
  158. 33.10 s gammaloop-nextest-spenso> left: "-1*f(coad(8,standalone_metric_j),coad(8,standalone_metric_s),coad(8,standalone_metric_u))"
  159. 33.10 s gammaloop-nextest-spenso> right: "f(coad(8,standalone_metric_j),coad(8,standalone_metric_s),coad(8,standalone_metric_u))"
  160. 33.10 s gammaloop-nextest-spenso> stack backtrace:
  161. 33.10 s gammaloop-nextest-spenso> 0: __rustc::rust_begin_unwind
  162. 33.10 s gammaloop-nextest-spenso> 1: core::panicking::panic_fmt
  163. 33.10 s gammaloop-nextest-spenso> 2: core::panicking::assert_failed_inner
  164. 33.10 s gammaloop-nextest-spenso> 3: core::panicking::assert_failed::<alloc::string::String, alloc::string::String>
  165. 33.10 s gammaloop-nextest-spenso> 4: idenso::color::test::form_reference::metric_contraction_respects_antisymmetric_normalization
  166. 33.10 s gammaloop-nextest-spenso> 5: <idenso::color::test::form_reference::metric_contraction_respects_antisymmetric_normalization::{closure#0} as core::ops::function::FnOnce<()>>::call_once
  167. 33.10 s gammaloop-nextest-spenso> note: Some details are omitted, run with `RUST_BACKTRACE=full` for a verbose backtrace.
  168. 33.10 s gammaloop-nextest-spenso>
  169. 33.10 s gammaloop-nextest-spenso> FAIL [ 0.323s] (221/224) idenso tensor::tests::parsing::infinite_execution
  170. 33.10 s gammaloop-nextest-spenso> stdout ---
  171. 33.10 s gammaloop-nextest-spenso>
  172. 33.10 s gammaloop-nextest-spenso> running 1 test
  173. 33.10 s gammaloop-nextest-spenso> ━━━━━━━━━━━━━━━━━━━━━━━━━━━━━━━ Snapshot Summary ━━━━━━━━━━━━━━━━━━━━━━━━━━━━━━━
  174. 33.10 s gammaloop-nextest-spenso> Snapshot: infinite_execution
  175. 33.10 s gammaloop-nextest-spenso> Source: crates/idenso/src/tensor/tests/parsing.rs:910
  176. 33.10 s gammaloop-nextest-spenso> ────────────────────────────────────────────────────────────────────────────────
  177. 33.10 s gammaloop-nextest-spenso> Expression: net_iter.snapshot_dot()
  178. 33.10 s gammaloop-nextest-spenso> ────────────────────────────────────────────────────────────────────────────────
  179. 33.10 s gammaloop-nextest-spenso> -old snapshot
  180. 33.10 s gammaloop-nextest-spenso> +new results
  181. 33.10 s gammaloop-nextest-spenso> ────────────┬───────────────────────────────────────────────────────────────────
  182. 33.10 s gammaloop-nextest-spenso> 8 8 │ 0:0:s -> ext0 [id=0 color="red"];
  183. 33.10 s gammaloop-nextest-spenso> 9 9 │ ext1 [style=invis];
  184. 33.10 s gammaloop-nextest-spenso> 10 10 │ 0:5:s -> ext1 [id=1 dir=none color="red" label="mink4|l_0"];
  185. 33.10 s gammaloop-nextest-spenso> 11 11 │ ext2 [style=invis];
  186. 33.10 s gammaloop-nextest-spenso> 12 │- 0:4:s -> ext2 [id=2 dir=none color="red" label="bis4|l_2"];
  187. 33.10 s gammaloop-nextest-spenso> 12 │+ 0:3:s -> ext2 [id=2 dir=none color="red" label="mink4|l_1"];
  188. 33.10 s gammaloop-nextest-spenso> 13 13 │ ext3 [style=invis];
  189. 33.10 s gammaloop-nextest-spenso> 14 │- 0:3:s -> ext3 [id=3 dir=none color="red" label="bis4|l_3"];
  190. 33.10 s gammaloop-nextest-spenso> 14 │+ 0:1:s -> ext3 [id=3 dir=none color="red" label="bis4|l_2"];
  191. 33.10 s gammaloop-nextest-spenso> 15 15 │ ext4 [style=invis];
  192. 33.10 s gammaloop-nextest-spenso> 16 │- 0:1:s -> ext4 [id=4 dir=none color="red" label="mink4|l_1"];
  193. 33.10 s gammaloop-nextest-spenso> 16 │+ 0:2:s -> ext4 [id=4 dir=none color="red" label="mink4|l_4"];
  194. 33.10 s gammaloop-nextest-spenso> 17 17 │ ext5 [style=invis];
  195. 33.10 s gammaloop-nextest-spenso> 18 │- 0:2:s -> ext5 [id=5 dir=none color="red" label="mink4|l_4"];
  196. 33.10 s gammaloop-nextest-spenso> 18 │+ 0:4:s -> ext5 [id=5 dir=none color="red" label="bis4|l_3"];
  197. 33.10 s gammaloop-nextest-spenso> 19 19 │ }
  198. 33.10 s gammaloop-nextest-spenso> ────────────┴───────────────────────────────────────────────────────────────────
  199. 33.10 s gammaloop-nextest-spenso> To update snapshots run `cargo insta review`
  200. 33.10 s gammaloop-nextest-spenso> Stopped on the first failure. Run `cargo insta test` to run all snapshots.
  201. 33.10 s gammaloop-nextest-spenso> test tensor::tests::parsing::infinite_execution ... FAILED
  202. 33.10 s gammaloop-nextest-spenso>
  203. 33.10 s gammaloop-nextest-spenso> failures:
  204. 33.10 s gammaloop-nextest-spenso>
  205. 33.10 s gammaloop-nextest-spenso> failures:
  206. 33.10 s gammaloop-nextest-spenso> tensor::tests::parsing::infinite_execution
  207. 33.10 s gammaloop-nextest-spenso>
  208. 33.10 s gammaloop-nextest-spenso> test result: FAILED. 0 passed; 1 failed; 0 ignored; 0 measured; 240 filtered out; finished in 0.30s
  209. 33.10 s gammaloop-nextest-spenso>
  210. 33.10 s gammaloop-nextest-spenso> stderr ---
  211. 33.10 s gammaloop-nextest-spenso>
  212. 33.10 s gammaloop-nextest-spenso> thread 'tensor::tests::parsing::infinite_execution' (850) panicked at /nix/store/hvwd4qqiaadc4s871lfyylxrciqrvlgs-vendor-cargo-deps/c19b7c6f923b580ac259164a89f2577984ad5ab09ee9d583b888f934adbbe8d0/insta-1.47.2/src/runtime.rs:719:13:
  213. 33.10 s gammaloop-nextest-spenso> snapshot assertion for 'infinite_execution' failed in line 910
  214. 33.10 s gammaloop-nextest-spenso> stack backtrace:
  215. 33.10 s gammaloop-nextest-spenso> 0: __rustc::rust_begin_unwind
  216. 33.10 s gammaloop-nextest-spenso> 1: core::panicking::panic_fmt
  217. 33.10 s gammaloop-nextest-spenso> 2: insta::runtime::assert_snapshot
  218. 33.10 s gammaloop-nextest-spenso> 3: idenso::tensor::tests::parsing::infinite_execution
  219. 33.10 s gammaloop-nextest-spenso> 4: <idenso::tensor::tests::parsing::infinite_execution::{closure#0} as core::ops::function::FnOnce<()>>::call_once
  220. 33.10 s gammaloop-nextest-spenso> note: Some details are omitted, run with `RUST_BACKTRACE=full` for a verbose backtrace.
  221. 33.10 s gammaloop-nextest-spenso>
  222. 33.14 s gammaloop-nextest-spenso> error: test run failed
  223. 33.29 s gammaloop-nextest-spenso>
  224. 33.29 s gammaloop-nextest-spenso> ========== nextest test summary ==========
  225. 33.29 s gammaloop-nextest-spenso> report: target/nextest/ci_gammaloop/junit.xml
  226. 33.29 s gammaloop-nextest-spenso> tests: 224, failures: 2, errors: 0
  227. 33.29 s gammaloop-nextest-spenso>
  228. 33.29 s gammaloop-nextest-spenso> 1. idenso::color::test::form_reference::metric_contraction_respects_antisymmetric_normalization
  229. 33.29 s gammaloop-nextest-spenso> failure: test failure with exit code 101
  230. 33.29 s gammaloop-nextest-spenso> thread 'color::test::form_reference::metric_contraction_respects_antisymmetric_normalization' (334) panicked at crates/idenso/src/color/test/form_reference.rs:171:5:
  231. 33.29 s gammaloop-nextest-spenso> assertion `left == right` failed
  232. 33.29 s gammaloop-nextest-spenso> left: "-1*f(coad(8,standalone_metric_j),coad(8,standalone_metric_s),coad(8,standalone_metric_u))"
  233. 33.29 s gammaloop-nextest-spenso> right: "f(coad(8,standalone_metric_j),coad(8,standalone_metric_s),coad(8,standalone_metric_u))"
  234. 33.29 s gammaloop-nextest-spenso> stack backtrace:
  235. 33.29 s gammaloop-nextest-spenso> 0: __rustc::rust_begin_unwind
  236. 33.29 s gammaloop-nextest-spenso> 1: core::panicking::panic_fmt
  237. 33.29 s gammaloop-nextest-spenso> 2: core::panicking::assert_failed_inner
  238. 33.29 s gammaloop-nextest-spenso> 3: core::panicking::assert_failed::<alloc::string::String, alloc::string::String>
  239. 33.29 s gammaloop-nextest-spenso> 4: idenso::color::test::form_reference::metric_contraction_respects_antisymmetric_normalization
  240. 33.29 s gammaloop-nextest-spenso> 5: <idenso::color::test::form_reference::metric_contraction_respects_antisymmetric_normalization::{closure#0} as core::ops::function::FnOnce<()>>::call_once
  241. 33.29 s gammaloop-nextest-spenso> note: Some details are omitted, run with `RUST_BACKTRACE=full` for a verbose backtrace.
  242. 33.29 s gammaloop-nextest-spenso> system-out
  243. 33.29 s gammaloop-nextest-spenso> running 1 test
  244. 33.29 s gammaloop-nextest-spenso> test color::test::form_reference::metric_contraction_respects_antisymmetric_normalization ... FAILED
  245. 33.29 s gammaloop-nextest-spenso>
  246. 33.29 s gammaloop-nextest-spenso> failures:
  247. 33.29 s gammaloop-nextest-spenso>
  248. 33.29 s gammaloop-nextest-spenso> failures:
  249. 33.29 s gammaloop-nextest-spenso> color::test::form_reference::metric_contraction_respects_antisymmetric_normalization
  250. 33.29 s gammaloop-nextest-spenso>
  251. 33.29 s gammaloop-nextest-spenso> test result: FAILED. 0 passed; 1 failed; 0 ignored; 0 measured; 240 filtered out; finished in 0.01s
  252. 33.29 s gammaloop-nextest-spenso> system-err
  253. 33.29 s gammaloop-nextest-spenso> thread 'color::test::form_reference::metric_contraction_respects_antisymmetric_normalization' (334) panicked at crates/idenso/src/color/test/form_reference.rs:171:5:
  254. 33.29 s gammaloop-nextest-spenso> assertion `left == right` failed
  255. 33.29 s gammaloop-nextest-spenso> left: "-1*f(coad(8,standalone_metric_j),coad(8,standalone_metric_s),coad(8,standalone_metric_u))"
  256. 33.29 s gammaloop-nextest-spenso> right: "f(coad(8,standalone_metric_j),coad(8,standalone_metric_s),coad(8,standalone_metric_u))"
  257. 33.29 s gammaloop-nextest-spenso> stack backtrace:
  258. 33.29 s gammaloop-nextest-spenso> 0: __rustc::rust_begin_unwind
  259. 33.29 s gammaloop-nextest-spenso> 1: core::panicking::panic_fmt
  260. 33.29 s gammaloop-nextest-spenso> 2: core::panicking::assert_failed_inner
  261. 33.29 s gammaloop-nextest-spenso> 3: core::panicking::assert_failed::<alloc::string::String, alloc::string::String>
  262. 33.29 s gammaloop-nextest-spenso> 4: idenso::color::test::form_reference::metric_contraction_respects_antisymmetric_normalization
  263. 33.29 s gammaloop-nextest-spenso> 5: <idenso::color::test::form_reference::metric_contraction_respects_antisymmetric_normalization::{closure#0} as core::ops::function::FnOnce<()>>::call_once
  264. 33.29 s gammaloop-nextest-spenso> note: Some details are omitted, run with `RUST_BACKTRACE=full` for a verbose backtrace.
  265. 33.29 s gammaloop-nextest-spenso>
  266. 33.29 s gammaloop-nextest-spenso> 2. idenso::tensor::tests::parsing::infinite_execution
  267. 33.29 s gammaloop-nextest-spenso> failure: test failure with exit code 101
  268. 33.29 s gammaloop-nextest-spenso> thread 'tensor::tests::parsing::infinite_execution' (850) panicked at /nix/store/hvwd4qqiaadc4s871lfyylxrciqrvlgs-vendor-cargo-deps/c19b7c6f923b580ac259164a89f2577984ad5ab09ee9d583b888f934adbbe8d0/insta-1.47.2/src/runtime.rs:719:13:
  269. 33.29 s gammaloop-nextest-spenso> snapshot assertion for 'infinite_execution' failed in line 910
  270. 33.29 s gammaloop-nextest-spenso> stack backtrace:
  271. 33.29 s gammaloop-nextest-spenso> 0: __rustc::rust_begin_unwind
  272. 33.29 s gammaloop-nextest-spenso> 1: core::panicking::panic_fmt
  273. 33.29 s gammaloop-nextest-spenso> 2: insta::runtime::assert_snapshot
  274. 33.29 s gammaloop-nextest-spenso> 3: idenso::tensor::tests::parsing::infinite_execution
  275. 33.29 s gammaloop-nextest-spenso> 4: <idenso::tensor::tests::parsing::infinite_execution::{closure#0} as core::ops::function::FnOnce<()>>::call_once
  276. 33.29 s gammaloop-nextest-spenso> note: Some details are omitted, run with `RUST_BACKTRACE=full` for a verbose backtrace.
  277. 33.29 s gammaloop-nextest-spenso> system-out
  278. 33.29 s gammaloop-nextest-spenso> running 1 test
  279. 33.29 s gammaloop-nextest-spenso> ━━━━━━━━━━━━━━━━━━━━━━━━━━━━━━━ Snapshot Summary ━━━━━━━━━━━━━━━━━━━━━━━━━━━━━━━
  280. 33.29 s gammaloop-nextest-spenso> Snapshot: infinite_execution
  281. 33.29 s gammaloop-nextest-spenso> Source: crates/idenso/src/tensor/tests/parsing.rs:910
  282. 33.29 s gammaloop-nextest-spenso> ────────────────────────────────────────────────────────────────────────────────
  283. 33.29 s gammaloop-nextest-spenso> Expression: net_iter.snapshot_dot()
  284. 33.29 s gammaloop-nextest-spenso> ────────────────────────────────────────────────────────────────────────────────
  285. 33.29 s gammaloop-nextest-spenso> -old snapshot
  286. 33.29 s gammaloop-nextest-spenso> +new results
  287. 33.29 s gammaloop-nextest-spenso> ────────────┬───────────────────────────────────────────────────────────────────
  288. 33.29 s gammaloop-nextest-spenso> 8 8 │ 0:0:s-> ext0 [id=0 color="red"];
  289. 33.29 s gammaloop-nextest-spenso> 9 9 │ ext1 [style=invis];
  290. 33.29 s gammaloop-nextest-spenso> 10 10 │ 0:5:s-> ext1 [id=1 dir=none color="red" label="mink4|l_0"];
  291. 33.29 s gammaloop-nextest-spenso> 11 11 │ ext2 [style=invis];
  292. 33.29 s gammaloop-nextest-spenso> 12 │- 0:4:s-> ext2 [id=2 dir=none color="red" label="bis4|l_2"];
  293. 33.29 s gammaloop-nextest-spenso> 12 │+ 0:3:s-> ext2 [id=2 dir=none color="red" label="mink4|l_1"];
  294. 33.29 s gammaloop-nextest-spenso> 13 13 │ ext3 [style=invis];
  295. 33.29 s gammaloop-nextest-spenso> 14 │- 0:3:s-> ext3 [id=3 dir=none color="red" label="bis4|l_3"];
  296. 33.29 s gammaloop-nextest-spenso> 14 │+ 0:1:s-> ext3 [id=3 dir=none color="red" label="bis4|l_2"];
  297. 33.29 s gammaloop-nextest-spenso> 15 15 │ ext4 [style=invis];
  298. 33.29 s gammaloop-nextest-spenso> 16 │- 0:1:s-> ext4 [id=4 dir=none color="red" label="mink4|l_1"];
  299. 33.29 s gammaloop-nextest-spenso> 16 │+ 0:2:s-> ext4 [id=4 dir=none color="red" label="mink4|l_4"];
  300. 33.29 s gammaloop-nextest-spenso> 17 17 │ ext5 [style=invis];
  301. 33.29 s gammaloop-nextest-spenso> 18 │- 0:2:s-> ext5 [id=5 dir=none color="red" label="mink4|l_4"];
  302. 33.29 s gammaloop-nextest-spenso> 18 │+ 0:4:s-> ext5 [id=5 dir=none color="red" label="bis4|l_3"];
  303. 33.29 s gammaloop-nextest-spenso> 19 19 │ }
  304. 33.29 s gammaloop-nextest-spenso> ────────────┴───────────────────────────────────────────────────────────────────
  305. 33.29 s gammaloop-nextest-spenso> To update snapshots run `cargo insta review`
  306. 33.29 s gammaloop-nextest-spenso> Stopped on the first failure. Run `cargo insta test` to run all snapshots.
  307. 33.29 s gammaloop-nextest-spenso> test tensor::tests::parsing::infinite_execution ... FAILED
  308. 33.29 s gammaloop-nextest-spenso>
  309. 33.29 s gammaloop-nextest-spenso> failures:
  310. 33.29 s gammaloop-nextest-spenso>
  311. 33.29 s gammaloop-nextest-spenso> failures:
  312. 33.29 s gammaloop-nextest-spenso> tensor::tests::parsing::infinite_execution
  313. 33.29 s gammaloop-nextest-spenso>
  314. 33.29 s gammaloop-nextest-spenso> test result: FAILED. 0 passed; 1 failed; 0 ignored; 0 measured; 240 filtered out; finished in 0.30s
  315. 33.29 s gammaloop-nextest-spenso> system-err
  316. 33.29 s gammaloop-nextest-spenso> thread 'tensor::tests::parsing::infinite_execution' (850) panicked at /nix/store/hvwd4qqiaadc4s871lfyylxrciqrvlgs-vendor-cargo-deps/c19b7c6f923b580ac259164a89f2577984ad5ab09ee9d583b888f934adbbe8d0/insta-1.47.2/src/runtime.rs:719:13:
  317. 33.29 s gammaloop-nextest-spenso> snapshot assertion for 'infinite_execution' failed in line 910
  318. 33.29 s gammaloop-nextest-spenso> stack backtrace:
  319. 33.29 s gammaloop-nextest-spenso> 0: __rustc::rust_begin_unwind
  320. 33.29 s gammaloop-nextest-spenso> 1: core::panicking::panic_fmt
  321. 33.29 s gammaloop-nextest-spenso> 2: insta::runtime::assert_snapshot
  322. 33.29 s gammaloop-nextest-spenso> 3: idenso::tensor::tests::parsing::infinite_execution
  323. 33.29 s gammaloop-nextest-spenso> 4: <idenso::tensor::tests::parsing::infinite_execution::{closure#0} as core::ops::function::FnOnce<()>>::call_once
  324. 33.29 s gammaloop-nextest-spenso> note: Some details are omitted, run with `RUST_BACKTRACE=full` for a verbose backtrace.
  325. 33.29 s gammaloop-nextest-spenso> =========================================
  326. 33.34 s gammaloop-nextest-spenso> Extracting 2 binaries and 1 linked path to /build/nextest-archive-UYMFLO
  327. 33.45 s gammaloop-nextest-spenso> Extracted 8 files to /build/nextest-archive-UYMFLO in 0.10s
  328. 33.48 s gammaloop-nextest-spenso> ------------
  329. 33.48 s gammaloop-nextest-spenso> Nextest run ID bde0aede-a296-4096-96a2-afb738dffd44 with nextest profile: ci_gammaloop
  330. 33.48 s gammaloop-nextest-spenso> Starting 135 tests across 2 binaries
  331. 33.72 s gammaloop-nextest-spenso> ------------
  332. 33.72 s gammaloop-nextest-spenso> Summary [ 0.239s] 135 tests run: 135 passed, 0 skipped
  333. 33.78 s gammaloop-nextest-spenso>
  334. 33.78 s gammaloop-nextest-spenso> ========== nextest test summary ==========
  335. 33.78 s gammaloop-nextest-spenso> report: target/nextest/ci_gammaloop/junit.xml
  336. 33.78 s gammaloop-nextest-spenso> tests: 135, failures: 0, errors: 0
  337. 33.78 s gammaloop-nextest-spenso> No failing testcases found.
  338. 33.78 s gammaloop-nextest-spenso> =========================================
  339. 33.80 s gammaloop-nextest-spenso> Extracting 5 binaries and 2 linked paths to /build/nextest-archive-b1PVc2
  340. 34.07 s gammaloop-nextest-spenso> Extracted 19 files to /build/nextest-archive-b1PVc2 in 0.27s
  341. 34.13 s gammaloop-nextest-spenso> ------------
  342. 34.13 s gammaloop-nextest-spenso> Nextest run ID f6225dfd-4d13-4e00-b66b-1de00f671025 with nextest profile: ci_gammaloop
  343. 34.13 s gammaloop-nextest-spenso> Starting 25 tests across 5 binaries (1 test skipped via profile.ci_gammaloop.default-filter)
  344. 34.45 s gammaloop-nextest-spenso> ------------
  345. 34.45 s gammaloop-nextest-spenso> Summary [ 0.324s] 25 tests run: 25 passed, 1 skipped
  346. 34.54 s gammaloop-nextest-spenso>
  347. 34.54 s gammaloop-nextest-spenso> ========== nextest test summary ==========
  348. 34.54 s gammaloop-nextest-spenso> report: target/nextest/ci_gammaloop/junit.xml
  349. 34.54 s gammaloop-nextest-spenso> tests: 25, failures: 0, errors: 0
  350. 34.54 s gammaloop-nextest-spenso> No failing testcases found.
  351. 34.54 s gammaloop-nextest-spenso> =========================================
  352. 34.57 s gammaloop-nextest-spenso> Extracting 2 binaries and 1 linked path to /build/nextest-archive-cfhhrA
  353. 34.64 s gammaloop-nextest-spenso> Extracted 8 files to /build/nextest-archive-cfhhrA in 0.07s
  354. 34.68 s gammaloop-nextest-spenso> ------------
  355. 34.68 s gammaloop-nextest-spenso> Nextest run ID 90f62386-5164-4a60-8d54-11b1c82371b9 with nextest profile: ci_gammaloop
  356. 34.68 s gammaloop-nextest-spenso> Starting 1 test across 2 binaries
  357. 34.70 s gammaloop-nextest-spenso> ------------
  358. 34.70 s gammaloop-nextest-spenso> Summary [ 0.016s] 1 test run: 1 passed, 0 skipped
  359. 34.81 s gammaloop-nextest-spenso>
  360. 34.81 s gammaloop-nextest-spenso> ========== nextest test summary ==========
  361. 34.81 s gammaloop-nextest-spenso> report: target/nextest/ci_gammaloop/junit.xml
  362. 34.81 s gammaloop-nextest-spenso> tests: 1, failures: 0, errors: 0
  363. 34.81 s gammaloop-nextest-spenso> No failing testcases found.
  364. 34.81 s gammaloop-nextest-spenso> =========================================
  365. 34.86 s gammaloop-nextest-spenso> Extracting 1 binary and 1 linked path to /build/nextest-archive-gtmCwU
  366. 34.97 s gammaloop-nextest-spenso> Extracted 7 files to /build/nextest-archive-gtmCwU in 0.12s
  367. 35.01 s gammaloop-nextest-spenso> ------------
  368. 35.01 s gammaloop-nextest-spenso> Nextest run ID 4a25515a-487e-4266-aa9b-55ecd40ffb51 with nextest profile: ci_gammaloop
  369. 35.01 s gammaloop-nextest-spenso> Starting 0 tests across 1 binary
  370. 35.01 s gammaloop-nextest-spenso> ------------
  371. 35.01 s gammaloop-nextest-spenso> Summary [ 0.000s] 0 tests run: 0 passed, 0 skipped
  372. 35.18 s gammaloop-nextest-spenso>
  373. 35.18 s gammaloop-nextest-spenso> ========== nextest test summary ==========
  374. 36.71 s gammaloop-nextest-spenso> report: target/nextest/ci_gammaloop/junit.xml
  375. 36.71 s gammaloop-nextest-spenso> tests: 0, failures: 0, errors: 0
  376. 36.71 s gammaloop-nextest-spenso> No failing testcases found.
  377. 36.71 s gammaloop-nextest-spenso> =========================================
  378. 36.71 s error: Cannot build '/nix/store/f7dlapwy00q35hpz63fxwqijy6397ql2-gammaloop-nextest-spenso.drv'.
  379. 36.71 s Reason: builder failed with exit code 100.
  380. 36.71 s Output paths:
  381. 36.71 s /nix/store/n4ly992ql65w80b8anh5nb2sbxg5pdzw-gammaloop-nextest-spenso
  382. 36.71 s Last 325 log lines:
  383. 36.71 s > Extracting 5 binaries and 2 linked paths to /build/nextest-archive-t1huKV
  384. 36.71 s > Extracted 19 files to /build/nextest-archive-t1huKV in 0.33s
  385. 36.71 s > ------------
  386. 36.71 s > Nextest run ID 9d0939b7-b4f5-4490-aa1b-97458a072b43 with nextest profile: ci_gammaloop
  387. 36.71 s > Starting 224 tests across 5 binaries (26 tests skipped, including 2 tests via profile.ci_gammaloop.default-filter)
  388. 36.71 s > FAIL [ 0.025s] ( 41/224) idenso color::test::form_reference::metric_contraction_respects_antisymmetric_normalization
  389. 36.71 s > stdout ---
  390. 36.71 s >
  391. 36.71 s > running 1 test
  392. 36.71 s > test color::test::form_reference::metric_contraction_respects_antisymmetric_normalization ... FAILED
  393. 36.71 s >
  394. 36.71 s > failures:
  395. 36.71 s >
  396. 36.71 s > failures:
  397. 36.71 s > color::test::form_reference::metric_contraction_respects_antisymmetric_normalization
  398. 36.71 s >
  399. 36.71 s > test result: FAILED. 0 passed; 1 failed; 0 ignored; 0 measured; 240 filtered out; finished in 0.01s
  400. 36.71 s >
  401. 36.71 s > stderr ---
  402. 36.71 s >
  403. 36.71 s > thread 'color::test::form_reference::metric_contraction_respects_antisymmetric_normalization' (334) panicked at crates/idenso/src/color/test/form_reference.rs:171:5:
  404. 36.71 s > assertion `left == right` failed
  405. 36.71 s > left: "-1*f(coad(8,standalone_metric_j),coad(8,standalone_metric_s),coad(8,standalone_metric_u))"
  406. 36.71 s > right: "f(coad(8,standalone_metric_j),coad(8,standalone_metric_s),coad(8,standalone_metric_u))"
  407. 36.71 s > stack backtrace:
  408. 36.71 s > 0: __rustc::rust_begin_unwind
  409. 36.71 s > 1: core::panicking::panic_fmt
  410. 36.71 s > 2: core::panicking::assert_failed_inner
  411. 36.71 s > 3: core::panicking::assert_failed::<alloc::string::String, alloc::string::String>
  412. 36.71 s > 4: idenso::color::test::form_reference::metric_contraction_respects_antisymmetric_normalization
  413. 36.71 s > 5: <idenso::color::test::form_reference::metric_contraction_respects_antisymmetric_normalization::{closure#0} as core::ops::function::FnOnce<()>>::call_once
  414. 36.71 s > note: Some details are omitted, run with `RUST_BACKTRACE=full` for a verbose backtrace.
  415. 36.71 s >
  416. 36.71 s > FAIL [ 0.323s] (221/224) idenso tensor::tests::parsing::infinite_execution
  417. 36.71 s > stdout ---
  418. 36.71 s >
  419. 36.71 s > running 1 test
  420. 36.71 s > ━━━━━━━━━━━━━━━━━━━━━━━━━━━━━━━ Snapshot Summary ━━━━━━━━━━━━━━━━━━━━━━━━━━━━━━━
  421. 36.71 s > Snapshot: infinite_execution
  422. 36.71 s > Source: crates/idenso/src/tensor/tests/parsing.rs:910
  423. 36.71 s > ────────────────────────────────────────────────────────────────────────────────
  424. 36.71 s > Expression: net_iter.snapshot_dot()
  425. 36.71 s > ────────────────────────────────────────────────────────────────────────────────
  426. 36.71 s > -old snapshot
  427. 36.71 s > +new results
  428. 36.71 s > ────────────┬───────────────────────────────────────────────────────────────────
  429. 36.71 s > 8 8 │ 0:0:s -> ext0 [id=0 color="red"];
  430. 36.71 s > 9 9 │ ext1 [style=invis];
  431. 36.71 s > 10 10 │ 0:5:s -> ext1 [id=1 dir=none color="red" label="mink4|l_0"];
  432. 36.71 s > 11 11 │ ext2 [style=invis];
  433. 36.71 s > 12 │- 0:4:s -> ext2 [id=2 dir=none color="red" label="bis4|l_2"];
  434. 36.71 s > 12 │+ 0:3:s -> ext2 [id=2 dir=none color="red" label="mink4|l_1"];
  435. 36.71 s > 13 13 │ ext3 [style=invis];
  436. 36.71 s > 14 │- 0:3:s -> ext3 [id=3 dir=none color="red" label="bis4|l_3"];
  437. 36.71 s > 14 │+ 0:1:s -> ext3 [id=3 dir=none color="red" label="bis4|l_2"];
  438. 36.71 s > 15 15 │ ext4 [style=invis];
  439. 36.71 s > 16 │- 0:1:s -> ext4 [id=4 dir=none color="red" label="mink4|l_1"];
  440. 36.71 s > 16 │+ 0:2:s -> ext4 [id=4 dir=none color="red" label="mink4|l_4"];
  441. 36.71 s > 17 17 │ ext5 [style=invis];
  442. 36.71 s > 18 │- 0:2:s -> ext5 [id=5 dir=none color="red" label="mink4|l_4"];
  443. 36.71 s > 18 │+ 0:4:s -> ext5 [id=5 dir=none color="red" label="bis4|l_3"];
  444. 36.71 s > 19 19 │ }
  445. 36.71 s > ────────────┴───────────────────────────────────────────────────────────────────
  446. 36.71 s > To update snapshots run `cargo insta review`
  447. 36.71 s > Stopped on the first failure. Run `cargo insta test` to run all snapshots.
  448. 36.71 s > test tensor::tests::parsing::infinite_execution ... FAILED
  449. 36.71 s >
  450. 36.71 s > failures:
  451. 36.71 s >
  452. 36.71 s > failures:
  453. 36.71 s > tensor::tests::parsing::infinite_execution
  454. 36.71 s >
  455. 36.71 s > test result: FAILED. 0 passed; 1 failed; 0 ignored; 0 measured; 240 filtered out; finished in 0.30s
  456. 36.71 s >
  457. 36.71 s > stderr ---
  458. 36.71 s >
  459. 36.71 s > thread 'tensor::tests::parsing::infinite_execution' (850) panicked at /nix/store/hvwd4qqiaadc4s871lfyylxrciqrvlgs-vendor-cargo-deps/c19b7c6f923b580ac259164a89f2577984ad5ab09ee9d583b888f934adbbe8d0/insta-1.47.2/src/runtime.rs:719:13:
  460. 36.71 s > snapshot assertion for 'infinite_execution' failed in line 910
  461. 36.71 s > stack backtrace:
  462. 36.71 s > 0: __rustc::rust_begin_unwind
  463. 36.71 s > 1: core::panicking::panic_fmt
  464. 36.71 s > 2: insta::runtime::assert_snapshot
  465. 36.71 s > 3: idenso::tensor::tests::parsing::infinite_execution
  466. 36.71 s > 4: <idenso::tensor::tests::parsing::infinite_execution::{closure#0} as core::ops::function::FnOnce<()>>::call_once
  467. 36.71 s > note: Some details are omitted, run with `RUST_BACKTRACE=full` for a verbose backtrace.
  468. 36.71 s >
  469. 36.71 s > ------------
  470. 36.71 s > Summary [ 2.652s] 224 tests run: 222 passed, 2 failed, 26 skipped
  471. 36.71 s > FAIL [ 0.025s] ( 41/224) idenso color::test::form_reference::metric_contraction_respects_antisymmetric_normalization
  472. 36.71 s > stdout ---
  473. 36.71 s >
  474. 36.71 s > running 1 test
  475. 36.71 s > test color::test::form_reference::metric_contraction_respects_antisymmetric_normalization ... FAILED
  476. 36.71 s >
  477. 36.71 s > failures:
  478. 36.71 s >
  479. 36.71 s > failures:
  480. 36.71 s > color::test::form_reference::metric_contraction_respects_antisymmetric_normalization
  481. 36.71 s >
  482. 36.71 s > test result: FAILED. 0 passed; 1 failed; 0 ignored; 0 measured; 240 filtered out; finished in 0.01s
  483. 36.71 s >
  484. 36.71 s > stderr ---
  485. 36.71 s >
  486. 36.71 s > thread 'color::test::form_reference::metric_contraction_respects_antisymmetric_normalization' (334) panicked at crates/idenso/src/color/test/form_reference.rs:171:5:
  487. 36.71 s > assertion `left == right` failed
  488. 36.71 s > left: "-1*f(coad(8,standalone_metric_j),coad(8,standalone_metric_s),coad(8,standalone_metric_u))"
  489. 36.71 s > right: "f(coad(8,standalone_metric_j),coad(8,standalone_metric_s),coad(8,standalone_metric_u))"
  490. 36.71 s > stack backtrace:
  491. 36.71 s > 0: __rustc::rust_begin_unwind
  492. 36.71 s > 1: core::panicking::panic_fmt
  493. 36.71 s > 2: core::panicking::assert_failed_inner
  494. 36.71 s > 3: core::panicking::assert_failed::<alloc::string::String, alloc::string::String>
  495. 36.71 s > 4: idenso::color::test::form_reference::metric_contraction_respects_antisymmetric_normalization
  496. 36.71 s > 5: <idenso::color::test::form_reference::metric_contraction_respects_antisymmetric_normalization::{closure#0} as core::ops::function::FnOnce<()>>::call_once
  497. 36.71 s > note: Some details are omitted, run with `RUST_BACKTRACE=full` for a verbose backtrace.
  498. 36.71 s >
  499. 36.71 s > FAIL [ 0.323s] (221/224) idenso tensor::tests::parsing::infinite_execution
  500. 36.71 s > stdout ---
  501. 36.71 s >
  502. 36.71 s > running 1 test
  503. 36.71 s > ━━━━━━━━━━━━━━━━━━━━━━━━━━━━━━━ Snapshot Summary ━━━━━━━━━━━━━━━━━━━━━━━━━━━━━━━
  504. 36.71 s > Snapshot: infinite_execution
  505. 36.71 s > Source: crates/idenso/src/tensor/tests/parsing.rs:910
  506. 36.71 s > ────────────────────────────────────────────────────────────────────────────────
  507. 36.71 s > Expression: net_iter.snapshot_dot()
  508. 36.71 s > ────────────────────────────────────────────────────────────────────────────────
  509. 36.71 s > -old snapshot
  510. 36.71 s > +new results
  511. 36.71 s > ────────────┬───────────────────────────────────────────────────────────────────
  512. 36.71 s > 8 8 │ 0:0:s -> ext0 [id=0 color="red"];
  513. 36.71 s > 9 9 │ ext1 [style=invis];
  514. 36.71 s > 10 10 │ 0:5:s -> ext1 [id=1 dir=none color="red" label="mink4|l_0"];
  515. 36.71 s > 11 11 │ ext2 [style=invis];
  516. 36.71 s > 12 │- 0:4:s -> ext2 [id=2 dir=none color="red" label="bis4|l_2"];
  517. 36.71 s > 12 │+ 0:3:s -> ext2 [id=2 dir=none color="red" label="mink4|l_1"];
  518. 36.71 s > 13 13 │ ext3 [style=invis];
  519. 36.71 s > 14 │- 0:3:s -> ext3 [id=3 dir=none color="red" label="bis4|l_3"];
  520. 36.71 s > 14 │+ 0:1:s -> ext3 [id=3 dir=none color="red" label="bis4|l_2"];
  521. 36.71 s > 15 15 │ ext4 [style=invis];
  522. 36.71 s > 16 │- 0:1:s -> ext4 [id=4 dir=none color="red" label="mink4|l_1"];
  523. 36.71 s > 16 │+ 0:2:s -> ext4 [id=4 dir=none color="red" label="mink4|l_4"];
  524. 36.71 s > 17 17 │ ext5 [style=invis];
  525. 36.71 s > 18 │- 0:2:s -> ext5 [id=5 dir=none color="red" label="mink4|l_4"];
  526. 36.71 s > 18 │+ 0:4:s -> ext5 [id=5 dir=none color="red" label="bis4|l_3"];
  527. 36.71 s > 19 19 │ }
  528. 36.71 s > ────────────┴───────────────────────────────────────────────────────────────────
  529. 36.71 s > To update snapshots run `cargo insta review`
  530. 36.71 s > Stopped on the first failure. Run `cargo insta test` to run all snapshots.
  531. 36.71 s > test tensor::tests::parsing::infinite_execution ... FAILED
  532. 36.71 s >
  533. 36.71 s > failures:
  534. 36.71 s >
  535. 36.71 s > failures:
  536. 36.71 s > tensor::tests::parsing::infinite_execution
  537. 36.71 s >
  538. 36.71 s > test result: FAILED. 0 passed; 1 failed; 0 ignored; 0 measured; 240 filtered out; finished in 0.30s
  539. 36.71 s >
  540. 36.71 s > stderr ---
  541. 36.71 s >
  542. 36.71 s > thread 'tensor::tests::parsing::infinite_execution' (850) panicked at /nix/store/hvwd4qqiaadc4s871lfyylxrciqrvlgs-vendor-cargo-deps/c19b7c6f923b580ac259164a89f2577984ad5ab09ee9d583b888f934adbbe8d0/insta-1.47.2/src/runtime.rs:719:13:
  543. 36.71 s > snapshot assertion for 'infinite_execution' failed in line 910
  544. 36.71 s > stack backtrace:
  545. 36.71 s > 0: __rustc::rust_begin_unwind
  546. 36.71 s > 1: core::panicking::panic_fmt
  547. 36.71 s > 2: insta::runtime::assert_snapshot
  548. 36.71 s > 3: idenso::tensor::tests::parsing::infinite_execution
  549. 36.71 s > 4: <idenso::tensor::tests::parsing::infinite_execution::{closure#0} as core::ops::function::FnOnce<()>>::call_once
  550. 36.71 s > note: Some details are omitted, run with `RUST_BACKTRACE=full` for a verbose backtrace.
  551. 36.71 s >
  552. 36.71 s > error: test run failed
  553. 36.71 s >
  554. 36.71 s > ========== nextest test summary ==========
  555. 36.71 s > report: target/nextest/ci_gammaloop/junit.xml
  556. 36.71 s > tests: 224, failures: 2, errors: 0
  557. 36.71 s >
  558. 36.71 s > 1. idenso::color::test::form_reference::metric_contraction_respects_antisymmetric_normalization
  559. 36.71 s > failure: test failure with exit code 101
  560. 36.71 s > thread 'color::test::form_reference::metric_contraction_respects_antisymmetric_normalization' (334) panicked at crates/idenso/src/color/test/form_reference.rs:171:5:
  561. 36.71 s > assertion `left == right` failed
  562. 36.71 s > left: "-1*f(coad(8,standalone_metric_j),coad(8,standalone_metric_s),coad(8,standalone_metric_u))"
  563. 36.71 s > right: "f(coad(8,standalone_metric_j),coad(8,standalone_metric_s),coad(8,standalone_metric_u))"
  564. 36.71 s > stack backtrace:
  565. 36.71 s > 0: __rustc::rust_begin_unwind
  566. 36.71 s > 1: core::panicking::panic_fmt
  567. 36.71 s > 2: core::panicking::assert_failed_inner
  568. 36.71 s > 3: core::panicking::assert_failed::<alloc::string::String, alloc::string::String>
  569. 36.71 s > 4: idenso::color::test::form_reference::metric_contraction_respects_antisymmetric_normalization
  570. 36.71 s > 5: <idenso::color::test::form_reference::metric_contraction_respects_antisymmetric_normalization::{closure#0} as core::ops::function::FnOnce<()>>::call_once
  571. 36.71 s > note: Some details are omitted, run with `RUST_BACKTRACE=full` for a verbose backtrace.
  572. 36.71 s > system-out
  573. 36.71 s > running 1 test
  574. 36.71 s > test color::test::form_reference::metric_contraction_respects_antisymmetric_normalization ... FAILED
  575. 36.71 s >
  576. 36.71 s > failures:
  577. 36.71 s >
  578. 36.71 s > failures:
  579. 36.71 s > color::test::form_reference::metric_contraction_respects_antisymmetric_normalization
  580. 36.71 s >
  581. 36.71 s > test result: FAILED. 0 passed; 1 failed; 0 ignored; 0 measured; 240 filtered out; finished in 0.01s
  582. 36.71 s > system-err
  583. 36.71 s > thread 'color::test::form_reference::metric_contraction_respects_antisymmetric_normalization' (334) panicked at crates/idenso/src/color/test/form_reference.rs:171:5:
  584. 36.71 s > assertion `left == right` failed
  585. 36.71 s > left: "-1*f(coad(8,standalone_metric_j),coad(8,standalone_metric_s),coad(8,standalone_metric_u))"
  586. 36.71 s > right: "f(coad(8,standalone_metric_j),coad(8,standalone_metric_s),coad(8,standalone_metric_u))"
  587. 36.71 s > stack backtrace:
  588. 36.71 s > 0: __rustc::rust_begin_unwind
  589. 36.71 s > 1: core::panicking::panic_fmt
  590. 36.71 s > 2: core::panicking::assert_failed_inner
  591. 36.71 s > 3: core::panicking::assert_failed::<alloc::string::String, alloc::string::String>
  592. 36.71 s > 4: idenso::color::test::form_reference::metric_contraction_respects_antisymmetric_normalization
  593. 36.71 s > 5: <idenso::color::test::form_reference::metric_contraction_respects_antisymmetric_normalization::{closure#0} as core::ops::function::FnOnce<()>>::call_once
  594. 36.71 s > note: Some details are omitted, run with `RUST_BACKTRACE=full` for a verbose backtrace.
  595. 36.71 s >
  596. 36.71 s > 2. idenso::tensor::tests::parsing::infinite_execution
  597. 36.71 s > failure: test failure with exit code 101
  598. 36.71 s > thread 'tensor::tests::parsing::infinite_execution' (850) panicked at /nix/store/hvwd4qqiaadc4s871lfyylxrciqrvlgs-vendor-cargo-deps/c19b7c6f923b580ac259164a89f2577984ad5ab09ee9d583b888f934adbbe8d0/insta-1.47.2/src/runtime.rs:719:13:
  599. 36.71 s > snapshot assertion for 'infinite_execution' failed in line 910
  600. 36.71 s > stack backtrace:
  601. 36.71 s > 0: __rustc::rust_begin_unwind
  602. 36.71 s > 1: core::panicking::panic_fmt
  603. 36.71 s > 2: insta::runtime::assert_snapshot
  604. 36.71 s > 3: idenso::tensor::tests::parsing::infinite_execution
  605. 36.71 s > 4: <idenso::tensor::tests::parsing::infinite_execution::{closure#0} as core::ops::function::FnOnce<()>>::call_once
  606. 36.71 s > note: Some details are omitted, run with `RUST_BACKTRACE=full` for a verbose backtrace.
  607. 36.71 s > system-out
  608. 36.71 s > running 1 test
  609. 36.71 s > ━━━━━━━━━━━━━━━━━━━━━━━━━━━━━━━ Snapshot Summary ━━━━━━━━━━━━━━━━━━━━━━━━━━━━━━━
  610. 36.71 s > Snapshot: infinite_execution
  611. 36.71 s > Source: crates/idenso/src/tensor/tests/parsing.rs:910
  612. 36.71 s > ────────────────────────────────────────────────────────────────────────────────
  613. 36.71 s > Expression: net_iter.snapshot_dot()
  614. 36.71 s > ────────────────────────────────────────────────────────────────────────────────
  615. 36.71 s > -old snapshot
  616. 36.71 s > +new results
  617. 36.71 s > ────────────┬───────────────────────────────────────────────────────────────────
  618. 36.71 s > 8 8 │ 0:0:s-> ext0 [id=0 color="red"];
  619. 36.71 s > 9 9 │ ext1 [style=invis];
  620. 36.71 s > 10 10 │ 0:5:s-> ext1 [id=1 dir=none color="red" label="mink4|l_0"];
  621. 36.71 s > 11 11 │ ext2 [style=invis];
  622. 36.71 s > 12 │- 0:4:s-> ext2 [id=2 dir=none color="red" label="bis4|l_2"];
  623. 36.71 s > 12 │+ 0:3:s-> ext2 [id=2 dir=none color="red" label="mink4|l_1"];
  624. 36.71 s > 13 13 │ ext3 [style=invis];
  625. 36.71 s > 14 │- 0:3:s-> ext3 [id=3 dir=none color="red" label="bis4|l_3"];
  626. 36.71 s > 14 │+ 0:1:s-> ext3 [id=3 dir=none color="red" label="bis4|l_2"];
  627. 36.71 s > 15 15 │ ext4 [style=invis];
  628. 36.71 s > 16 │- 0:1:s-> ext4 [id=4 dir=none color="red" label="mink4|l_1"];
  629. 36.71 s > 16 │+ 0:2:s-> ext4 [id=4 dir=none color="red" label="mink4|l_4"];
  630. 36.71 s > 17 17 │ ext5 [style=invis];
  631. 36.71 s > 18 │- 0:2:s-> ext5 [id=5 dir=none color="red" label="mink4|l_4"];
  632. 36.71 s > 18 │+ 0:4:s-> ext5 [id=5 dir=none color="red" label="bis4|l_3"];
  633. 36.71 s > 19 19 │ }
  634. 36.71 s > ────────────┴───────────────────────────────────────────────────────────────────
  635. 36.71 s > To update snapshots run `cargo insta review`
  636. 36.71 s > Stopped on the first failure. Run `cargo insta test` to run all snapshots.
  637. 36.71 s > test tensor::tests::parsing::infinite_execution ... FAILED
  638. 36.71 s >
  639. 36.71 s > failures:
  640. 36.71 s >
  641. 36.71 s > failures:
  642. 36.71 s > tensor::tests::parsing::infinite_execution
  643. 36.71 s >
  644. 36.71 s > test result: FAILED. 0 passed; 1 failed; 0 ignored; 0 measured; 240 filtered out; finished in 0.30s
  645. 36.71 s > system-err
  646. 36.71 s > thread 'tensor::tests::parsing::infinite_execution' (850) panicked at /nix/store/hvwd4qqiaadc4s871lfyylxrciqrvlgs-vendor-cargo-deps/c19b7c6f923b580ac259164a89f2577984ad5ab09ee9d583b888f934adbbe8d0/insta-1.47.2/src/runtime.rs:719:13:
  647. 36.71 s > snapshot assertion for 'infinite_execution' failed in line 910
  648. 36.71 s > stack backtrace:
  649. 36.71 s > 0: __rustc::rust_begin_unwind
  650. 36.71 s > 1: core::panicking::panic_fmt
  651. 36.71 s > 2: insta::runtime::assert_snapshot
  652. 36.71 s > 3: idenso::tensor::tests::parsing::infinite_execution
  653. 36.71 s > 4: <idenso::tensor::tests::parsing::infinite_execution::{closure#0} as core::ops::function::FnOnce<()>>::call_once
  654. 36.71 s > note: Some details are omitted, run with `RUST_BACKTRACE=full` for a verbose backtrace.
  655. 36.71 s > =========================================
  656. 36.71 s > Extracting 2 binaries and 1 linked path to /build/nextest-archive-UYMFLO
  657. 36.71 s > Extracted 8 files to /build/nextest-archive-UYMFLO in 0.10s
  658. 36.71 s > ------------
  659. 36.71 s > Nextest run ID bde0aede-a296-4096-96a2-afb738dffd44 with nextest profile: ci_gammaloop
  660. 36.71 s > Starting 135 tests across 2 binaries
  661. 36.71 s > ------------
  662. 36.71 s > Summary [ 0.239s] 135 tests run: 135 passed, 0 skipped
  663. 36.71 s >
  664. 36.71 s > ========== nextest test summary ==========
  665. 36.71 s > report: target/nextest/ci_gammaloop/junit.xml
  666. 36.71 s > tests: 135, failures: 0, errors: 0
  667. 36.71 s > No failing testcases found.
  668. 36.71 s > =========================================
  669. 36.71 s > Extracting 5 binaries and 2 linked paths to /build/nextest-archive-b1PVc2
  670. 36.71 s > Extracted 19 files to /build/nextest-archive-b1PVc2 in 0.27s
  671. 36.71 s > ------------
  672. 36.71 s > Nextest run ID f6225dfd-4d13-4e00-b66b-1de00f671025 with nextest profile: ci_gammaloop
  673. 36.71 s > Starting 25 tests across 5 binaries (1 test skipped via profile.ci_gammaloop.default-filter)
  674. 36.71 s > ------------
  675. 36.71 s > Summary [ 0.324s] 25 tests run: 25 passed, 1 skipped
  676. 36.71 s >
  677. 36.71 s > ========== nextest test summary ==========
  678. 36.71 s > report: target/nextest/ci_gammaloop/junit.xml
  679. 36.71 s > tests: 25, failures: 0, errors: 0
  680. 36.71 s > No failing testcases found.
  681. 36.71 s > =========================================
  682. 36.71 s > Extracting 2 binaries and 1 linked path to /build/nextest-archive-cfhhrA
  683. 36.71 s > Extracted 8 files to /build/nextest-archive-cfhhrA in 0.07s
  684. 36.71 s > ------------
  685. 36.71 s > Nextest run ID 90f62386-5164-4a60-8d54-11b1c82371b9 with nextest profile: ci_gammaloop
  686. 36.71 s > Starting 1 test across 2 binaries
  687. 36.71 s > ------------
  688. 36.71 s > Summary [ 0.016s] 1 test run: 1 passed, 0 skipped
  689. 36.71 s >
  690. 36.71 s > ========== nextest test summary ==========
  691. 36.71 s > report: target/nextest/ci_gammaloop/junit.xml
  692. 36.71 s > tests: 1, failures: 0, errors: 0
  693. 36.71 s > No failing testcases found.
  694. 36.71 s > =========================================
  695. 36.71 s > Extracting 1 binary and 1 linked path to /build/nextest-archive-gtmCwU
  696. 36.71 s > Extracted 7 files to /build/nextest-archive-gtmCwU in 0.12s
  697. 36.71 s > ------------
  698. 36.71 s > Nextest run ID 4a25515a-487e-4266-aa9b-55ecd40ffb51 with nextest profile: ci_gammaloop
  699. 36.71 s > Starting 0 tests across 1 binary
  700. 36.71 s > ------------
  701. 36.71 s > Summary [ 0.000s] 0 tests run: 0 passed, 0 skipped
  702. 36.71 s >
  703. 36.71 s > ========== nextest test summary ==========
  704. 36.71 s > report: target/nextest/ci_gammaloop/junit.xml
  705. 36.71 s > tests: 0, failures: 0, errors: 0
  706. 36.71 s > No failing testcases found.
  707. 36.71 s > =========================================
  708. 36.71 s For full logs, run:
  709. 36.71 s nix log /nix/store/f7dlapwy00q35hpz63fxwqijy6397ql2-gammaloop-nextest-spenso.drv
  710. 36.71 s [0 built (1 failed), 0.0Run failed.