test packages.x86_64-linux.nix-ci-check-gammaloop-nextest-spenso

Reproduce this run
Retry Run
  1. 0.14 s $ /nix/store/9ypz3flqsrl5xl495mm8h645gadjsxi1-coreutils-9.11/bin/timeout --kill-after=15s 7200s /nix/store/23zk8sgzamrbmj1fday15szf7f2279s8-nix-2.34.7/bin/nix --extra-experimental-features nix-command --extra-experimental-features flakes flake clone git+https://github.com/alphal00p/gammaloop --dest /tmp/nix-ci-worker/stable-pwd/repo/
  2. 0.37 s Cloning into '/tmp/nix-ci-worker/stable-pwd/repo'...
  3. 1.15 s remote: Enumerating objects: 65283, done.
  4. 1.26 s remote: Counting objects: 0% (1/7934) remote: Counting objects: 1% (80/7934) remote: Counting objects: 2% (159/7934) remote: Counting objects: 3% (239/7934) remote: Counting objects: 4% (318/7934) remote: Counting objects: 5% (397/7934) remote: Counting objects: 6% (477/7934) remote: Counting objects: 7% (556/7934) remote: Counting objects: 8% (635/7934) remote: Counting objects: 9% (715/7934) remote: Counting objects: 10% (794/7934) remote: Counting objects: 11% (873/7934) remote: Counting objects: 12% (953/7934) remote: Counting objects: 13% (1032/7934) remote: Counting objects: 14% (1111/7934) remote: Counting objects: 15% (1191/7934) remote: Counting objects: 16% (1270/7934) remote: Counting objects: 17% (1349/7934) remote: Counting objects: 18% (1429/7934) remote: Counting objects: 19% (1508/7934) remote: Counting objects: 20% (1587/7934) remote: Counting objects: 21% (1667/7934) remote: Counting objects: 22% (1746/7934) remote: Counting objects: 23% (1825/7934) remote: Counting objects: 24% (1905/7934) remote: Counting objects: 25% (1984/7934) remote: Counting objects: 26% (2063/7934) remote: Counting objects: 27% (2143/7934) remote: Counting objects: 28% (2222/7934) remote: Counting objects: 29% (2301/7934) remote: Counting objects: 30% (2381/7934) remote: Counting objects: 31% (2460/7934) remote: Counting objects: 32% (2539/7934) remote: Counting objects: 33% (2619/7934) remote: Counting objects: 34% (2698/7934) remote: Counting objects: 35% (2777/7934) remote: Counting objects: 36% (2857/7934) remote: Counting objects: 37% (2936/7934) remote: Counting objects: 38% (3015/7934) remote: Counting objects: 39% (3095/7934) remote: Counting objects: 40% (3174/7934) remote: Counting objects: 41% (3253/7934) remote: Counting objects: 42% (3333/7934) remote: Counting objects: 43% (3412/7934) remote: Counting objects: 44% (3491/7934) remote: Counting objects: 45% (3571/7934) remote: Counting objects: 46% (3650/7934) remote: Counting objects: 47% (3729/7934) remote: Counting objects: 48% (3809/7934) remote: Counting objects: 49% (3888/7934) remote: Counting objects: 50% (3967/7934) remote: Counting objects: 51% (4047/7934) remote: Counting objects: 52% (4126/7934) remote: Counting objects: 53% (4206/7934) remote: Counting objects: 54% (4285/7934) remote: Counting objects: 55% (4364/7934) remote: Counting objects: 56% (4444/7934) remote: Counting objects: 57% (4523/7934) remote: Counting objects: 58% (4602/7934) remote: Counting objects: 59% (4682/7934) remote: Counting objects: 60% (4761/7934) remote: Counting objects: 61% (4840/7934) remote: Counting objects: 62% (4920/7934) remote: Counting objects: 63% (4999/7934) remote: Counting objects: 64% (5078/7934) remote: Counting objects: 65% (5158/7934) remote: Counting objects: 66% (5237/7934) remote: Counting objects: 67% (5316/7934) remote: Counting objects: 68% (5396/7934) remote: Counting objects: 69% (5475/7934) remote: Counting objects: 70% (5554/7934) remote: Counting objects: 71% (5634/7934) remote: Counting objects: 72% (5713/7934) remote: Counting objects: 73% (5792/7934) remote: Counting objects: 74% (5872/7934) remote: Counting objects: 75% (5951/7934) remote: Counting objects: 76% (6030/7934) remote: Counting objects: 77% (6110/7934) remote: Counting objects: 78% (6189/7934) remote: Counting objects: 79% (6268/7934) remote: Counting objects: 80% (6348/7934) remote: Counting objects: 81% (6427/7934) remote: Counting objects: 82% (6506/7934) remote: Counting objects: 83% (6586/7934) remote: Counting objects: 84% (6665/7934) remote: Counting objects: 85% (6744/7934) remote: Counting objects: 86% (6824/7934) remote: Counting objects: 87% (6903/7934) remote: Counting objects: 88% (6982/7934) remote: Counting objects: 89% (7062/7934) remote: Counting objects: 90% (7141/7934) remote: Counting objects: 91% (7220/7934) remote: Counting objects: 92% (7300/7934) remote: Counting objects: 93% (7379/7934) remote: Counting objects: 94% (7458/7934) remote: Counting objects: 95% (7538/7934) remote: Counting objects: 96% (7617/7934) remote: Counting objects: 97% (7696/7934) remote: Counting objects: 98% (7776/7934) remote: Counting objects: 99% (7855/7934) remote: Counting objects: 100% (7934/7934) remote: Counting objects: 100% (7934/7934), done.
  5. 2.75 s remote: Compressing objects: 0% (1/1600) remote: Compressing objects: 1% (16/1600) remote: Compressing objects: 2% (32/1600) remote: Compressing objects: 3% (48/1600) remote: Compressing objects: 4% (64/1600) remote: Compressing objects: 5% (80/1600) remote: Compressing objects: 6% (96/1600) remote: Compressing objects: 7% (112/1600) remote: Compressing objects: 8% (128/1600) remote: Compressing objects: 9% (144/1600) remote: Compressing objects: 10% (160/1600) remote: Compressing objects: 11% (176/1600) remote: Compressing objects: 12% (192/1600) remote: Compressing objects: 13% (208/1600) remote: Compressing objects: 14% (224/1600) remote: Compressing objects: 15% (240/1600) remote: Compressing objects: 15% (254/1600) remote: Compressing objects: 16% (256/1600) remote: Compressing objects: 17% (272/1600) remote: Compressing objects: 18% (288/1600) remote: Compressing objects: 19% (304/1600) remote: Compressing objects: 20% (320/1600) remote: Compressing objects: 21% (336/1600) remote: Compressing objects: 22% (352/1600) remote: Compressing objects: 23% (368/1600) remote: Compressing objects: 24% (384/1600) remote: Compressing objects: 25% (400/1600) remote: Compressing objects: 26% (416/1600) remote: Compressing objects: 27% (432/1600) remote: Compressing objects: 28% (448/1600) remote: Compressing objects: 29% (464/1600) remote: Compressing objects: 30% (480/1600) remote: Compressing objects: 31% (496/1600) remote: Compressing objects: 32% (512/1600) remote: Compressing objects: 33% (528/1600) remote: Compressing objects: 34% (544/1600) remote: Compressing objects: 35% (560/1600) remote: Compressing objects: 36% (576/1600) remote: Compressing objects: 37% (592/1600) remote: Compressing objects: 38% (608/1600) remote: Compressing objects: 39% (624/1600) remote: Compressing objects: 40% (640/1600) remote: Compressing objects: 41% (656/1600) remote: Compressing objects: 42% (672/1600) remote: Compressing objects: 43% (688/1600) remote: Compressing objects: 44% (704/1600) remote: Compressing objects: 45% (720/1600) remote: Compressing objects: 46% (736/1600) remote: Compressing objects: 47% (752/1600) remote: Compressing objects: 48% (768/1600) remote: Compressing objects: 49% (784/1600) remote: Compressing objects: 50% (800/1600) remote: Compressing objects: 51% (816/1600) remote: Compressing objects: 52% (832/1600) remote: Compressing objects: 53% (848/1600) remote: Compressing objects: 54% (864/1600) remote: Compressing objects: 55% (880/1600) remote: Compressing objects: 56% (896/1600) remote: Compressing objects: 57% (912/1600) remote: Compressing objects: 58% (928/1600) remote: Compressing objects: 59% (944/1600) remote: Compressing objects: 60% (960/1600) remote: Compressing objects: 61% (976/1600) remote: Compressing objects: 62% (992/1600) remote: Compressing objects: 63% (1008/1600) remote: Compressing objects: 64% (1024/1600) remote: Compressing objects: 65% (1040/1600) remote: Compressing objects: 66% (1056/1600) remote: Compressing objects: 67% (1072/1600) remote: Compressing objects: 68% (1088/1600) remote: Compressing objects: 69% (1104/1600) remote: Compressing objects: 70% (1120/1600) remote: Compressing objects: 71% (1136/1600) remote: Compressing objects: 72% (1152/1600) remote: Compressing objects: 73% (1168/1600) remote: Compressing objects: 74% (1184/1600) remote: Compressing objects: 75% (1200/1600) remote: Compressing objects: 76% (1216/1600) remote: Compressing objects: 77% (1232/1600) remote: Compressing objects: 78% (1248/1600) remote: Compressing objects: 79% (1264/1600) remote: Compressing objects: 80% (1280/1600) remote: Compressing objects: 81% (1296/1600) remote: Compressing objects: 82% (1312/1600) remote: Compressing objects: 83% (1328/1600) remote: Compressing objects: 84% (1344/1600) remote: Compressing objects: 85% (1360/1600) remote: Compressing objects: 86% (1376/1600) remote: Compressing objects: 87% (1392/1600) remote: Compressing objects: 88% (1408/1600) remote: Compressing objects: 89% (1424/1600) remote: Compressing objects: 90% (1440/1600) remote: Compressing objects: 91% (1456/1600) remote: Compressing objects: 92% (1472/1600) remote: Compressing objects: 93% (1488/1600) remote: Compressing objects: 94% (1504/1600) remote: Compressing objects: 95% (1520/1600) remote: Compressing objects: 96% (1536/1600) remote: Compressing objects: 97% (1552/1600) remote: Compressing objects: 98% (1568/1600) remote: Compressing objects: 99% (1584/1600) remote: Compressing objects: 100% (1600/1600) remote: Compressing objects: 100% (1600/1600), done.
  6. 5.60 s Receiving objects: 0% (1/65283) Receiving objects: 1% (653/65283) Receiving objects: 2% (1306/65283) Receiving objects: 3% (1959/65283) Receiving objects: 4% (2612/65283) Receiving objects: 5% (3265/65283) Receiving objects: 6% (3917/65283) Receiving objects: 7% (4570/65283) Receiving objects: 8% (5223/65283) Receiving objects: 9% (5876/65283) Receiving objects: 10% (6529/65283), 10.07 MiB | 20.12 MiB/s Receiving objects: 11% (7182/65283), 10.07 MiB | 20.12 MiB/s Receiving objects: 12% (7834/65283), 10.07 MiB | 20.12 MiB/s Receiving objects: 13% (8487/65283), 10.07 MiB | 20.12 MiB/s Receiving objects: 14% (9140/65283), 10.07 MiB | 20.12 MiB/s Receiving objects: 15% (9793/65283), 10.07 MiB | 20.12 MiB/s Receiving objects: 16% (10446/65283), 10.07 MiB | 20.12 MiB/s Receiving objects: 17% (11099/65283), 10.07 MiB | 20.12 MiB/s Receiving objects: 18% (11751/65283), 10.07 MiB | 20.12 MiB/s Receiving objects: 19% (12404/65283), 10.07 MiB | 20.12 MiB/s Receiving objects: 20% (13057/65283), 10.07 MiB | 20.12 MiB/s Receiving objects: 21% (13710/65283), 10.07 MiB | 20.12 MiB/s Receiving objects: 22% (14363/65283), 10.07 MiB | 20.12 MiB/s Receiving objects: 23% (15016/65283), 10.07 MiB | 20.12 MiB/s Receiving objects: 24% (15668/65283), 10.07 MiB | 20.12 MiB/s Receiving objects: 25% (16321/65283), 10.07 MiB | 20.12 MiB/s Receiving objects: 26% (16974/65283), 10.07 MiB | 20.12 MiB/s Receiving objects: 27% (17627/65283), 10.07 MiB | 20.12 MiB/s Receiving objects: 28% (18280/65283), 10.07 MiB | 20.12 MiB/s Receiving objects: 29% (18933/65283), 10.07 MiB | 20.12 MiB/s Receiving objects: 30% (19585/65283), 10.07 MiB | 20.12 MiB/s Receiving objects: 31% (20238/65283), 10.07 MiB | 20.12 MiB/s Receiving objects: 32% (20891/65283), 10.07 MiB | 20.12 MiB/s Receiving objects: 33% (21544/65283), 10.07 MiB | 20.12 MiB/s Receiving objects: 34% (22197/65283), 10.07 MiB | 20.12 MiB/s Receiving objects: 34% (22603/65283), 23.09 MiB | 23.08 MiB/s Receiving objects: 35% (22850/65283), 23.09 MiB | 23.08 MiB/s Receiving objects: 36% (23502/65283), 23.09 MiB | 23.08 MiB/s Receiving objects: 37% (24155/65283), 23.09 MiB | 23.08 MiB/s Receiving objects: 38% (24808/65283), 23.09 MiB | 23.08 MiB/s Receiving objects: 39% (25461/65283), 23.09 MiB | 23.08 MiB/s Receiving objects: 40% (26114/65283), 23.09 MiB | 23.08 MiB/s Receiving objects: 41% (26767/65283), 23.09 MiB | 23.08 MiB/s Receiving objects: 42% (27419/65283), 23.09 MiB | 23.08 MiB/s Receiving objects: 43% (28072/65283), 23.09 MiB | 23.08 MiB/s Receiving objects: 44% (28725/65283), 23.09 MiB | 23.08 MiB/s Receiving objects: 45% (29378/65283), 23.09 MiB | 23.08 MiB/s Receiving objects: 46% (30031/65283), 23.09 MiB | 23.08 MiB/s Receiving objects: 47% (30684/65283), 23.09 MiB | 23.08 MiB/s Receiving objects: 48% (31336/65283), 23.09 MiB | 23.08 MiB/s Receiving objects: 49% (31989/65283), 23.09 MiB | 23.08 MiB/s Receiving objects: 50% (32642/65283), 23.09 MiB | 23.08 MiB/s Receiving objects: 51% (33295/65283), 23.09 MiB | 23.08 MiB/s Receiving objects: 52% (33948/65283), 23.09 MiB | 23.08 MiB/s Receiving objects: 53% (34600/65283), 23.09 MiB | 23.08 MiB/s Receiving objects: 54% (35253/65283), 23.09 MiB | 23.08 MiB/s Receiving objects: 55% (35906/65283), 23.09 MiB | 23.08 MiB/s Receiving objects: 56% (36559/65283), 23.09 MiB | 23.08 MiB/s Receiving objects: 57% (37212/65283), 23.09 MiB | 23.08 MiB/s Receiving objects: 58% (37865/65283), 23.09 MiB | 23.08 MiB/s Receiving objects: 59% (38517/65283), 43.12 MiB | 28.74 MiB/s Receiving objects: 60% (39170/65283), 43.12 MiB | 28.74 MiB/s Receiving objects: 61% (39823/65283), 43.12 MiB | 28.74 MiB/s Receiving objects: 62% (40476/65283), 43.12 MiB | 28.74 MiB/s Receiving objects: 63% (41129/65283), 43.12 MiB | 28.74 MiB/s Receiving objects: 64% (41782/65283), 43.12 MiB | 28.74 MiB/s Receiving objects: 65% (42434/65283), 43.12 MiB | 28.74 MiB/s Receiving objects: 66% (43087/65283), 43.12 MiB | 28.74 MiB/s Receiving objects: 67% (43740/65283), 43.12 MiB | 28.74 MiB/s Receiving objects: 68% (44393/65283), 43.12 MiB | 28.74 MiB/s Receiving objects: 69% (45046/65283), 43.12 MiB | 28.74 MiB/s Receiving objects: 70% (45699/65283), 43.12 MiB | 28.74 MiB/s Receiving objects: 71% (46351/65283), 43.12 MiB | 28.74 MiB/s Receiving objects: 72% (47004/65283), 43.12 MiB | 28.74 MiB/s Receiving objects: 72% (47639/65283), 43.12 MiB | 28.74 MiB/s Receiving objects: 73% (47657/65283), 60.12 MiB | 30.05 MiB/s Receiving objects: 74% (48310/65283), 60.12 MiB | 30.05 MiB/s Receiving objects: 75% (48963/65283), 60.12 MiB | 30.05 MiB/s Receiving objects: 76% (49616/65283), 60.12 MiB | 30.05 MiB/s Receiving objects: 77% (50268/65283), 60.12 MiB | 30.05 MiB/s Receiving objects: 78% (50921/65283), 60.12 MiB | 30.05 MiB/s Receiving objects: 79% (51574/65283), 60.12 MiB | 30.05 MiB/s Receiving objects: 80% (52227/65283), 60.12 MiB | 30.05 MiB/s Receiving objects: 81% (52880/65283), 60.12 MiB | 30.05 MiB/s Receiving objects: 82% (53533/65283), 76.60 MiB | 30.59 MiB/s Receiving objects: 83% (54185/65283), 76.60 MiB | 30.59 MiB/s Receiving objects: 84% (54838/65283), 76.60 MiB | 30.59 MiB/s Receiving objects: 85% (55491/65283), 76.60 MiB | 30.59 MiB/s Receiving objects: 86% (56144/65283), 76.60 MiB | 30.59 MiB/s Receiving objects: 87% (56797/65283), 76.60 MiB | 30.59 MiB/s Receiving objects: 88% (57450/65283), 76.60 MiB | 30.59 MiB/s Receiving objects: 89% (58102/65283), 76.60 MiB | 30.59 MiB/s Receiving objects: 90% (58755/65283), 76.60 MiB | 30.59 MiB/s Receiving objects: 91% (59408/65283), 76.60 MiB | 30.59 MiB/s Receiving objects: 92% (60061/65283), 76.60 MiB | 30.59 MiB/s Receiving objects: 93% (60714/65283), 76.60 MiB | 30.59 MiB/s Receiving objects: 94% (61367/65283), 76.60 MiB | 30.59 MiB/s Receiving objects: 95% (62019/65283), 76.60 MiB | 30.59 MiB/s Receiving objects: 96% (62672/65283), 76.60 MiB | 30.59 MiB/s Receiving objects: 97% (63325/65283), 76.60 MiB | 30.59 MiB/s Receiving objects: 98% (63978/65283), 76.60 MiB | 30.59 MiB/s Receiving objects: 99% (64631/65283), 76.60 MiB | 30.59 MiB/s remote: Total 65283 (delta 6877), reused 6420 (delta 6324), pack-reused 57349 (from 1)
  7. 5.62 s Receiving objects: 100% (65283/65283), 76.60 MiB | 30.59 MiB/s Receiving objects: 100% (65283/65283), 87.60 MiB | 30.72 MiB/s, done.
  8. 7.57 s Resolving deltas: 0% (0/45995) Resolving deltas: 1% (460/45995) Resolving deltas: 2% (920/45995) Resolving deltas: 3% (1380/45995) Resolving deltas: 4% (1840/45995) Resolving deltas: 5% (2300/45995) Resolving deltas: 6% (2760/45995) Resolving deltas: 7% (3220/45995) Resolving deltas: 8% (3680/45995) Resolving deltas: 9% (4140/45995) Resolving deltas: 10% (4600/45995) Resolving deltas: 11% (5060/45995) Resolving deltas: 12% (5520/45995) Resolving deltas: 13% (5980/45995) Resolving deltas: 14% (6442/45995) Resolving deltas: 15% (6900/45995) Resolving deltas: 16% (7361/45995) Resolving deltas: 17% (7820/45995) Resolving deltas: 18% (8280/45995) Resolving deltas: 19% (8740/45995) Resolving deltas: 20% (9199/45995) Resolving deltas: 21% (9659/45995) Resolving deltas: 22% (10120/45995) Resolving deltas: 23% (10579/45995) Resolving deltas: 24% (11039/45995) Resolving deltas: 25% (11499/45995) Resolving deltas: 26% (11959/45995) Resolving deltas: 27% (12419/45995) Resolving deltas: 28% (12879/45995) Resolving deltas: 29% (13339/45995) Resolving deltas: 30% (13799/45995) Resolving deltas: 31% (14260/45995) Resolving deltas: 32% (14719/45995) Resolving deltas: 33% (15179/45995) Resolving deltas: 34% (15640/45995) Resolving deltas: 35% (16099/45995) Resolving deltas: 36% (16559/45995) Resolving deltas: 37% (17019/45995) Resolving deltas: 38% (17479/45995) Resolving deltas: 39% (17939/45995) Resolving deltas: 40% (18398/45995) Resolving deltas: 41% (18858/45995) Resolving deltas: 42% (19318/45995) Resolving deltas: 43% (19778/45995) Resolving deltas: 44% (20238/45995) Resolving deltas: 45% (20698/45995) Resolving deltas: 46% (21158/45995) Resolving deltas: 47% (21619/45995) Resolving deltas: 48% (22078/45995) Resolving deltas: 49% (22539/45995) Resolving deltas: 50% (22998/45995) Resolving deltas: 51% (23458/45995) Resolving deltas: 52% (23918/45995) Resolving deltas: 53% (24378/45995) Resolving deltas: 54% (24838/45995) Resolving deltas: 55% (25300/45995) Resolving deltas: 56% (25758/45995) Resolving deltas: 57% (26219/45995) Resolving deltas: 58% (26678/45995) Resolving deltas: 59% (27138/45995) Resolving deltas: 60% (27597/45995) Resolving deltas: 61% (28057/45995) Resolving deltas: 62% (28517/45995) Resolving deltas: 63% (28977/45995) Resolving deltas: 64% (29437/45995) Resolving deltas: 65% (29897/45995) Resolving deltas: 66% (30357/45995) Resolving deltas: 67% (30817/45995) Resolving deltas: 68% (31277/45995) Resolving deltas: 69% (31737/45995) Resolving deltas: 69% (31765/45995) Resolving deltas: 70% (32197/45995) Resolving deltas: 71% (32657/45995) Resolving deltas: 72% (33117/45995) Resolving deltas: 73% (33577/45995) Resolving deltas: 74% (34037/45995) Resolving deltas: 75% (34497/45995) Resolving deltas: 76% (34957/45995) Resolving deltas: 77% (35418/45995) Resolving deltas: 78% (35877/45995) Resolving deltas: 79% (36337/45995) Resolving deltas: 80% (36796/45995) Resolving deltas: 81% (37256/45995) Resolving deltas: 82% (37716/45995) Resolving deltas: 83% (38176/45995) Resolving deltas: 84% (38636/45995) Resolving deltas: 85% (39096/45995) Resolving deltas: 86% (39556/45995) Resolving deltas: 87% (40016/45995) Resolving deltas: 88% (40476/45995) Resolving deltas: 89% (40936/45995) Resolving deltas: 90% (41396/45995) Resolving deltas: 91% (41856/45995) Resolving deltas: 92% (42316/45995) Resolving deltas: 93% (42776/45995) Resolving deltas: 94% (43236/45995) Resolving deltas: 95% (43696/45995) Resolving deltas: 96% (44156/45995) Resolving deltas: 97% (44616/45995) Resolving deltas: 98% (45076/45995) Resolving deltas: 99% (45536/45995) Resolving deltas: 100% (45995/45995) Resolving deltas: 100% (45995/45995), done.
  9. 9.51 s Fetching commit da217bcc31bb1b48f1e3e2a2ac0fb15dd06d1801 for vakint_rustred ...
  10. 9.51 s $ /nix/store/bcnisk3ydfgv26v2gw3zlky24g00yww2-git-2.54.0/bin/git fetch origin da217bcc31bb1b48f1e3e2a2ac0fb15dd06d1801
  11. 9.95 s From https://github.com/alphal00p/gammaloop
  12. 9.95 s * branch da217bcc31bb1b48f1e3e2a2ac0fb15dd06d1801 -> FETCH_HEAD
  13. 9.97 s $ /nix/store/9ypz3flqsrl5xl495mm8h645gadjsxi1-coreutils-9.11/bin/timeout --kill-after=15s 7200s /nix/store/bcnisk3ydfgv26v2gw3zlky24g00yww2-git-2.54.0/bin/git -c advice.detachedHead=false checkout da217bcc31bb1b48f1e3e2a2ac0fb15dd06d1801
  14. 10.24 s HEAD is now at da217bcc Reject obsolete RustRed artifact schemas
  15. 10.25 s $ /nix/store/9ypz3flqsrl5xl495mm8h645gadjsxi1-coreutils-9.11/bin/timeout --kill-after=15s 7200s /nix/store/23zk8sgzamrbmj1fday15szf7f2279s8-nix-2.34.7/bin/nix --extra-experimental-features nix-command --extra-experimental-features flakes --log-format internal-json run .#packages.x86_64-linux.nix-ci-check-gammaloop-nextest-spenso --print-build-logs
  16. 17.41 s
  17. 24.34 s evaluating derivation 'g copying '/nix/store/kl70 evaluating derivation 'g copying '/nix/store/kl70 evaluating derivation 'g copying '/nix/store/kl70 evaluating derivation 'g [0/1 built] [1/0/1 built] building ggammaloop-nextest-spenso> Extracting 5 binaries and 2 linked paths to /build/nextest-archive-DWHg12
  18. 24.65 s gammaloop-nextest-spenso> Extracted 19 files to /build/nextest-archive-DWHg12 in 0.32s
  19. 24.68 s gammaloop-nextest-spenso> ------------
  20. 24.68 s gammaloop-nextest-spenso> Nextest run ID 8b268bb5-c4e3-4007-8248-41a8efd3c331 with nextest profile: ci_gammaloop
  21. 24.68 s gammaloop-nextest-spenso> Starting 224 tests across 5 binaries (26 tests skipped, including 2 tests via profile.ci_gammaloop.default-filter)
  22. 24.84 s gammaloop-nextest-spenso> FAIL [ 0.029s] ( 49/224) idenso color::test::form_reference::metric_contraction_respects_antisymmetric_normalization
  23. 24.84 s gammaloop-nextest-spenso> stdout ---
  24. 24.84 s gammaloop-nextest-spenso>
  25. 24.84 s gammaloop-nextest-spenso> running 1 test
  26. 24.84 s gammaloop-nextest-spenso> test color::test::form_reference::metric_contraction_respects_antisymmetric_normalization ... FAILED
  27. 24.84 s gammaloop-nextest-spenso>
  28. 24.84 s gammaloop-nextest-spenso> failures:
  29. 24.84 s gammaloop-nextest-spenso>
  30. 24.84 s gammaloop-nextest-spenso> failures:
  31. 24.84 s gammaloop-nextest-spenso> color::test::form_reference::metric_contraction_respects_antisymmetric_normalization
  32. 24.84 s gammaloop-nextest-spenso>
  33. 24.84 s gammaloop-nextest-spenso> test result: FAILED. 0 passed; 1 failed; 0 ignored; 0 measured; 240 filtered out; finished in 0.01s
  34. 24.84 s gammaloop-nextest-spenso>
  35. 24.84 s gammaloop-nextest-spenso> stderr ---
  36. 24.84 s gammaloop-nextest-spenso>
  37. 24.84 s gammaloop-nextest-spenso> thread 'color::test::form_reference::metric_contraction_respects_antisymmetric_normalization' (340) panicked at crates/idenso/src/color/test/form_reference.rs:171:5:
  38. 24.84 s gammaloop-nextest-spenso> assertion `left == right` failed
  39. 24.84 s gammaloop-nextest-spenso> left: "-1*f(coad(8,standalone_metric_j),coad(8,standalone_metric_s),coad(8,standalone_metric_u))"
  40. 24.84 s gammaloop-nextest-spenso> right: "f(coad(8,standalone_metric_j),coad(8,standalone_metric_s),coad(8,standalone_metric_u))"
  41. 24.84 s gammaloop-nextest-spenso> stack backtrace:
  42. 24.84 s gammaloop-nextest-spenso> 0: __rustc::rust_begin_unwind
  43. 24.84 s gammaloop-nextest-spenso> 1: core::panicking::panic_fmt
  44. 24.84 s gammaloop-nextest-spenso> 2: core::panicking::assert_failed_inner
  45. 24.84 s gammaloop-nextest-spenso> 3: core::panicking::assert_failed::<alloc::string::String, alloc::string::String>
  46. 24.84 s gammaloop-nextest-spenso> 4: idenso::color::test::form_reference::metric_contraction_respects_antisymmetric_normalization
  47. 24.84 s gammaloop-nextest-spenso> 5: <idenso::color::test::form_reference::metric_contraction_respects_antisymmetric_normalization::{closure#0} as core::ops::function::FnOnce<()>>::call_once
  48. 24.84 s gammaloop-nextest-spenso> note: Some details are omitted, run with `RUST_BACKTRACE=full` for a verbose backtrace.
  49. 24.84 s gammaloop-nextest-spenso>
  50. 25.29 s gammaloop-nextest-spenso> FAIL [ 0.084s] (218/224) idenso tensor::tests::parsing::infinite_execution
  51. 25.29 s gammaloop-nextest-spenso> stdout ---
  52. 25.29 s gammaloop-nextest-spenso>
  53. 25.29 s gammaloop-nextest-spenso> running 1 test
  54. 25.29 s gammaloop-nextest-spenso> ━━━━━━━━━━━━━━━━━━━━━━━━━━━━━━━ Snapshot Summary ━━━━━━━━━━━━━━━━━━━━━━━━━━━━━━━
  55. 25.29 s gammaloop-nextest-spenso> Snapshot: infinite_execution
  56. 25.29 s gammaloop-nextest-spenso> Source: crates/idenso/src/tensor/tests/parsing.rs:910
  57. 25.29 s gammaloop-nextest-spenso> ────────────────────────────────────────────────────────────────────────────────
  58. 25.29 s gammaloop-nextest-spenso> Expression: net_iter.snapshot_dot()
  59. 25.29 s gammaloop-nextest-spenso> ────────────────────────────────────────────────────────────────────────────────
  60. 25.29 s gammaloop-nextest-spenso> -old snapshot
  61. 25.29 s gammaloop-nextest-spenso> +new results
  62. 25.29 s gammaloop-nextest-spenso> ────────────┬───────────────────────────────────────────────────────────────────
  63. 25.29 s gammaloop-nextest-spenso> 8 8 │ 0:0:s -> ext0 [id=0 color="red"];
  64. 25.29 s gammaloop-nextest-spenso> 9 9 │ ext1 [style=invis];
  65. 25.29 s gammaloop-nextest-spenso> 10 10 │ 0:5:s -> ext1 [id=1 dir=none color="red" label="mink4|l_0"];
  66. 25.29 s gammaloop-nextest-spenso> 11 11 │ ext2 [style=invis];
  67. 25.29 s gammaloop-nextest-spenso> 12 │- 0:4:s -> ext2 [id=2 dir=none color="red" label="bis4|l_2"];
  68. 25.29 s gammaloop-nextest-spenso> 12 │+ 0:3:s -> ext2 [id=2 dir=none color="red" label="mink4|l_1"];
  69. 25.29 s gammaloop-nextest-spenso> 13 13 │ ext3 [style=invis];
  70. 25.29 s gammaloop-nextest-spenso> 14 │- 0:3:s -> ext3 [id=3 dir=none color="red" label="bis4|l_3"];
  71. 25.29 s gammaloop-nextest-spenso> 14 │+ 0:1:s -> ext3 [id=3 dir=none color="red" label="bis4|l_2"];
  72. 25.29 s gammaloop-nextest-spenso> 15 15 │ ext4 [style=invis];
  73. 25.29 s gammaloop-nextest-spenso> 16 │- 0:1:s -> ext4 [id=4 dir=none color="red" label="mink4|l_1"];
  74. 25.29 s gammaloop-nextest-spenso> 16 │+ 0:2:s -> ext4 [id=4 dir=none color="red" label="mink4|l_4"];
  75. 25.29 s gammaloop-nextest-spenso> 17 17 │ ext5 [style=invis];
  76. 25.29 s gammaloop-nextest-spenso> 18 │- 0:2:s -> ext5 [id=5 dir=none color="red" label="mink4|l_4"];
  77. 25.29 s gammaloop-nextest-spenso> 18 │+ 0:4:s -> ext5 [id=5 dir=none color="red" label="bis4|l_3"];
  78. 25.29 s gammaloop-nextest-spenso> 19 19 │ }
  79. 25.29 s gammaloop-nextest-spenso> ────────────┴───────────────────────────────────────────────────────────────────
  80. 25.29 s gammaloop-nextest-spenso> To update snapshots run `cargo insta review`
  81. 25.29 s gammaloop-nextest-spenso> Stopped on the first failure. Run `cargo insta test` to run all snapshots.
  82. 25.29 s gammaloop-nextest-spenso> test tensor::tests::parsing::infinite_execution ... FAILED
  83. 25.29 s gammaloop-nextest-spenso>
  84. 25.29 s gammaloop-nextest-spenso> failures:
  85. 25.29 s gammaloop-nextest-spenso>
  86. 25.29 s gammaloop-nextest-spenso> failures:
  87. 25.29 s gammaloop-nextest-spenso> tensor::tests::parsing::infinite_execution
  88. 25.29 s gammaloop-nextest-spenso>
  89. 25.29 s gammaloop-nextest-spenso> test result: FAILED. 0 passed; 1 failed; 0 ignored; 0 measured; 240 filtered out; finished in 0.07s
  90. 25.29 s gammaloop-nextest-spenso>
  91. 25.29 s gammaloop-nextest-spenso> stderr ---
  92. 25.29 s gammaloop-nextest-spenso>
  93. 25.29 s gammaloop-nextest-spenso> thread 'tensor::tests::parsing::infinite_execution' (830) panicked at /nix/store/hvwd4qqiaadc4s871lfyylxrciqrvlgs-vendor-cargo-deps/c19b7c6f923b580ac259164a89f2577984ad5ab09ee9d583b888f934adbbe8d0/insta-1.47.2/src/runtime.rs:719:13:
  94. 25.29 s gammaloop-nextest-spenso> snapshot assertion for 'infinite_execution' failed in line 910
  95. 25.29 s gammaloop-nextest-spenso> stack backtrace:
  96. 25.29 s gammaloop-nextest-spenso> 0: __rustc::rust_begin_unwind
  97. 25.29 s gammaloop-nextest-spenso> 1: core::panicking::panic_fmt
  98. 25.29 s gammaloop-nextest-spenso> 2: insta::runtime::assert_snapshot
  99. 25.29 s gammaloop-nextest-spenso> 3: idenso::tensor::tests::parsing::infinite_execution
  100. 25.29 s gammaloop-nextest-spenso> 4: <idenso::tensor::tests::parsing::infinite_execution::{closure#0} as core::ops::function::FnOnce<()>>::call_once
  101. 25.29 s gammaloop-nextest-spenso> note: Some details are omitted, run with `RUST_BACKTRACE=full` for a verbose backtrace.
  102. 25.29 s gammaloop-nextest-spenso>
  103. 27.73 s gammaloop-nextest-spenso> ------------
  104. 27.73 s gammaloop-nextest-spenso> Summary [ 3.058s] 224 tests run: 222 passed, 2 failed, 26 skipped
  105. 27.73 s gammaloop-nextest-spenso> FAIL [ 0.029s] ( 49/224) idenso color::test::form_reference::metric_contraction_respects_antisymmetric_normalization
  106. 27.73 s gammaloop-nextest-spenso> stdout ---
  107. 27.73 s gammaloop-nextest-spenso>
  108. 27.73 s gammaloop-nextest-spenso> running 1 test
  109. 27.73 s gammaloop-nextest-spenso> test color::test::form_reference::metric_contraction_respects_antisymmetric_normalization ... FAILED
  110. 27.73 s gammaloop-nextest-spenso>
  111. 27.73 s gammaloop-nextest-spenso> failures:
  112. 27.73 s gammaloop-nextest-spenso>
  113. 27.73 s gammaloop-nextest-spenso> failures:
  114. 27.73 s gammaloop-nextest-spenso> color::test::form_reference::metric_contraction_respects_antisymmetric_normalization
  115. 27.73 s gammaloop-nextest-spenso>
  116. 27.73 s gammaloop-nextest-spenso> test result: FAILED. 0 passed; 1 failed; 0 ignored; 0 measured; 240 filtered out; finished in 0.01s
  117. 27.73 s gammaloop-nextest-spenso>
  118. 27.73 s gammaloop-nextest-spenso> stderr ---
  119. 27.73 s gammaloop-nextest-spenso>
  120. 27.73 s gammaloop-nextest-spenso> thread 'color::test::form_reference::metric_contraction_respects_antisymmetric_normalization' (340) panicked at crates/idenso/src/color/test/form_reference.rs:171:5:
  121. 27.73 s gammaloop-nextest-spenso> assertion `left == right` failed
  122. 27.73 s gammaloop-nextest-spenso> left: "-1*f(coad(8,standalone_metric_j),coad(8,standalone_metric_s),coad(8,standalone_metric_u))"
  123. 27.73 s gammaloop-nextest-spenso> right: "f(coad(8,standalone_metric_j),coad(8,standalone_metric_s),coad(8,standalone_metric_u))"
  124. 27.73 s gammaloop-nextest-spenso> stack backtrace:
  125. 27.73 s gammaloop-nextest-spenso> 0: __rustc::rust_begin_unwind
  126. 27.73 s gammaloop-nextest-spenso> 1: core::panicking::panic_fmt
  127. 27.73 s gammaloop-nextest-spenso> 2: core::panicking::assert_failed_inner
  128. 27.73 s gammaloop-nextest-spenso> 3: core::panicking::assert_failed::<alloc::string::String, alloc::string::String>
  129. 27.73 s gammaloop-nextest-spenso> 4: idenso::color::test::form_reference::metric_contraction_respects_antisymmetric_normalization
  130. 27.73 s gammaloop-nextest-spenso> 5: <idenso::color::test::form_reference::metric_contraction_respects_antisymmetric_normalization::{closure#0} as core::ops::function::FnOnce<()>>::call_once
  131. 27.73 s gammaloop-nextest-spenso> note: Some details are omitted, run with `RUST_BACKTRACE=full` for a verbose backtrace.
  132. 27.73 s gammaloop-nextest-spenso>
  133. 27.73 s gammaloop-nextest-spenso> FAIL [ 0.084s] (218/224) idenso tensor::tests::parsing::infinite_execution
  134. 27.73 s gammaloop-nextest-spenso> stdout ---
  135. 27.73 s gammaloop-nextest-spenso>
  136. 27.73 s gammaloop-nextest-spenso> running 1 test
  137. 27.73 s gammaloop-nextest-spenso> ━━━━━━━━━━━━━━━━━━━━━━━━━━━━━━━ Snapshot Summary ━━━━━━━━━━━━━━━━━━━━━━━━━━━━━━━
  138. 27.73 s gammaloop-nextest-spenso> Snapshot: infinite_execution
  139. 27.73 s gammaloop-nextest-spenso> Source: crates/idenso/src/tensor/tests/parsing.rs:910
  140. 27.73 s gammaloop-nextest-spenso> ────────────────────────────────────────────────────────────────────────────────
  141. 27.73 s gammaloop-nextest-spenso> Expression: net_iter.snapshot_dot()
  142. 27.73 s gammaloop-nextest-spenso> ────────────────────────────────────────────────────────────────────────────────
  143. 27.74 s gammaloop-nextest-spenso> -old snapshot
  144. 27.74 s gammaloop-nextest-spenso> +new results
  145. 27.74 s gammaloop-nextest-spenso> ────────────┬───────────────────────────────────────────────────────────────────
  146. 27.74 s gammaloop-nextest-spenso> 8 8 │ 0:0:s -> ext0 [id=0 color="red"];
  147. 27.74 s gammaloop-nextest-spenso> 9 9 │ ext1 [style=invis];
  148. 27.74 s gammaloop-nextest-spenso> 10 10 │ 0:5:s -> ext1 [id=1 dir=none color="red" label="mink4|l_0"];
  149. 27.74 s gammaloop-nextest-spenso> 11 11 │ ext2 [style=invis];
  150. 27.74 s gammaloop-nextest-spenso> 12 │- 0:4:s -> ext2 [id=2 dir=none color="red" label="bis4|l_2"];
  151. 27.74 s gammaloop-nextest-spenso> 12 │+ 0:3:s -> ext2 [id=2 dir=none color="red" label="mink4|l_1"];
  152. 27.74 s gammaloop-nextest-spenso> 13 13 │ ext3 [style=invis];
  153. 27.74 s gammaloop-nextest-spenso> 14 │- 0:3:s -> ext3 [id=3 dir=none color="red" label="bis4|l_3"];
  154. 27.74 s gammaloop-nextest-spenso> 14 │+ 0:1:s -> ext3 [id=3 dir=none color="red" label="bis4|l_2"];
  155. 27.74 s gammaloop-nextest-spenso> 15 15 │ ext4 [style=invis];
  156. 27.74 s gammaloop-nextest-spenso> 16 │- 0:1:s -> ext4 [id=4 dir=none color="red" label="mink4|l_1"];
  157. 27.74 s gammaloop-nextest-spenso> 16 │+ 0:2:s -> ext4 [id=4 dir=none color="red" label="mink4|l_4"];
  158. 27.74 s gammaloop-nextest-spenso> 17 17 │ ext5 [style=invis];
  159. 27.74 s gammaloop-nextest-spenso> 18 │- 0:2:s -> ext5 [id=5 dir=none color="red" label="mink4|l_4"];
  160. 27.74 s gammaloop-nextest-spenso> 18 │+ 0:4:s -> ext5 [id=5 dir=none color="red" label="bis4|l_3"];
  161. 27.74 s gammaloop-nextest-spenso> 19 19 │ }
  162. 27.74 s gammaloop-nextest-spenso> ────────────┴───────────────────────────────────────────────────────────────────
  163. 27.74 s gammaloop-nextest-spenso> To update snapshots run `cargo insta review`
  164. 27.74 s gammaloop-nextest-spenso> Stopped on the first failure. Run `cargo insta test` to run all snapshots.
  165. 27.74 s gammaloop-nextest-spenso> test tensor::tests::parsing::infinite_execution ... FAILED
  166. 27.74 s gammaloop-nextest-spenso>
  167. 27.74 s gammaloop-nextest-spenso> failures:
  168. 27.74 s gammaloop-nextest-spenso>
  169. 27.74 s gammaloop-nextest-spenso> failures:
  170. 27.74 s gammaloop-nextest-spenso> tensor::tests::parsing::infinite_execution
  171. 27.74 s gammaloop-nextest-spenso>
  172. 27.74 s gammaloop-nextest-spenso> test result: FAILED. 0 passed; 1 failed; 0 ignored; 0 measured; 240 filtered out; finished in 0.07s
  173. 27.74 s gammaloop-nextest-spenso>
  174. 27.74 s gammaloop-nextest-spenso> stderr ---
  175. 27.74 s gammaloop-nextest-spenso>
  176. 27.74 s gammaloop-nextest-spenso> thread 'tensor::tests::parsing::infinite_execution' (830) panicked at /nix/store/hvwd4qqiaadc4s871lfyylxrciqrvlgs-vendor-cargo-deps/c19b7c6f923b580ac259164a89f2577984ad5ab09ee9d583b888f934adbbe8d0/insta-1.47.2/src/runtime.rs:719:13:
  177. 27.74 s gammaloop-nextest-spenso> snapshot assertion for 'infinite_execution' failed in line 910
  178. 27.74 s gammaloop-nextest-spenso> stack backtrace:
  179. 27.74 s gammaloop-nextest-spenso> 0: __rustc::rust_begin_unwind
  180. 27.74 s gammaloop-nextest-spenso> 1: core::panicking::panic_fmt
  181. 27.74 s gammaloop-nextest-spenso> 2: insta::runtime::assert_snapshot
  182. 27.74 s gammaloop-nextest-spenso> 3: idenso::tensor::tests::parsing::infinite_execution
  183. 27.74 s gammaloop-nextest-spenso> 4: <idenso::tensor::tests::parsing::infinite_execution::{closure#0} as core::ops::function::FnOnce<()>>::call_once
  184. 27.74 s gammaloop-nextest-spenso> note: Some details are omitted, run with `RUST_BACKTRACE=full` for a verbose backtrace.
  185. 27.74 s gammaloop-nextest-spenso>
  186. 27.79 s gammaloop-nextest-spenso> error: test run failed
  187. 27.84 s gammaloop-nextest-spenso>
  188. 27.84 s gammaloop-nextest-spenso> ========== nextest test summary ==========
  189. 27.84 s gammaloop-nextest-spenso> report: target/nextest/ci_gammaloop/junit.xml
  190. 27.84 s gammaloop-nextest-spenso> tests: 224, failures: 2, errors: 0
  191. 27.84 s gammaloop-nextest-spenso>
  192. 27.84 s gammaloop-nextest-spenso> 1. idenso::color::test::form_reference::metric_contraction_respects_antisymmetric_normalization
  193. 27.84 s gammaloop-nextest-spenso> failure: test failure with exit code 101
  194. 27.84 s gammaloop-nextest-spenso> thread 'color::test::form_reference::metric_contraction_respects_antisymmetric_normalization' (340) panicked at crates/idenso/src/color/test/form_reference.rs:171:5:
  195. 27.84 s gammaloop-nextest-spenso> assertion `left == right` failed
  196. 27.84 s gammaloop-nextest-spenso> left: "-1*f(coad(8,standalone_metric_j),coad(8,standalone_metric_s),coad(8,standalone_metric_u))"
  197. 27.84 s gammaloop-nextest-spenso> right: "f(coad(8,standalone_metric_j),coad(8,standalone_metric_s),coad(8,standalone_metric_u))"
  198. 27.84 s gammaloop-nextest-spenso> stack backtrace:
  199. 27.84 s gammaloop-nextest-spenso> 0: __rustc::rust_begin_unwind
  200. 27.84 s gammaloop-nextest-spenso> 1: core::panicking::panic_fmt
  201. 27.84 s gammaloop-nextest-spenso> 2: core::panicking::assert_failed_inner
  202. 27.84 s gammaloop-nextest-spenso> 3: core::panicking::assert_failed::<alloc::string::String, alloc::string::String>
  203. 27.84 s gammaloop-nextest-spenso> 4: idenso::color::test::form_reference::metric_contraction_respects_antisymmetric_normalization
  204. 27.84 s gammaloop-nextest-spenso> 5: <idenso::color::test::form_reference::metric_contraction_respects_antisymmetric_normalization::{closure#0} as core::ops::function::FnOnce<()>>::call_once
  205. 27.84 s gammaloop-nextest-spenso> note: Some details are omitted, run with `RUST_BACKTRACE=full` for a verbose backtrace.
  206. 27.84 s gammaloop-nextest-spenso> system-out
  207. 27.84 s gammaloop-nextest-spenso> running 1 test
  208. 27.84 s gammaloop-nextest-spenso> test color::test::form_reference::metric_contraction_respects_antisymmetric_normalization ... FAILED
  209. 27.84 s gammaloop-nextest-spenso>
  210. 27.84 s gammaloop-nextest-spenso> failures:
  211. 27.84 s gammaloop-nextest-spenso>
  212. 27.84 s gammaloop-nextest-spenso> failures:
  213. 27.84 s gammaloop-nextest-spenso> color::test::form_reference::metric_contraction_respects_antisymmetric_normalization
  214. 27.84 s gammaloop-nextest-spenso>
  215. 27.84 s gammaloop-nextest-spenso> test result: FAILED. 0 passed; 1 failed; 0 ignored; 0 measured; 240 filtered out; finished in 0.01s
  216. 27.84 s gammaloop-nextest-spenso> system-err
  217. 27.84 s gammaloop-nextest-spenso> thread 'color::test::form_reference::metric_contraction_respects_antisymmetric_normalization' (340) panicked at crates/idenso/src/color/test/form_reference.rs:171:5:
  218. 27.84 s gammaloop-nextest-spenso> assertion `left == right` failed
  219. 27.84 s gammaloop-nextest-spenso> left: "-1*f(coad(8,standalone_metric_j),coad(8,standalone_metric_s),coad(8,standalone_metric_u))"
  220. 27.84 s gammaloop-nextest-spenso> right: "f(coad(8,standalone_metric_j),coad(8,standalone_metric_s),coad(8,standalone_metric_u))"
  221. 27.84 s gammaloop-nextest-spenso> stack backtrace:
  222. 27.84 s gammaloop-nextest-spenso> 0: __rustc::rust_begin_unwind
  223. 27.84 s gammaloop-nextest-spenso> 1: core::panicking::panic_fmt
  224. 27.84 s gammaloop-nextest-spenso> 2: core::panicking::assert_failed_inner
  225. 27.84 s gammaloop-nextest-spenso> 3: core::panicking::assert_failed::<alloc::string::String, alloc::string::String>
  226. 27.84 s gammaloop-nextest-spenso> 4: idenso::color::test::form_reference::metric_contraction_respects_antisymmetric_normalization
  227. 27.84 s gammaloop-nextest-spenso> 5: <idenso::color::test::form_reference::metric_contraction_respects_antisymmetric_normalization::{closure#0} as core::ops::function::FnOnce<()>>::call_once
  228. 27.84 s gammaloop-nextest-spenso> note: Some details are omitted, run with `RUST_BACKTRACE=full` for a verbose backtrace.
  229. 27.84 s gammaloop-nextest-spenso>
  230. 27.84 s gammaloop-nextest-spenso> 2. idenso::tensor::tests::parsing::infinite_execution
  231. 27.84 s gammaloop-nextest-spenso> failure: test failure with exit code 101
  232. 27.84 s gammaloop-nextest-spenso> thread 'tensor::tests::parsing::infinite_execution' (830) panicked at /nix/store/hvwd4qqiaadc4s871lfyylxrciqrvlgs-vendor-cargo-deps/c19b7c6f923b580ac259164a89f2577984ad5ab09ee9d583b888f934adbbe8d0/insta-1.47.2/src/runtime.rs:719:13:
  233. 27.84 s gammaloop-nextest-spenso> snapshot assertion for 'infinite_execution' failed in line 910
  234. 27.84 s gammaloop-nextest-spenso> stack backtrace:
  235. 27.84 s gammaloop-nextest-spenso> 0: __rustc::rust_begin_unwind
  236. 27.84 s gammaloop-nextest-spenso> 1: core::panicking::panic_fmt
  237. 27.84 s gammaloop-nextest-spenso> 2: insta::runtime::assert_snapshot
  238. 27.84 s gammaloop-nextest-spenso> 3: idenso::tensor::tests::parsing::infinite_execution
  239. 27.84 s gammaloop-nextest-spenso> 4: <idenso::tensor::tests::parsing::infinite_execution::{closure#0} as core::ops::function::FnOnce<()>>::call_once
  240. 27.84 s gammaloop-nextest-spenso> note: Some details are omitted, run with `RUST_BACKTRACE=full` for a verbose backtrace.
  241. 27.84 s gammaloop-nextest-spenso> system-out
  242. 27.84 s gammaloop-nextest-spenso> running 1 test
  243. 27.84 s gammaloop-nextest-spenso> ━━━━━━━━━━━━━━━━━━━━━━━━━━━━━━━ Snapshot Summary ━━━━━━━━━━━━━━━━━━━━━━━━━━━━━━━
  244. 27.84 s gammaloop-nextest-spenso> Snapshot: infinite_execution
  245. 27.84 s gammaloop-nextest-spenso> Source: crates/idenso/src/tensor/tests/parsing.rs:910
  246. 27.84 s gammaloop-nextest-spenso> ────────────────────────────────────────────────────────────────────────────────
  247. 27.84 s gammaloop-nextest-spenso> Expression: net_iter.snapshot_dot()
  248. 27.84 s gammaloop-nextest-spenso> ────────────────────────────────────────────────────────────────────────────────
  249. 27.84 s gammaloop-nextest-spenso> -old snapshot
  250. 27.84 s gammaloop-nextest-spenso> +new results
  251. 27.84 s gammaloop-nextest-spenso> ────────────┬───────────────────────────────────────────────────────────────────
  252. 27.84 s gammaloop-nextest-spenso> 8 8 │ 0:0:s-> ext0 [id=0 color="red"];
  253. 27.84 s gammaloop-nextest-spenso> 9 9 │ ext1 [style=invis];
  254. 27.84 s gammaloop-nextest-spenso> 10 10 │ 0:5:s-> ext1 [id=1 dir=none color="red" label="mink4|l_0"];
  255. 27.84 s gammaloop-nextest-spenso> 11 11 │ ext2 [style=invis];
  256. 27.84 s gammaloop-nextest-spenso> 12 │- 0:4:s-> ext2 [id=2 dir=none color="red" label="bis4|l_2"];
  257. 27.84 s gammaloop-nextest-spenso> 12 │+ 0:3:s-> ext2 [id=2 dir=none color="red" label="mink4|l_1"];
  258. 27.84 s gammaloop-nextest-spenso> 13 13 │ ext3 [style=invis];
  259. 27.84 s gammaloop-nextest-spenso> 14 │- 0:3:s-> ext3 [id=3 dir=none color="red" label="bis4|l_3"];
  260. 27.84 s gammaloop-nextest-spenso> 14 │+ 0:1:s-> ext3 [id=3 dir=none color="red" label="bis4|l_2"];
  261. 27.84 s gammaloop-nextest-spenso> 15 15 │ ext4 [style=invis];
  262. 27.84 s gammaloop-nextest-spenso> 16 │- 0:1:s-> ext4 [id=4 dir=none color="red" label="mink4|l_1"];
  263. 27.84 s gammaloop-nextest-spenso> 16 │+ 0:2:s-> ext4 [id=4 dir=none color="red" label="mink4|l_4"];
  264. 27.84 s gammaloop-nextest-spenso> 17 17 │ ext5 [style=invis];
  265. 27.84 s gammaloop-nextest-spenso> 18 │- 0:2:s-> ext5 [id=5 dir=none color="red" label="mink4|l_4"];
  266. 27.84 s gammaloop-nextest-spenso> 18 │+ 0:4:s-> ext5 [id=5 dir=none color="red" label="bis4|l_3"];
  267. 27.84 s gammaloop-nextest-spenso> 19 19 │ }
  268. 27.84 s gammaloop-nextest-spenso> ────────────┴───────────────────────────────────────────────────────────────────
  269. 27.84 s gammaloop-nextest-spenso> To update snapshots run `cargo insta review`
  270. 27.84 s gammaloop-nextest-spenso> Stopped on the first failure. Run `cargo insta test` to run all snapshots.
  271. 27.84 s gammaloop-nextest-spenso> test tensor::tests::parsing::infinite_execution ... FAILED
  272. 27.84 s gammaloop-nextest-spenso>
  273. 27.84 s gammaloop-nextest-spenso> failures:
  274. 27.84 s gammaloop-nextest-spenso>
  275. 27.84 s gammaloop-nextest-spenso> failures:
  276. 27.84 s gammaloop-nextest-spenso> tensor::tests::parsing::infinite_execution
  277. 27.84 s gammaloop-nextest-spenso>
  278. 27.84 s gammaloop-nextest-spenso> test result: FAILED. 0 passed; 1 failed; 0 ignored; 0 measured; 240 filtered out; finished in 0.07s
  279. 27.84 s gammaloop-nextest-spenso> system-err
  280. 27.84 s gammaloop-nextest-spenso> thread 'tensor::tests::parsing::infinite_execution' (830) panicked at /nix/store/hvwd4qqiaadc4s871lfyylxrciqrvlgs-vendor-cargo-deps/c19b7c6f923b580ac259164a89f2577984ad5ab09ee9d583b888f934adbbe8d0/insta-1.47.2/src/runtime.rs:719:13:
  281. 27.84 s gammaloop-nextest-spenso> snapshot assertion for 'infinite_execution' failed in line 910
  282. 27.84 s gammaloop-nextest-spenso> stack backtrace:
  283. 27.84 s gammaloop-nextest-spenso> 0: __rustc::rust_begin_unwind
  284. 27.84 s gammaloop-nextest-spenso> 1: core::panicking::panic_fmt
  285. 27.84 s gammaloop-nextest-spenso> 2: insta::runtime::assert_snapshot
  286. 27.84 s gammaloop-nextest-spenso> 3: idenso::tensor::tests::parsing::infinite_execution
  287. 27.84 s gammaloop-nextest-spenso> 4: <idenso::tensor::tests::parsing::infinite_execution::{closure#0} as core::ops::function::FnOnce<()>>::call_once
  288. 27.84 s gammaloop-nextest-spenso> note: Some details are omitted, run with `RUST_BACKTRACE=full` for a verbose backtrace.
  289. 27.84 s gammaloop-nextest-spenso> =========================================
  290. 27.87 s gammaloop-nextest-spenso> Extracting 2 binaries and 1 linked path to /build/nextest-archive-tVKcRJ
  291. 28.02 s gammaloop-nextest-spenso> Extracted 8 files to /build/nextest-archive-tVKcRJ in 0.15s
  292. 28.04 s gammaloop-nextest-spenso> ------------
  293. 28.04 s gammaloop-nextest-spenso> Nextest run ID 6cff0b4b-2c87-4f4b-9130-dab7a1e4d605 with nextest profile: ci_gammaloop
  294. 28.04 s gammaloop-nextest-spenso> Starting 135 tests across 2 binaries
  295. 28.21 s gammaloop-nextest-spenso> ------------
  296. 28.21 s gammaloop-nextest-spenso> Summary [ 0.165s] 135 tests run: 135 passed, 0 skipped
  297. 28.28 s gammaloop-nextest-spenso>
  298. 28.28 s gammaloop-nextest-spenso> ========== nextest test summary ==========
  299. 28.28 s gammaloop-nextest-spenso> report: target/nextest/ci_gammaloop/junit.xml
  300. 28.28 s gammaloop-nextest-spenso> tests: 135, failures: 0, errors: 0
  301. 28.28 s gammaloop-nextest-spenso> No failing testcases found.
  302. 28.28 s gammaloop-nextest-spenso> =========================================
  303. 28.31 s gammaloop-nextest-spenso> Extracting 5 binaries and 2 linked paths to /build/nextest-archive-RFNjGD
  304. 28.66 s gammaloop-nextest-spenso> Extracted 19 files to /build/nextest-archive-RFNjGD in 0.36s
  305. 28.68 s gammaloop-nextest-spenso> ------------
  306. 28.68 s gammaloop-nextest-spenso> Nextest run ID 6e8719c2-3558-4a9f-9ca1-e505a81a250c with nextest profile: ci_gammaloop
  307. 28.68 s gammaloop-nextest-spenso> Starting 25 tests across 5 binaries (1 test skipped via profile.ci_gammaloop.default-filter)
  308. 29.05 s gammaloop-nextest-spenso> ------------
  309. 29.05 s gammaloop-nextest-spenso> Summary [ 0.368s] 25 tests run: 25 passed, 1 skipped
  310. 29.16 s gammaloop-nextest-spenso>
  311. 29.16 s gammaloop-nextest-spenso> ========== nextest test summary ==========
  312. 29.16 s gammaloop-nextest-spenso> report: target/nextest/ci_gammaloop/junit.xml
  313. 29.16 s gammaloop-nextest-spenso> tests: 25, failures: 0, errors: 0
  314. 29.16 s gammaloop-nextest-spenso> No failing testcases found.
  315. 29.16 s gammaloop-nextest-spenso> =========================================
  316. 29.18 s gammaloop-nextest-spenso> Extracting 2 binaries and 1 linked path to /build/nextest-archive-VsohMF
  317. 29.28 s gammaloop-nextest-spenso> Extracted 8 files to /build/nextest-archive-VsohMF in 0.10s
  318. 29.30 s gammaloop-nextest-spenso> ------------
  319. 29.30 s gammaloop-nextest-spenso> Nextest run ID da5ab33b-0dd1-46d4-b7ec-b79e250b0075 with nextest profile: ci_gammaloop
  320. 29.30 s gammaloop-nextest-spenso> Starting 1 test across 2 binaries
  321. 29.31 s gammaloop-nextest-spenso> ------------
  322. 29.31 s gammaloop-nextest-spenso> Summary [ 0.010s] 1 test run: 1 passed, 0 skipped
  323. 29.37 s gammaloop-nextest-spenso>
  324. 29.37 s gammaloop-nextest-spenso> ========== nextest test summary ==========
  325. 29.42 s gammaloop-nextest-spenso> report: target/nextest/ci_gammaloop/junit.xml
  326. 29.42 s gammaloop-nextest-spenso> tests: 1, failures: 0, errors: 0
  327. 29.42 s gammaloop-nextest-spenso> No failing testcases found.
  328. 29.42 s gammaloop-nextest-spenso> =========================================
  329. 29.42 s gammaloop-nextest-spenso> Extracting 1 binary and 1 linked path to /build/nextest-archive-LEaFpW
  330. 29.46 s gammaloop-nextest-spenso> Extracted 7 files to /build/nextest-archive-LEaFpW in 0.07s
  331. 29.47 s gammaloop-nextest-spenso> ------------
  332. 29.47 s gammaloop-nextest-spenso> Nextest run ID 455891d9-46fe-4139-84b8-c0ab3248bf9d with nextest profile: ci_gammaloop
  333. 29.47 s gammaloop-nextest-spenso> Starting 0 tests across 1 binary
  334. 29.47 s gammaloop-nextest-spenso> ------------
  335. 29.47 s gammaloop-nextest-spenso> Summary [ 0.000s] 0 tests run: 0 passed, 0 skipped
  336. 29.54 s gammaloop-nextest-spenso>
  337. 29.54 s gammaloop-nextest-spenso> ========== nextest test summary ==========
  338. 29.54 s gammaloop-nextest-spenso> report: target/nextest/ci_gammaloop/junit.xml
  339. 29.54 s gammaloop-nextest-spenso> tests: 0, failures: 0, errors: 0
  340. 29.54 s gammaloop-nextest-spenso> No failing testcases found.
  341. 29.54 s gammaloop-nextest-spenso> =========================================
  342. 29.60 s error: Cannot build '/nix/store/f7dlapwy00q35hpz63fxwqijy6397ql2-gammaloop-nextest-spenso.drv'.
  343. 29.60 s Reason: builder failed with exit code 100.
  344. 29.60 s Output paths:
  345. 29.60 s /nix/store/n4ly992ql65w80b8anh5nb2sbxg5pdzw-gammaloop-nextest-spenso
  346. 29.60 s Last 325 log lines:
  347. 29.60 s > Extracting 5 binaries and 2 linked paths to /build/nextest-archive-DWHg12
  348. 29.60 s > Extracted 19 files to /build/nextest-archive-DWHg12 in 0.32s
  349. 29.60 s > ------------
  350. 29.60 s > Nextest run ID 8b268bb5-c4e3-4007-8248-41a8efd3c331 with nextest profile: ci_gammaloop
  351. 29.60 s > Starting 224 tests across 5 binaries (26 tests skipped, including 2 tests via profile.ci_gammaloop.default-filter)
  352. 29.60 s > FAIL [ 0.029s] ( 49/224) idenso color::test::form_reference::metric_contraction_respects_antisymmetric_normalization
  353. 29.60 s > stdout ---
  354. 29.60 s >
  355. 29.60 s > running 1 test
  356. 29.60 s > test color::test::form_reference::metric_contraction_respects_antisymmetric_normalization ... FAILED
  357. 29.60 s >
  358. 29.60 s > failures:
  359. 29.60 s >
  360. 29.60 s > failures:
  361. 29.60 s > color::test::form_reference::metric_contraction_respects_antisymmetric_normalization
  362. 29.60 s >
  363. 29.60 s > test result: FAILED. 0 passed; 1 failed; 0 ignored; 0 measured; 240 filtered out; finished in 0.01s
  364. 29.60 s >
  365. 29.60 s > stderr ---
  366. 29.60 s >
  367. 29.60 s > thread 'color::test::form_reference::metric_contraction_respects_antisymmetric_normalization' (340) panicked at crates/idenso/src/color/test/form_reference.rs:171:5:
  368. 29.60 s > assertion `left == right` failed
  369. 29.60 s > left: "-1*f(coad(8,standalone_metric_j),coad(8,standalone_metric_s),coad(8,standalone_metric_u))"
  370. 29.60 s > right: "f(coad(8,standalone_metric_j),coad(8,standalone_metric_s),coad(8,standalone_metric_u))"
  371. 29.60 s > stack backtrace:
  372. 29.60 s > 0: __rustc::rust_begin_unwind
  373. 29.60 s > 1: core::panicking::panic_fmt
  374. 29.60 s > 2: core::panicking::assert_failed_inner
  375. 29.60 s > 3: core::panicking::assert_failed::<alloc::string::String, alloc::string::String>
  376. 29.60 s > 4: idenso::color::test::form_reference::metric_contraction_respects_antisymmetric_normalization
  377. 29.60 s > 5: <idenso::color::test::form_reference::metric_contraction_respects_antisymmetric_normalization::{closure#0} as core::ops::function::FnOnce<()>>::call_once
  378. 29.60 s > note: Some details are omitted, run with `RUST_BACKTRACE=full` for a verbose backtrace.
  379. 29.60 s >
  380. 29.60 s > FAIL [ 0.084s] (218/224) idenso tensor::tests::parsing::infinite_execution
  381. 29.60 s > stdout ---
  382. 29.60 s >
  383. 29.60 s > running 1 test
  384. 29.60 s > ━━━━━━━━━━━━━━━━━━━━━━━━━━━━━━━ Snapshot Summary ━━━━━━━━━━━━━━━━━━━━━━━━━━━━━━━
  385. 29.60 s > Snapshot: infinite_execution
  386. 29.60 s > Source: crates/idenso/src/tensor/tests/parsing.rs:910
  387. 29.60 s > ────────────────────────────────────────────────────────────────────────────────
  388. 29.60 s > Expression: net_iter.snapshot_dot()
  389. 29.60 s > ────────────────────────────────────────────────────────────────────────────────
  390. 29.60 s > -old snapshot
  391. 29.60 s > +new results
  392. 29.60 s > ────────────┬───────────────────────────────────────────────────────────────────
  393. 29.60 s > 8 8 │ 0:0:s -> ext0 [id=0 color="red"];
  394. 29.60 s > 9 9 │ ext1 [style=invis];
  395. 29.60 s > 10 10 │ 0:5:s -> ext1 [id=1 dir=none color="red" label="mink4|l_0"];
  396. 29.60 s > 11 11 │ ext2 [style=invis];
  397. 29.60 s > 12 │- 0:4:s -> ext2 [id=2 dir=none color="red" label="bis4|l_2"];
  398. 29.60 s > 12 │+ 0:3:s -> ext2 [id=2 dir=none color="red" label="mink4|l_1"];
  399. 29.60 s > 13 13 │ ext3 [style=invis];
  400. 29.60 s > 14 │- 0:3:s -> ext3 [id=3 dir=none color="red" label="bis4|l_3"];
  401. 29.60 s > 14 │+ 0:1:s -> ext3 [id=3 dir=none color="red" label="bis4|l_2"];
  402. 29.60 s > 15 15 │ ext4 [style=invis];
  403. 29.60 s > 16 │- 0:1:s -> ext4 [id=4 dir=none color="red" label="mink4|l_1"];
  404. 29.60 s > 16 │+ 0:2:s -> ext4 [id=4 dir=none color="red" label="mink4|l_4"];
  405. 29.60 s > 17 17 │ ext5 [style=invis];
  406. 29.60 s > 18 │- 0:2:s -> ext5 [id=5 dir=none color="red" label="mink4|l_4"];
  407. 29.60 s > 18 │+ 0:4:s -> ext5 [id=5 dir=none color="red" label="bis4|l_3"];
  408. 29.60 s > 19 19 │ }
  409. 29.60 s > ────────────┴───────────────────────────────────────────────────────────────────
  410. 29.60 s > To update snapshots run `cargo insta review`
  411. 29.60 s > Stopped on the first failure. Run `cargo insta test` to run all snapshots.
  412. 29.60 s > test tensor::tests::parsing::infinite_execution ... FAILED
  413. 29.60 s >
  414. 29.60 s > failures:
  415. 29.60 s >
  416. 29.60 s > failures:
  417. 29.60 s > tensor::tests::parsing::infinite_execution
  418. 29.60 s >
  419. 29.60 s > test result: FAILED. 0 passed; 1 failed; 0 ignored; 0 measured; 240 filtered out; finished in 0.07s
  420. 29.60 s >
  421. 29.60 s > stderr ---
  422. 29.60 s >
  423. 29.60 s > thread 'tensor::tests::parsing::infinite_execution' (830) panicked at /nix/store/hvwd4qqiaadc4s871lfyylxrciqrvlgs-vendor-cargo-deps/c19b7c6f923b580ac259164a89f2577984ad5ab09ee9d583b888f934adbbe8d0/insta-1.47.2/src/runtime.rs:719:13:
  424. 29.60 s > snapshot assertion for 'infinite_execution' failed in line 910
  425. 29.60 s > stack backtrace:
  426. 29.60 s > 0: __rustc::rust_begin_unwind
  427. 29.60 s > 1: core::panicking::panic_fmt
  428. 29.60 s > 2: insta::runtime::assert_snapshot
  429. 29.60 s > 3: idenso::tensor::tests::parsing::infinite_execution
  430. 29.60 s > 4: <idenso::tensor::tests::parsing::infinite_execution::{closure#0} as core::ops::function::FnOnce<()>>::call_once
  431. 29.60 s > note: Some details are omitted, run with `RUST_BACKTRACE=full` for a verbose backtrace.
  432. 29.60 s >
  433. 29.60 s > ------------
  434. 29.60 s > Summary [ 3.058s] 224 tests run: 222 passed, 2 failed, 26 skipped
  435. 29.60 s > FAIL [ 0.029s] ( 49/224) idenso color::test::form_reference::metric_contraction_respects_antisymmetric_normalization
  436. 29.60 s > stdout ---
  437. 29.60 s >
  438. 29.60 s > running 1 test
  439. 29.60 s > test color::test::form_reference::metric_contraction_respects_antisymmetric_normalization ... FAILED
  440. 29.60 s >
  441. 29.60 s > failures:
  442. 29.60 s >
  443. 29.60 s > failures:
  444. 29.60 s > color::test::form_reference::metric_contraction_respects_antisymmetric_normalization
  445. 29.60 s >
  446. 29.60 s > test result: FAILED. 0 passed; 1 failed; 0 ignored; 0 measured; 240 filtered out; finished in 0.01s
  447. 29.60 s >
  448. 29.60 s > stderr ---
  449. 29.60 s >
  450. 29.60 s > thread 'color::test::form_reference::metric_contraction_respects_antisymmetric_normalization' (340) panicked at crates/idenso/src/color/test/form_reference.rs:171:5:
  451. 29.60 s > assertion `left == right` failed
  452. 29.60 s > left: "-1*f(coad(8,standalone_metric_j),coad(8,standalone_metric_s),coad(8,standalone_metric_u))"
  453. 29.60 s > right: "f(coad(8,standalone_metric_j),coad(8,standalone_metric_s),coad(8,standalone_metric_u))"
  454. 29.60 s > stack backtrace:
  455. 29.60 s > 0: __rustc::rust_begin_unwind
  456. 29.60 s > 1: core::panicking::panic_fmt
  457. 29.60 s > 2: core::panicking::assert_failed_inner
  458. 29.60 s > 3: core::panicking::assert_failed::<alloc::string::String, alloc::string::String>
  459. 29.60 s > 4: idenso::color::test::form_reference::metric_contraction_respects_antisymmetric_normalization
  460. 29.60 s > 5: <idenso::color::test::form_reference::metric_contraction_respects_antisymmetric_normalization::{closure#0} as core::ops::function::FnOnce<()>>::call_once
  461. 29.60 s > note: Some details are omitted, run with `RUST_BACKTRACE=full` for a verbose backtrace.
  462. 29.60 s >
  463. 29.60 s > FAIL [ 0.084s] (218/224) idenso tensor::tests::parsing::infinite_execution
  464. 29.60 s > stdout ---
  465. 29.60 s >
  466. 29.60 s > running 1 test
  467. 29.60 s > ━━━━━━━━━━━━━━━━━━━━━━━━━━━━━━━ Snapshot Summary ━━━━━━━━━━━━━━━━━━━━━━━━━━━━━━━
  468. 29.60 s > Snapshot: infinite_execution
  469. 29.60 s > Source: crates/idenso/src/tensor/tests/parsing.rs:910
  470. 29.60 s > ────────────────────────────────────────────────────────────────────────────────
  471. 29.60 s > Expression: net_iter.snapshot_dot()
  472. 29.60 s > ────────────────────────────────────────────────────────────────────────────────
  473. 29.60 s > -old snapshot
  474. 29.60 s > +new results
  475. 29.60 s > ────────────┬───────────────────────────────────────────────────────────────────
  476. 29.60 s > 8 8 │ 0:0:s -> ext0 [id=0 color="red"];
  477. 29.60 s > 9 9 │ ext1 [style=invis];
  478. 29.60 s > 10 10 │ 0:5:s -> ext1 [id=1 dir=none color="red" label="mink4|l_0"];
  479. 29.60 s > 11 11 │ ext2 [style=invis];
  480. 29.60 s > 12 │- 0:4:s -> ext2 [id=2 dir=none color="red" label="bis4|l_2"];
  481. 29.60 s > 12 │+ 0:3:s -> ext2 [id=2 dir=none color="red" label="mink4|l_1"];
  482. 29.60 s > 13 13 │ ext3 [style=invis];
  483. 29.60 s > 14 │- 0:3:s -> ext3 [id=3 dir=none color="red" label="bis4|l_3"];
  484. 29.60 s > 14 │+ 0:1:s -> ext3 [id=3 dir=none color="red" label="bis4|l_2"];
  485. 29.60 s > 15 15 │ ext4 [style=invis];
  486. 29.60 s > 16 │- 0:1:s -> ext4 [id=4 dir=none color="red" label="mink4|l_1"];
  487. 29.60 s > 16 │+ 0:2:s -> ext4 [id=4 dir=none color="red" label="mink4|l_4"];
  488. 29.60 s > 17 17 │ ext5 [style=invis];
  489. 29.60 s > 18 │- 0:2:s -> ext5 [id=5 dir=none color="red" label="mink4|l_4"];
  490. 29.60 s > 18 │+ 0:4:s -> ext5 [id=5 dir=none color="red" label="bis4|l_3"];
  491. 29.60 s > 19 19 │ }
  492. 29.60 s > ────────────┴───────────────────────────────────────────────────────────────────
  493. 29.60 s > To update snapshots run `cargo insta review`
  494. 29.60 s > Stopped on the first failure. Run `cargo insta test` to run all snapshots.
  495. 29.60 s > test tensor::tests::parsing::infinite_execution ... FAILED
  496. 29.60 s >
  497. 29.60 s > failures:
  498. 29.60 s >
  499. 29.60 s > failures:
  500. 29.60 s > tensor::tests::parsing::infinite_execution
  501. 29.60 s >
  502. 29.60 s > test result: FAILED. 0 passed; 1 failed; 0 ignored; 0 measured; 240 filtered out; finished in 0.07s
  503. 29.60 s >
  504. 29.60 s > stderr ---
  505. 29.60 s >
  506. 29.60 s > thread 'tensor::tests::parsing::infinite_execution' (830) panicked at /nix/store/hvwd4qqiaadc4s871lfyylxrciqrvlgs-vendor-cargo-deps/c19b7c6f923b580ac259164a89f2577984ad5ab09ee9d583b888f934adbbe8d0/insta-1.47.2/src/runtime.rs:719:13:
  507. 29.60 s > snapshot assertion for 'infinite_execution' failed in line 910
  508. 29.60 s > stack backtrace:
  509. 29.60 s > 0: __rustc::rust_begin_unwind
  510. 29.60 s > 1: core::panicking::panic_fmt
  511. 29.60 s > 2: insta::runtime::assert_snapshot
  512. 29.60 s > 3: idenso::tensor::tests::parsing::infinite_execution
  513. 29.60 s > 4: <idenso::tensor::tests::parsing::infinite_execution::{closure#0} as core::ops::function::FnOnce<()>>::call_once
  514. 29.60 s > note: Some details are omitted, run with `RUST_BACKTRACE=full` for a verbose backtrace.
  515. 29.60 s >
  516. 29.60 s > error: test run failed
  517. 29.60 s >
  518. 29.60 s > ========== nextest test summary ==========
  519. 29.60 s > report: target/nextest/ci_gammaloop/junit.xml
  520. 29.60 s > tests: 224, failures: 2, errors: 0
  521. 29.60 s >
  522. 29.60 s > 1. idenso::color::test::form_reference::metric_contraction_respects_antisymmetric_normalization
  523. 29.60 s > failure: test failure with exit code 101
  524. 29.60 s > thread 'color::test::form_reference::metric_contraction_respects_antisymmetric_normalization' (340) panicked at crates/idenso/src/color/test/form_reference.rs:171:5:
  525. 29.60 s > assertion `left == right` failed
  526. 29.60 s > left: "-1*f(coad(8,standalone_metric_j),coad(8,standalone_metric_s),coad(8,standalone_metric_u))"
  527. 29.60 s > right: "f(coad(8,standalone_metric_j),coad(8,standalone_metric_s),coad(8,standalone_metric_u))"
  528. 29.60 s > stack backtrace:
  529. 29.60 s > 0: __rustc::rust_begin_unwind
  530. 29.60 s > 1: core::panicking::panic_fmt
  531. 29.60 s > 2: core::panicking::assert_failed_inner
  532. 29.60 s > 3: core::panicking::assert_failed::<alloc::string::String, alloc::string::String>
  533. 29.60 s > 4: idenso::color::test::form_reference::metric_contraction_respects_antisymmetric_normalization
  534. 29.60 s > 5: <idenso::color::test::form_reference::metric_contraction_respects_antisymmetric_normalization::{closure#0} as core::ops::function::FnOnce<()>>::call_once
  535. 29.60 s > note: Some details are omitted, run with `RUST_BACKTRACE=full` for a verbose backtrace.
  536. 29.60 s > system-out
  537. 29.60 s > running 1 test
  538. 29.60 s > test color::test::form_reference::metric_contraction_respects_antisymmetric_normalization ... FAILED
  539. 29.60 s >
  540. 29.60 s > failures:
  541. 29.60 s >
  542. 29.60 s > failures:
  543. 29.60 s > color::test::form_reference::metric_contraction_respects_antisymmetric_normalization
  544. 29.60 s >
  545. 29.60 s > test result: FAILED. 0 passed; 1 failed; 0 ignored; 0 measured; 240 filtered out; finished in 0.01s
  546. 29.60 s > system-err
  547. 29.60 s > thread 'color::test::form_reference::metric_contraction_respects_antisymmetric_normalization' (340) panicked at crates/idenso/src/color/test/form_reference.rs:171:5:
  548. 29.60 s > assertion `left == right` failed
  549. 29.60 s > left: "-1*f(coad(8,standalone_metric_j),coad(8,standalone_metric_s),coad(8,standalone_metric_u))"
  550. 29.60 s > right: "f(coad(8,standalone_metric_j),coad(8,standalone_metric_s),coad(8,standalone_metric_u))"
  551. 29.60 s > stack backtrace:
  552. 29.60 s > 0: __rustc::rust_begin_unwind
  553. 29.60 s > 1: core::panicking::panic_fmt
  554. 29.60 s > 2: core::panicking::assert_failed_inner
  555. 29.60 s > 3: core::panicking::assert_failed::<alloc::string::String, alloc::string::String>
  556. 29.60 s > 4: idenso::color::test::form_reference::metric_contraction_respects_antisymmetric_normalization
  557. 29.60 s > 5: <idenso::color::test::form_reference::metric_contraction_respects_antisymmetric_normalization::{closure#0} as core::ops::function::FnOnce<()>>::call_once
  558. 29.60 s > note: Some details are omitted, run with `RUST_BACKTRACE=full` for a verbose backtrace.
  559. 29.60 s >
  560. 29.60 s > 2. idenso::tensor::tests::parsing::infinite_execution
  561. 29.60 s > failure: test failure with exit code 101
  562. 29.60 s > thread 'tensor::tests::parsing::infinite_execution' (830) panicked at /nix/store/hvwd4qqiaadc4s871lfyylxrciqrvlgs-vendor-cargo-deps/c19b7c6f923b580ac259164a89f2577984ad5ab09ee9d583b888f934adbbe8d0/insta-1.47.2/src/runtime.rs:719:13:
  563. 29.60 s > snapshot assertion for 'infinite_execution' failed in line 910
  564. 29.60 s > stack backtrace:
  565. 29.60 s > 0: __rustc::rust_begin_unwind
  566. 29.60 s > 1: core::panicking::panic_fmt
  567. 29.60 s > 2: insta::runtime::assert_snapshot
  568. 29.60 s > 3: idenso::tensor::tests::parsing::infinite_execution
  569. 29.60 s > 4: <idenso::tensor::tests::parsing::infinite_execution::{closure#0} as core::ops::function::FnOnce<()>>::call_once
  570. 29.60 s > note: Some details are omitted, run with `RUST_BACKTRACE=full` for a verbose backtrace.
  571. 29.60 s > system-out
  572. 29.60 s > running 1 test
  573. 29.60 s > ━━━━━━━━━━━━━━━━━━━━━━━━━━━━━━━ Snapshot Summary ━━━━━━━━━━━━━━━━━━━━━━━━━━━━━━━
  574. 29.60 s > Snapshot: infinite_execution
  575. 29.60 s > Source: crates/idenso/src/tensor/tests/parsing.rs:910
  576. 29.60 s > ────────────────────────────────────────────────────────────────────────────────
  577. 29.60 s > Expression: net_iter.snapshot_dot()
  578. 29.60 s > ────────────────────────────────────────────────────────────────────────────────
  579. 29.60 s > -old snapshot
  580. 29.60 s > +new results
  581. 29.60 s > ────────────┬───────────────────────────────────────────────────────────────────
  582. 29.60 s > 8 8 │ 0:0:s-> ext0 [id=0 color="red"];
  583. 29.60 s > 9 9 │ ext1 [style=invis];
  584. 29.60 s > 10 10 │ 0:5:s-> ext1 [id=1 dir=none color="red" label="mink4|l_0"];
  585. 29.60 s > 11 11 │ ext2 [style=invis];
  586. 29.60 s > 12 │- 0:4:s-> ext2 [id=2 dir=none color="red" label="bis4|l_2"];
  587. 29.60 s > 12 │+ 0:3:s-> ext2 [id=2 dir=none color="red" label="mink4|l_1"];
  588. 29.60 s > 13 13 │ ext3 [style=invis];
  589. 29.60 s > 14 │- 0:3:s-> ext3 [id=3 dir=none color="red" label="bis4|l_3"];
  590. 29.60 s > 14 │+ 0:1:s-> ext3 [id=3 dir=none color="red" label="bis4|l_2"];
  591. 29.60 s > 15 15 │ ext4 [style=invis];
  592. 29.60 s > 16 │- 0:1:s-> ext4 [id=4 dir=none color="red" label="mink4|l_1"];
  593. 29.60 s > 16 │+ 0:2:s-> ext4 [id=4 dir=none color="red" label="mink4|l_4"];
  594. 29.60 s > 17 17 │ ext5 [style=invis];
  595. 29.60 s > 18 │- 0:2:s-> ext5 [id=5 dir=none color="red" label="mink4|l_4"];
  596. 29.60 s > 18 │+ 0:4:s-> ext5 [id=5 dir=none color="red" label="bis4|l_3"];
  597. 29.60 s > 19 19 │ }
  598. 29.60 s > ────────────┴───────────────────────────────────────────────────────────────────
  599. 29.60 s > To update snapshots run `cargo insta review`
  600. 29.60 s > Stopped on the first failure. Run `cargo insta test` to run all snapshots.
  601. 29.60 s > test tensor::tests::parsing::infinite_execution ... FAILED
  602. 29.60 s >
  603. 29.60 s > failures:
  604. 29.60 s >
  605. 29.60 s > failures:
  606. 29.60 s > tensor::tests::parsing::infinite_execution
  607. 29.60 s >
  608. 29.60 s > test result: FAILED. 0 passed; 1 failed; 0 ignored; 0 measured; 240 filtered out; finished in 0.07s
  609. 29.60 s > system-err
  610. 29.60 s > thread 'tensor::tests::parsing::infinite_execution' (830) panicked at /nix/store/hvwd4qqiaadc4s871lfyylxrciqrvlgs-vendor-cargo-deps/c19b7c6f923b580ac259164a89f2577984ad5ab09ee9d583b888f934adbbe8d0/insta-1.47.2/src/runtime.rs:719:13:
  611. 29.60 s > snapshot assertion for 'infinite_execution' failed in line 910
  612. 29.60 s > stack backtrace:
  613. 29.60 s > 0: __rustc::rust_begin_unwind
  614. 29.60 s > 1: core::panicking::panic_fmt
  615. 29.60 s > 2: insta::runtime::assert_snapshot
  616. 29.60 s > 3: idenso::tensor::tests::parsing::infinite_execution
  617. 29.60 s > 4: <idenso::tensor::tests::parsing::infinite_execution::{closure#0} as core::ops::function::FnOnce<()>>::call_once
  618. 29.60 s > note: Some details are omitted, run with `RUST_BACKTRACE=full` for a verbose backtrace.
  619. 29.60 s > =========================================
  620. 29.60 s > Extracting 2 binaries and 1 linked path to /build/nextest-archive-tVKcRJ
  621. 29.60 s > Extracted 8 files to /build/nextest-archive-tVKcRJ in 0.15s
  622. 29.60 s > ------------
  623. 29.60 s > Nextest run ID 6cff0b4b-2c87-4f4b-9130-dab7a1e4d605 with nextest profile: ci_gammaloop
  624. 29.60 s > Starting 135 tests across 2 binaries
  625. 29.60 s > ------------
  626. 29.60 s > Summary [ 0.165s] 135 tests run: 135 passed, 0 skipped
  627. 29.60 s >
  628. 29.60 s > ========== nextest test summary ==========
  629. 29.60 s > report: target/nextest/ci_gammaloop/junit.xml
  630. 29.60 s > tests: 135, failures: 0, errors: 0
  631. 29.60 s > No failing testcases found.
  632. 29.60 s > =========================================
  633. 29.60 s > Extracting 5 binaries and 2 linked paths to /build/nextest-archive-RFNjGD
  634. 29.60 s > Extracted 19 files to /build/nextest-archive-RFNjGD in 0.36s
  635. 29.60 s > ------------
  636. 29.60 s > Nextest run ID 6e8719c2-3558-4a9f-9ca1-e505a81a250c with nextest profile: ci_gammaloop
  637. 29.60 s > Starting 25 tests across 5 binaries (1 test skipped via profile.ci_gammaloop.default-filter)
  638. 29.60 s > ------------
  639. 29.60 s > Summary [ 0.368s] 25 tests run: 25 passed, 1 skipped
  640. 29.60 s >
  641. 29.60 s > ========== nextest test summary ==========
  642. 29.60 s > report: target/nextest/ci_gammaloop/junit.xml
  643. 29.60 s > tests: 25, failures: 0, errors: 0
  644. 29.60 s > No failing testcases found.
  645. 29.60 s > =========================================
  646. 29.60 s > Extracting 2 binaries and 1 linked path to /build/nextest-archive-VsohMF
  647. 29.60 s > Extracted 8 files to /build/nextest-archive-VsohMF in 0.10s
  648. 29.60 s > ------------
  649. 29.60 s > Nextest run ID da5ab33b-0dd1-46d4-b7ec-b79e250b0075 with nextest profile: ci_gammaloop
  650. 29.60 s > Starting 1 test across 2 binaries
  651. 29.60 s > ------------
  652. 29.60 s > Summary [ 0.010s] 1 test run: 1 passed, 0 skipped
  653. 29.60 s >
  654. 29.60 s > ========== nextest test summary ==========
  655. 29.60 s > report: target/nextest/ci_gammaloop/junit.xml
  656. 29.60 s > tests: 1, failures: 0, errors: 0
  657. 29.60 s > No failing testcases found.
  658. 29.60 s > =========================================
  659. 29.60 s > Extracting 1 binary and 1 linked path to /build/nextest-archive-LEaFpW
  660. 29.60 s > Extracted 7 files to /build/nextest-archive-LEaFpW in 0.07s
  661. 29.60 s > ------------
  662. 29.60 s > Nextest run ID 455891d9-46fe-4139-84b8-c0ab3248bf9d with nextest profile: ci_gammaloop
  663. 29.60 s > Starting 0 tests across 1 binary
  664. 29.60 s > ------------
  665. 29.60 s > Summary [ 0.000s] 0 tests run: 0 passed, 0 skipped
  666. 29.60 s >
  667. 29.60 s > ========== nextest test summary ==========
  668. 29.60 s > report: target/nextest/ci_gammaloop/junit.xml
  669. 29.60 s > tests: 0, failures: 0, errors: 0
  670. 29.60 s > No failing testcases found.
  671. 29.60 s > =========================================
  672. 29.60 s For full logs, run:
  673. 29.60 s nix log /nix/store/f7dlapwy00q35hpz63fxwqijy6397ql2-gammaloop-nextest-spenso.drv
  674. 29.79 s [0 built (1 failed)]Run failed.