0.14 s
$ /nix/store/9ypz3flqsrl5xl495mm8h645gadjsxi1-coreutils-9.11/bin/timeout --kill-after=15s 7200s /nix/store/23zk8sgzamrbmj1fday15szf7f2279s8-nix-2.34.7/bin/nix --extra-experimental-features nix-command --extra-experimental-features flakes flake clone git+https://github.com/alphal00p/gammaloop --dest /tmp/nix-ci-worker/stable-pwd/repo/
0.37 s
Cloning into '/tmp/nix-ci-worker/stable-pwd/repo'...
1.15 s
remote: Enumerating objects: 65283, done.
1.26 s
remote: Counting objects: 0% (1/7934)
remote: Counting objects: 1% (80/7934)
remote: Counting objects: 2% (159/7934)
remote: Counting objects: 3% (239/7934)
remote: Counting objects: 4% (318/7934)
remote: Counting objects: 5% (397/7934)
remote: Counting objects: 6% (477/7934)
remote: Counting objects: 7% (556/7934)
remote: Counting objects: 8% (635/7934)
remote: Counting objects: 9% (715/7934)
remote: Counting objects: 10% (794/7934)
remote: Counting objects: 11% (873/7934)
remote: Counting objects: 12% (953/7934)
remote: Counting objects: 13% (1032/7934)
remote: Counting objects: 14% (1111/7934)
remote: Counting objects: 15% (1191/7934)
remote: Counting objects: 16% (1270/7934)
remote: Counting objects: 17% (1349/7934)
remote: Counting objects: 18% (1429/7934)
remote: Counting objects: 19% (1508/7934)
remote: Counting objects: 20% (1587/7934)
remote: Counting objects: 21% (1667/7934)
remote: Counting objects: 22% (1746/7934)
remote: Counting objects: 23% (1825/7934)
remote: Counting objects: 24% (1905/7934)
remote: Counting objects: 25% (1984/7934)
remote: Counting objects: 26% (2063/7934)
remote: Counting objects: 27% (2143/7934)
remote: Counting objects: 28% (2222/7934)
remote: Counting objects: 29% (2301/7934)
remote: Counting objects: 30% (2381/7934)
remote: Counting objects: 31% (2460/7934)
remote: Counting objects: 32% (2539/7934)
remote: Counting objects: 33% (2619/7934)
remote: Counting objects: 34% (2698/7934)
remote: Counting objects: 35% (2777/7934)
remote: Counting objects: 36% (2857/7934)
remote: Counting objects: 37% (2936/7934)
remote: Counting objects: 38% (3015/7934)
remote: Counting objects: 39% (3095/7934)
remote: Counting objects: 40% (3174/7934)
remote: Counting objects: 41% (3253/7934)
remote: Counting objects: 42% (3333/7934)
remote: Counting objects: 43% (3412/7934)
remote: Counting objects: 44% (3491/7934)
remote: Counting objects: 45% (3571/7934)
remote: Counting objects: 46% (3650/7934)
remote: Counting objects: 47% (3729/7934)
remote: Counting objects: 48% (3809/7934)
remote: Counting objects: 49% (3888/7934)
remote: Counting objects: 50% (3967/7934)
remote: Counting objects: 51% (4047/7934)
remote: Counting objects: 52% (4126/7934)
remote: Counting objects: 53% (4206/7934)
remote: Counting objects: 54% (4285/7934)
remote: Counting objects: 55% (4364/7934)
remote: Counting objects: 56% (4444/7934)
remote: Counting objects: 57% (4523/7934)
remote: Counting objects: 58% (4602/7934)
remote: Counting objects: 59% (4682/7934)
remote: Counting objects: 60% (4761/7934)
remote: Counting objects: 61% (4840/7934)
remote: Counting objects: 62% (4920/7934)
remote: Counting objects: 63% (4999/7934)
remote: Counting objects: 64% (5078/7934)
remote: Counting objects: 65% (5158/7934)
remote: Counting objects: 66% (5237/7934)
remote: Counting objects: 67% (5316/7934)
remote: Counting objects: 68% (5396/7934)
remote: Counting objects: 69% (5475/7934)
remote: Counting objects: 70% (5554/7934)
remote: Counting objects: 71% (5634/7934)
remote: Counting objects: 72% (5713/7934)
remote: Counting objects: 73% (5792/7934)
remote: Counting objects: 74% (5872/7934)
remote: Counting objects: 75% (5951/7934)
remote: Counting objects: 76% (6030/7934)
remote: Counting objects: 77% (6110/7934)
remote: Counting objects: 78% (6189/7934)
remote: Counting objects: 79% (6268/7934)
remote: Counting objects: 80% (6348/7934)
remote: Counting objects: 81% (6427/7934)
remote: Counting objects: 82% (6506/7934)
remote: Counting objects: 83% (6586/7934)
remote: Counting objects: 84% (6665/7934)
remote: Counting objects: 85% (6744/7934)
remote: Counting objects: 86% (6824/7934)
remote: Counting objects: 87% (6903/7934)
remote: Counting objects: 88% (6982/7934)
remote: Counting objects: 89% (7062/7934)
remote: Counting objects: 90% (7141/7934)
remote: Counting objects: 91% (7220/7934)
remote: Counting objects: 92% (7300/7934)
remote: Counting objects: 93% (7379/7934)
remote: Counting objects: 94% (7458/7934)
remote: Counting objects: 95% (7538/7934)
remote: Counting objects: 96% (7617/7934)
remote: Counting objects: 97% (7696/7934)
remote: Counting objects: 98% (7776/7934)
remote: Counting objects: 99% (7855/7934)
remote: Counting objects: 100% (7934/7934)
remote: Counting objects: 100% (7934/7934), done.
2.75 s
remote: Compressing objects: 0% (1/1600)
remote: Compressing objects: 1% (16/1600)
remote: Compressing objects: 2% (32/1600)
remote: Compressing objects: 3% (48/1600)
remote: Compressing objects: 4% (64/1600)
remote: Compressing objects: 5% (80/1600)
remote: Compressing objects: 6% (96/1600)
remote: Compressing objects: 7% (112/1600)
remote: Compressing objects: 8% (128/1600)
remote: Compressing objects: 9% (144/1600)
remote: Compressing objects: 10% (160/1600)
remote: Compressing objects: 11% (176/1600)
remote: Compressing objects: 12% (192/1600)
remote: Compressing objects: 13% (208/1600)
remote: Compressing objects: 14% (224/1600)
remote: Compressing objects: 15% (240/1600)
remote: Compressing objects: 15% (254/1600)
remote: Compressing objects: 16% (256/1600)
remote: Compressing objects: 17% (272/1600)
remote: Compressing objects: 18% (288/1600)
remote: Compressing objects: 19% (304/1600)
remote: Compressing objects: 20% (320/1600)
remote: Compressing objects: 21% (336/1600)
remote: Compressing objects: 22% (352/1600)
remote: Compressing objects: 23% (368/1600)
remote: Compressing objects: 24% (384/1600)
remote: Compressing objects: 25% (400/1600)
remote: Compressing objects: 26% (416/1600)
remote: Compressing objects: 27% (432/1600)
remote: Compressing objects: 28% (448/1600)
remote: Compressing objects: 29% (464/1600)
remote: Compressing objects: 30% (480/1600)
remote: Compressing objects: 31% (496/1600)
remote: Compressing objects: 32% (512/1600)
remote: Compressing objects: 33% (528/1600)
remote: Compressing objects: 34% (544/1600)
remote: Compressing objects: 35% (560/1600)
remote: Compressing objects: 36% (576/1600)
remote: Compressing objects: 37% (592/1600)
remote: Compressing objects: 38% (608/1600)
remote: Compressing objects: 39% (624/1600)
remote: Compressing objects: 40% (640/1600)
remote: Compressing objects: 41% (656/1600)
remote: Compressing objects: 42% (672/1600)
remote: Compressing objects: 43% (688/1600)
remote: Compressing objects: 44% (704/1600)
remote: Compressing objects: 45% (720/1600)
remote: Compressing objects: 46% (736/1600)
remote: Compressing objects: 47% (752/1600)
remote: Compressing objects: 48% (768/1600)
remote: Compressing objects: 49% (784/1600)
remote: Compressing objects: 50% (800/1600)
remote: Compressing objects: 51% (816/1600)
remote: Compressing objects: 52% (832/1600)
remote: Compressing objects: 53% (848/1600)
remote: Compressing objects: 54% (864/1600)
remote: Compressing objects: 55% (880/1600)
remote: Compressing objects: 56% (896/1600)
remote: Compressing objects: 57% (912/1600)
remote: Compressing objects: 58% (928/1600)
remote: Compressing objects: 59% (944/1600)
remote: Compressing objects: 60% (960/1600)
remote: Compressing objects: 61% (976/1600)
remote: Compressing objects: 62% (992/1600)
remote: Compressing objects: 63% (1008/1600)
remote: Compressing objects: 64% (1024/1600)
remote: Compressing objects: 65% (1040/1600)
remote: Compressing objects: 66% (1056/1600)
remote: Compressing objects: 67% (1072/1600)
remote: Compressing objects: 68% (1088/1600)
remote: Compressing objects: 69% (1104/1600)
remote: Compressing objects: 70% (1120/1600)
remote: Compressing objects: 71% (1136/1600)
remote: Compressing objects: 72% (1152/1600)
remote: Compressing objects: 73% (1168/1600)
remote: Compressing objects: 74% (1184/1600)
remote: Compressing objects: 75% (1200/1600)
remote: Compressing objects: 76% (1216/1600)
remote: Compressing objects: 77% (1232/1600)
remote: Compressing objects: 78% (1248/1600)
remote: Compressing objects: 79% (1264/1600)
remote: Compressing objects: 80% (1280/1600)
remote: Compressing objects: 81% (1296/1600)
remote: Compressing objects: 82% (1312/1600)
remote: Compressing objects: 83% (1328/1600)
remote: Compressing objects: 84% (1344/1600)
remote: Compressing objects: 85% (1360/1600)
remote: Compressing objects: 86% (1376/1600)
remote: Compressing objects: 87% (1392/1600)
remote: Compressing objects: 88% (1408/1600)
remote: Compressing objects: 89% (1424/1600)
remote: Compressing objects: 90% (1440/1600)
remote: Compressing objects: 91% (1456/1600)
remote: Compressing objects: 92% (1472/1600)
remote: Compressing objects: 93% (1488/1600)
remote: Compressing objects: 94% (1504/1600)
remote: Compressing objects: 95% (1520/1600)
remote: Compressing objects: 96% (1536/1600)
remote: Compressing objects: 97% (1552/1600)
remote: Compressing objects: 98% (1568/1600)
remote: Compressing objects: 99% (1584/1600)
remote: Compressing objects: 100% (1600/1600)
remote: Compressing objects: 100% (1600/1600), done.
5.60 s
Receiving objects: 0% (1/65283)
Receiving objects: 1% (653/65283)
Receiving objects: 2% (1306/65283)
Receiving objects: 3% (1959/65283)
Receiving objects: 4% (2612/65283)
Receiving objects: 5% (3265/65283)
Receiving objects: 6% (3917/65283)
Receiving objects: 7% (4570/65283)
Receiving objects: 8% (5223/65283)
Receiving objects: 9% (5876/65283)
Receiving objects: 10% (6529/65283), 10.07 MiB | 20.12 MiB/s
Receiving objects: 11% (7182/65283), 10.07 MiB | 20.12 MiB/s
Receiving objects: 12% (7834/65283), 10.07 MiB | 20.12 MiB/s
Receiving objects: 13% (8487/65283), 10.07 MiB | 20.12 MiB/s
Receiving objects: 14% (9140/65283), 10.07 MiB | 20.12 MiB/s
Receiving objects: 15% (9793/65283), 10.07 MiB | 20.12 MiB/s
Receiving objects: 16% (10446/65283), 10.07 MiB | 20.12 MiB/s
Receiving objects: 17% (11099/65283), 10.07 MiB | 20.12 MiB/s
Receiving objects: 18% (11751/65283), 10.07 MiB | 20.12 MiB/s
Receiving objects: 19% (12404/65283), 10.07 MiB | 20.12 MiB/s
Receiving objects: 20% (13057/65283), 10.07 MiB | 20.12 MiB/s
Receiving objects: 21% (13710/65283), 10.07 MiB | 20.12 MiB/s
Receiving objects: 22% (14363/65283), 10.07 MiB | 20.12 MiB/s
Receiving objects: 23% (15016/65283), 10.07 MiB | 20.12 MiB/s
Receiving objects: 24% (15668/65283), 10.07 MiB | 20.12 MiB/s
Receiving objects: 25% (16321/65283), 10.07 MiB | 20.12 MiB/s
Receiving objects: 26% (16974/65283), 10.07 MiB | 20.12 MiB/s
Receiving objects: 27% (17627/65283), 10.07 MiB | 20.12 MiB/s
Receiving objects: 28% (18280/65283), 10.07 MiB | 20.12 MiB/s
Receiving objects: 29% (18933/65283), 10.07 MiB | 20.12 MiB/s
Receiving objects: 30% (19585/65283), 10.07 MiB | 20.12 MiB/s
Receiving objects: 31% (20238/65283), 10.07 MiB | 20.12 MiB/s
Receiving objects: 32% (20891/65283), 10.07 MiB | 20.12 MiB/s
Receiving objects: 33% (21544/65283), 10.07 MiB | 20.12 MiB/s
Receiving objects: 34% (22197/65283), 10.07 MiB | 20.12 MiB/s
Receiving objects: 34% (22603/65283), 23.09 MiB | 23.08 MiB/s
Receiving objects: 35% (22850/65283), 23.09 MiB | 23.08 MiB/s
Receiving objects: 36% (23502/65283), 23.09 MiB | 23.08 MiB/s
Receiving objects: 37% (24155/65283), 23.09 MiB | 23.08 MiB/s
Receiving objects: 38% (24808/65283), 23.09 MiB | 23.08 MiB/s
Receiving objects: 39% (25461/65283), 23.09 MiB | 23.08 MiB/s
Receiving objects: 40% (26114/65283), 23.09 MiB | 23.08 MiB/s
Receiving objects: 41% (26767/65283), 23.09 MiB | 23.08 MiB/s
Receiving objects: 42% (27419/65283), 23.09 MiB | 23.08 MiB/s
Receiving objects: 43% (28072/65283), 23.09 MiB | 23.08 MiB/s
Receiving objects: 44% (28725/65283), 23.09 MiB | 23.08 MiB/s
Receiving objects: 45% (29378/65283), 23.09 MiB | 23.08 MiB/s
Receiving objects: 46% (30031/65283), 23.09 MiB | 23.08 MiB/s
Receiving objects: 47% (30684/65283), 23.09 MiB | 23.08 MiB/s
Receiving objects: 48% (31336/65283), 23.09 MiB | 23.08 MiB/s
Receiving objects: 49% (31989/65283), 23.09 MiB | 23.08 MiB/s
Receiving objects: 50% (32642/65283), 23.09 MiB | 23.08 MiB/s
Receiving objects: 51% (33295/65283), 23.09 MiB | 23.08 MiB/s
Receiving objects: 52% (33948/65283), 23.09 MiB | 23.08 MiB/s
Receiving objects: 53% (34600/65283), 23.09 MiB | 23.08 MiB/s
Receiving objects: 54% (35253/65283), 23.09 MiB | 23.08 MiB/s
Receiving objects: 55% (35906/65283), 23.09 MiB | 23.08 MiB/s
Receiving objects: 56% (36559/65283), 23.09 MiB | 23.08 MiB/s
Receiving objects: 57% (37212/65283), 23.09 MiB | 23.08 MiB/s
Receiving objects: 58% (37865/65283), 23.09 MiB | 23.08 MiB/s
Receiving objects: 59% (38517/65283), 43.12 MiB | 28.74 MiB/s
Receiving objects: 60% (39170/65283), 43.12 MiB | 28.74 MiB/s
Receiving objects: 61% (39823/65283), 43.12 MiB | 28.74 MiB/s
Receiving objects: 62% (40476/65283), 43.12 MiB | 28.74 MiB/s
Receiving objects: 63% (41129/65283), 43.12 MiB | 28.74 MiB/s
Receiving objects: 64% (41782/65283), 43.12 MiB | 28.74 MiB/s
Receiving objects: 65% (42434/65283), 43.12 MiB | 28.74 MiB/s
Receiving objects: 66% (43087/65283), 43.12 MiB | 28.74 MiB/s
Receiving objects: 67% (43740/65283), 43.12 MiB | 28.74 MiB/s
Receiving objects: 68% (44393/65283), 43.12 MiB | 28.74 MiB/s
Receiving objects: 69% (45046/65283), 43.12 MiB | 28.74 MiB/s
Receiving objects: 70% (45699/65283), 43.12 MiB | 28.74 MiB/s
Receiving objects: 71% (46351/65283), 43.12 MiB | 28.74 MiB/s
Receiving objects: 72% (47004/65283), 43.12 MiB | 28.74 MiB/s
Receiving objects: 72% (47639/65283), 43.12 MiB | 28.74 MiB/s
Receiving objects: 73% (47657/65283), 60.12 MiB | 30.05 MiB/s
Receiving objects: 74% (48310/65283), 60.12 MiB | 30.05 MiB/s
Receiving objects: 75% (48963/65283), 60.12 MiB | 30.05 MiB/s
Receiving objects: 76% (49616/65283), 60.12 MiB | 30.05 MiB/s
Receiving objects: 77% (50268/65283), 60.12 MiB | 30.05 MiB/s
Receiving objects: 78% (50921/65283), 60.12 MiB | 30.05 MiB/s
Receiving objects: 79% (51574/65283), 60.12 MiB | 30.05 MiB/s
Receiving objects: 80% (52227/65283), 60.12 MiB | 30.05 MiB/s
Receiving objects: 81% (52880/65283), 60.12 MiB | 30.05 MiB/s
Receiving objects: 82% (53533/65283), 76.60 MiB | 30.59 MiB/s
Receiving objects: 83% (54185/65283), 76.60 MiB | 30.59 MiB/s
Receiving objects: 84% (54838/65283), 76.60 MiB | 30.59 MiB/s
Receiving objects: 85% (55491/65283), 76.60 MiB | 30.59 MiB/s
Receiving objects: 86% (56144/65283), 76.60 MiB | 30.59 MiB/s
Receiving objects: 87% (56797/65283), 76.60 MiB | 30.59 MiB/s
Receiving objects: 88% (57450/65283), 76.60 MiB | 30.59 MiB/s
Receiving objects: 89% (58102/65283), 76.60 MiB | 30.59 MiB/s
Receiving objects: 90% (58755/65283), 76.60 MiB | 30.59 MiB/s
Receiving objects: 91% (59408/65283), 76.60 MiB | 30.59 MiB/s
Receiving objects: 92% (60061/65283), 76.60 MiB | 30.59 MiB/s
Receiving objects: 93% (60714/65283), 76.60 MiB | 30.59 MiB/s
Receiving objects: 94% (61367/65283), 76.60 MiB | 30.59 MiB/s
Receiving objects: 95% (62019/65283), 76.60 MiB | 30.59 MiB/s
Receiving objects: 96% (62672/65283), 76.60 MiB | 30.59 MiB/s
Receiving objects: 97% (63325/65283), 76.60 MiB | 30.59 MiB/s
Receiving objects: 98% (63978/65283), 76.60 MiB | 30.59 MiB/s
Receiving objects: 99% (64631/65283), 76.60 MiB | 30.59 MiB/s
remote: Total 65283 (delta 6877), reused 6420 (delta 6324), pack-reused 57349 (from 1)
5.62 s
Receiving objects: 100% (65283/65283), 76.60 MiB | 30.59 MiB/s
Receiving objects: 100% (65283/65283), 87.60 MiB | 30.72 MiB/s, done.
7.57 s
Resolving deltas: 0% (0/45995)
Resolving deltas: 1% (460/45995)
Resolving deltas: 2% (920/45995)
Resolving deltas: 3% (1380/45995)
Resolving deltas: 4% (1840/45995)
Resolving deltas: 5% (2300/45995)
Resolving deltas: 6% (2760/45995)
Resolving deltas: 7% (3220/45995)
Resolving deltas: 8% (3680/45995)
Resolving deltas: 9% (4140/45995)
Resolving deltas: 10% (4600/45995)
Resolving deltas: 11% (5060/45995)
Resolving deltas: 12% (5520/45995)
Resolving deltas: 13% (5980/45995)
Resolving deltas: 14% (6442/45995)
Resolving deltas: 15% (6900/45995)
Resolving deltas: 16% (7361/45995)
Resolving deltas: 17% (7820/45995)
Resolving deltas: 18% (8280/45995)
Resolving deltas: 19% (8740/45995)
Resolving deltas: 20% (9199/45995)
Resolving deltas: 21% (9659/45995)
Resolving deltas: 22% (10120/45995)
Resolving deltas: 23% (10579/45995)
Resolving deltas: 24% (11039/45995)
Resolving deltas: 25% (11499/45995)
Resolving deltas: 26% (11959/45995)
Resolving deltas: 27% (12419/45995)
Resolving deltas: 28% (12879/45995)
Resolving deltas: 29% (13339/45995)
Resolving deltas: 30% (13799/45995)
Resolving deltas: 31% (14260/45995)
Resolving deltas: 32% (14719/45995)
Resolving deltas: 33% (15179/45995)
Resolving deltas: 34% (15640/45995)
Resolving deltas: 35% (16099/45995)
Resolving deltas: 36% (16559/45995)
Resolving deltas: 37% (17019/45995)
Resolving deltas: 38% (17479/45995)
Resolving deltas: 39% (17939/45995)
Resolving deltas: 40% (18398/45995)
Resolving deltas: 41% (18858/45995)
Resolving deltas: 42% (19318/45995)
Resolving deltas: 43% (19778/45995)
Resolving deltas: 44% (20238/45995)
Resolving deltas: 45% (20698/45995)
Resolving deltas: 46% (21158/45995)
Resolving deltas: 47% (21619/45995)
Resolving deltas: 48% (22078/45995)
Resolving deltas: 49% (22539/45995)
Resolving deltas: 50% (22998/45995)
Resolving deltas: 51% (23458/45995)
Resolving deltas: 52% (23918/45995)
Resolving deltas: 53% (24378/45995)
Resolving deltas: 54% (24838/45995)
Resolving deltas: 55% (25300/45995)
Resolving deltas: 56% (25758/45995)
Resolving deltas: 57% (26219/45995)
Resolving deltas: 58% (26678/45995)
Resolving deltas: 59% (27138/45995)
Resolving deltas: 60% (27597/45995)
Resolving deltas: 61% (28057/45995)
Resolving deltas: 62% (28517/45995)
Resolving deltas: 63% (28977/45995)
Resolving deltas: 64% (29437/45995)
Resolving deltas: 65% (29897/45995)
Resolving deltas: 66% (30357/45995)
Resolving deltas: 67% (30817/45995)
Resolving deltas: 68% (31277/45995)
Resolving deltas: 69% (31737/45995)
Resolving deltas: 69% (31765/45995)
Resolving deltas: 70% (32197/45995)
Resolving deltas: 71% (32657/45995)
Resolving deltas: 72% (33117/45995)
Resolving deltas: 73% (33577/45995)
Resolving deltas: 74% (34037/45995)
Resolving deltas: 75% (34497/45995)
Resolving deltas: 76% (34957/45995)
Resolving deltas: 77% (35418/45995)
Resolving deltas: 78% (35877/45995)
Resolving deltas: 79% (36337/45995)
Resolving deltas: 80% (36796/45995)
Resolving deltas: 81% (37256/45995)
Resolving deltas: 82% (37716/45995)
Resolving deltas: 83% (38176/45995)
Resolving deltas: 84% (38636/45995)
Resolving deltas: 85% (39096/45995)
Resolving deltas: 86% (39556/45995)
Resolving deltas: 87% (40016/45995)
Resolving deltas: 88% (40476/45995)
Resolving deltas: 89% (40936/45995)
Resolving deltas: 90% (41396/45995)
Resolving deltas: 91% (41856/45995)
Resolving deltas: 92% (42316/45995)
Resolving deltas: 93% (42776/45995)
Resolving deltas: 94% (43236/45995)
Resolving deltas: 95% (43696/45995)
Resolving deltas: 96% (44156/45995)
Resolving deltas: 97% (44616/45995)
Resolving deltas: 98% (45076/45995)
Resolving deltas: 99% (45536/45995)
Resolving deltas: 100% (45995/45995)
Resolving deltas: 100% (45995/45995), done.
9.51 s
Fetching commit da217bcc31bb1b48f1e3e2a2ac0fb15dd06d1801 for vakint_rustred ...
9.51 s
$ /nix/store/bcnisk3ydfgv26v2gw3zlky24g00yww2-git-2.54.0/bin/git fetch origin da217bcc31bb1b48f1e3e2a2ac0fb15dd06d1801
9.95 s
From https://github.com/alphal00p/gammaloop
9.95 s
* branch da217bcc31bb1b48f1e3e2a2ac0fb15dd06d1801 -> FETCH_HEAD
9.97 s
$ /nix/store/9ypz3flqsrl5xl495mm8h645gadjsxi1-coreutils-9.11/bin/timeout --kill-after=15s 7200s /nix/store/bcnisk3ydfgv26v2gw3zlky24g00yww2-git-2.54.0/bin/git -c advice.detachedHead=false checkout da217bcc31bb1b48f1e3e2a2ac0fb15dd06d1801
10.24 s
HEAD is now at da217bcc Reject obsolete RustRed artifact schemas
10.25 s
$ /nix/store/9ypz3flqsrl5xl495mm8h645gadjsxi1-coreutils-9.11/bin/timeout --kill-after=15s 7200s /nix/store/23zk8sgzamrbmj1fday15szf7f2279s8-nix-2.34.7/bin/nix --extra-experimental-features nix-command --extra-experimental-features flakes --log-format internal-json run .#packages.x86_64-linux.nix-ci-check-gammaloop-nextest-spenso --print-build-logs
17.41 s
24.34 s
evaluating derivation 'g
copying '/nix/store/kl70
evaluating derivation 'g
copying '/nix/store/kl70
evaluating derivation 'g
copying '/nix/store/kl70
evaluating derivation 'g
[0 /1 built]
[1 /0 /1 built] building g gammaloop-nextest-spenso> Extracting 5 binaries and 2 linked paths to /build/nextest-archive-DWHg12
24.65 s
gammaloop-nextest-spenso> Extracted 19 files to /build/nextest-archive-DWHg12 in 0.32s
24.68 s
gammaloop-nextest-spenso> ------------
24.68 s
gammaloop-nextest-spenso> Nextest run ID 8b268bb5-c4e3-4007-8248-41a8efd3c331 with nextest profile: ci_gammaloop
24.68 s
gammaloop-nextest-spenso> Starting 224 tests across 5 binaries (26 tests skipped , including 2 tests via profile.ci_gammaloop.default-filter )
24.84 s
gammaloop-nextest-spenso> FAIL [ 0.029s] ( 49/224) idenso color::test::form_reference :: metric_contraction_respects_antisymmetric_normalization
24.84 s
gammaloop-nextest-spenso> stdout ---
24.84 s
gammaloop-nextest-spenso>
24.84 s
gammaloop-nextest-spenso> running 1 test
24.84 s
gammaloop-nextest-spenso> test color::test::form_reference::metric_contraction_respects_antisymmetric_normalization ... FAILED
24.84 s
gammaloop-nextest-spenso>
24.84 s
gammaloop-nextest-spenso> failures:
24.84 s
gammaloop-nextest-spenso>
24.84 s
gammaloop-nextest-spenso> failures:
24.84 s
gammaloop-nextest-spenso> color::test::form_reference::metric_contraction_respects_antisymmetric_normalization
24.84 s
gammaloop-nextest-spenso>
24.84 s
gammaloop-nextest-spenso> test result: FAILED. 0 passed; 1 failed; 0 ignored; 0 measured; 240 filtered out; finished in 0.01s
24.84 s
gammaloop-nextest-spenso>
24.84 s
gammaloop-nextest-spenso> stderr ---
24.84 s
gammaloop-nextest-spenso>
24.84 s
gammaloop-nextest-spenso> thread 'color::test::form_reference::metric_contraction_respects_antisymmetric_normalization' (340) panicked at crates/idenso/src/color/test/form_reference.rs:171:5:
24.84 s
gammaloop-nextest-spenso> assertion `left == right` failed
24.84 s
gammaloop-nextest-spenso> left: "-1*f(coad(8,standalone_metric_j),coad(8,standalone_metric_s),coad(8,standalone_metric_u))"
24.84 s
gammaloop-nextest-spenso> right: "f(coad(8,standalone_metric_j),coad(8,standalone_metric_s),coad(8,standalone_metric_u))"
24.84 s
gammaloop-nextest-spenso> stack backtrace:
24.84 s
gammaloop-nextest-spenso> 0: __rustc::rust_begin_unwind
24.84 s
gammaloop-nextest-spenso> 1: core::panicking::panic_fmt
24.84 s
gammaloop-nextest-spenso> 2: core::panicking::assert_failed_inner
24.84 s
gammaloop-nextest-spenso> 3: core::panicking::assert_failed::<alloc::string::String, alloc::string::String>
24.84 s
gammaloop-nextest-spenso> 4: idenso::color::test::form_reference::metric_contraction_respects_antisymmetric_normalization
24.84 s
gammaloop-nextest-spenso> 5: <idenso::color::test::form_reference::metric_contraction_respects_antisymmetric_normalization::{closure#0} as core::ops::function::FnOnce<()>>::call_once
24.84 s
gammaloop-nextest-spenso> note: Some details are omitted, run with `RUST_BACKTRACE=full` for a verbose backtrace.
24.84 s
gammaloop-nextest-spenso>
25.29 s
gammaloop-nextest-spenso> FAIL [ 0.084s] (218/224) idenso tensor::tests::parsing :: infinite_execution
25.29 s
gammaloop-nextest-spenso> stdout ---
25.29 s
gammaloop-nextest-spenso>
25.29 s
gammaloop-nextest-spenso> running 1 test
25.29 s
gammaloop-nextest-spenso> ━━━━━━━━━━━━━━━━━━━━━━━━━━━━━━━ Snapshot Summary ━━━━━━━━━━━━━━━━━━━━━━━━━━━━━━━
25.29 s
gammaloop-nextest-spenso> Snapshot: infinite_execution
25.29 s
gammaloop-nextest-spenso> Source: crates/idenso/src/tensor/tests/parsing.rs:910
25.29 s
gammaloop-nextest-spenso> ────────────────────────────────────────────────────────────────────────────────
25.29 s
gammaloop-nextest-spenso> Expression: net_iter.snapshot_dot()
25.29 s
gammaloop-nextest-spenso> ────────────────────────────────────────────────────────────────────────────────
25.29 s
gammaloop-nextest-spenso> -old snapshot
25.29 s
gammaloop-nextest-spenso> +new results
25.29 s
gammaloop-nextest-spenso> ────────────┬───────────────────────────────────────────────────────────────────
25.29 s
gammaloop-nextest-spenso> 8 8 │ 0:0:s -> ext0 [id=0 color="red"];
25.29 s
gammaloop-nextest-spenso> 9 9 │ ext1 [style=invis];
25.29 s
gammaloop-nextest-spenso> 10 10 │ 0:5:s -> ext1 [id=1 dir=none color="red" label="mink4|l_0"];
25.29 s
gammaloop-nextest-spenso> 11 11 │ ext2 [style=invis];
25.29 s
gammaloop-nextest-spenso> 12 │- 0:4:s -> ext2 [id=2 dir=none color="red" label="bis4|l_2"];
25.29 s
gammaloop-nextest-spenso> 12 │+ 0:3:s -> ext2 [id=2 dir=none color="red" label="mink4|l_1"];
25.29 s
gammaloop-nextest-spenso> 13 13 │ ext3 [style=invis];
25.29 s
gammaloop-nextest-spenso> 14 │- 0:3:s -> ext3 [id=3 dir=none color="red" label="bis4|l_3"];
25.29 s
gammaloop-nextest-spenso> 14 │+ 0:1:s -> ext3 [id=3 dir=none color="red" label="bis4|l_2"];
25.29 s
gammaloop-nextest-spenso> 15 15 │ ext4 [style=invis];
25.29 s
gammaloop-nextest-spenso> 16 │- 0:1:s -> ext4 [id=4 dir=none color="red" label="mink4|l_1"];
25.29 s
gammaloop-nextest-spenso> 16 │+ 0:2:s -> ext4 [id=4 dir=none color="red" label="mink4|l_4"];
25.29 s
gammaloop-nextest-spenso> 17 17 │ ext5 [style=invis];
25.29 s
gammaloop-nextest-spenso> 18 │- 0:2:s -> ext5 [id=5 dir=none color="red" label="mink4|l_4"];
25.29 s
gammaloop-nextest-spenso> 18 │+ 0:4:s -> ext5 [id=5 dir=none color="red" label="bis4|l_3"];
25.29 s
gammaloop-nextest-spenso> 19 19 │ }
25.29 s
gammaloop-nextest-spenso> ────────────┴───────────────────────────────────────────────────────────────────
25.29 s
gammaloop-nextest-spenso> To update snapshots run `cargo insta review`
25.29 s
gammaloop-nextest-spenso> Stopped on the first failure. Run `cargo insta test` to run all snapshots.
25.29 s
gammaloop-nextest-spenso> test tensor::tests::parsing::infinite_execution ... FAILED
25.29 s
gammaloop-nextest-spenso>
25.29 s
gammaloop-nextest-spenso> failures:
25.29 s
gammaloop-nextest-spenso>
25.29 s
gammaloop-nextest-spenso> failures:
25.29 s
gammaloop-nextest-spenso> tensor::tests::parsing::infinite_execution
25.29 s
gammaloop-nextest-spenso>
25.29 s
gammaloop-nextest-spenso> test result: FAILED. 0 passed; 1 failed; 0 ignored; 0 measured; 240 filtered out; finished in 0.07s
25.29 s
gammaloop-nextest-spenso>
25.29 s
gammaloop-nextest-spenso> stderr ---
25.29 s
gammaloop-nextest-spenso>
25.29 s
gammaloop-nextest-spenso> thread 'tensor::tests::parsing::infinite_execution' (830) panicked at /nix/store/hvwd4qqiaadc4s871lfyylxrciqrvlgs-vendor-cargo-deps/c19b7c6f923b580ac259164a89f2577984ad5ab09ee9d583b888f934adbbe8d0/insta-1.47.2/src/runtime.rs:719:13:
25.29 s
gammaloop-nextest-spenso> snapshot assertion for 'infinite_execution' failed in line 910
25.29 s
gammaloop-nextest-spenso> stack backtrace:
25.29 s
gammaloop-nextest-spenso> 0: __rustc::rust_begin_unwind
25.29 s
gammaloop-nextest-spenso> 1: core::panicking::panic_fmt
25.29 s
gammaloop-nextest-spenso> 2: insta::runtime::assert_snapshot
25.29 s
gammaloop-nextest-spenso> 3: idenso::tensor::tests::parsing::infinite_execution
25.29 s
gammaloop-nextest-spenso> 4: <idenso::tensor::tests::parsing::infinite_execution::{closure#0} as core::ops::function::FnOnce<()>>::call_once
25.29 s
gammaloop-nextest-spenso> note: Some details are omitted, run with `RUST_BACKTRACE=full` for a verbose backtrace.
25.29 s
gammaloop-nextest-spenso>
27.73 s
gammaloop-nextest-spenso> ------------
27.73 s
gammaloop-nextest-spenso> Summary [ 3.058s] 224 tests run: 222 passed , 2 failed , 26 skipped
27.73 s
gammaloop-nextest-spenso> FAIL [ 0.029s] ( 49/224) idenso color::test::form_reference :: metric_contraction_respects_antisymmetric_normalization
27.73 s
gammaloop-nextest-spenso> stdout ---
27.73 s
gammaloop-nextest-spenso>
27.73 s
gammaloop-nextest-spenso> running 1 test
27.73 s
gammaloop-nextest-spenso> test color::test::form_reference::metric_contraction_respects_antisymmetric_normalization ... FAILED
27.73 s
gammaloop-nextest-spenso>
27.73 s
gammaloop-nextest-spenso> failures:
27.73 s
gammaloop-nextest-spenso>
27.73 s
gammaloop-nextest-spenso> failures:
27.73 s
gammaloop-nextest-spenso> color::test::form_reference::metric_contraction_respects_antisymmetric_normalization
27.73 s
gammaloop-nextest-spenso>
27.73 s
gammaloop-nextest-spenso> test result: FAILED. 0 passed; 1 failed; 0 ignored; 0 measured; 240 filtered out; finished in 0.01s
27.73 s
gammaloop-nextest-spenso>
27.73 s
gammaloop-nextest-spenso> stderr ---
27.73 s
gammaloop-nextest-spenso>
27.73 s
gammaloop-nextest-spenso> thread 'color::test::form_reference::metric_contraction_respects_antisymmetric_normalization' (340) panicked at crates/idenso/src/color/test/form_reference.rs:171:5:
27.73 s
gammaloop-nextest-spenso> assertion `left == right` failed
27.73 s
gammaloop-nextest-spenso> left: "-1*f(coad(8,standalone_metric_j),coad(8,standalone_metric_s),coad(8,standalone_metric_u))"
27.73 s
gammaloop-nextest-spenso> right: "f(coad(8,standalone_metric_j),coad(8,standalone_metric_s),coad(8,standalone_metric_u))"
27.73 s
gammaloop-nextest-spenso> stack backtrace:
27.73 s
gammaloop-nextest-spenso> 0: __rustc::rust_begin_unwind
27.73 s
gammaloop-nextest-spenso> 1: core::panicking::panic_fmt
27.73 s
gammaloop-nextest-spenso> 2: core::panicking::assert_failed_inner
27.73 s
gammaloop-nextest-spenso> 3: core::panicking::assert_failed::<alloc::string::String, alloc::string::String>
27.73 s
gammaloop-nextest-spenso> 4: idenso::color::test::form_reference::metric_contraction_respects_antisymmetric_normalization
27.73 s
gammaloop-nextest-spenso> 5: <idenso::color::test::form_reference::metric_contraction_respects_antisymmetric_normalization::{closure#0} as core::ops::function::FnOnce<()>>::call_once
27.73 s
gammaloop-nextest-spenso> note: Some details are omitted, run with `RUST_BACKTRACE=full` for a verbose backtrace.
27.73 s
gammaloop-nextest-spenso>
27.73 s
gammaloop-nextest-spenso> FAIL [ 0.084s] (218/224) idenso tensor::tests::parsing :: infinite_execution
27.73 s
gammaloop-nextest-spenso> stdout ---
27.73 s
gammaloop-nextest-spenso>
27.73 s
gammaloop-nextest-spenso> running 1 test
27.73 s
gammaloop-nextest-spenso> ━━━━━━━━━━━━━━━━━━━━━━━━━━━━━━━ Snapshot Summary ━━━━━━━━━━━━━━━━━━━━━━━━━━━━━━━
27.73 s
gammaloop-nextest-spenso> Snapshot: infinite_execution
27.73 s
gammaloop-nextest-spenso> Source: crates/idenso/src/tensor/tests/parsing.rs:910
27.73 s
gammaloop-nextest-spenso> ────────────────────────────────────────────────────────────────────────────────
27.73 s
gammaloop-nextest-spenso> Expression: net_iter.snapshot_dot()
27.73 s
gammaloop-nextest-spenso> ────────────────────────────────────────────────────────────────────────────────
27.74 s
gammaloop-nextest-spenso> -old snapshot
27.74 s
gammaloop-nextest-spenso> +new results
27.74 s
gammaloop-nextest-spenso> ────────────┬───────────────────────────────────────────────────────────────────
27.74 s
gammaloop-nextest-spenso> 8 8 │ 0:0:s -> ext0 [id=0 color="red"];
27.74 s
gammaloop-nextest-spenso> 9 9 │ ext1 [style=invis];
27.74 s
gammaloop-nextest-spenso> 10 10 │ 0:5:s -> ext1 [id=1 dir=none color="red" label="mink4|l_0"];
27.74 s
gammaloop-nextest-spenso> 11 11 │ ext2 [style=invis];
27.74 s
gammaloop-nextest-spenso> 12 │- 0:4:s -> ext2 [id=2 dir=none color="red" label="bis4|l_2"];
27.74 s
gammaloop-nextest-spenso> 12 │+ 0:3:s -> ext2 [id=2 dir=none color="red" label="mink4|l_1"];
27.74 s
gammaloop-nextest-spenso> 13 13 │ ext3 [style=invis];
27.74 s
gammaloop-nextest-spenso> 14 │- 0:3:s -> ext3 [id=3 dir=none color="red" label="bis4|l_3"];
27.74 s
gammaloop-nextest-spenso> 14 │+ 0:1:s -> ext3 [id=3 dir=none color="red" label="bis4|l_2"];
27.74 s
gammaloop-nextest-spenso> 15 15 │ ext4 [style=invis];
27.74 s
gammaloop-nextest-spenso> 16 │- 0:1:s -> ext4 [id=4 dir=none color="red" label="mink4|l_1"];
27.74 s
gammaloop-nextest-spenso> 16 │+ 0:2:s -> ext4 [id=4 dir=none color="red" label="mink4|l_4"];
27.74 s
gammaloop-nextest-spenso> 17 17 │ ext5 [style=invis];
27.74 s
gammaloop-nextest-spenso> 18 │- 0:2:s -> ext5 [id=5 dir=none color="red" label="mink4|l_4"];
27.74 s
gammaloop-nextest-spenso> 18 │+ 0:4:s -> ext5 [id=5 dir=none color="red" label="bis4|l_3"];
27.74 s
gammaloop-nextest-spenso> 19 19 │ }
27.74 s
gammaloop-nextest-spenso> ────────────┴───────────────────────────────────────────────────────────────────
27.74 s
gammaloop-nextest-spenso> To update snapshots run `cargo insta review`
27.74 s
gammaloop-nextest-spenso> Stopped on the first failure. Run `cargo insta test` to run all snapshots.
27.74 s
gammaloop-nextest-spenso> test tensor::tests::parsing::infinite_execution ... FAILED
27.74 s
gammaloop-nextest-spenso>
27.74 s
gammaloop-nextest-spenso> failures:
27.74 s
gammaloop-nextest-spenso>
27.74 s
gammaloop-nextest-spenso> failures:
27.74 s
gammaloop-nextest-spenso> tensor::tests::parsing::infinite_execution
27.74 s
gammaloop-nextest-spenso>
27.74 s
gammaloop-nextest-spenso> test result: FAILED. 0 passed; 1 failed; 0 ignored; 0 measured; 240 filtered out; finished in 0.07s
27.74 s
gammaloop-nextest-spenso>
27.74 s
gammaloop-nextest-spenso> stderr ---
27.74 s
gammaloop-nextest-spenso>
27.74 s
gammaloop-nextest-spenso> thread 'tensor::tests::parsing::infinite_execution' (830) panicked at /nix/store/hvwd4qqiaadc4s871lfyylxrciqrvlgs-vendor-cargo-deps/c19b7c6f923b580ac259164a89f2577984ad5ab09ee9d583b888f934adbbe8d0/insta-1.47.2/src/runtime.rs:719:13:
27.74 s
gammaloop-nextest-spenso> snapshot assertion for 'infinite_execution' failed in line 910
27.74 s
gammaloop-nextest-spenso> stack backtrace:
27.74 s
gammaloop-nextest-spenso> 0: __rustc::rust_begin_unwind
27.74 s
gammaloop-nextest-spenso> 1: core::panicking::panic_fmt
27.74 s
gammaloop-nextest-spenso> 2: insta::runtime::assert_snapshot
27.74 s
gammaloop-nextest-spenso> 3: idenso::tensor::tests::parsing::infinite_execution
27.74 s
gammaloop-nextest-spenso> 4: <idenso::tensor::tests::parsing::infinite_execution::{closure#0} as core::ops::function::FnOnce<()>>::call_once
27.74 s
gammaloop-nextest-spenso> note: Some details are omitted, run with `RUST_BACKTRACE=full` for a verbose backtrace.
27.74 s
gammaloop-nextest-spenso>
27.79 s
gammaloop-nextest-spenso> error : test run failed
27.84 s
gammaloop-nextest-spenso>
27.84 s
gammaloop-nextest-spenso> ========== nextest test summary ==========
27.84 s
gammaloop-nextest-spenso> report: target/nextest/ci_gammaloop/junit.xml
27.84 s
gammaloop-nextest-spenso> tests: 224, failures: 2, errors: 0
27.84 s
gammaloop-nextest-spenso>
27.84 s
gammaloop-nextest-spenso> 1. idenso::color::test::form_reference::metric_contraction_respects_antisymmetric_normalization
27.84 s
gammaloop-nextest-spenso> failure: test failure with exit code 101
27.84 s
gammaloop-nextest-spenso> thread 'color::test::form_reference::metric_contraction_respects_antisymmetric_normalization' (340) panicked at crates/idenso/src/color/test/form_reference.rs:171:5:
27.84 s
gammaloop-nextest-spenso> assertion `left == right` failed
27.84 s
gammaloop-nextest-spenso> left: "-1*f(coad(8,standalone_metric_j),coad(8,standalone_metric_s),coad(8,standalone_metric_u))"
27.84 s
gammaloop-nextest-spenso> right: "f(coad(8,standalone_metric_j),coad(8,standalone_metric_s),coad(8,standalone_metric_u))"
27.84 s
gammaloop-nextest-spenso> stack backtrace:
27.84 s
gammaloop-nextest-spenso> 0: __rustc::rust_begin_unwind
27.84 s
gammaloop-nextest-spenso> 1: core::panicking::panic_fmt
27.84 s
gammaloop-nextest-spenso> 2: core::panicking::assert_failed_inner
27.84 s
gammaloop-nextest-spenso> 3: core::panicking::assert_failed::<alloc::string::String, alloc::string::String>
27.84 s
gammaloop-nextest-spenso> 4: idenso::color::test::form_reference::metric_contraction_respects_antisymmetric_normalization
27.84 s
gammaloop-nextest-spenso> 5: <idenso::color::test::form_reference::metric_contraction_respects_antisymmetric_normalization::{closure#0} as core::ops::function::FnOnce<()>>::call_once
27.84 s
gammaloop-nextest-spenso> note: Some details are omitted, run with `RUST_BACKTRACE=full` for a verbose backtrace.
27.84 s
gammaloop-nextest-spenso> system-out
27.84 s
gammaloop-nextest-spenso> running 1 test
27.84 s
gammaloop-nextest-spenso> test color::test::form_reference::metric_contraction_respects_antisymmetric_normalization ... FAILED
27.84 s
gammaloop-nextest-spenso>
27.84 s
gammaloop-nextest-spenso> failures:
27.84 s
gammaloop-nextest-spenso>
27.84 s
gammaloop-nextest-spenso> failures:
27.84 s
gammaloop-nextest-spenso> color::test::form_reference::metric_contraction_respects_antisymmetric_normalization
27.84 s
gammaloop-nextest-spenso>
27.84 s
gammaloop-nextest-spenso> test result: FAILED. 0 passed; 1 failed; 0 ignored; 0 measured; 240 filtered out; finished in 0.01s
27.84 s
gammaloop-nextest-spenso> system-err
27.84 s
gammaloop-nextest-spenso> thread 'color::test::form_reference::metric_contraction_respects_antisymmetric_normalization' (340) panicked at crates/idenso/src/color/test/form_reference.rs:171:5:
27.84 s
gammaloop-nextest-spenso> assertion `left == right` failed
27.84 s
gammaloop-nextest-spenso> left: "-1*f(coad(8,standalone_metric_j),coad(8,standalone_metric_s),coad(8,standalone_metric_u))"
27.84 s
gammaloop-nextest-spenso> right: "f(coad(8,standalone_metric_j),coad(8,standalone_metric_s),coad(8,standalone_metric_u))"
27.84 s
gammaloop-nextest-spenso> stack backtrace:
27.84 s
gammaloop-nextest-spenso> 0: __rustc::rust_begin_unwind
27.84 s
gammaloop-nextest-spenso> 1: core::panicking::panic_fmt
27.84 s
gammaloop-nextest-spenso> 2: core::panicking::assert_failed_inner
27.84 s
gammaloop-nextest-spenso> 3: core::panicking::assert_failed::<alloc::string::String, alloc::string::String>
27.84 s
gammaloop-nextest-spenso> 4: idenso::color::test::form_reference::metric_contraction_respects_antisymmetric_normalization
27.84 s
gammaloop-nextest-spenso> 5: <idenso::color::test::form_reference::metric_contraction_respects_antisymmetric_normalization::{closure#0} as core::ops::function::FnOnce<()>>::call_once
27.84 s
gammaloop-nextest-spenso> note: Some details are omitted, run with `RUST_BACKTRACE=full` for a verbose backtrace.
27.84 s
gammaloop-nextest-spenso>
27.84 s
gammaloop-nextest-spenso> 2. idenso::tensor::tests::parsing::infinite_execution
27.84 s
gammaloop-nextest-spenso> failure: test failure with exit code 101
27.84 s
gammaloop-nextest-spenso> thread 'tensor::tests::parsing::infinite_execution' (830) panicked at /nix/store/hvwd4qqiaadc4s871lfyylxrciqrvlgs-vendor-cargo-deps/c19b7c6f923b580ac259164a89f2577984ad5ab09ee9d583b888f934adbbe8d0/insta-1.47.2/src/runtime.rs:719:13:
27.84 s
gammaloop-nextest-spenso> snapshot assertion for 'infinite_execution' failed in line 910
27.84 s
gammaloop-nextest-spenso> stack backtrace:
27.84 s
gammaloop-nextest-spenso> 0: __rustc::rust_begin_unwind
27.84 s
gammaloop-nextest-spenso> 1: core::panicking::panic_fmt
27.84 s
gammaloop-nextest-spenso> 2: insta::runtime::assert_snapshot
27.84 s
gammaloop-nextest-spenso> 3: idenso::tensor::tests::parsing::infinite_execution
27.84 s
gammaloop-nextest-spenso> 4: <idenso::tensor::tests::parsing::infinite_execution::{closure#0} as core::ops::function::FnOnce<()>>::call_once
27.84 s
gammaloop-nextest-spenso> note: Some details are omitted, run with `RUST_BACKTRACE=full` for a verbose backtrace.
27.84 s
gammaloop-nextest-spenso> system-out
27.84 s
gammaloop-nextest-spenso> running 1 test
27.84 s
gammaloop-nextest-spenso> ━━━━━━━━━━━━━━━━━━━━━━━━━━━━━━━ Snapshot Summary ━━━━━━━━━━━━━━━━━━━━━━━━━━━━━━━
27.84 s
gammaloop-nextest-spenso> Snapshot: infinite_execution
27.84 s
gammaloop-nextest-spenso> Source: crates/idenso/src/tensor/tests/parsing.rs:910
27.84 s
gammaloop-nextest-spenso> ────────────────────────────────────────────────────────────────────────────────
27.84 s
gammaloop-nextest-spenso> Expression: net_iter.snapshot_dot()
27.84 s
gammaloop-nextest-spenso> ────────────────────────────────────────────────────────────────────────────────
27.84 s
gammaloop-nextest-spenso> -old snapshot
27.84 s
gammaloop-nextest-spenso> +new results
27.84 s
gammaloop-nextest-spenso> ────────────┬───────────────────────────────────────────────────────────────────
27.84 s
gammaloop-nextest-spenso> 8 8 │ 0:0:s-> ext0 [id=0 color="red"];
27.84 s
gammaloop-nextest-spenso> 9 9 │ ext1 [style=invis];
27.84 s
gammaloop-nextest-spenso> 10 10 │ 0:5:s-> ext1 [id=1 dir=none color="red" label="mink4|l_0"];
27.84 s
gammaloop-nextest-spenso> 11 11 │ ext2 [style=invis];
27.84 s
gammaloop-nextest-spenso> 12 │- 0:4:s-> ext2 [id=2 dir=none color="red" label="bis4|l_2"];
27.84 s
gammaloop-nextest-spenso> 12 │+ 0:3:s-> ext2 [id=2 dir=none color="red" label="mink4|l_1"];
27.84 s
gammaloop-nextest-spenso> 13 13 │ ext3 [style=invis];
27.84 s
gammaloop-nextest-spenso> 14 │- 0:3:s-> ext3 [id=3 dir=none color="red" label="bis4|l_3"];
27.84 s
gammaloop-nextest-spenso> 14 │+ 0:1:s-> ext3 [id=3 dir=none color="red" label="bis4|l_2"];
27.84 s
gammaloop-nextest-spenso> 15 15 │ ext4 [style=invis];
27.84 s
gammaloop-nextest-spenso> 16 │- 0:1:s-> ext4 [id=4 dir=none color="red" label="mink4|l_1"];
27.84 s
gammaloop-nextest-spenso> 16 │+ 0:2:s-> ext4 [id=4 dir=none color="red" label="mink4|l_4"];
27.84 s
gammaloop-nextest-spenso> 17 17 │ ext5 [style=invis];
27.84 s
gammaloop-nextest-spenso> 18 │- 0:2:s-> ext5 [id=5 dir=none color="red" label="mink4|l_4"];
27.84 s
gammaloop-nextest-spenso> 18 │+ 0:4:s-> ext5 [id=5 dir=none color="red" label="bis4|l_3"];
27.84 s
gammaloop-nextest-spenso> 19 19 │ }
27.84 s
gammaloop-nextest-spenso> ────────────┴───────────────────────────────────────────────────────────────────
27.84 s
gammaloop-nextest-spenso> To update snapshots run `cargo insta review`
27.84 s
gammaloop-nextest-spenso> Stopped on the first failure. Run `cargo insta test` to run all snapshots.
27.84 s
gammaloop-nextest-spenso> test tensor::tests::parsing::infinite_execution ... FAILED
27.84 s
gammaloop-nextest-spenso>
27.84 s
gammaloop-nextest-spenso> failures:
27.84 s
gammaloop-nextest-spenso>
27.84 s
gammaloop-nextest-spenso> failures:
27.84 s
gammaloop-nextest-spenso> tensor::tests::parsing::infinite_execution
27.84 s
gammaloop-nextest-spenso>
27.84 s
gammaloop-nextest-spenso> test result: FAILED. 0 passed; 1 failed; 0 ignored; 0 measured; 240 filtered out; finished in 0.07s
27.84 s
gammaloop-nextest-spenso> system-err
27.84 s
gammaloop-nextest-spenso> thread 'tensor::tests::parsing::infinite_execution' (830) panicked at /nix/store/hvwd4qqiaadc4s871lfyylxrciqrvlgs-vendor-cargo-deps/c19b7c6f923b580ac259164a89f2577984ad5ab09ee9d583b888f934adbbe8d0/insta-1.47.2/src/runtime.rs:719:13:
27.84 s
gammaloop-nextest-spenso> snapshot assertion for 'infinite_execution' failed in line 910
27.84 s
gammaloop-nextest-spenso> stack backtrace:
27.84 s
gammaloop-nextest-spenso> 0: __rustc::rust_begin_unwind
27.84 s
gammaloop-nextest-spenso> 1: core::panicking::panic_fmt
27.84 s
gammaloop-nextest-spenso> 2: insta::runtime::assert_snapshot
27.84 s
gammaloop-nextest-spenso> 3: idenso::tensor::tests::parsing::infinite_execution
27.84 s
gammaloop-nextest-spenso> 4: <idenso::tensor::tests::parsing::infinite_execution::{closure#0} as core::ops::function::FnOnce<()>>::call_once
27.84 s
gammaloop-nextest-spenso> note: Some details are omitted, run with `RUST_BACKTRACE=full` for a verbose backtrace.
27.84 s
gammaloop-nextest-spenso> =========================================
27.87 s
gammaloop-nextest-spenso> Extracting 2 binaries and 1 linked path to /build/nextest-archive-tVKcRJ
28.02 s
gammaloop-nextest-spenso> Extracted 8 files to /build/nextest-archive-tVKcRJ in 0.15s
28.04 s
gammaloop-nextest-spenso> ------------
28.04 s
gammaloop-nextest-spenso> Nextest run ID 6cff0b4b-2c87-4f4b-9130-dab7a1e4d605 with nextest profile: ci_gammaloop
28.04 s
gammaloop-nextest-spenso> Starting 135 tests across 2 binaries
28.21 s
gammaloop-nextest-spenso> ------------
28.21 s
gammaloop-nextest-spenso> Summary [ 0.165s] 135 tests run: 135 passed , 0 skipped
28.28 s
gammaloop-nextest-spenso>
28.28 s
gammaloop-nextest-spenso> ========== nextest test summary ==========
28.28 s
gammaloop-nextest-spenso> report: target/nextest/ci_gammaloop/junit.xml
28.28 s
gammaloop-nextest-spenso> tests: 135, failures: 0, errors: 0
28.28 s
gammaloop-nextest-spenso> No failing testcases found.
28.28 s
gammaloop-nextest-spenso> =========================================
28.31 s
gammaloop-nextest-spenso> Extracting 5 binaries and 2 linked paths to /build/nextest-archive-RFNjGD
28.66 s
gammaloop-nextest-spenso> Extracted 19 files to /build/nextest-archive-RFNjGD in 0.36s
28.68 s
gammaloop-nextest-spenso> ------------
28.68 s
gammaloop-nextest-spenso> Nextest run ID 6e8719c2-3558-4a9f-9ca1-e505a81a250c with nextest profile: ci_gammaloop
28.68 s
gammaloop-nextest-spenso> Starting 25 tests across 5 binaries (1 test skipped via profile.ci_gammaloop.default-filter )
29.05 s
gammaloop-nextest-spenso> ------------
29.05 s
gammaloop-nextest-spenso> Summary [ 0.368s] 25 tests run: 25 passed , 1 skipped
29.16 s
gammaloop-nextest-spenso>
29.16 s
gammaloop-nextest-spenso> ========== nextest test summary ==========
29.16 s
gammaloop-nextest-spenso> report: target/nextest/ci_gammaloop/junit.xml
29.16 s
gammaloop-nextest-spenso> tests: 25, failures: 0, errors: 0
29.16 s
gammaloop-nextest-spenso> No failing testcases found.
29.16 s
gammaloop-nextest-spenso> =========================================
29.18 s
gammaloop-nextest-spenso> Extracting 2 binaries and 1 linked path to /build/nextest-archive-VsohMF
29.28 s
gammaloop-nextest-spenso> Extracted 8 files to /build/nextest-archive-VsohMF in 0.10s
29.30 s
gammaloop-nextest-spenso> ------------
29.30 s
gammaloop-nextest-spenso> Nextest run ID da5ab33b-0dd1-46d4-b7ec-b79e250b0075 with nextest profile: ci_gammaloop
29.30 s
gammaloop-nextest-spenso> Starting 1 test across 2 binaries
29.31 s
gammaloop-nextest-spenso> ------------
29.31 s
gammaloop-nextest-spenso> Summary [ 0.010s] 1 test run: 1 passed , 0 skipped
29.37 s
gammaloop-nextest-spenso>
29.37 s
gammaloop-nextest-spenso> ========== nextest test summary ==========
29.42 s
gammaloop-nextest-spenso> report: target/nextest/ci_gammaloop/junit.xml
29.42 s
gammaloop-nextest-spenso> tests: 1, failures: 0, errors: 0
29.42 s
gammaloop-nextest-spenso> No failing testcases found.
29.42 s
gammaloop-nextest-spenso> =========================================
29.42 s
gammaloop-nextest-spenso> Extracting 1 binary and 1 linked path to /build/nextest-archive-LEaFpW
29.46 s
gammaloop-nextest-spenso> Extracted 7 files to /build/nextest-archive-LEaFpW in 0.07s
29.47 s
gammaloop-nextest-spenso> ------------
29.47 s
gammaloop-nextest-spenso> Nextest run ID 455891d9-46fe-4139-84b8-c0ab3248bf9d with nextest profile: ci_gammaloop
29.47 s
gammaloop-nextest-spenso> Starting 0 tests across 1 binary
29.47 s
gammaloop-nextest-spenso> ------------
29.47 s
gammaloop-nextest-spenso> Summary [ 0.000s] 0 tests run: 0 passed , 0 skipped
29.54 s
gammaloop-nextest-spenso>
29.54 s
gammaloop-nextest-spenso> ========== nextest test summary ==========
29.54 s
gammaloop-nextest-spenso> report: target/nextest/ci_gammaloop/junit.xml
29.54 s
gammaloop-nextest-spenso> tests: 0, failures: 0, errors: 0
29.54 s
gammaloop-nextest-spenso> No failing testcases found.
29.54 s
gammaloop-nextest-spenso> =========================================
29.60 s
error: Cannot build '/nix/store/f7dlapwy00q35hpz63fxwqijy6397ql2-gammaloop-nextest-spenso.drv '.
29.60 s
Reason: builder failed with exit code 100 .
29.60 s
Output paths:
29.60 s
/nix/store/n4ly992ql65w80b8anh5nb2sbxg5pdzw-gammaloop-nextest-spenso
29.60 s
Last 325 log lines:
29.60 s
> Extracting 5 binaries and 2 linked paths to /build/nextest-archive-DWHg12
29.60 s
> Extracted 19 files to /build/nextest-archive-DWHg12 in 0.32s
29.60 s
> ------------
29.60 s
> Nextest run ID 8b268bb5-c4e3-4007-8248-41a8efd3c331 with nextest profile: ci_gammaloop
29.60 s
> Starting 224 tests across 5 binaries (26 tests skipped , including 2 tests via profile.ci_gammaloop.default-filter )
29.60 s
> FAIL [ 0.029s] ( 49/224) idenso color::test::form_reference :: metric_contraction_respects_antisymmetric_normalization
29.60 s
> stdout ---
29.60 s
>
29.60 s
> running 1 test
29.60 s
> test color::test::form_reference::metric_contraction_respects_antisymmetric_normalization ... FAILED
29.60 s
>
29.60 s
> failures:
29.60 s
>
29.60 s
> failures:
29.60 s
> color::test::form_reference::metric_contraction_respects_antisymmetric_normalization
29.60 s
>
29.60 s
> test result: FAILED. 0 passed; 1 failed; 0 ignored; 0 measured; 240 filtered out; finished in 0.01s
29.60 s
>
29.60 s
> stderr ---
29.60 s
>
29.60 s
> thread 'color::test::form_reference::metric_contraction_respects_antisymmetric_normalization' (340) panicked at crates/idenso/src/color/test/form_reference.rs:171:5:
29.60 s
> assertion `left == right` failed
29.60 s
> left: "-1*f(coad(8,standalone_metric_j),coad(8,standalone_metric_s),coad(8,standalone_metric_u))"
29.60 s
> right: "f(coad(8,standalone_metric_j),coad(8,standalone_metric_s),coad(8,standalone_metric_u))"
29.60 s
> stack backtrace:
29.60 s
> 0: __rustc::rust_begin_unwind
29.60 s
> 1: core::panicking::panic_fmt
29.60 s
> 2: core::panicking::assert_failed_inner
29.60 s
> 3: core::panicking::assert_failed::<alloc::string::String, alloc::string::String>
29.60 s
> 4: idenso::color::test::form_reference::metric_contraction_respects_antisymmetric_normalization
29.60 s
> 5: <idenso::color::test::form_reference::metric_contraction_respects_antisymmetric_normalization::{closure#0} as core::ops::function::FnOnce<()>>::call_once
29.60 s
> note: Some details are omitted, run with `RUST_BACKTRACE=full` for a verbose backtrace.
29.60 s
>
29.60 s
> FAIL [ 0.084s] (218/224) idenso tensor::tests::parsing :: infinite_execution
29.60 s
> stdout ---
29.60 s
>
29.60 s
> running 1 test
29.60 s
> ━━━━━━━━━━━━━━━━━━━━━━━━━━━━━━━ Snapshot Summary ━━━━━━━━━━━━━━━━━━━━━━━━━━━━━━━
29.60 s
> Snapshot: infinite_execution
29.60 s
> Source: crates/idenso/src/tensor/tests/parsing.rs:910
29.60 s
> ────────────────────────────────────────────────────────────────────────────────
29.60 s
> Expression: net_iter.snapshot_dot()
29.60 s
> ────────────────────────────────────────────────────────────────────────────────
29.60 s
> -old snapshot
29.60 s
> +new results
29.60 s
> ────────────┬───────────────────────────────────────────────────────────────────
29.60 s
> 8 8 │ 0:0:s -> ext0 [id=0 color="red"];
29.60 s
> 9 9 │ ext1 [style=invis];
29.60 s
> 10 10 │ 0:5:s -> ext1 [id=1 dir=none color="red" label="mink4|l_0"];
29.60 s
> 11 11 │ ext2 [style=invis];
29.60 s
> 12 │- 0:4:s -> ext2 [id=2 dir=none color="red" label="bis4|l_2"];
29.60 s
> 12 │+ 0:3:s -> ext2 [id=2 dir=none color="red" label="mink4|l_1"];
29.60 s
> 13 13 │ ext3 [style=invis];
29.60 s
> 14 │- 0:3:s -> ext3 [id=3 dir=none color="red" label="bis4|l_3"];
29.60 s
> 14 │+ 0:1:s -> ext3 [id=3 dir=none color="red" label="bis4|l_2"];
29.60 s
> 15 15 │ ext4 [style=invis];
29.60 s
> 16 │- 0:1:s -> ext4 [id=4 dir=none color="red" label="mink4|l_1"];
29.60 s
> 16 │+ 0:2:s -> ext4 [id=4 dir=none color="red" label="mink4|l_4"];
29.60 s
> 17 17 │ ext5 [style=invis];
29.60 s
> 18 │- 0:2:s -> ext5 [id=5 dir=none color="red" label="mink4|l_4"];
29.60 s
> 18 │+ 0:4:s -> ext5 [id=5 dir=none color="red" label="bis4|l_3"];
29.60 s
> 19 19 │ }
29.60 s
> ────────────┴───────────────────────────────────────────────────────────────────
29.60 s
> To update snapshots run `cargo insta review`
29.60 s
> Stopped on the first failure. Run `cargo insta test` to run all snapshots.
29.60 s
> test tensor::tests::parsing::infinite_execution ... FAILED
29.60 s
>
29.60 s
> failures:
29.60 s
>
29.60 s
> failures:
29.60 s
> tensor::tests::parsing::infinite_execution
29.60 s
>
29.60 s
> test result: FAILED. 0 passed; 1 failed; 0 ignored; 0 measured; 240 filtered out; finished in 0.07s
29.60 s
>
29.60 s
> stderr ---
29.60 s
>
29.60 s
> thread 'tensor::tests::parsing::infinite_execution' (830) panicked at /nix/store/hvwd4qqiaadc4s871lfyylxrciqrvlgs-vendor-cargo-deps/c19b7c6f923b580ac259164a89f2577984ad5ab09ee9d583b888f934adbbe8d0/insta-1.47.2/src/runtime.rs:719:13:
29.60 s
> snapshot assertion for 'infinite_execution' failed in line 910
29.60 s
> stack backtrace:
29.60 s
> 0: __rustc::rust_begin_unwind
29.60 s
> 1: core::panicking::panic_fmt
29.60 s
> 2: insta::runtime::assert_snapshot
29.60 s
> 3: idenso::tensor::tests::parsing::infinite_execution
29.60 s
> 4: <idenso::tensor::tests::parsing::infinite_execution::{closure#0} as core::ops::function::FnOnce<()>>::call_once
29.60 s
> note: Some details are omitted, run with `RUST_BACKTRACE=full` for a verbose backtrace.
29.60 s
>
29.60 s
> ------------
29.60 s
> Summary [ 3.058s] 224 tests run: 222 passed , 2 failed , 26 skipped
29.60 s
> FAIL [ 0.029s] ( 49/224) idenso color::test::form_reference :: metric_contraction_respects_antisymmetric_normalization
29.60 s
> stdout ---
29.60 s
>
29.60 s
> running 1 test
29.60 s
> test color::test::form_reference::metric_contraction_respects_antisymmetric_normalization ... FAILED
29.60 s
>
29.60 s
> failures:
29.60 s
>
29.60 s
> failures:
29.60 s
> color::test::form_reference::metric_contraction_respects_antisymmetric_normalization
29.60 s
>
29.60 s
> test result: FAILED. 0 passed; 1 failed; 0 ignored; 0 measured; 240 filtered out; finished in 0.01s
29.60 s
>
29.60 s
> stderr ---
29.60 s
>
29.60 s
> thread 'color::test::form_reference::metric_contraction_respects_antisymmetric_normalization' (340) panicked at crates/idenso/src/color/test/form_reference.rs:171:5:
29.60 s
> assertion `left == right` failed
29.60 s
> left: "-1*f(coad(8,standalone_metric_j),coad(8,standalone_metric_s),coad(8,standalone_metric_u))"
29.60 s
> right: "f(coad(8,standalone_metric_j),coad(8,standalone_metric_s),coad(8,standalone_metric_u))"
29.60 s
> stack backtrace:
29.60 s
> 0: __rustc::rust_begin_unwind
29.60 s
> 1: core::panicking::panic_fmt
29.60 s
> 2: core::panicking::assert_failed_inner
29.60 s
> 3: core::panicking::assert_failed::<alloc::string::String, alloc::string::String>
29.60 s
> 4: idenso::color::test::form_reference::metric_contraction_respects_antisymmetric_normalization
29.60 s
> 5: <idenso::color::test::form_reference::metric_contraction_respects_antisymmetric_normalization::{closure#0} as core::ops::function::FnOnce<()>>::call_once
29.60 s
> note: Some details are omitted, run with `RUST_BACKTRACE=full` for a verbose backtrace.
29.60 s
>
29.60 s
> FAIL [ 0.084s] (218/224) idenso tensor::tests::parsing :: infinite_execution
29.60 s
> stdout ---
29.60 s
>
29.60 s
> running 1 test
29.60 s
> ━━━━━━━━━━━━━━━━━━━━━━━━━━━━━━━ Snapshot Summary ━━━━━━━━━━━━━━━━━━━━━━━━━━━━━━━
29.60 s
> Snapshot: infinite_execution
29.60 s
> Source: crates/idenso/src/tensor/tests/parsing.rs:910
29.60 s
> ────────────────────────────────────────────────────────────────────────────────
29.60 s
> Expression: net_iter.snapshot_dot()
29.60 s
> ────────────────────────────────────────────────────────────────────────────────
29.60 s
> -old snapshot
29.60 s
> +new results
29.60 s
> ────────────┬───────────────────────────────────────────────────────────────────
29.60 s
> 8 8 │ 0:0:s -> ext0 [id=0 color="red"];
29.60 s
> 9 9 │ ext1 [style=invis];
29.60 s
> 10 10 │ 0:5:s -> ext1 [id=1 dir=none color="red" label="mink4|l_0"];
29.60 s
> 11 11 │ ext2 [style=invis];
29.60 s
> 12 │- 0:4:s -> ext2 [id=2 dir=none color="red" label="bis4|l_2"];
29.60 s
> 12 │+ 0:3:s -> ext2 [id=2 dir=none color="red" label="mink4|l_1"];
29.60 s
> 13 13 │ ext3 [style=invis];
29.60 s
> 14 │- 0:3:s -> ext3 [id=3 dir=none color="red" label="bis4|l_3"];
29.60 s
> 14 │+ 0:1:s -> ext3 [id=3 dir=none color="red" label="bis4|l_2"];
29.60 s
> 15 15 │ ext4 [style=invis];
29.60 s
> 16 │- 0:1:s -> ext4 [id=4 dir=none color="red" label="mink4|l_1"];
29.60 s
> 16 │+ 0:2:s -> ext4 [id=4 dir=none color="red" label="mink4|l_4"];
29.60 s
> 17 17 │ ext5 [style=invis];
29.60 s
> 18 │- 0:2:s -> ext5 [id=5 dir=none color="red" label="mink4|l_4"];
29.60 s
> 18 │+ 0:4:s -> ext5 [id=5 dir=none color="red" label="bis4|l_3"];
29.60 s
> 19 19 │ }
29.60 s
> ────────────┴───────────────────────────────────────────────────────────────────
29.60 s
> To update snapshots run `cargo insta review`
29.60 s
> Stopped on the first failure. Run `cargo insta test` to run all snapshots.
29.60 s
> test tensor::tests::parsing::infinite_execution ... FAILED
29.60 s
>
29.60 s
> failures:
29.60 s
>
29.60 s
> failures:
29.60 s
> tensor::tests::parsing::infinite_execution
29.60 s
>
29.60 s
> test result: FAILED. 0 passed; 1 failed; 0 ignored; 0 measured; 240 filtered out; finished in 0.07s
29.60 s
>
29.60 s
> stderr ---
29.60 s
>
29.60 s
> thread 'tensor::tests::parsing::infinite_execution' (830) panicked at /nix/store/hvwd4qqiaadc4s871lfyylxrciqrvlgs-vendor-cargo-deps/c19b7c6f923b580ac259164a89f2577984ad5ab09ee9d583b888f934adbbe8d0/insta-1.47.2/src/runtime.rs:719:13:
29.60 s
> snapshot assertion for 'infinite_execution' failed in line 910
29.60 s
> stack backtrace:
29.60 s
> 0: __rustc::rust_begin_unwind
29.60 s
> 1: core::panicking::panic_fmt
29.60 s
> 2: insta::runtime::assert_snapshot
29.60 s
> 3: idenso::tensor::tests::parsing::infinite_execution
29.60 s
> 4: <idenso::tensor::tests::parsing::infinite_execution::{closure#0} as core::ops::function::FnOnce<()>>::call_once
29.60 s
> note: Some details are omitted, run with `RUST_BACKTRACE=full` for a verbose backtrace.
29.60 s
>
29.60 s
> error : test run failed
29.60 s
>
29.60 s
> ========== nextest test summary ==========
29.60 s
> report: target/nextest/ci_gammaloop/junit.xml
29.60 s
> tests: 224, failures: 2, errors: 0
29.60 s
>
29.60 s
> 1. idenso::color::test::form_reference::metric_contraction_respects_antisymmetric_normalization
29.60 s
> failure: test failure with exit code 101
29.60 s
> thread 'color::test::form_reference::metric_contraction_respects_antisymmetric_normalization' (340) panicked at crates/idenso/src/color/test/form_reference.rs:171:5:
29.60 s
> assertion `left == right` failed
29.60 s
> left: "-1*f(coad(8,standalone_metric_j),coad(8,standalone_metric_s),coad(8,standalone_metric_u))"
29.60 s
> right: "f(coad(8,standalone_metric_j),coad(8,standalone_metric_s),coad(8,standalone_metric_u))"
29.60 s
> stack backtrace:
29.60 s
> 0: __rustc::rust_begin_unwind
29.60 s
> 1: core::panicking::panic_fmt
29.60 s
> 2: core::panicking::assert_failed_inner
29.60 s
> 3: core::panicking::assert_failed::<alloc::string::String, alloc::string::String>
29.60 s
> 4: idenso::color::test::form_reference::metric_contraction_respects_antisymmetric_normalization
29.60 s
> 5: <idenso::color::test::form_reference::metric_contraction_respects_antisymmetric_normalization::{closure#0} as core::ops::function::FnOnce<()>>::call_once
29.60 s
> note: Some details are omitted, run with `RUST_BACKTRACE=full` for a verbose backtrace.
29.60 s
> system-out
29.60 s
> running 1 test
29.60 s
> test color::test::form_reference::metric_contraction_respects_antisymmetric_normalization ... FAILED
29.60 s
>
29.60 s
> failures:
29.60 s
>
29.60 s
> failures:
29.60 s
> color::test::form_reference::metric_contraction_respects_antisymmetric_normalization
29.60 s
>
29.60 s
> test result: FAILED. 0 passed; 1 failed; 0 ignored; 0 measured; 240 filtered out; finished in 0.01s
29.60 s
> system-err
29.60 s
> thread 'color::test::form_reference::metric_contraction_respects_antisymmetric_normalization' (340) panicked at crates/idenso/src/color/test/form_reference.rs:171:5:
29.60 s
> assertion `left == right` failed
29.60 s
> left: "-1*f(coad(8,standalone_metric_j),coad(8,standalone_metric_s),coad(8,standalone_metric_u))"
29.60 s
> right: "f(coad(8,standalone_metric_j),coad(8,standalone_metric_s),coad(8,standalone_metric_u))"
29.60 s
> stack backtrace:
29.60 s
> 0: __rustc::rust_begin_unwind
29.60 s
> 1: core::panicking::panic_fmt
29.60 s
> 2: core::panicking::assert_failed_inner
29.60 s
> 3: core::panicking::assert_failed::<alloc::string::String, alloc::string::String>
29.60 s
> 4: idenso::color::test::form_reference::metric_contraction_respects_antisymmetric_normalization
29.60 s
> 5: <idenso::color::test::form_reference::metric_contraction_respects_antisymmetric_normalization::{closure#0} as core::ops::function::FnOnce<()>>::call_once
29.60 s
> note: Some details are omitted, run with `RUST_BACKTRACE=full` for a verbose backtrace.
29.60 s
>
29.60 s
> 2. idenso::tensor::tests::parsing::infinite_execution
29.60 s
> failure: test failure with exit code 101
29.60 s
> thread 'tensor::tests::parsing::infinite_execution' (830) panicked at /nix/store/hvwd4qqiaadc4s871lfyylxrciqrvlgs-vendor-cargo-deps/c19b7c6f923b580ac259164a89f2577984ad5ab09ee9d583b888f934adbbe8d0/insta-1.47.2/src/runtime.rs:719:13:
29.60 s
> snapshot assertion for 'infinite_execution' failed in line 910
29.60 s
> stack backtrace:
29.60 s
> 0: __rustc::rust_begin_unwind
29.60 s
> 1: core::panicking::panic_fmt
29.60 s
> 2: insta::runtime::assert_snapshot
29.60 s
> 3: idenso::tensor::tests::parsing::infinite_execution
29.60 s
> 4: <idenso::tensor::tests::parsing::infinite_execution::{closure#0} as core::ops::function::FnOnce<()>>::call_once
29.60 s
> note: Some details are omitted, run with `RUST_BACKTRACE=full` for a verbose backtrace.
29.60 s
> system-out
29.60 s
> running 1 test
29.60 s
> ━━━━━━━━━━━━━━━━━━━━━━━━━━━━━━━ Snapshot Summary ━━━━━━━━━━━━━━━━━━━━━━━━━━━━━━━
29.60 s
> Snapshot: infinite_execution
29.60 s
> Source: crates/idenso/src/tensor/tests/parsing.rs:910
29.60 s
> ────────────────────────────────────────────────────────────────────────────────
29.60 s
> Expression: net_iter.snapshot_dot()
29.60 s
> ────────────────────────────────────────────────────────────────────────────────
29.60 s
> -old snapshot
29.60 s
> +new results
29.60 s
> ────────────┬───────────────────────────────────────────────────────────────────
29.60 s
> 8 8 │ 0:0:s-> ext0 [id=0 color="red"];
29.60 s
> 9 9 │ ext1 [style=invis];
29.60 s
> 10 10 │ 0:5:s-> ext1 [id=1 dir=none color="red" label="mink4|l_0"];
29.60 s
> 11 11 │ ext2 [style=invis];
29.60 s
> 12 │- 0:4:s-> ext2 [id=2 dir=none color="red" label="bis4|l_2"];
29.60 s
> 12 │+ 0:3:s-> ext2 [id=2 dir=none color="red" label="mink4|l_1"];
29.60 s
> 13 13 │ ext3 [style=invis];
29.60 s
> 14 │- 0:3:s-> ext3 [id=3 dir=none color="red" label="bis4|l_3"];
29.60 s
> 14 │+ 0:1:s-> ext3 [id=3 dir=none color="red" label="bis4|l_2"];
29.60 s
> 15 15 │ ext4 [style=invis];
29.60 s
> 16 │- 0:1:s-> ext4 [id=4 dir=none color="red" label="mink4|l_1"];
29.60 s
> 16 │+ 0:2:s-> ext4 [id=4 dir=none color="red" label="mink4|l_4"];
29.60 s
> 17 17 │ ext5 [style=invis];
29.60 s
> 18 │- 0:2:s-> ext5 [id=5 dir=none color="red" label="mink4|l_4"];
29.60 s
> 18 │+ 0:4:s-> ext5 [id=5 dir=none color="red" label="bis4|l_3"];
29.60 s
> 19 19 │ }
29.60 s
> ────────────┴───────────────────────────────────────────────────────────────────
29.60 s
> To update snapshots run `cargo insta review`
29.60 s
> Stopped on the first failure. Run `cargo insta test` to run all snapshots.
29.60 s
> test tensor::tests::parsing::infinite_execution ... FAILED
29.60 s
>
29.60 s
> failures:
29.60 s
>
29.60 s
> failures:
29.60 s
> tensor::tests::parsing::infinite_execution
29.60 s
>
29.60 s
> test result: FAILED. 0 passed; 1 failed; 0 ignored; 0 measured; 240 filtered out; finished in 0.07s
29.60 s
> system-err
29.60 s
> thread 'tensor::tests::parsing::infinite_execution' (830) panicked at /nix/store/hvwd4qqiaadc4s871lfyylxrciqrvlgs-vendor-cargo-deps/c19b7c6f923b580ac259164a89f2577984ad5ab09ee9d583b888f934adbbe8d0/insta-1.47.2/src/runtime.rs:719:13:
29.60 s
> snapshot assertion for 'infinite_execution' failed in line 910
29.60 s
> stack backtrace:
29.60 s
> 0: __rustc::rust_begin_unwind
29.60 s
> 1: core::panicking::panic_fmt
29.60 s
> 2: insta::runtime::assert_snapshot
29.60 s
> 3: idenso::tensor::tests::parsing::infinite_execution
29.60 s
> 4: <idenso::tensor::tests::parsing::infinite_execution::{closure#0} as core::ops::function::FnOnce<()>>::call_once
29.60 s
> note: Some details are omitted, run with `RUST_BACKTRACE=full` for a verbose backtrace.
29.60 s
> =========================================
29.60 s
> Extracting 2 binaries and 1 linked path to /build/nextest-archive-tVKcRJ
29.60 s
> Extracted 8 files to /build/nextest-archive-tVKcRJ in 0.15s
29.60 s
> ------------
29.60 s
> Nextest run ID 6cff0b4b-2c87-4f4b-9130-dab7a1e4d605 with nextest profile: ci_gammaloop
29.60 s
> Starting 135 tests across 2 binaries
29.60 s
> ------------
29.60 s
> Summary [ 0.165s] 135 tests run: 135 passed , 0 skipped
29.60 s
>
29.60 s
> ========== nextest test summary ==========
29.60 s
> report: target/nextest/ci_gammaloop/junit.xml
29.60 s
> tests: 135, failures: 0, errors: 0
29.60 s
> No failing testcases found.
29.60 s
> =========================================
29.60 s
> Extracting 5 binaries and 2 linked paths to /build/nextest-archive-RFNjGD
29.60 s
> Extracted 19 files to /build/nextest-archive-RFNjGD in 0.36s
29.60 s
> ------------
29.60 s
> Nextest run ID 6e8719c2-3558-4a9f-9ca1-e505a81a250c with nextest profile: ci_gammaloop
29.60 s
> Starting 25 tests across 5 binaries (1 test skipped via profile.ci_gammaloop.default-filter )
29.60 s
> ------------
29.60 s
> Summary [ 0.368s] 25 tests run: 25 passed , 1 skipped
29.60 s
>
29.60 s
> ========== nextest test summary ==========
29.60 s
> report: target/nextest/ci_gammaloop/junit.xml
29.60 s
> tests: 25, failures: 0, errors: 0
29.60 s
> No failing testcases found.
29.60 s
> =========================================
29.60 s
> Extracting 2 binaries and 1 linked path to /build/nextest-archive-VsohMF
29.60 s
> Extracted 8 files to /build/nextest-archive-VsohMF in 0.10s
29.60 s
> ------------
29.60 s
> Nextest run ID da5ab33b-0dd1-46d4-b7ec-b79e250b0075 with nextest profile: ci_gammaloop
29.60 s
> Starting 1 test across 2 binaries
29.60 s
> ------------
29.60 s
> Summary [ 0.010s] 1 test run: 1 passed , 0 skipped
29.60 s
>
29.60 s
> ========== nextest test summary ==========
29.60 s
> report: target/nextest/ci_gammaloop/junit.xml
29.60 s
> tests: 1, failures: 0, errors: 0
29.60 s
> No failing testcases found.
29.60 s
> =========================================
29.60 s
> Extracting 1 binary and 1 linked path to /build/nextest-archive-LEaFpW
29.60 s
> Extracted 7 files to /build/nextest-archive-LEaFpW in 0.07s
29.60 s
> ------------
29.60 s
> Nextest run ID 455891d9-46fe-4139-84b8-c0ab3248bf9d with nextest profile: ci_gammaloop
29.60 s
> Starting 0 tests across 1 binary
29.60 s
> ------------
29.60 s
> Summary [ 0.000s] 0 tests run: 0 passed , 0 skipped
29.60 s
>
29.60 s
> ========== nextest test summary ==========
29.60 s
> report: target/nextest/ci_gammaloop/junit.xml
29.60 s
> tests: 0, failures: 0, errors: 0
29.60 s
> No failing testcases found.
29.60 s
> =========================================
29.60 s
For full logs, run:
29.60 s
nix log /nix/store/f7dlapwy00q35hpz63fxwqijy6397ql2-gammaloop-nextest-spenso.drv
29.79 s
[0 built (1 failed )]Run failed.