test packages.x86_64-linux.nix-ci-check-gammaloop-nextest-core

Reproduce this run
Retry Run
  1. 0.00 s $ /nix/store/9ypz3flqsrl5xl495mm8h645gadjsxi1-coreutils-9.11/bin/timeout --kill-after=15s 7200s /nix/store/23zk8sgzamrbmj1fday15szf7f2279s8-nix-2.34.7/bin/nix --extra-experimental-features nix-command --extra-experimental-features flakes flake clone git+https://github.com/alphal00p/gammaloop --dest /tmp/nix-ci-worker/stable-pwd/repo/
  2. 0.06 s Cloning into '/tmp/nix-ci-worker/stable-pwd/repo'...
  3. 1.72 s remote: Enumerating objects: 81983, done.
  4. 1.85 s remote: Counting objects: 0% (1/11500) remote: Counting objects: 1% (115/11500) remote: Counting objects: 2% (230/11500) remote: Counting objects: 3% (345/11500) remote: Counting objects: 4% (460/11500) remote: Counting objects: 5% (575/11500) remote: Counting objects: 6% (690/11500) remote: Counting objects: 7% (805/11500) remote: Counting objects: 8% (920/11500) remote: Counting objects: 9% (1035/11500) remote: Counting objects: 10% (1150/11500) remote: Counting objects: 11% (1265/11500) remote: Counting objects: 12% (1380/11500) remote: Counting objects: 13% (1495/11500) remote: Counting objects: 14% (1610/11500) remote: Counting objects: 15% (1725/11500) remote: Counting objects: 16% (1840/11500) remote: Counting objects: 17% (1955/11500) remote: Counting objects: 18% (2070/11500) remote: Counting objects: 19% (2185/11500) remote: Counting objects: 20% (2300/11500) remote: Counting objects: 21% (2415/11500) remote: Counting objects: 22% (2530/11500) remote: Counting objects: 23% (2645/11500) remote: Counting objects: 24% (2760/11500) remote: Counting objects: 25% (2875/11500) remote: Counting objects: 26% (2990/11500) remote: Counting objects: 27% (3105/11500) remote: Counting objects: 28% (3220/11500) remote: Counting objects: 29% (3335/11500) remote: Counting objects: 30% (3450/11500) remote: Counting objects: 31% (3565/11500) remote: Counting objects: 32% (3680/11500) remote: Counting objects: 33% (3795/11500) remote: Counting objects: 34% (3910/11500) remote: Counting objects: 35% (4025/11500) remote: Counting objects: 36% (4140/11500) remote: Counting objects: 37% (4255/11500) remote: Counting objects: 38% (4370/11500) remote: Counting objects: 39% (4485/11500) remote: Counting objects: 40% (4600/11500) remote: Counting objects: 41% (4715/11500) remote: Counting objects: 42% (4830/11500) remote: Counting objects: 43% (4945/11500) remote: Counting objects: 44% (5060/11500) remote: Counting objects: 45% (5175/11500) remote: Counting objects: 46% (5290/11500) remote: Counting objects: 47% (5405/11500) remote: Counting objects: 48% (5520/11500) remote: Counting objects: 49% (5635/11500) remote: Counting objects: 50% (5750/11500) remote: Counting objects: 51% (5865/11500) remote: Counting objects: 52% (5980/11500) remote: Counting objects: 53% (6095/11500) remote: Counting objects: 54% (6210/11500) remote: Counting objects: 55% (6325/11500) remote: Counting objects: 56% (6440/11500) remote: Counting objects: 57% (6555/11500) remote: Counting objects: 58% (6670/11500) remote: Counting objects: 59% (6785/11500) remote: Counting objects: 60% (6900/11500) remote: Counting objects: 61% (7015/11500) remote: Counting objects: 62% (7130/11500) remote: Counting objects: 63% (7245/11500) remote: Counting objects: 64% (7360/11500) remote: Counting objects: 65% (7475/11500) remote: Counting objects: 66% (7590/11500) remote: Counting objects: 67% (7705/11500) remote: Counting objects: 68% (7820/11500) remote: Counting objects: 69% (7935/11500) remote: Counting objects: 70% (8050/11500) remote: Counting objects: 71% (8165/11500) remote: Counting objects: 72% (8280/11500) remote: Counting objects: 73% (8395/11500) remote: Counting objects: 74% (8510/11500) remote: Counting objects: 75% (8625/11500) remote: Counting objects: 76% (8740/11500) remote: Counting objects: 77% (8855/11500) remote: Counting objects: 78% (8970/11500) remote: Counting objects: 79% (9085/11500) remote: Counting objects: 80% (9200/11500) remote: Counting objects: 81% (9315/11500) remote: Counting objects: 82% (9430/11500) remote: Counting objects: 83% (9545/11500) remote: Counting objects: 84% (9660/11500) remote: Counting objects: 85% (9775/11500) remote: Counting objects: 86% (9890/11500) remote: Counting objects: 87% (10005/11500) remote: Counting objects: 88% (10120/11500) remote: Counting objects: 89% (10235/11500) remote: Counting objects: 90% (10350/11500) remote: Counting objects: 91% (10465/11500) remote: Counting objects: 92% (10580/11500) remote: Counting objects: 93% (10695/11500) remote: Counting objects: 94% (10810/11500) remote: Counting objects: 95% (10925/11500) remote: Counting objects: 96% (11040/11500) remote: Counting objects: 97% (11155/11500) remote: Counting objects: 98% (11270/11500) remote: Counting objects: 99% (11385/11500) remote: Counting objects: 100% (11500/11500) remote: Counting objects: 100% (11500/11500), done.
  5. 4.38 s remote: Compressing objects: 0% (1/2701) remote: Compressing objects: 1% (28/2701) remote: Compressing objects: 2% (55/2701) remote: Compressing objects: 3% (82/2701) remote: Compressing objects: 4% (109/2701) remote: Compressing objects: 5% (136/2701) remote: Compressing objects: 6% (163/2701) remote: Compressing objects: 7% (190/2701) remote: Compressing objects: 8% (217/2701) remote: Compressing objects: 9% (244/2701) remote: Compressing objects: 10% (271/2701) remote: Compressing objects: 11% (298/2701) remote: Compressing objects: 12% (325/2701) remote: Compressing objects: 13% (352/2701) remote: Compressing objects: 14% (379/2701) remote: Compressing objects: 15% (406/2701) remote: Compressing objects: 16% (433/2701) remote: Compressing objects: 17% (460/2701) remote: Compressing objects: 18% (487/2701) remote: Compressing objects: 19% (514/2701) remote: Compressing objects: 20% (541/2701) remote: Compressing objects: 20% (552/2701) remote: Compressing objects: 21% (568/2701) remote: Compressing objects: 22% (595/2701) remote: Compressing objects: 23% (622/2701) remote: Compressing objects: 24% (649/2701) remote: Compressing objects: 25% (676/2701) remote: Compressing objects: 26% (703/2701) remote: Compressing objects: 27% (730/2701) remote: Compressing objects: 27% (733/2701) remote: Compressing objects: 28% (757/2701) remote: Compressing objects: 29% (784/2701) remote: Compressing objects: 30% (811/2701) remote: Compressing objects: 31% (838/2701) remote: Compressing objects: 32% (865/2701) remote: Compressing objects: 33% (892/2701) remote: Compressing objects: 34% (919/2701) remote: Compressing objects: 35% (946/2701) remote: Compressing objects: 36% (973/2701) remote: Compressing objects: 37% (1000/2701) remote: Compressing objects: 38% (1027/2701) remote: Compressing objects: 39% (1054/2701) remote: Compressing objects: 40% (1081/2701) remote: Compressing objects: 41% (1108/2701) remote: Compressing objects: 42% (1135/2701) remote: Compressing objects: 43% (1162/2701) remote: Compressing objects: 44% (1189/2701) remote: Compressing objects: 45% (1216/2701) remote: Compressing objects: 46% (1243/2701) remote: Compressing objects: 47% (1270/2701) remote: Compressing objects: 48% (1297/2701) remote: Compressing objects: 49% (1324/2701) remote: Compressing objects: 50% (1351/2701) remote: Compressing objects: 51% (1378/2701) remote: Compressing objects: 52% (1405/2701) remote: Compressing objects: 53% (1432/2701) remote: Compressing objects: 54% (1459/2701) remote: Compressing objects: 55% (1486/2701) remote: Compressing objects: 56% (1513/2701) remote: Compressing objects: 57% (1540/2701) remote: Compressing objects: 58% (1567/2701) remote: Compressing objects: 59% (1594/2701) remote: Compressing objects: 60% (1621/2701) remote: Compressing objects: 61% (1648/2701) remote: Compressing objects: 62% (1675/2701) remote: Compressing objects: 63% (1702/2701) remote: Compressing objects: 64% (1729/2701) remote: Compressing objects: 65% (1756/2701) remote: Compressing objects: 66% (1783/2701) remote: Compressing objects: 67% (1810/2701) remote: Compressing objects: 68% (1837/2701) remote: Compressing objects: 69% (1864/2701) remote: Compressing objects: 70% (1891/2701) remote: Compressing objects: 71% (1918/2701) remote: Compressing objects: 72% (1945/2701) remote: Compressing objects: 73% (1972/2701) remote: Compressing objects: 74% (1999/2701) remote: Compressing objects: 75% (2026/2701) remote: Compressing objects: 76% (2053/2701) remote: Compressing objects: 77% (2080/2701) remote: Compressing objects: 78% (2107/2701) remote: Compressing objects: 79% (2134/2701) remote: Compressing objects: 80% (2161/2701) remote: Compressing objects: 81% (2188/2701) remote: Compressing objects: 82% (2215/2701) remote: Compressing objects: 83% (2242/2701) remote: Compressing objects: 84% (2269/2701) remote: Compressing objects: 85% (2296/2701) remote: Compressing objects: 86% (2323/2701) remote: Compressing objects: 87% (2350/2701) remote: Compressing objects: 88% (2377/2701) remote: Compressing objects: 89% (2404/2701) remote: Compressing objects: 90% (2431/2701) remote: Compressing objects: 91% (2458/2701) remote: Compressing objects: 92% (2485/2701) remote: Compressing objects: 93% (2512/2701) remote: Compressing objects: 94% (2539/2701) remote: Compressing objects: 95% (2566/2701) remote: Compressing objects: 96% (2593/2701) remote: Compressing objects: 97% (2620/2701) remote: Compressing objects: 98% (2647/2701) remote: Compressing objects: 99% (2674/2701) remote: Compressing objects: 100% (2701/2701) remote: Compressing objects: 100% (2701/2701), done.
  6. 8.65 s Receiving objects: 0% (1/81983) Receiving objects: 1% (820/81983) Receiving objects: 2% (1640/81983) Receiving objects: 3% (2460/81983) Receiving objects: 4% (3280/81983) Receiving objects: 5% (4100/81983) Receiving objects: 6% (4919/81983) Receiving objects: 7% (5739/81983) Receiving objects: 8% (6559/81983), 9.88 MiB | 19.74 MiB/s Receiving objects: 9% (7379/81983), 9.88 MiB | 19.74 MiB/s Receiving objects: 10% (8199/81983), 9.88 MiB | 19.74 MiB/s Receiving objects: 11% (9019/81983), 9.88 MiB | 19.74 MiB/s Receiving objects: 12% (9838/81983), 9.88 MiB | 19.74 MiB/s Receiving objects: 13% (10658/81983), 9.88 MiB | 19.74 MiB/s Receiving objects: 14% (11478/81983), 9.88 MiB | 19.74 MiB/s Receiving objects: 15% (12298/81983), 9.88 MiB | 19.74 MiB/s Receiving objects: 16% (13118/81983), 9.88 MiB | 19.74 MiB/s Receiving objects: 17% (13938/81983), 9.88 MiB | 19.74 MiB/s Receiving objects: 18% (14757/81983), 9.88 MiB | 19.74 MiB/s Receiving objects: 19% (15577/81983), 9.88 MiB | 19.74 MiB/s Receiving objects: 20% (16397/81983), 9.88 MiB | 19.74 MiB/s Receiving objects: 21% (17217/81983), 9.88 MiB | 19.74 MiB/s Receiving objects: 22% (18037/81983), 9.88 MiB | 19.74 MiB/s Receiving objects: 23% (18857/81983), 9.88 MiB | 19.74 MiB/s Receiving objects: 24% (19676/81983), 9.88 MiB | 19.74 MiB/s Receiving objects: 25% (20496/81983), 9.88 MiB | 19.74 MiB/s Receiving objects: 26% (21316/81983), 9.88 MiB | 19.74 MiB/s Receiving objects: 27% (22136/81983), 9.88 MiB | 19.74 MiB/s Receiving objects: 28% (22956/81983), 9.88 MiB | 19.74 MiB/s Receiving objects: 29% (23776/81983), 9.88 MiB | 19.74 MiB/s Receiving objects: 30% (24595/81983), 9.88 MiB | 19.74 MiB/s Receiving objects: 31% (25415/81983), 9.88 MiB | 19.74 MiB/s Receiving objects: 32% (26235/81983), 9.88 MiB | 19.74 MiB/s Receiving objects: 33% (27055/81983), 9.88 MiB | 19.74 MiB/s Receiving objects: 34% (27875/81983), 9.88 MiB | 19.74 MiB/s Receiving objects: 35% (28695/81983), 9.88 MiB | 19.74 MiB/s Receiving objects: 36% (29514/81983), 9.88 MiB | 19.74 MiB/s Receiving objects: 37% (30334/81983), 9.88 MiB | 19.74 MiB/s Receiving objects: 38% (31154/81983), 9.88 MiB | 19.74 MiB/s Receiving objects: 38% (31444/81983), 27.70 MiB | 27.69 MiB/s Receiving objects: 39% (31974/81983), 27.70 MiB | 27.69 MiB/s Receiving objects: 40% (32794/81983), 27.70 MiB | 27.69 MiB/s Receiving objects: 41% (33614/81983), 27.70 MiB | 27.69 MiB/s Receiving objects: 42% (34433/81983), 27.70 MiB | 27.69 MiB/s Receiving objects: 43% (35253/81983), 27.70 MiB | 27.69 MiB/s Receiving objects: 44% (36073/81983), 27.70 MiB | 27.69 MiB/s Receiving objects: 45% (36893/81983), 27.70 MiB | 27.69 MiB/s Receiving objects: 46% (37713/81983), 27.70 MiB | 27.69 MiB/s Receiving objects: 47% (38533/81983), 42.41 MiB | 28.14 MiB/s Receiving objects: 48% (39352/81983), 42.41 MiB | 28.14 MiB/s Receiving objects: 49% (40172/81983), 42.41 MiB | 28.14 MiB/s Receiving objects: 50% (40992/81983), 42.41 MiB | 28.14 MiB/s Receiving objects: 51% (41812/81983), 42.41 MiB | 28.14 MiB/s Receiving objects: 52% (42632/81983), 42.41 MiB | 28.14 MiB/s Receiving objects: 53% (43451/81983), 42.41 MiB | 28.14 MiB/s Receiving objects: 54% (44271/81983), 42.41 MiB | 28.14 MiB/s Receiving objects: 55% (45091/81983), 42.41 MiB | 28.14 MiB/s Receiving objects: 56% (45911/81983), 42.41 MiB | 28.14 MiB/s Receiving objects: 56% (46403/81983), 57.57 MiB | 28.52 MiB/s Receiving objects: 57% (46731/81983), 57.57 MiB | 28.52 MiB/s Receiving objects: 58% (47551/81983), 57.57 MiB | 28.52 MiB/s Receiving objects: 59% (48370/81983), 57.57 MiB | 28.52 MiB/s Receiving objects: 60% (49190/81983), 57.57 MiB | 28.52 MiB/s Receiving objects: 61% (50010/81983), 57.57 MiB | 28.52 MiB/s Receiving objects: 62% (50830/81983), 57.57 MiB | 28.52 MiB/s Receiving objects: 63% (51650/81983), 73.21 MiB | 28.95 MiB/s Receiving objects: 64% (52470/81983), 73.21 MiB | 28.95 MiB/s Receiving objects: 65% (53289/81983), 73.21 MiB | 28.95 MiB/s Receiving objects: 66% (54109/81983), 73.21 MiB | 28.95 MiB/s Receiving objects: 67% (54929/81983), 73.21 MiB | 28.95 MiB/s Receiving objects: 68% (55749/81983), 73.21 MiB | 28.95 MiB/s Receiving objects: 69% (56569/81983), 73.21 MiB | 28.95 MiB/s Receiving objects: 70% (57389/81983), 73.21 MiB | 28.95 MiB/s Receiving objects: 71% (58208/81983), 73.21 MiB | 28.95 MiB/s Receiving objects: 72% (59028/81983), 73.21 MiB | 28.95 MiB/s Receiving objects: 72% (59212/81983), 73.21 MiB | 28.95 MiB/s Receiving objects: 73% (59848/81983), 73.21 MiB | 28.95 MiB/s Receiving objects: 74% (60668/81983), 89.21 MiB | 29.35 MiB/s Receiving objects: 75% (61488/81983), 89.21 MiB | 29.35 MiB/s Receiving objects: 76% (62308/81983), 89.21 MiB | 29.35 MiB/s Receiving objects: 77% (63127/81983), 89.21 MiB | 29.35 MiB/s Receiving objects: 78% (63947/81983), 105.46 MiB | 29.71 MiB/s Receiving objects: 79% (64767/81983), 105.46 MiB | 29.71 MiB/s Receiving objects: 80% (65587/81983), 105.46 MiB | 29.71 MiB/s Receiving objects: 81% (66407/81983), 105.46 MiB | 29.71 MiB/s Receiving objects: 82% (67227/81983), 105.46 MiB | 29.71 MiB/s Receiving objects: 83% (68046/81983), 105.46 MiB | 29.71 MiB/s Receiving objects: 84% (68866/81983), 105.46 MiB | 29.71 MiB/s Receiving objects: 85% (69686/81983), 105.46 MiB | 29.71 MiB/s Receiving objects: 86% (70506/81983), 105.46 MiB | 29.71 MiB/s Receiving objects: 87% (71326/81983), 105.46 MiB | 29.71 MiB/s Receiving objects: 88% (72146/81983), 105.46 MiB | 29.71 MiB/s Receiving objects: 89% (72965/81983), 105.46 MiB | 29.71 MiB/s Receiving objects: 90% (73785/81983), 105.46 MiB | 29.71 MiB/s Receiving objects: 91% (74605/81983), 105.46 MiB | 29.71 MiB/s Receiving objects: 92% (75425/81983), 105.46 MiB | 29.71 MiB/s Receiving objects: 93% (76245/81983), 105.46 MiB | 29.71 MiB/s Receiving objects: 94% (77065/81983), 105.46 MiB | 29.71 MiB/s Receiving objects: 95% (77884/81983), 105.46 MiB | 29.71 MiB/s Receiving objects: 95% (78179/81983), 105.46 MiB | 29.71 MiB/s Receiving objects: 96% (78704/81983), 105.46 MiB | 29.71 MiB/s Receiving objects: 97% (79524/81983), 121.61 MiB | 30.03 MiB/s Receiving objects: 98% (80344/81983), 121.61 MiB | 30.03 MiB/s Receiving objects: 99% (81164/81983), 121.61 MiB | 30.03 MiB/s remote: Total 81983 (delta 8900), reused 9414 (delta 8005), pack-reused 70483 (from 2)
  7. 8.65 s Receiving objects: 100% (81983/81983), 121.61 MiB | 30.03 MiB/s Receiving objects: 100% (81983/81983), 127.89 MiB | 29.99 MiB/s, done.
  8. 9.47 s Resolving deltas: 0% (0/55458) Resolving deltas: 1% (555/55458) Resolving deltas: 2% (1110/55458) Resolving deltas: 3% (1664/55458) Resolving deltas: 4% (2219/55458) Resolving deltas: 5% (2773/55458) Resolving deltas: 6% (3328/55458) Resolving deltas: 7% (3883/55458) Resolving deltas: 8% (4437/55458) Resolving deltas: 9% (4992/55458) Resolving deltas: 10% (5546/55458) Resolving deltas: 11% (6102/55458) Resolving deltas: 12% (6655/55458) Resolving deltas: 13% (7211/55458) Resolving deltas: 14% (7765/55458) Resolving deltas: 15% (8321/55458) Resolving deltas: 16% (8874/55458) Resolving deltas: 17% (9428/55458) Resolving deltas: 18% (9983/55458) Resolving deltas: 19% (10538/55458) Resolving deltas: 20% (11092/55458) Resolving deltas: 21% (11649/55458) Resolving deltas: 22% (12202/55458) Resolving deltas: 23% (12756/55458) Resolving deltas: 24% (13310/55458) Resolving deltas: 25% (13865/55458) Resolving deltas: 26% (14420/55458) Resolving deltas: 27% (14974/55458) Resolving deltas: 28% (15529/55458) Resolving deltas: 29% (16083/55458) Resolving deltas: 30% (16638/55458) Resolving deltas: 31% (17192/55458) Resolving deltas: 32% (17747/55458) Resolving deltas: 33% (18302/55458) Resolving deltas: 34% (18856/55458) Resolving deltas: 35% (19412/55458) Resolving deltas: 36% (19965/55458) Resolving deltas: 37% (20520/55458) Resolving deltas: 38% (21075/55458) Resolving deltas: 39% (21629/55458) Resolving deltas: 40% (22186/55458) Resolving deltas: 41% (22738/55458) Resolving deltas: 42% (23293/55458) Resolving deltas: 43% (23847/55458) Resolving deltas: 44% (24403/55458) Resolving deltas: 45% (24957/55458) Resolving deltas: 46% (25511/55458) Resolving deltas: 47% (26066/55458) Resolving deltas: 48% (26621/55458) Resolving deltas: 49% (27175/55458) Resolving deltas: 50% (27729/55458) Resolving deltas: 51% (28284/55458) Resolving deltas: 52% (28841/55458) Resolving deltas: 53% (29393/55458) Resolving deltas: 54% (29948/55458) Resolving deltas: 55% (30502/55458) Resolving deltas: 56% (31057/55458) Resolving deltas: 57% (31612/55458) Resolving deltas: 58% (32166/55458) Resolving deltas: 59% (32721/55458) Resolving deltas: 60% (33275/55458) Resolving deltas: 61% (33830/55458) Resolving deltas: 62% (34384/55458) Resolving deltas: 63% (34939/55458) Resolving deltas: 64% (35494/55458) Resolving deltas: 65% (36048/55458) Resolving deltas: 66% (36604/55458) Resolving deltas: 67% (37158/55458) Resolving deltas: 68% (37712/55458) Resolving deltas: 69% (38267/55458) Resolving deltas: 70% (38821/55458) Resolving deltas: 71% (39376/55458) Resolving deltas: 72% (39930/55458) Resolving deltas: 73% (40485/55458) Resolving deltas: 74% (41039/55458) Resolving deltas: 75% (41594/55458) Resolving deltas: 76% (42149/55458) Resolving deltas: 77% (42704/55458) Resolving deltas: 78% (43258/55458) Resolving deltas: 79% (43812/55458) Resolving deltas: 80% (44367/55458) Resolving deltas: 81% (44921/55458) Resolving deltas: 82% (45476/55458) Resolving deltas: 83% (46031/55458) Resolving deltas: 84% (46585/55458) Resolving deltas: 85% (47140/55458) Resolving deltas: 86% (47694/55458) Resolving deltas: 87% (48249/55458) Resolving deltas: 88% (48804/55458) Resolving deltas: 89% (49358/55458) Resolving deltas: 90% (49916/55458) Resolving deltas: 91% (50467/55458) Resolving deltas: 92% (51022/55458) Resolving deltas: 93% (51576/55458) Resolving deltas: 94% (52131/55458) Resolving deltas: 95% (52688/55458) Resolving deltas: 96% (53240/55458) Resolving deltas: 97% (53795/55458) Resolving deltas: 98% (54351/55458) Resolving deltas: 99% (54904/55458) Resolving deltas: 100% (55458/55458) Resolving deltas: 100% (55458/55458), done.
  9. 9.76 s Fetching commit 4536be27cf46d387134394bef7d376842a5ccfe5 for wip/native-symbolica-hyperbolics ...
  10. 9.76 s $ /nix/store/bcnisk3ydfgv26v2gw3zlky24g00yww2-git-2.54.0/bin/git fetch origin 4536be27cf46d387134394bef7d376842a5ccfe5
  11. 10.24 s From https://github.com/alphal00p/gammaloop
  12. 10.24 s * branch 4536be27cf46d387134394bef7d376842a5ccfe5 -> FETCH_HEAD
  13. 10.25 s $ /nix/store/9ypz3flqsrl5xl495mm8h645gadjsxi1-coreutils-9.11/bin/timeout --kill-after=15s 7200s /nix/store/bcnisk3ydfgv26v2gw3zlky24g00yww2-git-2.54.0/bin/git -c advice.detachedHead=false checkout 4536be27cf46d387134394bef7d376842a5ccfe5
  14. 10.41 s HEAD is now at 4536be27c Update symjit and use it for thermal sunrise tests
  15. 10.41 s $ /nix/store/9ypz3flqsrl5xl495mm8h645gadjsxi1-coreutils-9.11/bin/timeout --kill-after=15s 7200s /nix/store/23zk8sgzamrbmj1fday15szf7f2279s8-nix-2.34.7/bin/nix --extra-experimental-features nix-command --extra-experimental-features flakes --log-format internal-json run .#packages.x86_64-linux.nix-ci-check-gammaloop-nextest-core --print-build-logs
  16. 14.15 s
  17. 14.30 s Downloading cached gammaloop-nextest-binaries-core-gammaloop-api from https://cache.nix-ci.com
  18. 14.30 s Downloading cached gammaloop-nextest-binaries-core-gammaloop-tracing-filter from https://cache.nix-ci.com
  19. 14.30 s Downloading cached gammaloop-nextest-binaries-core-gammaloop-tracing-filter-macros from https://cache.nix-ci.com
  20. 14.30 s Downloading cached gammaloop-nextest-binaries-core-gammalooprs from https://cache.nix-ci.com
  21. 14.60 s Downloaded cached gammaloop-nextest-binaries-core-gammaloop-tracing-filter-macros (1.7 MiB) in 301ms
  22. 14.60 s Progress: 0 of 1 built, 1 of 6 downloaded from cache (3 downloading)
  23. 15.56 s Downloaded cached gammaloop-nextest-binaries-core-gammaloop-api (68.5 MiB) in 1.2s
  24. 15.56 s Progress: 0 of 1 built, 2 of 6 downloaded from cache (2 downloading)
  25. 15.61 s Downloaded cached gammaloop-nextest-binaries-core-gammaloop-tracing-filter (8.1 MiB) in 1.3s
  26. 15.61 s Progress: 0 of 1 built, 3 of 6 downloaded from cache (1 downloading)
  27. 16.57 s Downloaded cached gammaloop-nextest-binaries-core-gammalooprs (79.6 MiB) in 2.2s
  28. 16.57 s Progress: 0 of 1 built, 4 of 6 downloaded from cache
  29. 16.57 s Downloading cached gammaloop-nextest-binaries-core from https://cache.nix-ci.com
  30. 16.61 s Downloaded cached gammaloop-nextest-binaries-core (1640 B) in 38ms
  31. 16.61 s Progress: 0 of 1 built, 5 of 6 downloaded from cache
  32. 16.61 s Downloading cached nix-ci-check-gammaloop-nextest-core from https://cache.nix-ci.com
  33. 16.65 s Downloaded cached nix-ci-check-gammaloop-nextest-core (1016 B) in 38ms
  34. 16.65 s Progress: 0 of 1 built, 6 of 6 downloaded from cache
  35. 20.75 s evaluating derivation 'g copying '/nix/store/mc4j evaluating derivation 'g copying '/nix/store/mc4j evaluating derivation 'g copying '/nix/store/mc4j evaluating derivation 'g copying '/nix/store/mc4j evaluating derivation 'g copying '/nix/store/mc4j evaluating derivation 'g copying '/nix/store/mc4j evaluating derivation 'g querying gammaloop-nexte [0/1 built, 0.0 KiB DL] [1/0/1 built, 0.0 KiB DLgammaloop-nextest-core> Extracting 3 binaries (including 1 non-test binary), 1 build script output directory, and 2 linked paths to /build/nextest-archive-ocZF4V
  36. 21.14 s gammaloop-nextest-core> Extracted 18 files to /build/nextest-archive-ocZF4V in 0.39s
  37. 21.15 s gammaloop-nextest-core> ------------
  38. 21.15 s gammaloop-nextest-core> Nextest run ID b156a1cf-0e63-4889-a6d3-8a6074ed94a3 with nextest profile: ci_gammaloop
  39. 21.15 s gammaloop-nextest-core> Starting 339 tests across 2 binaries
  40. 21.55 s gammaloop-nextest-core> ------------
  41. 21.55 s gammaloop-nextest-core> Summary [ 0.407s] 339 tests run: 339 passed, 0 skipped
  42. 21.65 s gammaloop-nextest-core>
  43. 21.65 s gammaloop-nextest-core> ========== nextest test summary ==========
  44. 21.65 s gammaloop-nextest-core> report: target/nextest/ci_gammaloop/junit.xml
  45. 21.65 s gammaloop-nextest-core> tests: 339, failures: 0, errors: 0
  46. 21.65 s gammaloop-nextest-core> No failing testcases found.
  47. 21.65 s gammaloop-nextest-core> =========================================
  48. 21.67 s gammaloop-nextest-core> Extracting 1 binary and 1 linked path to /build/nextest-archive-nEFrtg
  49. 21.72 s gammaloop-nextest-core> Extracted 7 files to /build/nextest-archive-nEFrtg in 0.06s
  50. 21.73 s gammaloop-nextest-core> ------------
  51. 21.73 s gammaloop-nextest-core> Nextest run ID 5d4917af-8cc4-4a1b-84bf-acabf2b77377 with nextest profile: ci_gammaloop
  52. 21.73 s gammaloop-nextest-core> Starting 19 tests across 1 binary
  53. 21.74 s gammaloop-nextest-core> ------------
  54. 21.74 s gammaloop-nextest-core> Summary [ 0.010s] 19 tests run: 19 passed, 0 skipped
  55. 21.77 s gammaloop-nextest-core>
  56. 21.77 s gammaloop-nextest-core> ========== nextest test summary ==========
  57. 21.77 s gammaloop-nextest-core> report: target/nextest/ci_gammaloop/junit.xml
  58. 21.77 s gammaloop-nextest-core> tests: 19, failures: 0, errors: 0
  59. 21.77 s gammaloop-nextest-core> No failing testcases found.
  60. 21.77 s gammaloop-nextest-core> =========================================
  61. 21.79 s gammaloop-nextest-core> Extracting 1 binary to /build/nextest-archive-XExa8G
  62. 21.81 s gammaloop-nextest-core> Extracted 4 files to /build/nextest-archive-XExa8G in 0.03s
  63. 21.82 s gammaloop-nextest-core> ------------
  64. 21.82 s gammaloop-nextest-core> Nextest run ID 5f0b8542-db87-4f83-b24e-190edf506fdc with nextest profile: ci_gammaloop
  65. 21.82 s gammaloop-nextest-core> Starting 0 tests across 1 binary
  66. 21.82 s gammaloop-nextest-core> ------------
  67. 21.82 s gammaloop-nextest-core> Summary [ 0.000s] 0 tests run: 0 passed, 0 skipped
  68. 21.84 s gammaloop-nextest-core>
  69. 21.84 s gammaloop-nextest-core> ========== nextest test summary ==========
  70. 21.84 s gammaloop-nextest-core> report: target/nextest/ci_gammaloop/junit.xml
  71. 21.84 s gammaloop-nextest-core> tests: 0, failures: 0, errors: 0
  72. 21.84 s gammaloop-nextest-core> No failing testcases found.
  73. 21.84 s gammaloop-nextest-core> =========================================
  74. 21.86 s gammaloop-nextest-core> Extracting 4 binaries, 1 build script output directory, and 2 linked paths to /build/nextest-archive-3Wl95O
  75. 22.25 s gammaloop-nextest-core> Extracted 18 files to /build/nextest-archive-3Wl95O in 0.40s
  76. 22.26 s gammaloop-nextest-core> ------------
  77. 22.26 s gammaloop-nextest-core> Nextest run ID b449860b-a396-41af-91f6-3ff3df4bf1ce with nextest profile: ci_gammaloop
  78. 22.26 s gammaloop-nextest-core> Starting 483 tests across 4 binaries (61 tests skipped, including 60 tests via profile.ci_gammaloop.default-filter)
  79. 22.30 s gammaloop-nextest-core> FAIL [ 0.015s] ( 49/483) gammalooprs cff::generation::tests_cff::thermal_eight
  80. 22.30 s gammaloop-nextest-core> stdout ---
  81. 22.30 s gammaloop-nextest-core>
  82. 22.30 s gammaloop-nextest-core> running 1 test
  83. 22.30 s gammaloop-nextest-core> test cff::generation::tests_cff::thermal_eight ... FAILED
  84. 22.30 s gammaloop-nextest-core>
  85. 22.30 s gammaloop-nextest-core> failures:
  86. 22.30 s gammaloop-nextest-core>
  87. 22.30 s gammaloop-nextest-core> failures:
  88. 22.30 s gammaloop-nextest-core> cff::generation::tests_cff::thermal_eight
  89. 22.30 s gammaloop-nextest-core>
  90. 22.30 s gammaloop-nextest-core> test result: FAILED. 0 passed; 1 failed; 0 ignored; 0 measured; 535 filtered out; finished in 0.01s
  91. 22.30 s gammaloop-nextest-core>
  92. 22.30 s gammaloop-nextest-core> stderr ---
  93. 22.30 s gammaloop-nextest-core>
  94. 22.30 s gammaloop-nextest-core> thread 'cff::generation::tests_cff::thermal_eight' (1282) panicked at /nix/store/l5xazfnr7k6r6p8mlkn38x2afab0rygz-vendor-cargo-deps/5929dab090e556a579e9f3b708cd2e67c60b3d84a12b5a276f2a36cb00473133/symbolica-2.2.0/src/evaluate/evaluator.rs:295:21:
  95. 22.30 s gammaloop-nextest-core> External function 'symbolica_coth' does not have an implementation for gammalooprs::utils::F<f64>
  96. 22.30 s gammaloop-nextest-core> stack backtrace:
  97. 22.30 s gammaloop-nextest-core> 0: __rustc::rust_begin_unwind
  98. 22.30 s gammaloop-nextest-core> 1: core::panicking::panic_fmt
  99. 22.30 s gammaloop-nextest-core> 2: <symbolica::evaluate::evaluator::ExpressionEvaluator<gammalooprs::utils::F<f64>>>::evaluate_impl_no_ops
  100. 22.30 s gammaloop-nextest-core> 3: <symbolica::evaluate::evaluator::ExpressionEvaluator<gammalooprs::utils::F<f64>>>::evaluate_single
  101. 22.30 s gammaloop-nextest-core> 4: gammalooprs::cff::generation::tests_cff::thermal_eight
  102. 22.30 s gammaloop-nextest-core> 5: <gammalooprs::cff::generation::tests_cff::thermal_eight::{closure#0} as core::ops::function::FnOnce<()>>::call_once
  103. 22.30 s gammaloop-nextest-core> note: Some details are omitted, run with `RUST_BACKTRACE=full` for a verbose backtrace.
  104. 22.30 s gammaloop-nextest-core>
  105. 22.30 s gammaloop-nextest-core> FAIL [ 0.018s] ( 51/483) gammalooprs cff::generation::tests_cff::thermal_bubble_chain
  106. 22.30 s gammaloop-nextest-core> stdout ---
  107. 22.30 s gammaloop-nextest-core>
  108. 22.30 s gammaloop-nextest-core> running 1 test
  109. 22.30 s gammaloop-nextest-core> test cff::generation::tests_cff::thermal_bubble_chain ... FAILED
  110. 22.30 s gammaloop-nextest-core>
  111. 22.30 s gammaloop-nextest-core> failures:
  112. 22.30 s gammaloop-nextest-core>
  113. 22.30 s gammaloop-nextest-core> failures:
  114. 22.30 s gammaloop-nextest-core> cff::generation::tests_cff::thermal_bubble_chain
  115. 22.30 s gammaloop-nextest-core>
  116. 22.30 s gammaloop-nextest-core> test result: FAILED. 0 passed; 1 failed; 0 ignored; 0 measured; 535 filtered out; finished in 0.01s
  117. 22.30 s gammaloop-nextest-core>
  118. 22.30 s gammaloop-nextest-core> stderr ---
  119. 22.30 s gammaloop-nextest-core>
  120. 22.30 s gammaloop-nextest-core> thread 'cff::generation::tests_cff::thermal_bubble_chain' (1273) panicked at /nix/store/l5xazfnr7k6r6p8mlkn38x2afab0rygz-vendor-cargo-deps/5929dab090e556a579e9f3b708cd2e67c60b3d84a12b5a276f2a36cb00473133/symbolica-2.2.0/src/evaluate/evaluator.rs:295:21:
  121. 22.30 s gammaloop-nextest-core> External function 'symbolica_coth' does not have an implementation for gammalooprs::utils::F<f64>
  122. 22.30 s gammaloop-nextest-core> stack backtrace:
  123. 22.30 s gammaloop-nextest-core> 0: __rustc::rust_begin_unwind
  124. 22.30 s gammaloop-nextest-core> 1: core::panicking::panic_fmt
  125. 22.30 s gammaloop-nextest-core> 2: <symbolica::evaluate::evaluator::ExpressionEvaluator<gammalooprs::utils::F<f64>>>::evaluate_impl_no_ops
  126. 22.30 s gammaloop-nextest-core> 3: <symbolica::evaluate::evaluator::ExpressionEvaluator<gammalooprs::utils::F<f64>>>::evaluate_single
  127. 22.30 s gammaloop-nextest-core> 4: gammalooprs::cff::generation::tests_cff::thermal_bubble_chain
  128. 22.30 s gammaloop-nextest-core> 5: <gammalooprs::cff::generation::tests_cff::thermal_bubble_chain::{closure#0} as core::ops::function::FnOnce<()>>::call_once
  129. 22.30 s gammaloop-nextest-core> note: Some details are omitted, run with `RUST_BACKTRACE=full` for a verbose backtrace.
  130. 22.30 s gammaloop-nextest-core>
  131. 22.30 s gammaloop-nextest-core> FAIL [ 0.021s] ( 58/483) gammalooprs cff::generation::tests_cff::thermal_bubble
  132. 22.30 s gammaloop-nextest-core> stdout ---
  133. 22.30 s gammaloop-nextest-core>
  134. 22.30 s gammaloop-nextest-core> running 1 test
  135. 22.30 s gammaloop-nextest-core> test cff::generation::tests_cff::thermal_bubble ... FAILED
  136. 22.30 s gammaloop-nextest-core>
  137. 22.30 s gammaloop-nextest-core> failures:
  138. 22.30 s gammaloop-nextest-core>
  139. 22.30 s gammaloop-nextest-core> failures:
  140. 22.30 s gammaloop-nextest-core> cff::generation::tests_cff::thermal_bubble
  141. 22.30 s gammaloop-nextest-core>
  142. 22.30 s gammaloop-nextest-core> test result: FAILED. 0 passed; 1 failed; 0 ignored; 0 measured; 535 filtered out; finished in 0.01s
  143. 22.30 s gammaloop-nextest-core>
  144. 22.30 s gammaloop-nextest-core> stderr ---
  145. 22.30 s gammaloop-nextest-core>
  146. 22.30 s gammaloop-nextest-core> thread 'cff::generation::tests_cff::thermal_bubble' (1280) panicked at /nix/store/l5xazfnr7k6r6p8mlkn38x2afab0rygz-vendor-cargo-deps/5929dab090e556a579e9f3b708cd2e67c60b3d84a12b5a276f2a36cb00473133/symbolica-2.2.0/src/evaluate/evaluator.rs:295:21:
  147. 22.30 s gammaloop-nextest-core> External function 'symbolica_coth' does not have an implementation for gammalooprs::utils::F<f64>
  148. 22.30 s gammaloop-nextest-core> stack backtrace:
  149. 22.30 s gammaloop-nextest-core> 0: __rustc::rust_begin_unwind
  150. 22.30 s gammaloop-nextest-core> 1: core::panicking::panic_fmt
  151. 22.30 s gammaloop-nextest-core> 2: <symbolica::evaluate::evaluator::ExpressionEvaluator<gammalooprs::utils::F<f64>>>::evaluate_impl_no_ops
  152. 22.30 s gammaloop-nextest-core> 3: <symbolica::evaluate::evaluator::ExpressionEvaluator<gammalooprs::utils::F<f64>>>::evaluate_single
  153. 22.30 s gammaloop-nextest-core> 4: gammalooprs::cff::generation::tests_cff::thermal_bubble
  154. 22.30 s gammaloop-nextest-core> 5: <gammalooprs::cff::generation::tests_cff::thermal_bubble::{closure#0} as core::ops::function::FnOnce<()>>::call_once
  155. 22.30 s gammaloop-nextest-core> note: Some details are omitted, run with `RUST_BACKTRACE=full` for a verbose backtrace.
  156. 22.30 s gammaloop-nextest-core>
  157. 22.35 s gammaloop-nextest-core> FAIL [ 0.068s] ( 76/483) gammalooprs cff::generation::tests_cff::thermal_ring
  158. 22.35 s gammaloop-nextest-core> stdout ---
  159. 22.35 s gammaloop-nextest-core>
  160. 22.35 s gammaloop-nextest-core> running 1 test
  161. 22.35 s gammaloop-nextest-core> test cff::generation::tests_cff::thermal_ring ... FAILED
  162. 22.35 s gammaloop-nextest-core>
  163. 22.35 s gammaloop-nextest-core> failures:
  164. 22.35 s gammaloop-nextest-core>
  165. 22.35 s gammaloop-nextest-core> failures:
  166. 22.35 s gammaloop-nextest-core> cff::generation::tests_cff::thermal_ring
  167. 22.35 s gammaloop-nextest-core>
  168. 22.35 s gammaloop-nextest-core> test result: FAILED. 0 passed; 1 failed; 0 ignored; 0 measured; 535 filtered out; finished in 0.06s
  169. 22.35 s gammaloop-nextest-core>
  170. 22.35 s gammaloop-nextest-core> stderr ---
  171. 22.35 s gammaloop-nextest-core>
  172. 22.35 s gammaloop-nextest-core> thread 'cff::generation::tests_cff::thermal_ring' (1291) panicked at /nix/store/l5xazfnr7k6r6p8mlkn38x2afab0rygz-vendor-cargo-deps/5929dab090e556a579e9f3b708cd2e67c60b3d84a12b5a276f2a36cb00473133/symbolica-2.2.0/src/evaluate/evaluator.rs:295:21:
  173. 22.35 s gammaloop-nextest-core> External function 'symbolica_coth' does not have an implementation for gammalooprs::utils::F<f64>
  174. 22.35 s gammaloop-nextest-core> stack backtrace:
  175. 22.35 s gammaloop-nextest-core> 0: __rustc::rust_begin_unwind
  176. 22.35 s gammaloop-nextest-core> 1: core::panicking::panic_fmt
  177. 22.35 s gammaloop-nextest-core> 2: <symbolica::evaluate::evaluator::ExpressionEvaluator<gammalooprs::utils::F<f64>>>::evaluate_impl_no_ops
  178. 22.35 s gammaloop-nextest-core> 3: <symbolica::evaluate::evaluator::ExpressionEvaluator<gammalooprs::utils::F<f64>>>::evaluate_single
  179. 22.35 s gammaloop-nextest-core> 4: gammalooprs::cff::generation::tests_cff::thermal_ring
  180. 22.35 s gammaloop-nextest-core> 5: <gammalooprs::cff::generation::tests_cff::thermal_ring::{closure#0} as core::ops::function::FnOnce<()>>::call_once
  181. 22.35 s gammaloop-nextest-core> note: Some details are omitted, run with `RUST_BACKTRACE=full` for a verbose backtrace.
  182. 22.35 s gammaloop-nextest-core>
  183. 22.39 s gammaloop-nextest-core> FAIL [ 0.111s] ( 83/483) gammalooprs cff::generation::tests_cff::thermal_mercedes
  184. 22.39 s gammaloop-nextest-core> stdout ---
  185. 22.39 s gammaloop-nextest-core>
  186. 22.39 s gammaloop-nextest-core> running 1 test
  187. 22.39 s gammaloop-nextest-core> test cff::generation::tests_cff::thermal_mercedes ... FAILED
  188. 22.39 s gammaloop-nextest-core>
  189. 22.39 s gammaloop-nextest-core> failures:
  190. 22.39 s gammaloop-nextest-core>
  191. 22.39 s gammaloop-nextest-core> failures:
  192. 22.39 s gammaloop-nextest-core> cff::generation::tests_cff::thermal_mercedes
  193. 22.39 s gammaloop-nextest-core>
  194. 22.39 s gammaloop-nextest-core> test result: FAILED. 0 passed; 1 failed; 0 ignored; 0 measured; 535 filtered out; finished in 0.10s
  195. 22.39 s gammaloop-nextest-core>
  196. 22.39 s gammaloop-nextest-core> stderr ---
  197. 22.39 s gammaloop-nextest-core>
  198. 22.39 s gammaloop-nextest-core> thread 'cff::generation::tests_cff::thermal_mercedes' (1276) panicked at /nix/store/l5xazfnr7k6r6p8mlkn38x2afab0rygz-vendor-cargo-deps/5929dab090e556a579e9f3b708cd2e67c60b3d84a12b5a276f2a36cb00473133/symbolica-2.2.0/src/evaluate/evaluator.rs:295:21:
  199. 22.39 s gammaloop-nextest-core> External function 'symbolica_coth' does not have an implementation for gammalooprs::utils::F<f64>
  200. 22.39 s gammaloop-nextest-core> stack backtrace:
  201. 22.39 s gammaloop-nextest-core> 0: __rustc::rust_begin_unwind
  202. 22.39 s gammaloop-nextest-core> 1: core::panicking::panic_fmt
  203. 22.39 s gammaloop-nextest-core> 2: <symbolica::evaluate::evaluator::ExpressionEvaluator<gammalooprs::utils::F<f64>>>::evaluate_impl_no_ops
  204. 22.39 s gammaloop-nextest-core> 3: <symbolica::evaluate::evaluator::ExpressionEvaluator<gammalooprs::utils::F<f64>>>::evaluate_single
  205. 22.39 s gammaloop-nextest-core> 4: gammalooprs::cff::generation::tests_cff::thermal_mercedes
  206. 22.39 s gammaloop-nextest-core> 5: <gammalooprs::cff::generation::tests_cff::thermal_mercedes::{closure#0} as core::ops::function::FnOnce<()>>::call_once
  207. 22.39 s gammaloop-nextest-core> note: Some details are omitted, run with `RUST_BACKTRACE=full` for a verbose backtrace.
  208. 22.39 s gammaloop-nextest-core>
  209. 22.76 s gammaloop-nextest-core> FAIL [ 0.454s] (270/483) gammalooprs graph::feynman_graph::tests::native_thermal_distributions
  210. 22.76 s gammaloop-nextest-core> stdout ---
  211. 22.76 s gammaloop-nextest-core>
  212. 22.76 s gammaloop-nextest-core> running 1 test
  213. 22.76 s gammaloop-nextest-core> test graph::feynman_graph::tests::native_thermal_distributions ... FAILED
  214. 22.76 s gammaloop-nextest-core>
  215. 22.76 s gammaloop-nextest-core> failures:
  216. 22.76 s gammaloop-nextest-core>
  217. 22.76 s gammaloop-nextest-core> failures:
  218. 22.76 s gammaloop-nextest-core> graph::feynman_graph::tests::native_thermal_distributions
  219. 22.76 s gammaloop-nextest-core>
  220. 22.76 s gammaloop-nextest-core> test result: FAILED. 0 passed; 1 failed; 0 ignored; 0 measured; 535 filtered out; finished in 0.44s
  221. 22.76 s gammaloop-nextest-core>
  222. 22.76 s gammaloop-nextest-core> stderr ---
  223. 22.76 s gammaloop-nextest-core> The application panicked (crashed).
  224. 22.76 s gammaloop-nextest-core> Message: called `Result::unwrap()` on an `Err` value: Custom { kind: Other, error: "Could not compile code: g++ -shared -O3 -fPIC -ffast-math -funsafe-math-optimizations -march=native -o /build/gammaloop-native-thermal-1345/thermal_0_0.so /build/gammaloop-native-thermal-1345/thermal_0_0.cpp\nwarning: Skipping impure flag -march=native because NIX_ENFORCE_NO_NATIVE is set\n/build/gammaloop-native-thermal-1345/thermal_0_0.cpp: In function 'void thermal_realf64(const double*, double*, double*)':\n/build/gammaloop-native-thermal-1345/thermal_0_0.cpp:27:16: error: 'symbolica_tanh' was not declared in this scope\n 27 | Z[6] = symbolica_tanh(Z[6]);\n | ^~~~~~~~~~~~~~\n" }
  225. 22.76 s gammaloop-nextest-core> Location: crates/gammalooprs/src/graph/feynman_graph.rs:937
  226. 22.76 s gammaloop-nextest-core>
  227. 22.76 s gammaloop-nextest-core> ━━━━━━━━━━━━━━━━━━━━━━━━━━━━━━━━━━ BACKTRACE ━━━━━━━━━━━━━━━━━━━━━━━━━━━━━━━━━━━
  228. 22.76 s gammaloop-nextest-core> 1: <color_eyre[b0c9e66060e883b2]::config::PanicHook>::panic_report<unknown>
  229. 22.76 s gammaloop-nextest-core> at <unknown source file>:<unknown line>
  230. 22.76 s gammaloop-nextest-core> 2: <color_eyre[b0c9e66060e883b2]::config::PanicHook>::into_panic_hook::{closure#0}<unknown>
  231. 22.76 s gammaloop-nextest-core> at <unknown source file>:<unknown line>
  232. 22.76 s gammaloop-nextest-core> 3: std[bcb96dfbba0ab899]::panicking::panic_with_hook<unknown>
  233. 22.76 s gammaloop-nextest-core> at <unknown source file>:<unknown line>
  234. 22.76 s gammaloop-nextest-core> 4: std[bcb96dfbba0ab899]::panicking::panic_handler::{closure#0}<unknown>
  235. 22.76 s gammaloop-nextest-core> at <unknown source file>:<unknown line>
  236. 22.76 s gammaloop-nextest-core> 5: std[bcb96dfbba0ab899]::sys::backtrace::__rust_end_short_backtrace::<std[bcb96dfbba0ab899]::panicking::panic_handler::{closure#0}, !><unknown>
  237. 22.76 s gammaloop-nextest-core> at <unknown source file>:<unknown line>
  238. 22.76 s gammaloop-nextest-core> 6: __rustc[6c289b9f9c454d21]::rust_begin_unwind<unknown>
  239. 22.76 s gammaloop-nextest-core> at <unknown source file>:<unknown line>
  240. 22.76 s gammaloop-nextest-core> 7: core[940e698046960fd5]::panicking::panic_fmt<unknown>
  241. 22.76 s gammaloop-nextest-core> at <unknown source file>:<unknown line>
  242. 22.76 s gammaloop-nextest-core> 8: core[940e698046960fd5]::result::unwrap_failed<unknown>
  243. 22.76 s gammaloop-nextest-core> at <unknown source file>:<unknown line>
  244. 22.76 s gammaloop-nextest-core> 9: gammalooprs[f21b74aec46f5289]::graph::feynman_graph::tests::native_thermal_distributions<unknown>
  245. 22.76 s gammaloop-nextest-core> at <unknown source file>:<unknown line>
  246. 22.76 s gammaloop-nextest-core> 10: <gammalooprs[f21b74aec46f5289]::graph::feynman_graph::tests::native_thermal_distributions::{closure#0} as core[940e698046960fd5]::ops::function::FnOnce<()>>::call_once<unknown>
  247. 22.76 s gammaloop-nextest-core> at <unknown source file>:<unknown line>
  248. 22.76 s gammaloop-nextest-core> 11: test[75d6903177b1d7e9]::__rust_begin_short_backtrace::<core[940e698046960fd5]::result::Result<(), alloc[2ea6bcb46fca0c42]::string::String>, fn() -> core[940e698046960fd5]::result::Result<(), alloc[2ea6bcb46fca0c42]::string::String>><unknown>
  249. 22.76 s gammaloop-nextest-core> at <unknown source file>:<unknown line>
  250. 22.76 s gammaloop-nextest-core> 12: test[75d6903177b1d7e9]::run_test::{closure#0}<unknown>
  251. 22.76 s gammaloop-nextest-core> at <unknown source file>:<unknown line>
  252. 22.76 s gammaloop-nextest-core> 13: std[bcb96dfbba0ab899]::sys::backtrace::__rust_begin_short_backtrace::<test[75d6903177b1d7e9]::run_test::{closure#1}, ()><unknown>
  253. 22.76 s gammaloop-nextest-core> at <unknown source file>:<unknown line>
  254. 22.76 s gammaloop-nextest-core> 14: <std[bcb96dfbba0ab899]::thread::lifecycle::spawn_unchecked<test[75d6903177b1d7e9]::run_test::{closure#1}, ()>::{closure#1} as core[940e698046960fd5]::ops::function::FnOnce<()>>::call_once::{shim:vtable#0}<unknown>
  255. 22.76 s gammaloop-nextest-core> at <unknown source file>:<unknown line>
  256. 22.76 s gammaloop-nextest-core> 15: <std[bcb96dfbba0ab899]::sys::thread::unix::Thread>::new::thread_start<unknown>
  257. 22.76 s gammaloop-nextest-core> at <unknown source file>:<unknown line>
  258. 22.76 s gammaloop-nextest-core> 16: start_thread<unknown>
  259. 22.76 s gammaloop-nextest-core> at <unknown source file>:<unknown line>
  260. 22.76 s gammaloop-nextest-core> 17: __clone3<unknown>
  261. 22.76 s gammaloop-nextest-core> at <unknown source file>:<unknown line>
  262. 22.76 s gammaloop-nextest-core>
  263. 22.76 s gammaloop-nextest-core> Run with COLORBT_SHOW_HIDDEN=1 environment variable to disable frame filtering.
  264. 22.76 s gammaloop-nextest-core> Run with RUST_BACKTRACE=full to include source snippets.
  265. 22.76 s gammaloop-nextest-core>
  266. 27.60 s gammaloop-nextest-core> FAIL [ 5.321s] (479/483) gammalooprs cff::generation::tests_cff::thermal_bugblatter
  267. 27.60 s gammaloop-nextest-core> stdout ---
  268. 27.60 s gammaloop-nextest-core>
  269. 27.60 s gammaloop-nextest-core> running 1 test
  270. 27.60 s gammaloop-nextest-core> test cff::generation::tests_cff::thermal_bugblatter ... FAILED
  271. 27.60 s gammaloop-nextest-core>
  272. 27.60 s gammaloop-nextest-core> failures:
  273. 27.60 s gammaloop-nextest-core>
  274. 27.60 s gammaloop-nextest-core> failures:
  275. 27.60 s gammaloop-nextest-core> cff::generation::tests_cff::thermal_bugblatter
  276. 27.60 s gammaloop-nextest-core>
  277. 27.60 s gammaloop-nextest-core> test result: FAILED. 0 passed; 1 failed; 0 ignored; 0 measured; 535 filtered out; finished in 5.24s
  278. 27.60 s gammaloop-nextest-core>
  279. 27.60 s gammaloop-nextest-core> stderr ---
  280. 27.60 s gammaloop-nextest-core>
  281. 27.60 s gammaloop-nextest-core> thread 'cff::generation::tests_cff::thermal_bugblatter' (1274) panicked at /nix/store/l5xazfnr7k6r6p8mlkn38x2afab0rygz-vendor-cargo-deps/5929dab090e556a579e9f3b708cd2e67c60b3d84a12b5a276f2a36cb00473133/symbolica-2.2.0/src/evaluate/evaluator.rs:295:21:
  282. 27.60 s gammaloop-nextest-core> External function 'symbolica_coth' does not have an implementation for gammalooprs::utils::F<f64>
  283. 27.60 s gammaloop-nextest-core> stack backtrace:
  284. 27.60 s gammaloop-nextest-core> 0: __rustc::rust_begin_unwind
  285. 27.60 s gammaloop-nextest-core> 1: core::panicking::panic_fmt
  286. 27.60 s gammaloop-nextest-core> 2: <symbolica::evaluate::evaluator::ExpressionEvaluator<gammalooprs::utils::F<f64>>>::evaluate_impl_no_ops
  287. 27.60 s gammaloop-nextest-core> 3: <symbolica::evaluate::evaluator::ExpressionEvaluator<gammalooprs::utils::F<f64>>>::evaluate_single
  288. 27.60 s gammaloop-nextest-core> 4: gammalooprs::cff::generation::tests_cff::thermal_bugblatter
  289. 27.60 s gammaloop-nextest-core> 5: <gammalooprs::cff::generation::tests_cff::thermal_bugblatter::{closure#0} as core::ops::function::FnOnce<()>>::call_once
  290. 27.60 s gammaloop-nextest-core> note: Some details are omitted, run with `RUST_BACKTRACE=full` for a verbose backtrace.
  291. 27.60 s gammaloop-nextest-core>
  292. 30.31 s gammaloop-nextest-core> ------------
  293. 30.31 s gammaloop-nextest-core> Summary [ 8.041s] 483 tests run: 476 passed, 7 failed, 61 skipped
  294. 30.31 s gammaloop-nextest-core> FAIL [ 0.015s] ( 49/483) gammalooprs cff::generation::tests_cff::thermal_eight
  295. 30.31 s gammaloop-nextest-core> stdout ---
  296. 30.31 s gammaloop-nextest-core>
  297. 30.31 s gammaloop-nextest-core> running 1 test
  298. 30.31 s gammaloop-nextest-core> test cff::generation::tests_cff::thermal_eight ... FAILED
  299. 30.31 s gammaloop-nextest-core>
  300. 30.31 s gammaloop-nextest-core> failures:
  301. 30.31 s gammaloop-nextest-core>
  302. 30.31 s gammaloop-nextest-core> failures:
  303. 30.31 s gammaloop-nextest-core> cff::generation::tests_cff::thermal_eight
  304. 30.31 s gammaloop-nextest-core>
  305. 30.31 s gammaloop-nextest-core> test result: FAILED. 0 passed; 1 failed; 0 ignored; 0 measured; 535 filtered out; finished in 0.01s
  306. 30.31 s gammaloop-nextest-core>
  307. 30.31 s gammaloop-nextest-core> stderr ---
  308. 30.31 s gammaloop-nextest-core>
  309. 30.31 s gammaloop-nextest-core> thread 'cff::generation::tests_cff::thermal_eight' (1282) panicked at /nix/store/l5xazfnr7k6r6p8mlkn38x2afab0rygz-vendor-cargo-deps/5929dab090e556a579e9f3b708cd2e67c60b3d84a12b5a276f2a36cb00473133/symbolica-2.2.0/src/evaluate/evaluator.rs:295:21:
  310. 30.31 s gammaloop-nextest-core> External function 'symbolica_coth' does not have an implementation for gammalooprs::utils::F<f64>
  311. 30.31 s gammaloop-nextest-core> stack backtrace:
  312. 30.31 s gammaloop-nextest-core> 0: __rustc::rust_begin_unwind
  313. 30.31 s gammaloop-nextest-core> 1: core::panicking::panic_fmt
  314. 30.31 s gammaloop-nextest-core> 2: <symbolica::evaluate::evaluator::ExpressionEvaluator<gammalooprs::utils::F<f64>>>::evaluate_impl_no_ops
  315. 30.31 s gammaloop-nextest-core> 3: <symbolica::evaluate::evaluator::ExpressionEvaluator<gammalooprs::utils::F<f64>>>::evaluate_single
  316. 30.31 s gammaloop-nextest-core> 4: gammalooprs::cff::generation::tests_cff::thermal_eight
  317. 30.31 s gammaloop-nextest-core> 5: <gammalooprs::cff::generation::tests_cff::thermal_eight::{closure#0} as core::ops::function::FnOnce<()>>::call_once
  318. 30.31 s gammaloop-nextest-core> note: Some details are omitted, run with `RUST_BACKTRACE=full` for a verbose backtrace.
  319. 30.31 s gammaloop-nextest-core>
  320. 30.31 s gammaloop-nextest-core> FAIL [ 0.018s] ( 51/483) gammalooprs cff::generation::tests_cff::thermal_bubble_chain
  321. 30.31 s gammaloop-nextest-core> stdout ---
  322. 30.31 s gammaloop-nextest-core>
  323. 30.31 s gammaloop-nextest-core> running 1 test
  324. 30.31 s gammaloop-nextest-core> test cff::generation::tests_cff::thermal_bubble_chain ... FAILED
  325. 30.31 s gammaloop-nextest-core>
  326. 30.31 s gammaloop-nextest-core> failures:
  327. 30.31 s gammaloop-nextest-core>
  328. 30.31 s gammaloop-nextest-core> failures:
  329. 30.31 s gammaloop-nextest-core> cff::generation::tests_cff::thermal_bubble_chain
  330. 30.31 s gammaloop-nextest-core>
  331. 30.31 s gammaloop-nextest-core> test result: FAILED. 0 passed; 1 failed; 0 ignored; 0 measured; 535 filtered out; finished in 0.01s
  332. 30.31 s gammaloop-nextest-core>
  333. 30.31 s gammaloop-nextest-core> stderr ---
  334. 30.31 s gammaloop-nextest-core>
  335. 30.31 s gammaloop-nextest-core> thread 'cff::generation::tests_cff::thermal_bubble_chain' (1273) panicked at /nix/store/l5xazfnr7k6r6p8mlkn38x2afab0rygz-vendor-cargo-deps/5929dab090e556a579e9f3b708cd2e67c60b3d84a12b5a276f2a36cb00473133/symbolica-2.2.0/src/evaluate/evaluator.rs:295:21:
  336. 30.31 s gammaloop-nextest-core> External function 'symbolica_coth' does not have an implementation for gammalooprs::utils::F<f64>
  337. 30.31 s gammaloop-nextest-core> stack backtrace:
  338. 30.31 s gammaloop-nextest-core> 0: __rustc::rust_begin_unwind
  339. 30.31 s gammaloop-nextest-core> 1: core::panicking::panic_fmt
  340. 30.31 s gammaloop-nextest-core> 2: <symbolica::evaluate::evaluator::ExpressionEvaluator<gammalooprs::utils::F<f64>>>::evaluate_impl_no_ops
  341. 30.31 s gammaloop-nextest-core> 3: <symbolica::evaluate::evaluator::ExpressionEvaluator<gammalooprs::utils::F<f64>>>::evaluate_single
  342. 30.31 s gammaloop-nextest-core> 4: gammalooprs::cff::generation::tests_cff::thermal_bubble_chain
  343. 30.31 s gammaloop-nextest-core> 5: <gammalooprs::cff::generation::tests_cff::thermal_bubble_chain::{closure#0} as core::ops::function::FnOnce<()>>::call_once
  344. 30.31 s gammaloop-nextest-core> note: Some details are omitted, run with `RUST_BACKTRACE=full` for a verbose backtrace.
  345. 30.31 s gammaloop-nextest-core>
  346. 30.31 s gammaloop-nextest-core> FAIL [ 0.021s] ( 58/483) gammalooprs cff::generation::tests_cff::thermal_bubble
  347. 30.31 s gammaloop-nextest-core> stdout ---
  348. 30.31 s gammaloop-nextest-core>
  349. 30.31 s gammaloop-nextest-core> running 1 test
  350. 30.31 s gammaloop-nextest-core> test cff::generation::tests_cff::thermal_bubble ... FAILED
  351. 30.31 s gammaloop-nextest-core>
  352. 30.31 s gammaloop-nextest-core> failures:
  353. 30.31 s gammaloop-nextest-core>
  354. 30.31 s gammaloop-nextest-core> failures:
  355. 30.31 s gammaloop-nextest-core> cff::generation::tests_cff::thermal_bubble
  356. 30.31 s gammaloop-nextest-core>
  357. 30.31 s gammaloop-nextest-core> test result: FAILED. 0 passed; 1 failed; 0 ignored; 0 measured; 535 filtered out; finished in 0.01s
  358. 30.31 s gammaloop-nextest-core>
  359. 30.31 s gammaloop-nextest-core> stderr ---
  360. 30.31 s gammaloop-nextest-core>
  361. 30.31 s gammaloop-nextest-core> thread 'cff::generation::tests_cff::thermal_bubble' (1280) panicked at /nix/store/l5xazfnr7k6r6p8mlkn38x2afab0rygz-vendor-cargo-deps/5929dab090e556a579e9f3b708cd2e67c60b3d84a12b5a276f2a36cb00473133/symbolica-2.2.0/src/evaluate/evaluator.rs:295:21:
  362. 30.31 s gammaloop-nextest-core> External function 'symbolica_coth' does not have an implementation for gammalooprs::utils::F<f64>
  363. 30.31 s gammaloop-nextest-core> stack backtrace:
  364. 30.31 s gammaloop-nextest-core> 0: __rustc::rust_begin_unwind
  365. 30.31 s gammaloop-nextest-core> 1: core::panicking::panic_fmt
  366. 30.31 s gammaloop-nextest-core> 2: <symbolica::evaluate::evaluator::ExpressionEvaluator<gammalooprs::utils::F<f64>>>::evaluate_impl_no_ops
  367. 30.31 s gammaloop-nextest-core> 3: <symbolica::evaluate::evaluator::ExpressionEvaluator<gammalooprs::utils::F<f64>>>::evaluate_single
  368. 30.31 s gammaloop-nextest-core> 4: gammalooprs::cff::generation::tests_cff::thermal_bubble
  369. 30.31 s gammaloop-nextest-core> 5: <gammalooprs::cff::generation::tests_cff::thermal_bubble::{closure#0} as core::ops::function::FnOnce<()>>::call_once
  370. 30.31 s gammaloop-nextest-core> note: Some details are omitted, run with `RUST_BACKTRACE=full` for a verbose backtrace.
  371. 30.31 s gammaloop-nextest-core>
  372. 30.31 s gammaloop-nextest-core> FAIL [ 0.068s] ( 76/483) gammalooprs cff::generation::tests_cff::thermal_ring
  373. 30.31 s gammaloop-nextest-core> stdout ---
  374. 30.31 s gammaloop-nextest-core>
  375. 30.31 s gammaloop-nextest-core> running 1 test
  376. 30.31 s gammaloop-nextest-core> test cff::generation::tests_cff::thermal_ring ... FAILED
  377. 30.31 s gammaloop-nextest-core>
  378. 30.31 s gammaloop-nextest-core> failures:
  379. 30.31 s gammaloop-nextest-core>
  380. 30.31 s gammaloop-nextest-core> failures:
  381. 30.31 s gammaloop-nextest-core> cff::generation::tests_cff::thermal_ring
  382. 30.31 s gammaloop-nextest-core>
  383. 30.31 s gammaloop-nextest-core> test result: FAILED. 0 passed; 1 failed; 0 ignored; 0 measured; 535 filtered out; finished in 0.06s
  384. 30.31 s gammaloop-nextest-core>
  385. 30.31 s gammaloop-nextest-core> stderr ---
  386. 30.31 s gammaloop-nextest-core>
  387. 30.31 s gammaloop-nextest-core> thread 'cff::generation::tests_cff::thermal_ring' (1291) panicked at /nix/store/l5xazfnr7k6r6p8mlkn38x2afab0rygz-vendor-cargo-deps/5929dab090e556a579e9f3b708cd2e67c60b3d84a12b5a276f2a36cb00473133/symbolica-2.2.0/src/evaluate/evaluator.rs:295:21:
  388. 30.31 s gammaloop-nextest-core> External function 'symbolica_coth' does not have an implementation for gammalooprs::utils::F<f64>
  389. 30.31 s gammaloop-nextest-core> stack backtrace:
  390. 30.31 s gammaloop-nextest-core> 0: __rustc::rust_begin_unwind
  391. 30.31 s gammaloop-nextest-core> 1: core::panicking::panic_fmt
  392. 30.31 s gammaloop-nextest-core> 2: <symbolica::evaluate::evaluator::ExpressionEvaluator<gammalooprs::utils::F<f64>>>::evaluate_impl_no_ops
  393. 30.31 s gammaloop-nextest-core> 3: <symbolica::evaluate::evaluator::ExpressionEvaluator<gammalooprs::utils::F<f64>>>::evaluate_single
  394. 30.31 s gammaloop-nextest-core> 4: gammalooprs::cff::generation::tests_cff::thermal_ring
  395. 30.31 s gammaloop-nextest-core> 5: <gammalooprs::cff::generation::tests_cff::thermal_ring::{closure#0} as core::ops::function::FnOnce<()>>::call_once
  396. 30.31 s gammaloop-nextest-core> note: Some details are omitted, run with `RUST_BACKTRACE=full` for a verbose backtrace.
  397. 30.31 s gammaloop-nextest-core>
  398. 30.31 s gammaloop-nextest-core> FAIL [ 0.111s] ( 83/483) gammalooprs cff::generation::tests_cff::thermal_mercedes
  399. 30.31 s gammaloop-nextest-core> stdout ---
  400. 30.31 s gammaloop-nextest-core>
  401. 30.31 s gammaloop-nextest-core> running 1 test
  402. 30.31 s gammaloop-nextest-core> test cff::generation::tests_cff::thermal_mercedes ... FAILED
  403. 30.31 s gammaloop-nextest-core>
  404. 30.31 s gammaloop-nextest-core> failures:
  405. 30.31 s gammaloop-nextest-core>
  406. 30.31 s gammaloop-nextest-core> failures:
  407. 30.31 s gammaloop-nextest-core> cff::generation::tests_cff::thermal_mercedes
  408. 30.31 s gammaloop-nextest-core>
  409. 30.31 s gammaloop-nextest-core> test result: FAILED. 0 passed; 1 failed; 0 ignored; 0 measured; 535 filtered out; finished in 0.10s
  410. 30.31 s gammaloop-nextest-core>
  411. 30.31 s gammaloop-nextest-core> stderr ---
  412. 30.31 s gammaloop-nextest-core>
  413. 30.31 s gammaloop-nextest-core> thread 'cff::generation::tests_cff::thermal_mercedes' (1276) panicked at /nix/store/l5xazfnr7k6r6p8mlkn38x2afab0rygz-vendor-cargo-deps/5929dab090e556a579e9f3b708cd2e67c60b3d84a12b5a276f2a36cb00473133/symbolica-2.2.0/src/evaluate/evaluator.rs:295:21:
  414. 30.31 s gammaloop-nextest-core> External function 'symbolica_coth' does not have an implementation for gammalooprs::utils::F<f64>
  415. 30.31 s gammaloop-nextest-core> stack backtrace:
  416. 30.31 s gammaloop-nextest-core> 0: __rustc::rust_begin_unwind
  417. 30.31 s gammaloop-nextest-core> 1: core::panicking::panic_fmt
  418. 30.31 s gammaloop-nextest-core> 2: <symbolica::evaluate::evaluator::ExpressionEvaluator<gammalooprs::utils::F<f64>>>::evaluate_impl_no_ops
  419. 30.31 s gammaloop-nextest-core> 3: <symbolica::evaluate::evaluator::ExpressionEvaluator<gammalooprs::utils::F<f64>>>::evaluate_single
  420. 30.31 s gammaloop-nextest-core> 4: gammalooprs::cff::generation::tests_cff::thermal_mercedes
  421. 30.31 s gammaloop-nextest-core> 5: <gammalooprs::cff::generation::tests_cff::thermal_mercedes::{closure#0} as core::ops::function::FnOnce<()>>::call_once
  422. 30.31 s gammaloop-nextest-core> note: Some details are omitted, run with `RUST_BACKTRACE=full` for a verbose backtrace.
  423. 30.31 s gammaloop-nextest-core>
  424. 30.31 s gammaloop-nextest-core> FAIL [ 0.454s] (270/483) gammalooprs graph::feynman_graph::tests::native_thermal_distributions
  425. 30.31 s gammaloop-nextest-core> stdout ---
  426. 30.31 s gammaloop-nextest-core>
  427. 30.31 s gammaloop-nextest-core> running 1 test
  428. 30.31 s gammaloop-nextest-core> test graph::feynman_graph::tests::native_thermal_distributions ... FAILED
  429. 30.31 s gammaloop-nextest-core>
  430. 30.31 s gammaloop-nextest-core> failures:
  431. 30.31 s gammaloop-nextest-core>
  432. 30.31 s gammaloop-nextest-core> failures:
  433. 30.31 s gammaloop-nextest-core> graph::feynman_graph::tests::native_thermal_distributions
  434. 30.31 s gammaloop-nextest-core>
  435. 30.31 s gammaloop-nextest-core> test result: FAILED. 0 passed; 1 failed; 0 ignored; 0 measured; 535 filtered out; finished in 0.44s
  436. 30.31 s gammaloop-nextest-core>
  437. 30.31 s gammaloop-nextest-core> stderr ---
  438. 30.31 s gammaloop-nextest-core> The application panicked (crashed).
  439. 30.31 s gammaloop-nextest-core> Message: called `Result::unwrap()` on an `Err` value: Custom { kind: Other, error: "Could not compile code: g++ -shared -O3 -fPIC -ffast-math -funsafe-math-optimizations -march=native -o /build/gammaloop-native-thermal-1345/thermal_0_0.so /build/gammaloop-native-thermal-1345/thermal_0_0.cpp\nwarning: Skipping impure flag -march=native because NIX_ENFORCE_NO_NATIVE is set\n/build/gammaloop-native-thermal-1345/thermal_0_0.cpp: In function 'void thermal_realf64(const double*, double*, double*)':\n/build/gammaloop-native-thermal-1345/thermal_0_0.cpp:27:16: error: 'symbolica_tanh' was not declared in this scope\n 27 | Z[6] = symbolica_tanh(Z[6]);\n | ^~~~~~~~~~~~~~\n" }
  440. 30.31 s gammaloop-nextest-core> Location: crates/gammalooprs/src/graph/feynman_graph.rs:937
  441. 30.31 s gammaloop-nextest-core>
  442. 30.31 s gammaloop-nextest-core> ━━━━━━━━━━━━━━━━━━━━━━━━━━━━━━━━━━ BACKTRACE ━━━━━━━━━━━━━━━━━━━━━━━━━━━━━━━━━━━
  443. 30.31 s gammaloop-nextest-core> 1: <color_eyre[b0c9e66060e883b2]::config::PanicHook>::panic_report<unknown>
  444. 30.31 s gammaloop-nextest-core> at <unknown source file>:<unknown line>
  445. 30.31 s gammaloop-nextest-core> 2: <color_eyre[b0c9e66060e883b2]::config::PanicHook>::into_panic_hook::{closure#0}<unknown>
  446. 30.31 s gammaloop-nextest-core> at <unknown source file>:<unknown line>
  447. 30.31 s gammaloop-nextest-core> 3: std[bcb96dfbba0ab899]::panicking::panic_with_hook<unknown>
  448. 30.31 s gammaloop-nextest-core> at <unknown source file>:<unknown line>
  449. 30.31 s gammaloop-nextest-core> 4: std[bcb96dfbba0ab899]::panicking::panic_handler::{closure#0}<unknown>
  450. 30.31 s gammaloop-nextest-core> at <unknown source file>:<unknown line>
  451. 30.31 s gammaloop-nextest-core> 5: std[bcb96dfbba0ab899]::sys::backtrace::__rust_end_short_backtrace::<std[bcb96dfbba0ab899]::panicking::panic_handler::{closure#0}, !><unknown>
  452. 30.31 s gammaloop-nextest-core> at <unknown source file>:<unknown line>
  453. 30.31 s gammaloop-nextest-core> 6: __rustc[6c289b9f9c454d21]::rust_begin_unwind<unknown>
  454. 30.31 s gammaloop-nextest-core> at <unknown source file>:<unknown line>
  455. 30.31 s gammaloop-nextest-core> 7: core[940e698046960fd5]::panicking::panic_fmt<unknown>
  456. 30.31 s gammaloop-nextest-core> at <unknown source file>:<unknown line>
  457. 30.31 s gammaloop-nextest-core> 8: core[940e698046960fd5]::result::unwrap_failed<unknown>
  458. 30.31 s gammaloop-nextest-core> at <unknown source file>:<unknown line>
  459. 30.31 s gammaloop-nextest-core> 9: gammalooprs[f21b74aec46f5289]::graph::feynman_graph::tests::native_thermal_distributions<unknown>
  460. 30.31 s gammaloop-nextest-core> at <unknown source file>:<unknown line>
  461. 30.31 s gammaloop-nextest-core> 10: <gammalooprs[f21b74aec46f5289]::graph::feynman_graph::tests::native_thermal_distributions::{closure#0} as core[940e698046960fd5]::ops::function::FnOnce<()>>::call_once<unknown>
  462. 30.31 s gammaloop-nextest-core> at <unknown source file>:<unknown line>
  463. 30.31 s gammaloop-nextest-core> 11: test[75d6903177b1d7e9]::__rust_begin_short_backtrace::<core[940e698046960fd5]::result::Result<(), alloc[2ea6bcb46fca0c42]::string::String>, fn() -> core[940e698046960fd5]::result::Result<(), alloc[2ea6bcb46fca0c42]::string::String>><unknown>
  464. 30.31 s gammaloop-nextest-core> at <unknown source file>:<unknown line>
  465. 30.31 s gammaloop-nextest-core> 12: test[75d6903177b1d7e9]::run_test::{closure#0}<unknown>
  466. 30.31 s gammaloop-nextest-core> at <unknown source file>:<unknown line>
  467. 30.31 s gammaloop-nextest-core> 13: std[bcb96dfbba0ab899]::sys::backtrace::__rust_begin_short_backtrace::<test[75d6903177b1d7e9]::run_test::{closure#1}, ()><unknown>
  468. 30.31 s gammaloop-nextest-core> at <unknown source file>:<unknown line>
  469. 30.31 s gammaloop-nextest-core> 14: <std[bcb96dfbba0ab899]::thread::lifecycle::spawn_unchecked<test[75d6903177b1d7e9]::run_test::{closure#1}, ()>::{closure#1} as core[940e698046960fd5]::ops::function::FnOnce<()>>::call_once::{shim:vtable#0}<unknown>
  470. 30.31 s gammaloop-nextest-core> at <unknown source file>:<unknown line>
  471. 30.31 s gammaloop-nextest-core> 15: <std[bcb96dfbba0ab899]::sys::thread::unix::Thread>::new::thread_start<unknown>
  472. 30.31 s gammaloop-nextest-core> at <unknown source file>:<unknown line>
  473. 30.31 s gammaloop-nextest-core> 16: start_thread<unknown>
  474. 30.31 s gammaloop-nextest-core> at <unknown source file>:<unknown line>
  475. 30.31 s gammaloop-nextest-core> 17: __clone3<unknown>
  476. 30.31 s gammaloop-nextest-core> at <unknown source file>:<unknown line>
  477. 30.31 s gammaloop-nextest-core>
  478. 30.31 s gammaloop-nextest-core> Run with COLORBT_SHOW_HIDDEN=1 environment variable to disable frame filtering.
  479. 30.31 s gammaloop-nextest-core> Run with RUST_BACKTRACE=full to include source snippets.
  480. 30.31 s gammaloop-nextest-core>
  481. 30.31 s gammaloop-nextest-core> FAIL [ 5.321s] (479/483) gammalooprs cff::generation::tests_cff::thermal_bugblatter
  482. 30.31 s gammaloop-nextest-core> stdout ---
  483. 30.31 s gammaloop-nextest-core>
  484. 30.31 s gammaloop-nextest-core> running 1 test
  485. 30.31 s gammaloop-nextest-core> test cff::generation::tests_cff::thermal_bugblatter ... FAILED
  486. 30.31 s gammaloop-nextest-core>
  487. 30.31 s gammaloop-nextest-core> failures:
  488. 30.31 s gammaloop-nextest-core>
  489. 30.31 s gammaloop-nextest-core> failures:
  490. 30.31 s gammaloop-nextest-core> cff::generation::tests_cff::thermal_bugblatter
  491. 30.31 s gammaloop-nextest-core>
  492. 30.31 s gammaloop-nextest-core> test result: FAILED. 0 passed; 1 failed; 0 ignored; 0 measured; 535 filtered out; finished in 5.24s
  493. 30.31 s gammaloop-nextest-core>
  494. 30.31 s gammaloop-nextest-core> stderr ---
  495. 30.31 s gammaloop-nextest-core>
  496. 30.31 s gammaloop-nextest-core> thread 'cff::generation::tests_cff::thermal_bugblatter' (1274) panicked at /nix/store/l5xazfnr7k6r6p8mlkn38x2afab0rygz-vendor-cargo-deps/5929dab090e556a579e9f3b708cd2e67c60b3d84a12b5a276f2a36cb00473133/symbolica-2.2.0/src/evaluate/evaluator.rs:295:21:
  497. 30.31 s gammaloop-nextest-core> External function 'symbolica_coth' does not have an implementation for gammalooprs::utils::F<f64>
  498. 30.31 s gammaloop-nextest-core> stack backtrace:
  499. 30.31 s gammaloop-nextest-core> 0: __rustc::rust_begin_unwind
  500. 30.31 s gammaloop-nextest-core> 1: core::panicking::panic_fmt
  501. 30.31 s gammaloop-nextest-core> 2: <symbolica::evaluate::evaluator::ExpressionEvaluator<gammalooprs::utils::F<f64>>>::evaluate_impl_no_ops
  502. 30.31 s gammaloop-nextest-core> 3: <symbolica::evaluate::evaluator::ExpressionEvaluator<gammalooprs::utils::F<f64>>>::evaluate_single
  503. 30.31 s gammaloop-nextest-core> 4: gammalooprs::cff::generation::tests_cff::thermal_bugblatter
  504. 30.31 s gammaloop-nextest-core> 5: <gammalooprs::cff::generation::tests_cff::thermal_bugblatter::{closure#0} as core::ops::function::FnOnce<()>>::call_once
  505. 30.31 s gammaloop-nextest-core> note: Some details are omitted, run with `RUST_BACKTRACE=full` for a verbose backtrace.
  506. 30.31 s gammaloop-nextest-core>
  507. 30.37 s gammaloop-nextest-core> error: test run failed
  508. 30.39 s gammaloop-nextest-core>
  509. 30.39 s gammaloop-nextest-core> ========== nextest test summary ==========
  510. 30.39 s gammaloop-nextest-core> report: target/nextest/ci_gammaloop/junit.xml
  511. 30.39 s gammaloop-nextest-core> tests: 483, failures: 7, errors: 0
  512. 30.39 s gammaloop-nextest-core>
  513. 30.39 s gammaloop-nextest-core> 1. gammalooprs::cff::generation::tests_cff::thermal_eight
  514. 30.39 s gammaloop-nextest-core> failure: test failure with exit code 101
  515. 30.39 s gammaloop-nextest-core> thread 'cff::generation::tests_cff::thermal_eight' (1282) panicked at /nix/store/l5xazfnr7k6r6p8mlkn38x2afab0rygz-vendor-cargo-deps/5929dab090e556a579e9f3b708cd2e67c60b3d84a12b5a276f2a36cb00473133/symbolica-2.2.0/src/evaluate/evaluator.rs:295:21:
  516. 30.39 s gammaloop-nextest-core> External function 'symbolica_coth' does not have an implementation for gammalooprs::utils::F<f64>
  517. 30.39 s gammaloop-nextest-core> stack backtrace:
  518. 30.39 s gammaloop-nextest-core> 0: __rustc::rust_begin_unwind
  519. 30.39 s gammaloop-nextest-core> 1: core::panicking::panic_fmt
  520. 30.39 s gammaloop-nextest-core> 2: <symbolica::evaluate::evaluator::ExpressionEvaluator<gammalooprs::utils::F<f64>>>::evaluate_impl_no_ops
  521. 30.39 s gammaloop-nextest-core> 3: <symbolica::evaluate::evaluator::ExpressionEvaluator<gammalooprs::utils::F<f64>>>::evaluate_single
  522. 30.39 s gammaloop-nextest-core> 4: gammalooprs::cff::generation::tests_cff::thermal_eight
  523. 30.39 s gammaloop-nextest-core> 5: <gammalooprs::cff::generation::tests_cff::thermal_eight::{closure#0} as core::ops::function::FnOnce<()>>::call_once
  524. 30.39 s gammaloop-nextest-core> note: Some details are omitted, run with `RUST_BACKTRACE=full` for a verbose backtrace.
  525. 30.39 s gammaloop-nextest-core> system-out
  526. 30.39 s gammaloop-nextest-core> running 1 test
  527. 30.39 s gammaloop-nextest-core> test cff::generation::tests_cff::thermal_eight ... FAILED
  528. 30.39 s gammaloop-nextest-core>
  529. 30.39 s gammaloop-nextest-core> failures:
  530. 30.39 s gammaloop-nextest-core>
  531. 30.39 s gammaloop-nextest-core> failures:
  532. 30.39 s gammaloop-nextest-core> cff::generation::tests_cff::thermal_eight
  533. 30.39 s gammaloop-nextest-core>
  534. 30.39 s gammaloop-nextest-core> test result: FAILED. 0 passed; 1 failed; 0 ignored; 0 measured; 535 filtered out; finished in 0.01s
  535. 30.39 s gammaloop-nextest-core> system-err
  536. 30.39 s gammaloop-nextest-core> thread 'cff::generation::tests_cff::thermal_eight' (1282) panicked at /nix/store/l5xazfnr7k6r6p8mlkn38x2afab0rygz-vendor-cargo-deps/5929dab090e556a579e9f3b708cd2e67c60b3d84a12b5a276f2a36cb00473133/symbolica-2.2.0/src/evaluate/evaluator.rs:295:21:
  537. 30.39 s gammaloop-nextest-core> External function 'symbolica_coth' does not have an implementation for gammalooprs::utils::F<f64>
  538. 30.39 s gammaloop-nextest-core> stack backtrace:
  539. 30.39 s gammaloop-nextest-core> 0: __rustc::rust_begin_unwind
  540. 30.39 s gammaloop-nextest-core> 1: core::panicking::panic_fmt
  541. 30.39 s gammaloop-nextest-core> 2: <symbolica::evaluate::evaluator::ExpressionEvaluator<gammalooprs::utils::F<f64>>>::evaluate_impl_no_ops
  542. 30.39 s gammaloop-nextest-core> 3: <symbolica::evaluate::evaluator::ExpressionEvaluator<gammalooprs::utils::F<f64>>>::evaluate_single
  543. 30.39 s gammaloop-nextest-core> 4: gammalooprs::cff::generation::tests_cff::thermal_eight
  544. 30.39 s gammaloop-nextest-core> 5: <gammalooprs::cff::generation::tests_cff::thermal_eight::{closure#0} as core::ops::function::FnOnce<()>>::call_once
  545. 30.39 s gammaloop-nextest-core> note: Some details are omitted, run with `RUST_BACKTRACE=full` for a verbose backtrace.
  546. 30.39 s gammaloop-nextest-core>
  547. 30.39 s gammaloop-nextest-core> 2. gammalooprs::cff::generation::tests_cff::thermal_bubble_chain
  548. 30.39 s gammaloop-nextest-core> failure: test failure with exit code 101
  549. 30.39 s gammaloop-nextest-core> thread 'cff::generation::tests_cff::thermal_bubble_chain' (1273) panicked at /nix/store/l5xazfnr7k6r6p8mlkn38x2afab0rygz-vendor-cargo-deps/5929dab090e556a579e9f3b708cd2e67c60b3d84a12b5a276f2a36cb00473133/symbolica-2.2.0/src/evaluate/evaluator.rs:295:21:
  550. 30.39 s gammaloop-nextest-core> External function 'symbolica_coth' does not have an implementation for gammalooprs::utils::F<f64>
  551. 30.39 s gammaloop-nextest-core> stack backtrace:
  552. 30.39 s gammaloop-nextest-core> 0: __rustc::rust_begin_unwind
  553. 30.39 s gammaloop-nextest-core> 1: core::panicking::panic_fmt
  554. 30.39 s gammaloop-nextest-core> 2: <symbolica::evaluate::evaluator::ExpressionEvaluator<gammalooprs::utils::F<f64>>>::evaluate_impl_no_ops
  555. 30.39 s gammaloop-nextest-core> 3: <symbolica::evaluate::evaluator::ExpressionEvaluator<gammalooprs::utils::F<f64>>>::evaluate_single
  556. 30.39 s gammaloop-nextest-core> 4: gammalooprs::cff::generation::tests_cff::thermal_bubble_chain
  557. 30.39 s gammaloop-nextest-core> 5: <gammalooprs::cff::generation::tests_cff::thermal_bubble_chain::{closure#0} as core::ops::function::FnOnce<()>>::call_once
  558. 30.39 s gammaloop-nextest-core> note: Some details are omitted, run with `RUST_BACKTRACE=full` for a verbose backtrace.
  559. 30.39 s gammaloop-nextest-core> system-out
  560. 30.39 s gammaloop-nextest-core> running 1 test
  561. 30.39 s gammaloop-nextest-core> test cff::generation::tests_cff::thermal_bubble_chain ... FAILED
  562. 30.39 s gammaloop-nextest-core>
  563. 30.39 s gammaloop-nextest-core> failures:
  564. 30.39 s gammaloop-nextest-core>
  565. 30.39 s gammaloop-nextest-core> failures:
  566. 30.39 s gammaloop-nextest-core> cff::generation::tests_cff::thermal_bubble_chain
  567. 30.39 s gammaloop-nextest-core>
  568. 30.39 s gammaloop-nextest-core> test result: FAILED. 0 passed; 1 failed; 0 ignored; 0 measured; 535 filtered out; finished in 0.01s
  569. 30.39 s gammaloop-nextest-core> system-err
  570. 30.39 s gammaloop-nextest-core> thread 'cff::generation::tests_cff::thermal_bubble_chain' (1273) panicked at /nix/store/l5xazfnr7k6r6p8mlkn38x2afab0rygz-vendor-cargo-deps/5929dab090e556a579e9f3b708cd2e67c60b3d84a12b5a276f2a36cb00473133/symbolica-2.2.0/src/evaluate/evaluator.rs:295:21:
  571. 30.39 s gammaloop-nextest-core> External function 'symbolica_coth' does not have an implementation for gammalooprs::utils::F<f64>
  572. 30.39 s gammaloop-nextest-core> stack backtrace:
  573. 30.39 s gammaloop-nextest-core> 0: __rustc::rust_begin_unwind
  574. 30.39 s gammaloop-nextest-core> 1: core::panicking::panic_fmt
  575. 30.39 s gammaloop-nextest-core> 2: <symbolica::evaluate::evaluator::ExpressionEvaluator<gammalooprs::utils::F<f64>>>::evaluate_impl_no_ops
  576. 30.39 s gammaloop-nextest-core> 3: <symbolica::evaluate::evaluator::ExpressionEvaluator<gammalooprs::utils::F<f64>>>::evaluate_single
  577. 30.39 s gammaloop-nextest-core> 4: gammalooprs::cff::generation::tests_cff::thermal_bubble_chain
  578. 30.39 s gammaloop-nextest-core> 5: <gammalooprs::cff::generation::tests_cff::thermal_bubble_chain::{closure#0} as core::ops::function::FnOnce<()>>::call_once
  579. 30.39 s gammaloop-nextest-core> note: Some details are omitted, run with `RUST_BACKTRACE=full` for a verbose backtrace.
  580. 30.39 s gammaloop-nextest-core>
  581. 30.39 s gammaloop-nextest-core> 3. gammalooprs::cff::generation::tests_cff::thermal_bubble
  582. 30.39 s gammaloop-nextest-core> failure: test failure with exit code 101
  583. 30.39 s gammaloop-nextest-core> thread 'cff::generation::tests_cff::thermal_bubble' (1280) panicked at /nix/store/l5xazfnr7k6r6p8mlkn38x2afab0rygz-vendor-cargo-deps/5929dab090e556a579e9f3b708cd2e67c60b3d84a12b5a276f2a36cb00473133/symbolica-2.2.0/src/evaluate/evaluator.rs:295:21:
  584. 30.39 s gammaloop-nextest-core> External function 'symbolica_coth' does not have an implementation for gammalooprs::utils::F<f64>
  585. 30.39 s gammaloop-nextest-core> stack backtrace:
  586. 30.39 s gammaloop-nextest-core> 0: __rustc::rust_begin_unwind
  587. 30.39 s gammaloop-nextest-core> 1: core::panicking::panic_fmt
  588. 30.39 s gammaloop-nextest-core> 2: <symbolica::evaluate::evaluator::ExpressionEvaluator<gammalooprs::utils::F<f64>>>::evaluate_impl_no_ops
  589. 30.39 s gammaloop-nextest-core> 3: <symbolica::evaluate::evaluator::ExpressionEvaluator<gammalooprs::utils::F<f64>>>::evaluate_single
  590. 30.39 s gammaloop-nextest-core> 4: gammalooprs::cff::generation::tests_cff::thermal_bubble
  591. 30.39 s gammaloop-nextest-core> 5: <gammalooprs::cff::generation::tests_cff::thermal_bubble::{closure#0} as core::ops::function::FnOnce<()>>::call_once
  592. 30.39 s gammaloop-nextest-core> note: Some details are omitted, run with `RUST_BACKTRACE=full` for a verbose backtrace.
  593. 30.39 s gammaloop-nextest-core> system-out
  594. 30.39 s gammaloop-nextest-core> running 1 test
  595. 30.39 s gammaloop-nextest-core> test cff::generation::tests_cff::thermal_bubble ... FAILED
  596. 30.39 s gammaloop-nextest-core>
  597. 30.39 s gammaloop-nextest-core> failures:
  598. 30.39 s gammaloop-nextest-core>
  599. 30.39 s gammaloop-nextest-core> failures:
  600. 30.39 s gammaloop-nextest-core> cff::generation::tests_cff::thermal_bubble
  601. 30.39 s gammaloop-nextest-core>
  602. 30.39 s gammaloop-nextest-core> test result: FAILED. 0 passed; 1 failed; 0 ignored; 0 measured; 535 filtered out; finished in 0.01s
  603. 30.39 s gammaloop-nextest-core> system-err
  604. 30.39 s gammaloop-nextest-core> thread 'cff::generation::tests_cff::thermal_bubble' (1280) panicked at /nix/store/l5xazfnr7k6r6p8mlkn38x2afab0rygz-vendor-cargo-deps/5929dab090e556a579e9f3b708cd2e67c60b3d84a12b5a276f2a36cb00473133/symbolica-2.2.0/src/evaluate/evaluator.rs:295:21:
  605. 30.39 s gammaloop-nextest-core> External function 'symbolica_coth' does not have an implementation for gammalooprs::utils::F<f64>
  606. 30.39 s gammaloop-nextest-core> stack backtrace:
  607. 30.39 s gammaloop-nextest-core> 0: __rustc::rust_begin_unwind
  608. 30.39 s gammaloop-nextest-core> 1: core::panicking::panic_fmt
  609. 30.39 s gammaloop-nextest-core> 2: <symbolica::evaluate::evaluator::ExpressionEvaluator<gammalooprs::utils::F<f64>>>::evaluate_impl_no_ops
  610. 30.39 s gammaloop-nextest-core> 3: <symbolica::evaluate::evaluator::ExpressionEvaluator<gammalooprs::utils::F<f64>>>::evaluate_single
  611. 30.39 s gammaloop-nextest-core> 4: gammalooprs::cff::generation::tests_cff::thermal_bubble
  612. 30.39 s gammaloop-nextest-core> 5: <gammalooprs::cff::generation::tests_cff::thermal_bubble::{closure#0} as core::ops::function::FnOnce<()>>::call_once
  613. 30.39 s gammaloop-nextest-core> note: Some details are omitted, run with `RUST_BACKTRACE=full` for a verbose backtrace.
  614. 30.39 s gammaloop-nextest-core>
  615. 30.39 s gammaloop-nextest-core> 4. gammalooprs::cff::generation::tests_cff::thermal_ring
  616. 30.39 s gammaloop-nextest-core> failure: test failure with exit code 101
  617. 30.39 s gammaloop-nextest-core> thread 'cff::generation::tests_cff::thermal_ring' (1291) panicked at /nix/store/l5xazfnr7k6r6p8mlkn38x2afab0rygz-vendor-cargo-deps/5929dab090e556a579e9f3b708cd2e67c60b3d84a12b5a276f2a36cb00473133/symbolica-2.2.0/src/evaluate/evaluator.rs:295:21:
  618. 30.39 s gammaloop-nextest-core> External function 'symbolica_coth' does not have an implementation for gammalooprs::utils::F<f64>
  619. 30.39 s gammaloop-nextest-core> stack backtrace:
  620. 30.39 s gammaloop-nextest-core> 0: __rustc::rust_begin_unwind
  621. 30.39 s gammaloop-nextest-core> 1: core::panicking::panic_fmt
  622. 30.39 s gammaloop-nextest-core> 2: <symbolica::evaluate::evaluator::ExpressionEvaluator<gammalooprs::utils::F<f64>>>::evaluate_impl_no_ops
  623. 30.39 s gammaloop-nextest-core> 3: <symbolica::evaluate::evaluator::ExpressionEvaluator<gammalooprs::utils::F<f64>>>::evaluate_single
  624. 30.39 s gammaloop-nextest-core> 4: gammalooprs::cff::generation::tests_cff::thermal_ring
  625. 30.39 s gammaloop-nextest-core> 5: <gammalooprs::cff::generation::tests_cff::thermal_ring::{closure#0} as core::ops::function::FnOnce<()>>::call_once
  626. 30.39 s gammaloop-nextest-core> note: Some details are omitted, run with `RUST_BACKTRACE=full` for a verbose backtrace.
  627. 30.39 s gammaloop-nextest-core> system-out
  628. 30.39 s gammaloop-nextest-core> running 1 test
  629. 30.39 s gammaloop-nextest-core> test cff::generation::tests_cff::thermal_ring ... FAILED
  630. 30.39 s gammaloop-nextest-core>
  631. 30.39 s gammaloop-nextest-core> failures:
  632. 30.39 s gammaloop-nextest-core>
  633. 30.39 s gammaloop-nextest-core> failures:
  634. 30.39 s gammaloop-nextest-core> cff::generation::tests_cff::thermal_ring
  635. 30.39 s gammaloop-nextest-core>
  636. 30.39 s gammaloop-nextest-core> test result: FAILED. 0 passed; 1 failed; 0 ignored; 0 measured; 535 filtered out; finished in 0.06s
  637. 30.39 s gammaloop-nextest-core> system-err
  638. 30.39 s gammaloop-nextest-core> thread 'cff::generation::tests_cff::thermal_ring' (1291) panicked at /nix/store/l5xazfnr7k6r6p8mlkn38x2afab0rygz-vendor-cargo-deps/5929dab090e556a579e9f3b708cd2e67c60b3d84a12b5a276f2a36cb00473133/symbolica-2.2.0/src/evaluate/evaluator.rs:295:21:
  639. 30.39 s gammaloop-nextest-core> External function 'symbolica_coth' does not have an implementation for gammalooprs::utils::F<f64>
  640. 30.39 s gammaloop-nextest-core> stack backtrace:
  641. 30.39 s gammaloop-nextest-core> 0: __rustc::rust_begin_unwind
  642. 30.39 s gammaloop-nextest-core> 1: core::panicking::panic_fmt
  643. 30.39 s gammaloop-nextest-core> 2: <symbolica::evaluate::evaluator::ExpressionEvaluator<gammalooprs::utils::F<f64>>>::evaluate_impl_no_ops
  644. 30.39 s gammaloop-nextest-core> 3: <symbolica::evaluate::evaluator::ExpressionEvaluator<gammalooprs::utils::F<f64>>>::evaluate_single
  645. 30.39 s gammaloop-nextest-core> 4: gammalooprs::cff::generation::tests_cff::thermal_ring
  646. 30.39 s gammaloop-nextest-core> 5: <gammalooprs::cff::generation::tests_cff::thermal_ring::{closure#0} as core::ops::function::FnOnce<()>>::call_once
  647. 30.39 s gammaloop-nextest-core> note: Some details are omitted, run with `RUST_BACKTRACE=full` for a verbose backtrace.
  648. 30.39 s gammaloop-nextest-core>
  649. 30.39 s gammaloop-nextest-core> 5. gammalooprs::cff::generation::tests_cff::thermal_mercedes
  650. 30.39 s gammaloop-nextest-core> failure: test failure with exit code 101
  651. 30.39 s gammaloop-nextest-core> thread 'cff::generation::tests_cff::thermal_mercedes' (1276) panicked at /nix/store/l5xazfnr7k6r6p8mlkn38x2afab0rygz-vendor-cargo-deps/5929dab090e556a579e9f3b708cd2e67c60b3d84a12b5a276f2a36cb00473133/symbolica-2.2.0/src/evaluate/evaluator.rs:295:21:
  652. 30.39 s gammaloop-nextest-core> External function 'symbolica_coth' does not have an implementation for gammalooprs::utils::F<f64>
  653. 30.39 s gammaloop-nextest-core> stack backtrace:
  654. 30.39 s gammaloop-nextest-core> 0: __rustc::rust_begin_unwind
  655. 30.39 s gammaloop-nextest-core> 1: core::panicking::panic_fmt
  656. 30.39 s gammaloop-nextest-core> 2: <symbolica::evaluate::evaluator::ExpressionEvaluator<gammalooprs::utils::F<f64>>>::evaluate_impl_no_ops
  657. 30.39 s gammaloop-nextest-core> 3: <symbolica::evaluate::evaluator::ExpressionEvaluator<gammalooprs::utils::F<f64>>>::evaluate_single
  658. 30.39 s gammaloop-nextest-core> 4: gammalooprs::cff::generation::tests_cff::thermal_mercedes
  659. 30.39 s gammaloop-nextest-core> 5: <gammalooprs::cff::generation::tests_cff::thermal_mercedes::{closure#0} as core::ops::function::FnOnce<()>>::call_once
  660. 30.39 s gammaloop-nextest-core> note: Some details are omitted, run with `RUST_BACKTRACE=full` for a verbose backtrace.
  661. 30.39 s gammaloop-nextest-core> system-out
  662. 30.39 s gammaloop-nextest-core> running 1 test
  663. 30.39 s gammaloop-nextest-core> test cff::generation::tests_cff::thermal_mercedes ... FAILED
  664. 30.39 s gammaloop-nextest-core>
  665. 30.39 s gammaloop-nextest-core> failures:
  666. 30.39 s gammaloop-nextest-core>
  667. 30.39 s gammaloop-nextest-core> failures:
  668. 30.39 s gammaloop-nextest-core> cff::generation::tests_cff::thermal_mercedes
  669. 30.39 s gammaloop-nextest-core>
  670. 30.39 s gammaloop-nextest-core> test result: FAILED. 0 passed; 1 failed; 0 ignored; 0 measured; 535 filtered out; finished in 0.10s
  671. 30.39 s gammaloop-nextest-core> system-err
  672. 30.39 s gammaloop-nextest-core> thread 'cff::generation::tests_cff::thermal_mercedes' (1276) panicked at /nix/store/l5xazfnr7k6r6p8mlkn38x2afab0rygz-vendor-cargo-deps/5929dab090e556a579e9f3b708cd2e67c60b3d84a12b5a276f2a36cb00473133/symbolica-2.2.0/src/evaluate/evaluator.rs:295:21:
  673. 30.39 s gammaloop-nextest-core> External function 'symbolica_coth' does not have an implementation for gammalooprs::utils::F<f64>
  674. 30.39 s gammaloop-nextest-core> stack backtrace:
  675. 30.39 s gammaloop-nextest-core> 0: __rustc::rust_begin_unwind
  676. 30.39 s gammaloop-nextest-core> 1: core::panicking::panic_fmt
  677. 30.39 s gammaloop-nextest-core> 2: <symbolica::evaluate::evaluator::ExpressionEvaluator<gammalooprs::utils::F<f64>>>::evaluate_impl_no_ops
  678. 30.39 s gammaloop-nextest-core> 3: <symbolica::evaluate::evaluator::ExpressionEvaluator<gammalooprs::utils::F<f64>>>::evaluate_single
  679. 30.39 s gammaloop-nextest-core> 4: gammalooprs::cff::generation::tests_cff::thermal_mercedes
  680. 30.39 s gammaloop-nextest-core> 5: <gammalooprs::cff::generation::tests_cff::thermal_mercedes::{closure#0} as core::ops::function::FnOnce<()>>::call_once
  681. 30.39 s gammaloop-nextest-core> note: Some details are omitted, run with `RUST_BACKTRACE=full` for a verbose backtrace.
  682. 30.39 s gammaloop-nextest-core>
  683. 30.39 s gammaloop-nextest-core> 6. gammalooprs::graph::feynman_graph::tests::native_thermal_distributions
  684. 30.39 s gammaloop-nextest-core> failure: test failure with exit code 101
  685. 30.39 s gammaloop-nextest-core> system-out
  686. 30.39 s gammaloop-nextest-core> running 1 test
  687. 30.39 s gammaloop-nextest-core> test graph::feynman_graph::tests::native_thermal_distributions ... FAILED
  688. 30.39 s gammaloop-nextest-core>
  689. 30.39 s gammaloop-nextest-core> failures:
  690. 30.39 s gammaloop-nextest-core>
  691. 30.39 s gammaloop-nextest-core> failures:
  692. 30.39 s gammaloop-nextest-core> graph::feynman_graph::tests::native_thermal_distributions
  693. 30.39 s gammaloop-nextest-core>
  694. 30.39 s gammaloop-nextest-core> test result: FAILED. 0 passed; 1 failed; 0 ignored; 0 measured; 535 filtered out; finished in 0.44s
  695. 30.39 s gammaloop-nextest-core> system-err
  696. 30.39 s gammaloop-nextest-core> The application panicked (crashed).
  697. 30.39 s gammaloop-nextest-core> Message: called `Result::unwrap()` on an `Err` value: Custom { kind: Other, error: "Could not compile code: g++ -shared -O3 -fPIC -ffast-math -funsafe-math-optimizations -march=native -o /build/gammaloop-native-thermal-1345/thermal_0_0.so /build/gammaloop-native-thermal-1345/thermal_0_0.cpp\nwarning: Skipping impure flag -march=native because NIX_ENFORCE_NO_NATIVE is set\n/build/gammaloop-native-thermal-1345/thermal_0_0.cpp: In function 'void thermal_realf64(const double*, double*, double*)':\n/build/gammaloop-native-thermal-1345/thermal_0_0.cpp:27:16: error: 'symbolica_tanh' was not declared in this scope\n 27 | Z[6] = symbolica_tanh(Z[6]);\n | ^~~~~~~~~~~~~~\n" }
  698. 30.39 s gammaloop-nextest-core> Location: crates/gammalooprs/src/graph/feynman_graph.rs:937
  699. 30.39 s gammaloop-nextest-core>
  700. 30.39 s gammaloop-nextest-core> ━━━━━━━━━━━━━━━━━━━━━━━━━━━━━━━━━━ BACKTRACE ━━━━━━━━━━━━━━━━━━━━━━━━━━━━━━━━━━━
  701. 30.39 s gammaloop-nextest-core> 1: <color_eyre[b0c9e66060e883b2]::config::PanicHook>::panic_report<unknown>
  702. 30.39 s gammaloop-nextest-core> at <unknown source file>:<unknown line>
  703. 30.39 s gammaloop-nextest-core> 2: <color_eyre[b0c9e66060e883b2]::config::PanicHook>::into_panic_hook::{closure#0}<unknown>
  704. 30.39 s gammaloop-nextest-core> at <unknown source file>:<unknown line>
  705. 30.39 s gammaloop-nextest-core> 3: std[bcb96dfbba0ab899]::panicking::panic_with_hook<unknown>
  706. 30.39 s gammaloop-nextest-core> at <unknown source file>:<unknown line>
  707. 30.39 s gammaloop-nextest-core> 4: std[bcb96dfbba0ab899]::panicking::panic_handler::{closure#0}<unknown>
  708. 30.39 s gammaloop-nextest-core> at <unknown source file>:<unknown line>
  709. 30.39 s gammaloop-nextest-core> 5: std[bcb96dfbba0ab899]::sys::backtrace::__rust_end_short_backtrace::<std[bcb96dfbba0ab899]::panicking::panic_handler::{closure#0}, !><unknown>
  710. 30.39 s gammaloop-nextest-core> at <unknown source file>:<unknown line>
  711. 30.39 s gammaloop-nextest-core> 6: __rustc[6c289b9f9c454d21]::rust_begin_unwind<unknown>
  712. 30.39 s gammaloop-nextest-core> at <unknown source file>:<unknown line>
  713. 30.39 s gammaloop-nextest-core> 7: core[940e698046960fd5]::panicking::panic_fmt<unknown>
  714. 30.39 s gammaloop-nextest-core> at <unknown source file>:<unknown line>
  715. 30.39 s gammaloop-nextest-core> 8: core[940e698046960fd5]::result::unwrap_failed<unknown>
  716. 30.39 s gammaloop-nextest-core> at <unknown source file>:<unknown line>
  717. 30.39 s gammaloop-nextest-core> 9: gammalooprs[f21b74aec46f5289]::graph::feynman_graph::tests::native_thermal_distributions<unknown>
  718. 30.39 s gammaloop-nextest-core> at <unknown source file>:<unknown line>
  719. 30.39 s gammaloop-nextest-core> 10: <gammalooprs[f21b74aec46f5289]::graph::feynman_graph::tests::native_thermal_distributions::{closure#0} as core[940e698046960fd5]::ops::function::FnOnce<()>>::call_once<unknown>
  720. 30.39 s gammaloop-nextest-core> at <unknown source file>:<unknown line>
  721. 30.39 s gammaloop-nextest-core> 11: test[75d6903177b1d7e9]::__rust_begin_short_backtrace::<core[940e698046960fd5]::result::Result<(), alloc[2ea6bcb46fca0c42]::string::String>, fn() -> core[940e698046960fd5]::result::Result<(), alloc[2ea6bcb46fca0c42]::string::String>><unknown>
  722. 30.39 s gammaloop-nextest-core> at <unknown source file>:<unknown line>
  723. 30.39 s gammaloop-nextest-core> 12: test[75d6903177b1d7e9]::run_test::{closure#0}<unknown>
  724. 30.39 s gammaloop-nextest-core> at <unknown source file>:<unknown line>
  725. 30.39 s gammaloop-nextest-core> 13: std[bcb96dfbba0ab899]::sys::backtrace::__rust_begin_short_backtrace::<test[75d6903177b1d7e9]::run_test::{closure#1}, ()><unknown>
  726. 30.39 s gammaloop-nextest-core> at <unknown source file>:<unknown line>
  727. 30.39 s gammaloop-nextest-core> 14: <std[bcb96dfbba0ab899]::thread::lifecycle::spawn_unchecked<test[75d6903177b1d7e9]::run_test::{closure#1}, ()>::{closure#1} as core[940e698046960fd5]::ops::function::FnOnce<()>>::call_once::{shim:vtable#0}<unknown>
  728. 30.39 s gammaloop-nextest-core> at <unknown source file>:<unknown line>
  729. 30.39 s gammaloop-nextest-core> 15: <std[bcb96dfbba0ab899]::sys::thread::unix::Thread>::new::thread_start<unknown>
  730. 30.39 s gammaloop-nextest-core> at <unknown source file>:<unknown line>
  731. 30.39 s gammaloop-nextest-core> 16: start_thread<unknown>
  732. 30.39 s gammaloop-nextest-core> at <unknown source file>:<unknown line>
  733. 30.39 s gammaloop-nextest-core> 17: __clone3<unknown>
  734. 30.39 s gammaloop-nextest-core> at <unknown source file>:<unknown line>
  735. 30.39 s gammaloop-nextest-core>
  736. 30.39 s gammaloop-nextest-core> Run with COLORBT_SHOW_HIDDEN=1 environment variable to disable frame filtering.
  737. 30.39 s gammaloop-nextest-core> Run with RUST_BACKTRACE=full to include source snippets.
  738. 30.39 s gammaloop-nextest-core>
  739. 30.39 s gammaloop-nextest-core> 7. gammalooprs::cff::generation::tests_cff::thermal_bugblatter
  740. 30.39 s gammaloop-nextest-core> failure: test failure with exit code 101
  741. 30.39 s gammaloop-nextest-core> thread 'cff::generation::tests_cff::thermal_bugblatter' (1274) panicked at /nix/store/l5xazfnr7k6r6p8mlkn38x2afab0rygz-vendor-cargo-deps/5929dab090e556a579e9f3b708cd2e67c60b3d84a12b5a276f2a36cb00473133/symbolica-2.2.0/src/evaluate/evaluator.rs:295:21:
  742. 30.39 s gammaloop-nextest-core> External function 'symbolica_coth' does not have an implementation for gammalooprs::utils::F<f64>
  743. 30.39 s gammaloop-nextest-core> stack backtrace:
  744. 30.39 s gammaloop-nextest-core> 0: __rustc::rust_begin_unwind
  745. 30.39 s gammaloop-nextest-core> 1: core::panicking::panic_fmt
  746. 30.39 s gammaloop-nextest-core> 2: <symbolica::evaluate::evaluator::ExpressionEvaluator<gammalooprs::utils::F<f64>>>::evaluate_impl_no_ops
  747. 30.39 s gammaloop-nextest-core> 3: <symbolica::evaluate::evaluator::ExpressionEvaluator<gammalooprs::utils::F<f64>>>::evaluate_single
  748. 30.39 s gammaloop-nextest-core> 4: gammalooprs::cff::generation::tests_cff::thermal_bugblatter
  749. 30.39 s gammaloop-nextest-core> 5: <gammalooprs::cff::generation::tests_cff::thermal_bugblatter::{closure#0} as core::ops::function::FnOnce<()>>::call_once
  750. 30.39 s gammaloop-nextest-core> note: Some details are omitted, run with `RUST_BACKTRACE=full` for a verbose backtrace.
  751. 30.39 s gammaloop-nextest-core> system-out
  752. 30.39 s gammaloop-nextest-core> running 1 test
  753. 30.39 s gammaloop-nextest-core> test cff::generation::tests_cff::thermal_bugblatter ... FAILED
  754. 30.39 s gammaloop-nextest-core>
  755. 30.39 s gammaloop-nextest-core> failures:
  756. 30.39 s gammaloop-nextest-core>
  757. 30.39 s gammaloop-nextest-core> failures:
  758. 30.39 s gammaloop-nextest-core> cff::generation::tests_cff::thermal_bugblatter
  759. 30.39 s gammaloop-nextest-core>
  760. 30.39 s gammaloop-nextest-core> test result: FAILED. 0 passed; 1 failed; 0 ignored; 0 measured; 535 filtered out; finished in 5.24s
  761. 30.39 s gammaloop-nextest-core> system-err
  762. 30.39 s gammaloop-nextest-core> thread 'cff::generation::tests_cff::thermal_bugblatter' (1274) panicked at /nix/store/l5xazfnr7k6r6p8mlkn38x2afab0rygz-vendor-cargo-deps/5929dab090e556a579e9f3b708cd2e67c60b3d84a12b5a276f2a36cb00473133/symbolica-2.2.0/src/evaluate/evaluator.rs:295:21:
  763. 30.39 s gammaloop-nextest-core> External function 'symbolica_coth' does not have an implementation for gammalooprs::utils::F<f64>
  764. 30.39 s gammaloop-nextest-core> stack backtrace:
  765. 30.39 s gammaloop-nextest-core> 0: __rustc::rust_begin_unwind
  766. 30.39 s gammaloop-nextest-core> 1: core::panicking::panic_fmt
  767. 30.39 s gammaloop-nextest-core> 2: <symbolica::evaluate::evaluator::ExpressionEvaluator<gammalooprs::utils::F<f64>>>::evaluate_impl_no_ops
  768. 30.39 s gammaloop-nextest-core> 3: <symbolica::evaluate::evaluator::ExpressionEvaluator<gammalooprs::utils::F<f64>>>::evaluate_single
  769. 30.39 s gammaloop-nextest-core> 4: gammalooprs::cff::generation::tests_cff::thermal_bugblatter
  770. 30.39 s gammaloop-nextest-core> 5: <gammalooprs::cff::generation::tests_cff::thermal_bugblatter::{closure#0} as core::ops::function::FnOnce<()>>::call_once
  771. 30.39 s gammaloop-nextest-core> note: Some details are omitted, run with `RUST_BACKTRACE=full` for a verbose backtrace.
  772. 30.39 s gammaloop-nextest-core> =========================================
  773. 30.43 s error: Cannot build '/nix/store/8r84j4srh5jz28101cd8xndlncp1i0gs-gammaloop-nextest-core.drv'.
  774. 30.43 s Reason: builder failed with exit code 100.
  775. 30.43 s Output paths:
  776. 30.43 s /nix/store/31q585g5sl9sp361gqhbqb1ds9nvb6js-gammaloop-nextest-core
  777. 30.43 s Last 738 log lines:
  778. 30.43 s > Extracting 3 binaries (including 1 non-test binary), 1 build script output directory, and 2 linked paths to /build/nextest-archive-ocZF4V
  779. 30.43 s > Extracted 18 files to /build/nextest-archive-ocZF4V in 0.39s
  780. 30.43 s > ------------
  781. 30.43 s > Nextest run ID b156a1cf-0e63-4889-a6d3-8a6074ed94a3 with nextest profile: ci_gammaloop
  782. 30.43 s > Starting 339 tests across 2 binaries
  783. 30.43 s > ------------
  784. 30.43 s > Summary [ 0.407s] 339 tests run: 339 passed, 0 skipped
  785. 30.43 s >
  786. 30.43 s > ========== nextest test summary ==========
  787. 30.43 s > report: target/nextest/ci_gammaloop/junit.xml
  788. 30.43 s > tests: 339, failures: 0, errors: 0
  789. 30.43 s > No failing testcases found.
  790. 30.43 s > =========================================
  791. 30.43 s > Extracting 1 binary and 1 linked path to /build/nextest-archive-nEFrtg
  792. 30.43 s > Extracted 7 files to /build/nextest-archive-nEFrtg in 0.06s
  793. 30.43 s > ------------
  794. 30.43 s > Nextest run ID 5d4917af-8cc4-4a1b-84bf-acabf2b77377 with nextest profile: ci_gammaloop
  795. 30.43 s > Starting 19 tests across 1 binary
  796. 30.43 s > ------------
  797. 30.43 s > Summary [ 0.010s] 19 tests run: 19 passed, 0 skipped
  798. 30.43 s >
  799. 30.43 s > ========== nextest test summary ==========
  800. 30.43 s > report: target/nextest/ci_gammaloop/junit.xml
  801. 30.43 s > tests: 19, failures: 0, errors: 0
  802. 30.43 s > No failing testcases found.
  803. 30.43 s > =========================================
  804. 30.43 s > Extracting 1 binary to /build/nextest-archive-XExa8G
  805. 30.43 s > Extracted 4 files to /build/nextest-archive-XExa8G in 0.03s
  806. 30.43 s > ------------
  807. 30.43 s > Nextest run ID 5f0b8542-db87-4f83-b24e-190edf506fdc with nextest profile: ci_gammaloop
  808. 30.43 s > Starting 0 tests across 1 binary
  809. 30.43 s > ------------
  810. 30.43 s > Summary [ 0.000s] 0 tests run: 0 passed, 0 skipped
  811. 30.43 s >
  812. 30.43 s > ========== nextest test summary ==========
  813. 30.43 s > report: target/nextest/ci_gammaloop/junit.xml
  814. 30.43 s > tests: 0, failures: 0, errors: 0
  815. 30.43 s > No failing testcases found.
  816. 30.43 s > =========================================
  817. 30.43 s > Extracting 4 binaries, 1 build script output directory, and 2 linked paths to /build/nextest-archive-3Wl95O
  818. 30.43 s > Extracted 18 files to /build/nextest-archive-3Wl95O in 0.40s
  819. 30.43 s > ------------
  820. 30.43 s > Nextest run ID b449860b-a396-41af-91f6-3ff3df4bf1ce with nextest profile: ci_gammaloop
  821. 30.43 s > Starting 483 tests across 4 binaries (61 tests skipped, including 60 tests via profile.ci_gammaloop.default-filter)
  822. 30.43 s > FAIL [ 0.015s] ( 49/483) gammalooprs cff::generation::tests_cff::thermal_eight
  823. 30.43 s > stdout ---
  824. 30.43 s >
  825. 30.43 s > running 1 test
  826. 30.43 s > test cff::generation::tests_cff::thermal_eight ... FAILED
  827. 30.43 s >
  828. 30.43 s > failures:
  829. 30.43 s >
  830. 30.43 s > failures:
  831. 30.43 s > cff::generation::tests_cff::thermal_eight
  832. 30.43 s >
  833. 30.43 s > test result: FAILED. 0 passed; 1 failed; 0 ignored; 0 measured; 535 filtered out; finished in 0.01s
  834. 30.43 s >
  835. 30.43 s > stderr ---
  836. 30.43 s >
  837. 30.43 s > thread 'cff::generation::tests_cff::thermal_eight' (1282) panicked at /nix/store/l5xazfnr7k6r6p8mlkn38x2afab0rygz-vendor-cargo-deps/5929dab090e556a579e9f3b708cd2e67c60b3d84a12b5a276f2a36cb00473133/symbolica-2.2.0/src/evaluate/evaluator.rs:295:21:
  838. 30.43 s > External function 'symbolica_coth' does not have an implementation for gammalooprs::utils::F<f64>
  839. 30.43 s > stack backtrace:
  840. 30.43 s > 0: __rustc::rust_begin_unwind
  841. 30.43 s > 1: core::panicking::panic_fmt
  842. 30.43 s > 2: <symbolica::evaluate::evaluator::ExpressionEvaluator<gammalooprs::utils::F<f64>>>::evaluate_impl_no_ops
  843. 30.43 s > 3: <symbolica::evaluate::evaluator::ExpressionEvaluator<gammalooprs::utils::F<f64>>>::evaluate_single
  844. 30.43 s > 4: gammalooprs::cff::generation::tests_cff::thermal_eight
  845. 30.43 s > 5: <gammalooprs::cff::generation::tests_cff::thermal_eight::{closure#0} as core::ops::function::FnOnce<()>>::call_once
  846. 30.43 s > note: Some details are omitted, run with `RUST_BACKTRACE=full` for a verbose backtrace.
  847. 30.43 s >
  848. 30.43 s > FAIL [ 0.018s] ( 51/483) gammalooprs cff::generation::tests_cff::thermal_bubble_chain
  849. 30.43 s > stdout ---
  850. 30.43 s >
  851. 30.43 s > running 1 test
  852. 30.43 s > test cff::generation::tests_cff::thermal_bubble_chain ... FAILED
  853. 30.43 s >
  854. 30.43 s > failures:
  855. 30.43 s >
  856. 30.43 s > failures:
  857. 30.43 s > cff::generation::tests_cff::thermal_bubble_chain
  858. 30.43 s >
  859. 30.43 s > test result: FAILED. 0 passed; 1 failed; 0 ignored; 0 measured; 535 filtered out; finished in 0.01s
  860. 30.43 s >
  861. 30.43 s > stderr ---
  862. 30.43 s >
  863. 30.43 s > thread 'cff::generation::tests_cff::thermal_bubble_chain' (1273) panicked at /nix/store/l5xazfnr7k6r6p8mlkn38x2afab0rygz-vendor-cargo-deps/5929dab090e556a579e9f3b708cd2e67c60b3d84a12b5a276f2a36cb00473133/symbolica-2.2.0/src/evaluate/evaluator.rs:295:21:
  864. 30.43 s > External function 'symbolica_coth' does not have an implementation for gammalooprs::utils::F<f64>
  865. 30.43 s > stack backtrace:
  866. 30.43 s > 0: __rustc::rust_begin_unwind
  867. 30.43 s > 1: core::panicking::panic_fmt
  868. 30.43 s > 2: <symbolica::evaluate::evaluator::ExpressionEvaluator<gammalooprs::utils::F<f64>>>::evaluate_impl_no_ops
  869. 30.43 s > 3: <symbolica::evaluate::evaluator::ExpressionEvaluator<gammalooprs::utils::F<f64>>>::evaluate_single
  870. 30.43 s > 4: gammalooprs::cff::generation::tests_cff::thermal_bubble_chain
  871. 30.43 s > 5: <gammalooprs::cff::generation::tests_cff::thermal_bubble_chain::{closure#0} as core::ops::function::FnOnce<()>>::call_once
  872. 30.43 s > note: Some details are omitted, run with `RUST_BACKTRACE=full` for a verbose backtrace.
  873. 30.43 s >
  874. 30.43 s > FAIL [ 0.021s] ( 58/483) gammalooprs cff::generation::tests_cff::thermal_bubble
  875. 30.43 s > stdout ---
  876. 30.43 s >
  877. 30.43 s > running 1 test
  878. 30.43 s > test cff::generation::tests_cff::thermal_bubble ... FAILED
  879. 30.43 s >
  880. 30.43 s > failures:
  881. 30.43 s >
  882. 30.43 s > failures:
  883. 30.43 s > cff::generation::tests_cff::thermal_bubble
  884. 30.43 s >
  885. 30.43 s > test result: FAILED. 0 passed; 1 failed; 0 ignored; 0 measured; 535 filtered out; finished in 0.01s
  886. 30.43 s >
  887. 30.43 s > stderr ---
  888. 30.43 s >
  889. 30.43 s > thread 'cff::generation::tests_cff::thermal_bubble' (1280) panicked at /nix/store/l5xazfnr7k6r6p8mlkn38x2afab0rygz-vendor-cargo-deps/5929dab090e556a579e9f3b708cd2e67c60b3d84a12b5a276f2a36cb00473133/symbolica-2.2.0/src/evaluate/evaluator.rs:295:21:
  890. 30.43 s > External function 'symbolica_coth' does not have an implementation for gammalooprs::utils::F<f64>
  891. 30.43 s > stack backtrace:
  892. 30.43 s > 0: __rustc::rust_begin_unwind
  893. 30.43 s > 1: core::panicking::panic_fmt
  894. 30.43 s > 2: <symbolica::evaluate::evaluator::ExpressionEvaluator<gammalooprs::utils::F<f64>>>::evaluate_impl_no_ops
  895. 30.43 s > 3: <symbolica::evaluate::evaluator::ExpressionEvaluator<gammalooprs::utils::F<f64>>>::evaluate_single
  896. 30.43 s > 4: gammalooprs::cff::generation::tests_cff::thermal_bubble
  897. 30.43 s > 5: <gammalooprs::cff::generation::tests_cff::thermal_bubble::{closure#0} as core::ops::function::FnOnce<()>>::call_once
  898. 30.43 s > note: Some details are omitted, run with `RUST_BACKTRACE=full` for a verbose backtrace.
  899. 30.43 s >
  900. 30.43 s > FAIL [ 0.068s] ( 76/483) gammalooprs cff::generation::tests_cff::thermal_ring
  901. 30.43 s > stdout ---
  902. 30.43 s >
  903. 30.43 s > running 1 test
  904. 30.43 s > test cff::generation::tests_cff::thermal_ring ... FAILED
  905. 30.43 s >
  906. 30.43 s > failures:
  907. 30.43 s >
  908. 30.43 s > failures:
  909. 30.44 s > cff::generation::tests_cff::thermal_ring
  910. 30.44 s >
  911. 30.44 s > test result: FAILED. 0 passed; 1 failed; 0 ignored; 0 measured; 535 filtered out; finished in 0.06s
  912. 30.44 s >
  913. 30.44 s > stderr ---
  914. 30.44 s >
  915. 30.44 s > thread 'cff::generation::tests_cff::thermal_ring' (1291) panicked at /nix/store/l5xazfnr7k6r6p8mlkn38x2afab0rygz-vendor-cargo-deps/5929dab090e556a579e9f3b708cd2e67c60b3d84a12b5a276f2a36cb00473133/symbolica-2.2.0/src/evaluate/evaluator.rs:295:21:
  916. 30.44 s > External function 'symbolica_coth' does not have an implementation for gammalooprs::utils::F<f64>
  917. 30.44 s > stack backtrace:
  918. 30.44 s > 0: __rustc::rust_begin_unwind
  919. 30.44 s > 1: core::panicking::panic_fmt
  920. 30.44 s > 2: <symbolica::evaluate::evaluator::ExpressionEvaluator<gammalooprs::utils::F<f64>>>::evaluate_impl_no_ops
  921. 30.44 s > 3: <symbolica::evaluate::evaluator::ExpressionEvaluator<gammalooprs::utils::F<f64>>>::evaluate_single
  922. 30.44 s > 4: gammalooprs::cff::generation::tests_cff::thermal_ring
  923. 30.44 s > 5: <gammalooprs::cff::generation::tests_cff::thermal_ring::{closure#0} as core::ops::function::FnOnce<()>>::call_once
  924. 30.44 s > note: Some details are omitted, run with `RUST_BACKTRACE=full` for a verbose backtrace.
  925. 30.44 s >
  926. 30.44 s > FAIL [ 0.111s] ( 83/483) gammalooprs cff::generation::tests_cff::thermal_mercedes
  927. 30.44 s > stdout ---
  928. 30.44 s >
  929. 30.44 s > running 1 test
  930. 30.44 s > test cff::generation::tests_cff::thermal_mercedes ... FAILED
  931. 30.44 s >
  932. 30.44 s > failures:
  933. 30.44 s >
  934. 30.44 s > failures:
  935. 30.44 s > cff::generation::tests_cff::thermal_mercedes
  936. 30.44 s >
  937. 30.44 s > test result: FAILED. 0 passed; 1 failed; 0 ignored; 0 measured; 535 filtered out; finished in 0.10s
  938. 30.44 s >
  939. 30.44 s > stderr ---
  940. 30.44 s >
  941. 30.44 s > thread 'cff::generation::tests_cff::thermal_mercedes' (1276) panicked at /nix/store/l5xazfnr7k6r6p8mlkn38x2afab0rygz-vendor-cargo-deps/5929dab090e556a579e9f3b708cd2e67c60b3d84a12b5a276f2a36cb00473133/symbolica-2.2.0/src/evaluate/evaluator.rs:295:21:
  942. 30.44 s > External function 'symbolica_coth' does not have an implementation for gammalooprs::utils::F<f64>
  943. 30.44 s > stack backtrace:
  944. 30.44 s > 0: __rustc::rust_begin_unwind
  945. 30.44 s > 1: core::panicking::panic_fmt
  946. 30.44 s > 2: <symbolica::evaluate::evaluator::ExpressionEvaluator<gammalooprs::utils::F<f64>>>::evaluate_impl_no_ops
  947. 30.44 s > 3: <symbolica::evaluate::evaluator::ExpressionEvaluator<gammalooprs::utils::F<f64>>>::evaluate_single
  948. 30.44 s > 4: gammalooprs::cff::generation::tests_cff::thermal_mercedes
  949. 30.44 s > 5: <gammalooprs::cff::generation::tests_cff::thermal_mercedes::{closure#0} as core::ops::function::FnOnce<()>>::call_once
  950. 30.44 s > note: Some details are omitted, run with `RUST_BACKTRACE=full` for a verbose backtrace.
  951. 30.44 s >
  952. 30.44 s > FAIL [ 0.454s] (270/483) gammalooprs graph::feynman_graph::tests::native_thermal_distributions
  953. 30.44 s > stdout ---
  954. 30.44 s >
  955. 30.44 s > running 1 test
  956. 30.44 s > test graph::feynman_graph::tests::native_thermal_distributions ... FAILED
  957. 30.44 s >
  958. 30.44 s > failures:
  959. 30.44 s >
  960. 30.44 s > failures:
  961. 30.44 s > graph::feynman_graph::tests::native_thermal_distributions
  962. 30.44 s >
  963. 30.44 s > test result: FAILED. 0 passed; 1 failed; 0 ignored; 0 measured; 535 filtered out; finished in 0.44s
  964. 30.44 s >
  965. 30.44 s > stderr ---
  966. 30.44 s > The application panicked (crashed).
  967. 30.44 s > Message: called `Result::unwrap()` on an `Err` value: Custom { kind: Other, error: "Could not compile code: g++ -shared -O3 -fPIC -ffast-math -funsafe-math-optimizations -march=native -o /build/gammaloop-native-thermal-1345/thermal_0_0.so /build/gammaloop-native-thermal-1345/thermal_0_0.cpp\nwarning: Skipping impure flag -march=native because NIX_ENFORCE_NO_NATIVE is set\n/build/gammaloop-native-thermal-1345/thermal_0_0.cpp: In function 'void thermal_realf64(const double*, double*, double*)':\n/build/gammaloop-native-thermal-1345/thermal_0_0.cpp:27:16: error: 'symbolica_tanh' was not declared in this scope\n 27 | Z[6] = symbolica_tanh(Z[6]);\n | ^~~~~~~~~~~~~~\n" }
  968. 30.44 s > Location: crates/gammalooprs/src/graph/feynman_graph.rs:937
  969. 30.44 s >
  970. 30.44 s > ━━━━━━━━━━━━━━━━━━━━━━━━━━━━━━━━━━ BACKTRACE ━━━━━━━━━━━━━━━━━━━━━━━━━━━━━━━━━━━
  971. 30.44 s > 1: <color_eyre[b0c9e66060e883b2]::config::PanicHook>::panic_report<unknown>
  972. 30.44 s > at <unknown source file>:<unknown line>
  973. 30.44 s > 2: <color_eyre[b0c9e66060e883b2]::config::PanicHook>::into_panic_hook::{closure#0}<unknown>
  974. 30.44 s > at <unknown source file>:<unknown line>
  975. 30.44 s > 3: std[bcb96dfbba0ab899]::panicking::panic_with_hook<unknown>
  976. 30.44 s > at <unknown source file>:<unknown line>
  977. 30.44 s > 4: std[bcb96dfbba0ab899]::panicking::panic_handler::{closure#0}<unknown>
  978. 30.44 s > at <unknown source file>:<unknown line>
  979. 30.44 s > 5: std[bcb96dfbba0ab899]::sys::backtrace::__rust_end_short_backtrace::<std[bcb96dfbba0ab899]::panicking::panic_handler::{closure#0}, !><unknown>
  980. 30.44 s > at <unknown source file>:<unknown line>
  981. 30.44 s > 6: __rustc[6c289b9f9c454d21]::rust_begin_unwind<unknown>
  982. 30.44 s > at <unknown source file>:<unknown line>
  983. 30.44 s > 7: core[940e698046960fd5]::panicking::panic_fmt<unknown>
  984. 30.44 s > at <unknown source file>:<unknown line>
  985. 30.44 s > 8: core[940e698046960fd5]::result::unwrap_failed<unknown>
  986. 30.44 s > at <unknown source file>:<unknown line>
  987. 30.44 s > 9: gammalooprs[f21b74aec46f5289]::graph::feynman_graph::tests::native_thermal_distributions<unknown>
  988. 30.44 s > at <unknown source file>:<unknown line>
  989. 30.44 s > 10: <gammalooprs[f21b74aec46f5289]::graph::feynman_graph::tests::native_thermal_distributions::{closure#0} as core[940e698046960fd5]::ops::function::FnOnce<()>>::call_once<unknown>
  990. 30.44 s > at <unknown source file>:<unknown line>
  991. 30.44 s > 11: test[75d6903177b1d7e9]::__rust_begin_short_backtrace::<core[940e698046960fd5]::result::Result<(), alloc[2ea6bcb46fca0c42]::string::String>, fn() -> core[940e698046960fd5]::result::Result<(), alloc[2ea6bcb46fca0c42]::string::String>><unknown>
  992. 30.44 s > at <unknown source file>:<unknown line>
  993. 30.44 s > 12: test[75d6903177b1d7e9]::run_test::{closure#0}<unknown>
  994. 30.44 s > at <unknown source file>:<unknown line>
  995. 30.44 s > 13: std[bcb96dfbba0ab899]::sys::backtrace::__rust_begin_short_backtrace::<test[75d6903177b1d7e9]::run_test::{closure#1}, ()><unknown>
  996. 30.44 s > at <unknown source file>:<unknown line>
  997. 30.44 s > 14: <std[bcb96dfbba0ab899]::thread::lifecycle::spawn_unchecked<test[75d6903177b1d7e9]::run_test::{closure#1}, ()>::{closure#1} as core[940e698046960fd5]::ops::function::FnOnce<()>>::call_once::{shim:vtable#0}<unknown>
  998. 30.44 s > at <unknown source file>:<unknown line>
  999. 30.44 s > 15: <std[bcb96dfbba0ab899]::sys::thread::unix::Thread>::new::thread_start<unknown>
  1000. 30.44 s > at <unknown source file>:<unknown line>
  1001. 30.44 s > 16: start_thread<unknown>
  1002. 30.44 s > at <unknown source file>:<unknown line>
  1003. 30.44 s > 17: __clone3<unknown>
  1004. 30.44 s > at <unknown source file>:<unknown line>
  1005. 30.44 s >
  1006. 30.44 s > Run with COLORBT_SHOW_HIDDEN=1 environment variable to disable frame filtering.
  1007. 30.44 s > Run with RUST_BACKTRACE=full to include source snippets.
  1008. 30.44 s >
  1009. 30.44 s > FAIL [ 5.321s] (479/483) gammalooprs cff::generation::tests_cff::thermal_bugblatter
  1010. 30.44 s > stdout ---
  1011. 30.44 s >
  1012. 30.44 s > running 1 test
  1013. 30.44 s > test cff::generation::tests_cff::thermal_bugblatter ... FAILED
  1014. 30.44 s >
  1015. 30.44 s > failures:
  1016. 30.44 s >
  1017. 30.44 s > failures:
  1018. 30.44 s > cff::generation::tests_cff::thermal_bugblatter
  1019. 30.44 s >
  1020. 30.44 s > test result: FAILED. 0 passed; 1 failed; 0 ignored; 0 measured; 535 filtered out; finished in 5.24s
  1021. 30.44 s >
  1022. 30.44 s > stderr ---
  1023. 30.44 s >
  1024. 30.44 s > thread 'cff::generation::tests_cff::thermal_bugblatter' (1274) panicked at /nix/store/l5xazfnr7k6r6p8mlkn38x2afab0rygz-vendor-cargo-deps/5929dab090e556a579e9f3b708cd2e67c60b3d84a12b5a276f2a36cb00473133/symbolica-2.2.0/src/evaluate/evaluator.rs:295:21:
  1025. 30.44 s > External function 'symbolica_coth' does not have an implementation for gammalooprs::utils::F<f64>
  1026. 30.44 s > stack backtrace:
  1027. 30.44 s > 0: __rustc::rust_begin_unwind
  1028. 30.44 s > 1: core::panicking::panic_fmt
  1029. 30.44 s > 2: <symbolica::evaluate::evaluator::ExpressionEvaluator<gammalooprs::utils::F<f64>>>::evaluate_impl_no_ops
  1030. 30.44 s > 3: <symbolica::evaluate::evaluator::ExpressionEvaluator<gammalooprs::utils::F<f64>>>::evaluate_single
  1031. 30.44 s > 4: gammalooprs::cff::generation::tests_cff::thermal_bugblatter
  1032. 30.44 s > 5: <gammalooprs::cff::generation::tests_cff::thermal_bugblatter::{closure#0} as core::ops::function::FnOnce<()>>::call_once
  1033. 30.44 s > note: Some details are omitted, run with `RUST_BACKTRACE=full` for a verbose backtrace.
  1034. 30.44 s >
  1035. 30.44 s > ------------
  1036. 30.44 s > Summary [ 8.041s] 483 tests run: 476 passed, 7 failed, 61 skipped
  1037. 30.44 s > FAIL [ 0.015s] ( 49/483) gammalooprs cff::generation::tests_cff::thermal_eight
  1038. 30.44 s > stdout ---
  1039. 30.44 s >
  1040. 30.44 s > running 1 test
  1041. 30.44 s > test cff::generation::tests_cff::thermal_eight ... FAILED
  1042. 30.44 s >
  1043. 30.44 s > failures:
  1044. 30.44 s >
  1045. 30.44 s > failures:
  1046. 30.44 s > cff::generation::tests_cff::thermal_eight
  1047. 30.44 s >
  1048. 30.44 s > test result: FAILED. 0 passed; 1 failed; 0 ignored; 0 measured; 535 filtered out; finished in 0.01s
  1049. 30.44 s >
  1050. 30.44 s > stderr ---
  1051. 30.44 s >
  1052. 30.44 s > thread 'cff::generation::tests_cff::thermal_eight' (1282) panicked at /nix/store/l5xazfnr7k6r6p8mlkn38x2afab0rygz-vendor-cargo-deps/5929dab090e556a579e9f3b708cd2e67c60b3d84a12b5a276f2a36cb00473133/symbolica-2.2.0/src/evaluate/evaluator.rs:295:21:
  1053. 30.44 s > External function 'symbolica_coth' does not have an implementation for gammalooprs::utils::F<f64>
  1054. 30.44 s > stack backtrace:
  1055. 30.44 s > 0: __rustc::rust_begin_unwind
  1056. 30.44 s > 1: core::panicking::panic_fmt
  1057. 30.44 s > 2: <symbolica::evaluate::evaluator::ExpressionEvaluator<gammalooprs::utils::F<f64>>>::evaluate_impl_no_ops
  1058. 30.44 s > 3: <symbolica::evaluate::evaluator::ExpressionEvaluator<gammalooprs::utils::F<f64>>>::evaluate_single
  1059. 30.44 s > 4: gammalooprs::cff::generation::tests_cff::thermal_eight
  1060. 30.44 s > 5: <gammalooprs::cff::generation::tests_cff::thermal_eight::{closure#0} as core::ops::function::FnOnce<()>>::call_once
  1061. 30.44 s > note: Some details are omitted, run with `RUST_BACKTRACE=full` for a verbose backtrace.
  1062. 30.44 s >
  1063. 30.44 s > FAIL [ 0.018s] ( 51/483) gammalooprs cff::generation::tests_cff::thermal_bubble_chain
  1064. 30.44 s > stdout ---
  1065. 30.44 s >
  1066. 30.44 s > running 1 test
  1067. 30.44 s > test cff::generation::tests_cff::thermal_bubble_chain ... FAILED
  1068. 30.44 s >
  1069. 30.44 s > failures:
  1070. 30.44 s >
  1071. 30.44 s > failures:
  1072. 30.44 s > cff::generation::tests_cff::thermal_bubble_chain
  1073. 30.44 s >
  1074. 30.44 s > test result: FAILED. 0 passed; 1 failed; 0 ignored; 0 measured; 535 filtered out; finished in 0.01s
  1075. 30.44 s >
  1076. 30.44 s > stderr ---
  1077. 30.44 s >
  1078. 30.44 s > thread 'cff::generation::tests_cff::thermal_bubble_chain' (1273) panicked at /nix/store/l5xazfnr7k6r6p8mlkn38x2afab0rygz-vendor-cargo-deps/5929dab090e556a579e9f3b708cd2e67c60b3d84a12b5a276f2a36cb00473133/symbolica-2.2.0/src/evaluate/evaluator.rs:295:21:
  1079. 30.44 s > External function 'symbolica_coth' does not have an implementation for gammalooprs::utils::F<f64>
  1080. 30.44 s > stack backtrace:
  1081. 30.44 s > 0: __rustc::rust_begin_unwind
  1082. 30.44 s > 1: core::panicking::panic_fmt
  1083. 30.44 s > 2: <symbolica::evaluate::evaluator::ExpressionEvaluator<gammalooprs::utils::F<f64>>>::evaluate_impl_no_ops
  1084. 30.44 s > 3: <symbolica::evaluate::evaluator::ExpressionEvaluator<gammalooprs::utils::F<f64>>>::evaluate_single
  1085. 30.44 s > 4: gammalooprs::cff::generation::tests_cff::thermal_bubble_chain
  1086. 30.44 s > 5: <gammalooprs::cff::generation::tests_cff::thermal_bubble_chain::{closure#0} as core::ops::function::FnOnce<()>>::call_once
  1087. 30.44 s > note: Some details are omitted, run with `RUST_BACKTRACE=full` for a verbose backtrace.
  1088. 30.44 s >
  1089. 30.44 s > FAIL [ 0.021s] ( 58/483) gammalooprs cff::generation::tests_cff::thermal_bubble
  1090. 30.44 s > stdout ---
  1091. 30.44 s >
  1092. 30.44 s > running 1 test
  1093. 30.44 s > test cff::generation::tests_cff::thermal_bubble ... FAILED
  1094. 30.44 s >
  1095. 30.44 s > failures:
  1096. 30.44 s >
  1097. 30.44 s > failures:
  1098. 30.44 s > cff::generation::tests_cff::thermal_bubble
  1099. 30.44 s >
  1100. 30.44 s > test result: FAILED. 0 passed; 1 failed; 0 ignored; 0 measured; 535 filtered out; finished in 0.01s
  1101. 30.44 s >
  1102. 30.44 s > stderr ---
  1103. 30.44 s >
  1104. 30.44 s > thread 'cff::generation::tests_cff::thermal_bubble' (1280) panicked at /nix/store/l5xazfnr7k6r6p8mlkn38x2afab0rygz-vendor-cargo-deps/5929dab090e556a579e9f3b708cd2e67c60b3d84a12b5a276f2a36cb00473133/symbolica-2.2.0/src/evaluate/evaluator.rs:295:21:
  1105. 30.44 s > External function 'symbolica_coth' does not have an implementation for gammalooprs::utils::F<f64>
  1106. 30.44 s > stack backtrace:
  1107. 30.44 s > 0: __rustc::rust_begin_unwind
  1108. 30.44 s > 1: core::panicking::panic_fmt
  1109. 30.44 s > 2: <symbolica::evaluate::evaluator::ExpressionEvaluator<gammalooprs::utils::F<f64>>>::evaluate_impl_no_ops
  1110. 30.44 s > 3: <symbolica::evaluate::evaluator::ExpressionEvaluator<gammalooprs::utils::F<f64>>>::evaluate_single
  1111. 30.44 s > 4: gammalooprs::cff::generation::tests_cff::thermal_bubble
  1112. 30.44 s > 5: <gammalooprs::cff::generation::tests_cff::thermal_bubble::{closure#0} as core::ops::function::FnOnce<()>>::call_once
  1113. 30.44 s > note: Some details are omitted, run with `RUST_BACKTRACE=full` for a verbose backtrace.
  1114. 30.44 s >
  1115. 30.44 s > FAIL [ 0.068s] ( 76/483) gammalooprs cff::generation::tests_cff::thermal_ring
  1116. 30.44 s > stdout ---
  1117. 30.44 s >
  1118. 30.44 s > running 1 test
  1119. 30.44 s > test cff::generation::tests_cff::thermal_ring ... FAILED
  1120. 30.44 s >
  1121. 30.44 s > failures:
  1122. 30.44 s >
  1123. 30.44 s > failures:
  1124. 30.44 s > cff::generation::tests_cff::thermal_ring
  1125. 30.44 s >
  1126. 30.44 s > test result: FAILED. 0 passed; 1 failed; 0 ignored; 0 measured; 535 filtered out; finished in 0.06s
  1127. 30.44 s >
  1128. 30.44 s > stderr ---
  1129. 30.44 s >
  1130. 30.44 s > thread 'cff::generation::tests_cff::thermal_ring' (1291) panicked at /nix/store/l5xazfnr7k6r6p8mlkn38x2afab0rygz-vendor-cargo-deps/5929dab090e556a579e9f3b708cd2e67c60b3d84a12b5a276f2a36cb00473133/symbolica-2.2.0/src/evaluate/evaluator.rs:295:21:
  1131. 30.44 s > External function 'symbolica_coth' does not have an implementation for gammalooprs::utils::F<f64>
  1132. 30.44 s > stack backtrace:
  1133. 30.44 s > 0: __rustc::rust_begin_unwind
  1134. 30.44 s > 1: core::panicking::panic_fmt
  1135. 30.44 s > 2: <symbolica::evaluate::evaluator::ExpressionEvaluator<gammalooprs::utils::F<f64>>>::evaluate_impl_no_ops
  1136. 30.44 s > 3: <symbolica::evaluate::evaluator::ExpressionEvaluator<gammalooprs::utils::F<f64>>>::evaluate_single
  1137. 30.44 s > 4: gammalooprs::cff::generation::tests_cff::thermal_ring
  1138. 30.44 s > 5: <gammalooprs::cff::generation::tests_cff::thermal_ring::{closure#0} as core::ops::function::FnOnce<()>>::call_once
  1139. 30.44 s > note: Some details are omitted, run with `RUST_BACKTRACE=full` for a verbose backtrace.
  1140. 30.44 s >
  1141. 30.44 s > FAIL [ 0.111s] ( 83/483) gammalooprs cff::generation::tests_cff::thermal_mercedes
  1142. 30.44 s > stdout ---
  1143. 30.44 s >
  1144. 30.44 s > running 1 test
  1145. 30.44 s > test cff::generation::tests_cff::thermal_mercedes ... FAILED
  1146. 30.44 s >
  1147. 30.44 s > failures:
  1148. 30.44 s >
  1149. 30.44 s > failures:
  1150. 30.44 s > cff::generation::tests_cff::thermal_mercedes
  1151. 30.44 s >
  1152. 30.44 s > test result: FAILED. 0 passed; 1 failed; 0 ignored; 0 measured; 535 filtered out; finished in 0.10s
  1153. 30.44 s >
  1154. 30.44 s > stderr ---
  1155. 30.44 s >
  1156. 30.44 s > thread 'cff::generation::tests_cff::thermal_mercedes' (1276) panicked at /nix/store/l5xazfnr7k6r6p8mlkn38x2afab0rygz-vendor-cargo-deps/5929dab090e556a579e9f3b708cd2e67c60b3d84a12b5a276f2a36cb00473133/symbolica-2.2.0/src/evaluate/evaluator.rs:295:21:
  1157. 30.44 s > External function 'symbolica_coth' does not have an implementation for gammalooprs::utils::F<f64>
  1158. 30.44 s > stack backtrace:
  1159. 30.44 s > 0: __rustc::rust_begin_unwind
  1160. 30.44 s > 1: core::panicking::panic_fmt
  1161. 30.44 s > 2: <symbolica::evaluate::evaluator::ExpressionEvaluator<gammalooprs::utils::F<f64>>>::evaluate_impl_no_ops
  1162. 30.44 s > 3: <symbolica::evaluate::evaluator::ExpressionEvaluator<gammalooprs::utils::F<f64>>>::evaluate_single
  1163. 30.44 s > 4: gammalooprs::cff::generation::tests_cff::thermal_mercedes
  1164. 30.44 s > 5: <gammalooprs::cff::generation::tests_cff::thermal_mercedes::{closure#0} as core::ops::function::FnOnce<()>>::call_once
  1165. 30.44 s > note: Some details are omitted, run with `RUST_BACKTRACE=full` for a verbose backtrace.
  1166. 30.44 s >
  1167. 30.44 s > FAIL [ 0.454s] (270/483) gammalooprs graph::feynman_graph::tests::native_thermal_distributions
  1168. 30.44 s > stdout ---
  1169. 30.44 s >
  1170. 30.44 s > running 1 test
  1171. 30.44 s > test graph::feynman_graph::tests::native_thermal_distributions ... FAILED
  1172. 30.44 s >
  1173. 30.44 s > failures:
  1174. 30.44 s >
  1175. 30.44 s > failures:
  1176. 30.44 s > graph::feynman_graph::tests::native_thermal_distributions
  1177. 30.44 s >
  1178. 30.44 s > test result: FAILED. 0 passed; 1 failed; 0 ignored; 0 measured; 535 filtered out; finished in 0.44s
  1179. 30.44 s >
  1180. 30.44 s > stderr ---
  1181. 30.44 s > The application panicked (crashed).
  1182. 30.44 s > Message: called `Result::unwrap()` on an `Err` value: Custom { kind: Other, error: "Could not compile code: g++ -shared -O3 -fPIC -ffast-math -funsafe-math-optimizations -march=native -o /build/gammaloop-native-thermal-1345/thermal_0_0.so /build/gammaloop-native-thermal-1345/thermal_0_0.cpp\nwarning: Skipping impure flag -march=native because NIX_ENFORCE_NO_NATIVE is set\n/build/gammaloop-native-thermal-1345/thermal_0_0.cpp: In function 'void thermal_realf64(const double*, double*, double*)':\n/build/gammaloop-native-thermal-1345/thermal_0_0.cpp:27:16: error: 'symbolica_tanh' was not declared in this scope\n 27 | Z[6] = symbolica_tanh(Z[6]);\n | ^~~~~~~~~~~~~~\n" }
  1183. 30.44 s > Location: crates/gammalooprs/src/graph/feynman_graph.rs:937
  1184. 30.44 s >
  1185. 30.44 s > ━━━━━━━━━━━━━━━━━━━━━━━━━━━━━━━━━━ BACKTRACE ━━━━━━━━━━━━━━━━━━━━━━━━━━━━━━━━━━━
  1186. 30.44 s > 1: <color_eyre[b0c9e66060e883b2]::config::PanicHook>::panic_report<unknown>
  1187. 30.44 s > at <unknown source file>:<unknown line>
  1188. 30.44 s > 2: <color_eyre[b0c9e66060e883b2]::config::PanicHook>::into_panic_hook::{closure#0}<unknown>
  1189. 30.44 s > at <unknown source file>:<unknown line>
  1190. 30.44 s > 3: std[bcb96dfbba0ab899]::panicking::panic_with_hook<unknown>
  1191. 30.44 s > at <unknown source file>:<unknown line>
  1192. 30.44 s > 4: std[bcb96dfbba0ab899]::panicking::panic_handler::{closure#0}<unknown>
  1193. 30.44 s > at <unknown source file>:<unknown line>
  1194. 30.44 s > 5: std[bcb96dfbba0ab899]::sys::backtrace::__rust_end_short_backtrace::<std[bcb96dfbba0ab899]::panicking::panic_handler::{closure#0}, !><unknown>
  1195. 30.44 s > at <unknown source file>:<unknown line>
  1196. 30.44 s > 6: __rustc[6c289b9f9c454d21]::rust_begin_unwind<unknown>
  1197. 30.44 s > at <unknown source file>:<unknown line>
  1198. 30.44 s > 7: core[940e698046960fd5]::panicking::panic_fmt<unknown>
  1199. 30.44 s > at <unknown source file>:<unknown line>
  1200. 30.44 s > 8: core[940e698046960fd5]::result::unwrap_failed<unknown>
  1201. 30.44 s > at <unknown source file>:<unknown line>
  1202. 30.44 s > 9: gammalooprs[f21b74aec46f5289]::graph::feynman_graph::tests::native_thermal_distributions<unknown>
  1203. 30.44 s > at <unknown source file>:<unknown line>
  1204. 30.44 s > 10: <gammalooprs[f21b74aec46f5289]::graph::feynman_graph::tests::native_thermal_distributions::{closure#0} as core[940e698046960fd5]::ops::function::FnOnce<()>>::call_once<unknown>
  1205. 30.44 s > at <unknown source file>:<unknown line>
  1206. 30.44 s > 11: test[75d6903177b1d7e9]::__rust_begin_short_backtrace::<core[940e698046960fd5]::result::Result<(), alloc[2ea6bcb46fca0c42]::string::String>, fn() -> core[940e698046960fd5]::result::Result<(), alloc[2ea6bcb46fca0c42]::string::String>><unknown>
  1207. 30.44 s > at <unknown source file>:<unknown line>
  1208. 30.44 s > 12: test[75d6903177b1d7e9]::run_test::{closure#0}<unknown>
  1209. 30.44 s > at <unknown source file>:<unknown line>
  1210. 30.44 s > 13: std[bcb96dfbba0ab899]::sys::backtrace::__rust_begin_short_backtrace::<test[75d6903177b1d7e9]::run_test::{closure#1}, ()><unknown>
  1211. 30.44 s > at <unknown source file>:<unknown line>
  1212. 30.44 s > 14: <std[bcb96dfbba0ab899]::thread::lifecycle::spawn_unchecked<test[75d6903177b1d7e9]::run_test::{closure#1}, ()>::{closure#1} as core[940e698046960fd5]::ops::function::FnOnce<()>>::call_once::{shim:vtable#0}<unknown>
  1213. 30.44 s > at <unknown source file>:<unknown line>
  1214. 30.44 s > 15: <std[bcb96dfbba0ab899]::sys::thread::unix::Thread>::new::thread_start<unknown>
  1215. 30.44 s > at <unknown source file>:<unknown line>
  1216. 30.44 s > 16: start_thread<unknown>
  1217. 30.44 s > at <unknown source file>:<unknown line>
  1218. 30.44 s > 17: __clone3<unknown>
  1219. 30.44 s > at <unknown source file>:<unknown line>
  1220. 30.44 s >
  1221. 30.44 s > Run with COLORBT_SHOW_HIDDEN=1 environment variable to disable frame filtering.
  1222. 30.44 s > Run with RUST_BACKTRACE=full to include source snippets.
  1223. 30.44 s >
  1224. 30.44 s > FAIL [ 5.321s] (479/483) gammalooprs cff::generation::tests_cff::thermal_bugblatter
  1225. 30.44 s > stdout ---
  1226. 30.44 s >
  1227. 30.44 s > running 1 test
  1228. 30.44 s > test cff::generation::tests_cff::thermal_bugblatter ... FAILED
  1229. 30.44 s >
  1230. 30.44 s > failures:
  1231. 30.44 s >
  1232. 30.44 s > failures:
  1233. 30.44 s > cff::generation::tests_cff::thermal_bugblatter
  1234. 30.44 s >
  1235. 30.44 s > test result: FAILED. 0 passed; 1 failed; 0 ignored; 0 measured; 535 filtered out; finished in 5.24s
  1236. 30.44 s >
  1237. 30.44 s > stderr ---
  1238. 30.44 s >
  1239. 30.44 s > thread 'cff::generation::tests_cff::thermal_bugblatter' (1274) panicked at /nix/store/l5xazfnr7k6r6p8mlkn38x2afab0rygz-vendor-cargo-deps/5929dab090e556a579e9f3b708cd2e67c60b3d84a12b5a276f2a36cb00473133/symbolica-2.2.0/src/evaluate/evaluator.rs:295:21:
  1240. 30.44 s > External function 'symbolica_coth' does not have an implementation for gammalooprs::utils::F<f64>
  1241. 30.44 s > stack backtrace:
  1242. 30.44 s > 0: __rustc::rust_begin_unwind
  1243. 30.44 s > 1: core::panicking::panic_fmt
  1244. 30.44 s > 2: <symbolica::evaluate::evaluator::ExpressionEvaluator<gammalooprs::utils::F<f64>>>::evaluate_impl_no_ops
  1245. 30.44 s > 3: <symbolica::evaluate::evaluator::ExpressionEvaluator<gammalooprs::utils::F<f64>>>::evaluate_single
  1246. 30.44 s > 4: gammalooprs::cff::generation::tests_cff::thermal_bugblatter
  1247. 30.44 s > 5: <gammalooprs::cff::generation::tests_cff::thermal_bugblatter::{closure#0} as core::ops::function::FnOnce<()>>::call_once
  1248. 30.44 s > note: Some details are omitted, run with `RUST_BACKTRACE=full` for a verbose backtrace.
  1249. 30.44 s >
  1250. 30.44 s > error: test run failed
  1251. 30.44 s >
  1252. 30.44 s > ========== nextest test summary ==========
  1253. 30.44 s > report: target/nextest/ci_gammaloop/junit.xml
  1254. 30.44 s > tests: 483, failures: 7, errors: 0
  1255. 30.44 s >
  1256. 30.44 s > 1. gammalooprs::cff::generation::tests_cff::thermal_eight
  1257. 30.44 s > failure: test failure with exit code 101
  1258. 30.44 s > thread 'cff::generation::tests_cff::thermal_eight' (1282) panicked at /nix/store/l5xazfnr7k6r6p8mlkn38x2afab0rygz-vendor-cargo-deps/5929dab090e556a579e9f3b708cd2e67c60b3d84a12b5a276f2a36cb00473133/symbolica-2.2.0/src/evaluate/evaluator.rs:295:21:
  1259. 30.44 s > External function 'symbolica_coth' does not have an implementation for gammalooprs::utils::F<f64>
  1260. 30.44 s > stack backtrace:
  1261. 30.44 s > 0: __rustc::rust_begin_unwind
  1262. 30.44 s > 1: core::panicking::panic_fmt
  1263. 30.44 s > 2: <symbolica::evaluate::evaluator::ExpressionEvaluator<gammalooprs::utils::F<f64>>>::evaluate_impl_no_ops
  1264. 30.44 s > 3: <symbolica::evaluate::evaluator::ExpressionEvaluator<gammalooprs::utils::F<f64>>>::evaluate_single
  1265. 30.44 s > 4: gammalooprs::cff::generation::tests_cff::thermal_eight
  1266. 30.44 s > 5: <gammalooprs::cff::generation::tests_cff::thermal_eight::{closure#0} as core::ops::function::FnOnce<()>>::call_once
  1267. 30.44 s > note: Some details are omitted, run with `RUST_BACKTRACE=full` for a verbose backtrace.
  1268. 30.44 s > system-out
  1269. 30.44 s > running 1 test
  1270. 30.44 s > test cff::generation::tests_cff::thermal_eight ... FAILED
  1271. 30.44 s >
  1272. 30.44 s > failures:
  1273. 30.44 s >
  1274. 30.44 s > failures:
  1275. 30.44 s > cff::generation::tests_cff::thermal_eight
  1276. 30.44 s >
  1277. 30.44 s > test result: FAILED. 0 passed; 1 failed; 0 ignored; 0 measured; 535 filtered out; finished in 0.01s
  1278. 30.44 s > system-err
  1279. 30.44 s > thread 'cff::generation::tests_cff::thermal_eight' (1282) panicked at /nix/store/l5xazfnr7k6r6p8mlkn38x2afab0rygz-vendor-cargo-deps/5929dab090e556a579e9f3b708cd2e67c60b3d84a12b5a276f2a36cb00473133/symbolica-2.2.0/src/evaluate/evaluator.rs:295:21:
  1280. 30.44 s > External function 'symbolica_coth' does not have an implementation for gammalooprs::utils::F<f64>
  1281. 30.44 s > stack backtrace:
  1282. 30.44 s > 0: __rustc::rust_begin_unwind
  1283. 30.44 s > 1: core::panicking::panic_fmt
  1284. 30.44 s > 2: <symbolica::evaluate::evaluator::ExpressionEvaluator<gammalooprs::utils::F<f64>>>::evaluate_impl_no_ops
  1285. 30.44 s > 3: <symbolica::evaluate::evaluator::ExpressionEvaluator<gammalooprs::utils::F<f64>>>::evaluate_single
  1286. 30.44 s > 4: gammalooprs::cff::generation::tests_cff::thermal_eight
  1287. 30.44 s > 5: <gammalooprs::cff::generation::tests_cff::thermal_eight::{closure#0} as core::ops::function::FnOnce<()>>::call_once
  1288. 30.44 s > note: Some details are omitted, run with `RUST_BACKTRACE=full` for a verbose backtrace.
  1289. 30.44 s >
  1290. 30.44 s > 2. gammalooprs::cff::generation::tests_cff::thermal_bubble_chain
  1291. 30.44 s > failure: test failure with exit code 101
  1292. 30.44 s > thread 'cff::generation::tests_cff::thermal_bubble_chain' (1273) panicked at /nix/store/l5xazfnr7k6r6p8mlkn38x2afab0rygz-vendor-cargo-deps/5929dab090e556a579e9f3b708cd2e67c60b3d84a12b5a276f2a36cb00473133/symbolica-2.2.0/src/evaluate/evaluator.rs:295:21:
  1293. 30.44 s > External function 'symbolica_coth' does not have an implementation for gammalooprs::utils::F<f64>
  1294. 30.44 s > stack backtrace:
  1295. 30.44 s > 0: __rustc::rust_begin_unwind
  1296. 30.44 s > 1: core::panicking::panic_fmt
  1297. 30.44 s > 2: <symbolica::evaluate::evaluator::ExpressionEvaluator<gammalooprs::utils::F<f64>>>::evaluate_impl_no_ops
  1298. 30.44 s > 3: <symbolica::evaluate::evaluator::ExpressionEvaluator<gammalooprs::utils::F<f64>>>::evaluate_single
  1299. 30.44 s > 4: gammalooprs::cff::generation::tests_cff::thermal_bubble_chain
  1300. 30.44 s > 5: <gammalooprs::cff::generation::tests_cff::thermal_bubble_chain::{closure#0} as core::ops::function::FnOnce<()>>::call_once
  1301. 30.44 s > note: Some details are omitted, run with `RUST_BACKTRACE=full` for a verbose backtrace.
  1302. 30.44 s > system-out
  1303. 30.44 s > running 1 test
  1304. 30.44 s > test cff::generation::tests_cff::thermal_bubble_chain ... FAILED
  1305. 30.44 s >
  1306. 30.44 s > failures:
  1307. 30.44 s >
  1308. 30.44 s > failures:
  1309. 30.44 s > cff::generation::tests_cff::thermal_bubble_chain
  1310. 30.44 s >
  1311. 30.44 s > test result: FAILED. 0 passed; 1 failed; 0 ignored; 0 measured; 535 filtered out; finished in 0.01s
  1312. 30.44 s > system-err
  1313. 30.44 s > thread 'cff::generation::tests_cff::thermal_bubble_chain' (1273) panicked at /nix/store/l5xazfnr7k6r6p8mlkn38x2afab0rygz-vendor-cargo-deps/5929dab090e556a579e9f3b708cd2e67c60b3d84a12b5a276f2a36cb00473133/symbolica-2.2.0/src/evaluate/evaluator.rs:295:21:
  1314. 30.44 s > External function 'symbolica_coth' does not have an implementation for gammalooprs::utils::F<f64>
  1315. 30.44 s > stack backtrace:
  1316. 30.44 s > 0: __rustc::rust_begin_unwind
  1317. 30.44 s > 1: core::panicking::panic_fmt
  1318. 30.44 s > 2: <symbolica::evaluate::evaluator::ExpressionEvaluator<gammalooprs::utils::F<f64>>>::evaluate_impl_no_ops
  1319. 30.44 s > 3: <symbolica::evaluate::evaluator::ExpressionEvaluator<gammalooprs::utils::F<f64>>>::evaluate_single
  1320. 30.44 s > 4: gammalooprs::cff::generation::tests_cff::thermal_bubble_chain
  1321. 30.44 s > 5: <gammalooprs::cff::generation::tests_cff::thermal_bubble_chain::{closure#0} as core::ops::function::FnOnce<()>>::call_once
  1322. 30.44 s > note: Some details are omitted, run with `RUST_BACKTRACE=full` for a verbose backtrace.
  1323. 30.44 s >
  1324. 30.44 s > 3. gammalooprs::cff::generation::tests_cff::thermal_bubble
  1325. 30.44 s > failure: test failure with exit code 101
  1326. 30.44 s > thread 'cff::generation::tests_cff::thermal_bubble' (1280) panicked at /nix/store/l5xazfnr7k6r6p8mlkn38x2afab0rygz-vendor-cargo-deps/5929dab090e556a579e9f3b708cd2e67c60b3d84a12b5a276f2a36cb00473133/symbolica-2.2.0/src/evaluate/evaluator.rs:295:21:
  1327. 30.44 s > External function 'symbolica_coth' does not have an implementation for gammalooprs::utils::F<f64>
  1328. 30.44 s > stack backtrace:
  1329. 30.44 s > 0: __rustc::rust_begin_unwind
  1330. 30.44 s > 1: core::panicking::panic_fmt
  1331. 30.44 s > 2: <symbolica::evaluate::evaluator::ExpressionEvaluator<gammalooprs::utils::F<f64>>>::evaluate_impl_no_ops
  1332. 30.44 s > 3: <symbolica::evaluate::evaluator::ExpressionEvaluator<gammalooprs::utils::F<f64>>>::evaluate_single
  1333. 30.44 s > 4: gammalooprs::cff::generation::tests_cff::thermal_bubble
  1334. 30.44 s > 5: <gammalooprs::cff::generation::tests_cff::thermal_bubble::{closure#0} as core::ops::function::FnOnce<()>>::call_once
  1335. 30.44 s > note: Some details are omitted, run with `RUST_BACKTRACE=full` for a verbose backtrace.
  1336. 30.44 s > system-out
  1337. 30.44 s > running 1 test
  1338. 30.44 s > test cff::generation::tests_cff::thermal_bubble ... FAILED
  1339. 30.44 s >
  1340. 30.44 s > failures:
  1341. 30.44 s >
  1342. 30.44 s > failures:
  1343. 30.44 s > cff::generation::tests_cff::thermal_bubble
  1344. 30.44 s >
  1345. 30.44 s > test result: FAILED. 0 passed; 1 failed; 0 ignored; 0 measured; 535 filtered out; finished in 0.01s
  1346. 30.44 s > system-err
  1347. 30.44 s > thread 'cff::generation::tests_cff::thermal_bubble' (1280) panicked at /nix/store/l5xazfnr7k6r6p8mlkn38x2afab0rygz-vendor-cargo-deps/5929dab090e556a579e9f3b708cd2e67c60b3d84a12b5a276f2a36cb00473133/symbolica-2.2.0/src/evaluate/evaluator.rs:295:21:
  1348. 30.44 s > External function 'symbolica_coth' does not have an implementation for gammalooprs::utils::F<f64>
  1349. 30.44 s > stack backtrace:
  1350. 30.44 s > 0: __rustc::rust_begin_unwind
  1351. 30.44 s > 1: core::panicking::panic_fmt
  1352. 30.44 s > 2: <symbolica::evaluate::evaluator::ExpressionEvaluator<gammalooprs::utils::F<f64>>>::evaluate_impl_no_ops
  1353. 30.44 s > 3: <symbolica::evaluate::evaluator::ExpressionEvaluator<gammalooprs::utils::F<f64>>>::evaluate_single
  1354. 30.44 s > 4: gammalooprs::cff::generation::tests_cff::thermal_bubble
  1355. 30.44 s > 5: <gammalooprs::cff::generation::tests_cff::thermal_bubble::{closure#0} as core::ops::function::FnOnce<()>>::call_once
  1356. 30.44 s > note: Some details are omitted, run with `RUST_BACKTRACE=full` for a verbose backtrace.
  1357. 30.44 s >
  1358. 30.44 s > 4. gammalooprs::cff::generation::tests_cff::thermal_ring
  1359. 30.44 s > failure: test failure with exit code 101
  1360. 30.44 s > thread 'cff::generation::tests_cff::thermal_ring' (1291) panicked at /nix/store/l5xazfnr7k6r6p8mlkn38x2afab0rygz-vendor-cargo-deps/5929dab090e556a579e9f3b708cd2e67c60b3d84a12b5a276f2a36cb00473133/symbolica-2.2.0/src/evaluate/evaluator.rs:295:21:
  1361. 30.44 s > External function 'symbolica_coth' does not have an implementation for gammalooprs::utils::F<f64>
  1362. 30.44 s > stack backtrace:
  1363. 30.44 s > 0: __rustc::rust_begin_unwind
  1364. 30.44 s > 1: core::panicking::panic_fmt
  1365. 30.44 s > 2: <symbolica::evaluate::evaluator::ExpressionEvaluator<gammalooprs::utils::F<f64>>>::evaluate_impl_no_ops
  1366. 30.44 s > 3: <symbolica::evaluate::evaluator::ExpressionEvaluator<gammalooprs::utils::F<f64>>>::evaluate_single
  1367. 30.44 s > 4: gammalooprs::cff::generation::tests_cff::thermal_ring
  1368. 30.44 s > 5: <gammalooprs::cff::generation::tests_cff::thermal_ring::{closure#0} as core::ops::function::FnOnce<()>>::call_once
  1369. 30.44 s > note: Some details are omitted, run with `RUST_BACKTRACE=full` for a verbose backtrace.
  1370. 30.44 s > system-out
  1371. 30.44 s > running 1 test
  1372. 30.44 s > test cff::generation::tests_cff::thermal_ring ... FAILED
  1373. 30.44 s >
  1374. 30.44 s > failures:
  1375. 30.44 s >
  1376. 30.44 s > failures:
  1377. 30.44 s > cff::generation::tests_cff::thermal_ring
  1378. 30.44 s >
  1379. 30.44 s > test result: FAILED. 0 passed; 1 failed; 0 ignored; 0 measured; 535 filtered out; finished in 0.06s
  1380. 30.44 s > system-err
  1381. 30.44 s > thread 'cff::generation::tests_cff::thermal_ring' (1291) panicked at /nix/store/l5xazfnr7k6r6p8mlkn38x2afab0rygz-vendor-cargo-deps/5929dab090e556a579e9f3b708cd2e67c60b3d84a12b5a276f2a36cb00473133/symbolica-2.2.0/src/evaluate/evaluator.rs:295:21:
  1382. 30.44 s > External function 'symbolica_coth' does not have an implementation for gammalooprs::utils::F<f64>
  1383. 30.44 s > stack backtrace:
  1384. 30.44 s > 0: __rustc::rust_begin_unwind
  1385. 30.44 s > 1: core::panicking::panic_fmt
  1386. 30.44 s > 2: <symbolica::evaluate::evaluator::ExpressionEvaluator<gammalooprs::utils::F<f64>>>::evaluate_impl_no_ops
  1387. 30.44 s > 3: <symbolica::evaluate::evaluator::ExpressionEvaluator<gammalooprs::utils::F<f64>>>::evaluate_single
  1388. 30.44 s > 4: gammalooprs::cff::generation::tests_cff::thermal_ring
  1389. 30.44 s > 5: <gammalooprs::cff::generation::tests_cff::thermal_ring::{closure#0} as core::ops::function::FnOnce<()>>::call_once
  1390. 30.44 s > note: Some details are omitted, run with `RUST_BACKTRACE=full` for a verbose backtrace.
  1391. 30.44 s >
  1392. 30.44 s > 5. gammalooprs::cff::generation::tests_cff::thermal_mercedes
  1393. 30.44 s > failure: test failure with exit code 101
  1394. 30.44 s > thread 'cff::generation::tests_cff::thermal_mercedes' (1276) panicked at /nix/store/l5xazfnr7k6r6p8mlkn38x2afab0rygz-vendor-cargo-deps/5929dab090e556a579e9f3b708cd2e67c60b3d84a12b5a276f2a36cb00473133/symbolica-2.2.0/src/evaluate/evaluator.rs:295:21:
  1395. 30.44 s > External function 'symbolica_coth' does not have an implementation for gammalooprs::utils::F<f64>
  1396. 30.44 s > stack backtrace:
  1397. 30.44 s > 0: __rustc::rust_begin_unwind
  1398. 30.44 s > 1: core::panicking::panic_fmt
  1399. 30.44 s > 2: <symbolica::evaluate::evaluator::ExpressionEvaluator<gammalooprs::utils::F<f64>>>::evaluate_impl_no_ops
  1400. 30.44 s > 3: <symbolica::evaluate::evaluator::ExpressionEvaluator<gammalooprs::utils::F<f64>>>::evaluate_single
  1401. 30.44 s > 4: gammalooprs::cff::generation::tests_cff::thermal_mercedes
  1402. 30.44 s > 5: <gammalooprs::cff::generation::tests_cff::thermal_mercedes::{closure#0} as core::ops::function::FnOnce<()>>::call_once
  1403. 30.44 s > note: Some details are omitted, run with `RUST_BACKTRACE=full` for a verbose backtrace.
  1404. 30.44 s > system-out
  1405. 30.44 s > running 1 test
  1406. 30.44 s > test cff::generation::tests_cff::thermal_mercedes ... FAILED
  1407. 30.44 s >
  1408. 30.44 s > failures:
  1409. 30.44 s >
  1410. 30.44 s > failures:
  1411. 30.44 s > cff::generation::tests_cff::thermal_mercedes
  1412. 30.44 s >
  1413. 30.44 s > test result: FAILED. 0 passed; 1 failed; 0 ignored; 0 measured; 535 filtered out; finished in 0.10s
  1414. 30.44 s > system-err
  1415. 30.44 s > thread 'cff::generation::tests_cff::thermal_mercedes' (1276) panicked at /nix/store/l5xazfnr7k6r6p8mlkn38x2afab0rygz-vendor-cargo-deps/5929dab090e556a579e9f3b708cd2e67c60b3d84a12b5a276f2a36cb00473133/symbolica-2.2.0/src/evaluate/evaluator.rs:295:21:
  1416. 30.44 s > External function 'symbolica_coth' does not have an implementation for gammalooprs::utils::F<f64>
  1417. 30.44 s > stack backtrace:
  1418. 30.44 s > 0: __rustc::rust_begin_unwind
  1419. 30.44 s > 1: core::panicking::panic_fmt
  1420. 30.44 s > 2: <symbolica::evaluate::evaluator::ExpressionEvaluator<gammalooprs::utils::F<f64>>>::evaluate_impl_no_ops
  1421. 30.44 s > 3: <symbolica::evaluate::evaluator::ExpressionEvaluator<gammalooprs::utils::F<f64>>>::evaluate_single
  1422. 30.44 s > 4: gammalooprs::cff::generation::tests_cff::thermal_mercedes
  1423. 30.44 s > 5: <gammalooprs::cff::generation::tests_cff::thermal_mercedes::{closure#0} as core::ops::function::FnOnce<()>>::call_once
  1424. 30.44 s > note: Some details are omitted, run with `RUST_BACKTRACE=full` for a verbose backtrace.
  1425. 30.44 s >
  1426. 30.44 s > 6. gammalooprs::graph::feynman_graph::tests::native_thermal_distributions
  1427. 30.44 s > failure: test failure with exit code 101
  1428. 30.44 s > system-out
  1429. 30.44 s > running 1 test
  1430. 30.44 s > test graph::feynman_graph::tests::native_thermal_distributions ... FAILED
  1431. 30.44 s >
  1432. 30.44 s > failures:
  1433. 30.44 s >
  1434. 30.44 s > failures:
  1435. 30.44 s > graph::feynman_graph::tests::native_thermal_distributions
  1436. 30.44 s >
  1437. 30.44 s > test result: FAILED. 0 passed; 1 failed; 0 ignored; 0 measured; 535 filtered out; finished in 0.44s
  1438. 30.44 s > system-err
  1439. 30.44 s > The application panicked (crashed).
  1440. 30.44 s > Message: called `Result::unwrap()` on an `Err` value: Custom { kind: Other, error: "Could not compile code: g++ -shared -O3 -fPIC -ffast-math -funsafe-math-optimizations -march=native -o /build/gammaloop-native-thermal-1345/thermal_0_0.so /build/gammaloop-native-thermal-1345/thermal_0_0.cpp\nwarning: Skipping impure flag -march=native because NIX_ENFORCE_NO_NATIVE is set\n/build/gammaloop-native-thermal-1345/thermal_0_0.cpp: In function 'void thermal_realf64(const double*, double*, double*)':\n/build/gammaloop-native-thermal-1345/thermal_0_0.cpp:27:16: error: 'symbolica_tanh' was not declared in this scope\n 27 | Z[6] = symbolica_tanh(Z[6]);\n | ^~~~~~~~~~~~~~\n" }
  1441. 30.44 s > Location: crates/gammalooprs/src/graph/feynman_graph.rs:937
  1442. 30.44 s >
  1443. 30.44 s > ━━━━━━━━━━━━━━━━━━━━━━━━━━━━━━━━━━ BACKTRACE ━━━━━━━━━━━━━━━━━━━━━━━━━━━━━━━━━━━
  1444. 30.44 s > 1: <color_eyre[b0c9e66060e883b2]::config::PanicHook>::panic_report<unknown>
  1445. 30.44 s > at <unknown source file>:<unknown line>
  1446. 30.44 s > 2: <color_eyre[b0c9e66060e883b2]::config::PanicHook>::into_panic_hook::{closure#0}<unknown>
  1447. 30.44 s > at <unknown source file>:<unknown line>
  1448. 30.44 s > 3: std[bcb96dfbba0ab899]::panicking::panic_with_hook<unknown>
  1449. 30.44 s > at <unknown source file>:<unknown line>
  1450. 30.44 s > 4: std[bcb96dfbba0ab899]::panicking::panic_handler::{closure#0}<unknown>
  1451. 30.44 s > at <unknown source file>:<unknown line>
  1452. 30.44 s > 5: std[bcb96dfbba0ab899]::sys::backtrace::__rust_end_short_backtrace::<std[bcb96dfbba0ab899]::panicking::panic_handler::{closure#0}, !><unknown>
  1453. 30.44 s > at <unknown source file>:<unknown line>
  1454. 30.44 s > 6: __rustc[6c289b9f9c454d21]::rust_begin_unwind<unknown>
  1455. 30.44 s > at <unknown source file>:<unknown line>
  1456. 30.44 s > 7: core[940e698046960fd5]::panicking::panic_fmt<unknown>
  1457. 30.44 s > at <unknown source file>:<unknown line>
  1458. 30.44 s > 8: core[940e698046960fd5]::result::unwrap_failed<unknown>
  1459. 30.44 s > at <unknown source file>:<unknown line>
  1460. 30.44 s > 9: gammalooprs[f21b74aec46f5289]::graph::feynman_graph::tests::native_thermal_distributions<unknown>
  1461. 30.44 s > at <unknown source file>:<unknown line>
  1462. 30.44 s > 10: <gammalooprs[f21b74aec46f5289]::graph::feynman_graph::tests::native_thermal_distributions::{closure#0} as core[940e698046960fd5]::ops::function::FnOnce<()>>::call_once<unknown>
  1463. 30.44 s > at <unknown source file>:<unknown line>
  1464. 30.44 s > 11: test[75d6903177b1d7e9]::__rust_begin_short_backtrace::<core[940e698046960fd5]::result::Result<(), alloc[2ea6bcb46fca0c42]::string::String>, fn() -> core[940e698046960fd5]::result::Result<(), alloc[2ea6bcb46fca0c42]::string::String>><unknown>
  1465. 30.44 s > at <unknown source file>:<unknown line>
  1466. 30.44 s > 12: test[75d6903177b1d7e9]::run_test::{closure#0}<unknown>
  1467. 30.44 s > at <unknown source file>:<unknown line>
  1468. 30.44 s > 13: std[bcb96dfbba0ab899]::sys::backtrace::__rust_begin_short_backtrace::<test[75d6903177b1d7e9]::run_test::{closure#1}, ()><unknown>
  1469. 30.44 s > at <unknown source file>:<unknown line>
  1470. 30.44 s > 14: <std[bcb96dfbba0ab899]::thread::lifecycle::spawn_unchecked<test[75d6903177b1d7e9]::run_test::{closure#1}, ()>::{closure#1} as core[940e698046960fd5]::ops::function::FnOnce<()>>::call_once::{shim:vtable#0}<unknown>
  1471. 30.44 s > at <unknown source file>:<unknown line>
  1472. 30.44 s > 15: <std[bcb96dfbba0ab899]::sys::thread::unix::Thread>::new::thread_start<unknown>
  1473. 30.44 s > at <unknown source file>:<unknown line>
  1474. 30.44 s > 16: start_thread<unknown>
  1475. 30.44 s > at <unknown source file>:<unknown line>
  1476. 30.44 s > 17: __clone3<unknown>
  1477. 30.44 s > at <unknown source file>:<unknown line>
  1478. 30.44 s >
  1479. 30.44 s > Run with COLORBT_SHOW_HIDDEN=1 environment variable to disable frame filtering.
  1480. 30.44 s > Run with RUST_BACKTRACE=full to include source snippets.
  1481. 30.44 s >
  1482. 30.44 s > 7. gammalooprs::cff::generation::tests_cff::thermal_bugblatter
  1483. 30.44 s > failure: test failure with exit code 101
  1484. 30.44 s > thread 'cff::generation::tests_cff::thermal_bugblatter' (1274) panicked at /nix/store/l5xazfnr7k6r6p8mlkn38x2afab0rygz-vendor-cargo-deps/5929dab090e556a579e9f3b708cd2e67c60b3d84a12b5a276f2a36cb00473133/symbolica-2.2.0/src/evaluate/evaluator.rs:295:21:
  1485. 30.44 s > External function 'symbolica_coth' does not have an implementation for gammalooprs::utils::F<f64>
  1486. 30.44 s > stack backtrace:
  1487. 30.44 s > 0: __rustc::rust_begin_unwind
  1488. 30.44 s > 1: core::panicking::panic_fmt
  1489. 30.44 s > 2: <symbolica::evaluate::evaluator::ExpressionEvaluator<gammalooprs::utils::F<f64>>>::evaluate_impl_no_ops
  1490. 30.44 s > 3: <symbolica::evaluate::evaluator::ExpressionEvaluator<gammalooprs::utils::F<f64>>>::evaluate_single
  1491. 30.44 s > 4: gammalooprs::cff::generation::tests_cff::thermal_bugblatter
  1492. 30.44 s > 5: <gammalooprs::cff::generation::tests_cff::thermal_bugblatter::{closure#0} as core::ops::function::FnOnce<()>>::call_once
  1493. 30.44 s > note: Some details are omitted, run with `RUST_BACKTRACE=full` for a verbose backtrace.
  1494. 30.44 s > system-out
  1495. 30.44 s > running 1 test
  1496. 30.44 s > test cff::generation::tests_cff::thermal_bugblatter ... FAILED
  1497. 30.44 s >
  1498. 30.44 s > failures:
  1499. 30.44 s >
  1500. 30.44 s > failures:
  1501. 30.44 s > cff::generation::tests_cff::thermal_bugblatter
  1502. 30.44 s >
  1503. 30.44 s > test result: FAILED. 0 passed; 1 failed; 0 ignored; 0 measured; 535 filtered out; finished in 5.24s
  1504. 30.44 s > system-err
  1505. 30.44 s > thread 'cff::generation::tests_cff::thermal_bugblatter' (1274) panicked at /nix/store/l5xazfnr7k6r6p8mlkn38x2afab0rygz-vendor-cargo-deps/5929dab090e556a579e9f3b708cd2e67c60b3d84a12b5a276f2a36cb00473133/symbolica-2.2.0/src/evaluate/evaluator.rs:295:21:
  1506. 30.44 s > External function 'symbolica_coth' does not have an implementation for gammalooprs::utils::F<f64>
  1507. 30.44 s > stack backtrace:
  1508. 30.44 s > 0: __rustc::rust_begin_unwind
  1509. 30.44 s > 1: core::panicking::panic_fmt
  1510. 30.44 s > 2: <symbolica::evaluate::evaluator::ExpressionEvaluator<gammalooprs::utils::F<f64>>>::evaluate_impl_no_ops
  1511. 30.44 s > 3: <symbolica::evaluate::evaluator::ExpressionEvaluator<gammalooprs::utils::F<f64>>>::evaluate_single
  1512. 30.44 s > 4: gammalooprs::cff::generation::tests_cff::thermal_bugblatter
  1513. 30.44 s > 5: <gammalooprs::cff::generation::tests_cff::thermal_bugblatter::{closure#0} as core::ops::function::FnOnce<()>>::call_once
  1514. 30.44 s > note: Some details are omitted, run with `RUST_BACKTRACE=full` for a verbose backtrace.
  1515. 30.44 s > =========================================
  1516. 30.44 s For full logs, run:
  1517. 30.44 s nix log /nix/store/8r84j4srh5jz28101cd8xndlncp1i0gs-gammaloop-nextest-core.drv
  1518. 30.54 s [0 built (1 failed), 0.0Run failed.