0.00 s
$ /nix/store/9ypz3flqsrl5xl495mm8h645gadjsxi1-coreutils-9.11/bin/timeout --kill-after=15s 7200s /nix/store/23zk8sgzamrbmj1fday15szf7f2279s8-nix-2.34.7/bin/nix --extra-experimental-features nix-command --extra-experimental-features flakes flake clone git+https://github.com/alphal00p/gammaloop --dest /tmp/nix-ci-worker/stable-pwd/repo/
0.06 s
Cloning into '/tmp/nix-ci-worker/stable-pwd/repo'...
1.72 s
remote: Enumerating objects: 81983, done.
1.85 s
remote: Counting objects: 0% (1/11500)
remote: Counting objects: 1% (115/11500)
remote: Counting objects: 2% (230/11500)
remote: Counting objects: 3% (345/11500)
remote: Counting objects: 4% (460/11500)
remote: Counting objects: 5% (575/11500)
remote: Counting objects: 6% (690/11500)
remote: Counting objects: 7% (805/11500)
remote: Counting objects: 8% (920/11500)
remote: Counting objects: 9% (1035/11500)
remote: Counting objects: 10% (1150/11500)
remote: Counting objects: 11% (1265/11500)
remote: Counting objects: 12% (1380/11500)
remote: Counting objects: 13% (1495/11500)
remote: Counting objects: 14% (1610/11500)
remote: Counting objects: 15% (1725/11500)
remote: Counting objects: 16% (1840/11500)
remote: Counting objects: 17% (1955/11500)
remote: Counting objects: 18% (2070/11500)
remote: Counting objects: 19% (2185/11500)
remote: Counting objects: 20% (2300/11500)
remote: Counting objects: 21% (2415/11500)
remote: Counting objects: 22% (2530/11500)
remote: Counting objects: 23% (2645/11500)
remote: Counting objects: 24% (2760/11500)
remote: Counting objects: 25% (2875/11500)
remote: Counting objects: 26% (2990/11500)
remote: Counting objects: 27% (3105/11500)
remote: Counting objects: 28% (3220/11500)
remote: Counting objects: 29% (3335/11500)
remote: Counting objects: 30% (3450/11500)
remote: Counting objects: 31% (3565/11500)
remote: Counting objects: 32% (3680/11500)
remote: Counting objects: 33% (3795/11500)
remote: Counting objects: 34% (3910/11500)
remote: Counting objects: 35% (4025/11500)
remote: Counting objects: 36% (4140/11500)
remote: Counting objects: 37% (4255/11500)
remote: Counting objects: 38% (4370/11500)
remote: Counting objects: 39% (4485/11500)
remote: Counting objects: 40% (4600/11500)
remote: Counting objects: 41% (4715/11500)
remote: Counting objects: 42% (4830/11500)
remote: Counting objects: 43% (4945/11500)
remote: Counting objects: 44% (5060/11500)
remote: Counting objects: 45% (5175/11500)
remote: Counting objects: 46% (5290/11500)
remote: Counting objects: 47% (5405/11500)
remote: Counting objects: 48% (5520/11500)
remote: Counting objects: 49% (5635/11500)
remote: Counting objects: 50% (5750/11500)
remote: Counting objects: 51% (5865/11500)
remote: Counting objects: 52% (5980/11500)
remote: Counting objects: 53% (6095/11500)
remote: Counting objects: 54% (6210/11500)
remote: Counting objects: 55% (6325/11500)
remote: Counting objects: 56% (6440/11500)
remote: Counting objects: 57% (6555/11500)
remote: Counting objects: 58% (6670/11500)
remote: Counting objects: 59% (6785/11500)
remote: Counting objects: 60% (6900/11500)
remote: Counting objects: 61% (7015/11500)
remote: Counting objects: 62% (7130/11500)
remote: Counting objects: 63% (7245/11500)
remote: Counting objects: 64% (7360/11500)
remote: Counting objects: 65% (7475/11500)
remote: Counting objects: 66% (7590/11500)
remote: Counting objects: 67% (7705/11500)
remote: Counting objects: 68% (7820/11500)
remote: Counting objects: 69% (7935/11500)
remote: Counting objects: 70% (8050/11500)
remote: Counting objects: 71% (8165/11500)
remote: Counting objects: 72% (8280/11500)
remote: Counting objects: 73% (8395/11500)
remote: Counting objects: 74% (8510/11500)
remote: Counting objects: 75% (8625/11500)
remote: Counting objects: 76% (8740/11500)
remote: Counting objects: 77% (8855/11500)
remote: Counting objects: 78% (8970/11500)
remote: Counting objects: 79% (9085/11500)
remote: Counting objects: 80% (9200/11500)
remote: Counting objects: 81% (9315/11500)
remote: Counting objects: 82% (9430/11500)
remote: Counting objects: 83% (9545/11500)
remote: Counting objects: 84% (9660/11500)
remote: Counting objects: 85% (9775/11500)
remote: Counting objects: 86% (9890/11500)
remote: Counting objects: 87% (10005/11500)
remote: Counting objects: 88% (10120/11500)
remote: Counting objects: 89% (10235/11500)
remote: Counting objects: 90% (10350/11500)
remote: Counting objects: 91% (10465/11500)
remote: Counting objects: 92% (10580/11500)
remote: Counting objects: 93% (10695/11500)
remote: Counting objects: 94% (10810/11500)
remote: Counting objects: 95% (10925/11500)
remote: Counting objects: 96% (11040/11500)
remote: Counting objects: 97% (11155/11500)
remote: Counting objects: 98% (11270/11500)
remote: Counting objects: 99% (11385/11500)
remote: Counting objects: 100% (11500/11500)
remote: Counting objects: 100% (11500/11500), done.
4.38 s
remote: Compressing objects: 0% (1/2701)
remote: Compressing objects: 1% (28/2701)
remote: Compressing objects: 2% (55/2701)
remote: Compressing objects: 3% (82/2701)
remote: Compressing objects: 4% (109/2701)
remote: Compressing objects: 5% (136/2701)
remote: Compressing objects: 6% (163/2701)
remote: Compressing objects: 7% (190/2701)
remote: Compressing objects: 8% (217/2701)
remote: Compressing objects: 9% (244/2701)
remote: Compressing objects: 10% (271/2701)
remote: Compressing objects: 11% (298/2701)
remote: Compressing objects: 12% (325/2701)
remote: Compressing objects: 13% (352/2701)
remote: Compressing objects: 14% (379/2701)
remote: Compressing objects: 15% (406/2701)
remote: Compressing objects: 16% (433/2701)
remote: Compressing objects: 17% (460/2701)
remote: Compressing objects: 18% (487/2701)
remote: Compressing objects: 19% (514/2701)
remote: Compressing objects: 20% (541/2701)
remote: Compressing objects: 20% (552/2701)
remote: Compressing objects: 21% (568/2701)
remote: Compressing objects: 22% (595/2701)
remote: Compressing objects: 23% (622/2701)
remote: Compressing objects: 24% (649/2701)
remote: Compressing objects: 25% (676/2701)
remote: Compressing objects: 26% (703/2701)
remote: Compressing objects: 27% (730/2701)
remote: Compressing objects: 27% (733/2701)
remote: Compressing objects: 28% (757/2701)
remote: Compressing objects: 29% (784/2701)
remote: Compressing objects: 30% (811/2701)
remote: Compressing objects: 31% (838/2701)
remote: Compressing objects: 32% (865/2701)
remote: Compressing objects: 33% (892/2701)
remote: Compressing objects: 34% (919/2701)
remote: Compressing objects: 35% (946/2701)
remote: Compressing objects: 36% (973/2701)
remote: Compressing objects: 37% (1000/2701)
remote: Compressing objects: 38% (1027/2701)
remote: Compressing objects: 39% (1054/2701)
remote: Compressing objects: 40% (1081/2701)
remote: Compressing objects: 41% (1108/2701)
remote: Compressing objects: 42% (1135/2701)
remote: Compressing objects: 43% (1162/2701)
remote: Compressing objects: 44% (1189/2701)
remote: Compressing objects: 45% (1216/2701)
remote: Compressing objects: 46% (1243/2701)
remote: Compressing objects: 47% (1270/2701)
remote: Compressing objects: 48% (1297/2701)
remote: Compressing objects: 49% (1324/2701)
remote: Compressing objects: 50% (1351/2701)
remote: Compressing objects: 51% (1378/2701)
remote: Compressing objects: 52% (1405/2701)
remote: Compressing objects: 53% (1432/2701)
remote: Compressing objects: 54% (1459/2701)
remote: Compressing objects: 55% (1486/2701)
remote: Compressing objects: 56% (1513/2701)
remote: Compressing objects: 57% (1540/2701)
remote: Compressing objects: 58% (1567/2701)
remote: Compressing objects: 59% (1594/2701)
remote: Compressing objects: 60% (1621/2701)
remote: Compressing objects: 61% (1648/2701)
remote: Compressing objects: 62% (1675/2701)
remote: Compressing objects: 63% (1702/2701)
remote: Compressing objects: 64% (1729/2701)
remote: Compressing objects: 65% (1756/2701)
remote: Compressing objects: 66% (1783/2701)
remote: Compressing objects: 67% (1810/2701)
remote: Compressing objects: 68% (1837/2701)
remote: Compressing objects: 69% (1864/2701)
remote: Compressing objects: 70% (1891/2701)
remote: Compressing objects: 71% (1918/2701)
remote: Compressing objects: 72% (1945/2701)
remote: Compressing objects: 73% (1972/2701)
remote: Compressing objects: 74% (1999/2701)
remote: Compressing objects: 75% (2026/2701)
remote: Compressing objects: 76% (2053/2701)
remote: Compressing objects: 77% (2080/2701)
remote: Compressing objects: 78% (2107/2701)
remote: Compressing objects: 79% (2134/2701)
remote: Compressing objects: 80% (2161/2701)
remote: Compressing objects: 81% (2188/2701)
remote: Compressing objects: 82% (2215/2701)
remote: Compressing objects: 83% (2242/2701)
remote: Compressing objects: 84% (2269/2701)
remote: Compressing objects: 85% (2296/2701)
remote: Compressing objects: 86% (2323/2701)
remote: Compressing objects: 87% (2350/2701)
remote: Compressing objects: 88% (2377/2701)
remote: Compressing objects: 89% (2404/2701)
remote: Compressing objects: 90% (2431/2701)
remote: Compressing objects: 91% (2458/2701)
remote: Compressing objects: 92% (2485/2701)
remote: Compressing objects: 93% (2512/2701)
remote: Compressing objects: 94% (2539/2701)
remote: Compressing objects: 95% (2566/2701)
remote: Compressing objects: 96% (2593/2701)
remote: Compressing objects: 97% (2620/2701)
remote: Compressing objects: 98% (2647/2701)
remote: Compressing objects: 99% (2674/2701)
remote: Compressing objects: 100% (2701/2701)
remote: Compressing objects: 100% (2701/2701), done.
8.65 s
Receiving objects: 0% (1/81983)
Receiving objects: 1% (820/81983)
Receiving objects: 2% (1640/81983)
Receiving objects: 3% (2460/81983)
Receiving objects: 4% (3280/81983)
Receiving objects: 5% (4100/81983)
Receiving objects: 6% (4919/81983)
Receiving objects: 7% (5739/81983)
Receiving objects: 8% (6559/81983), 9.88 MiB | 19.74 MiB/s
Receiving objects: 9% (7379/81983), 9.88 MiB | 19.74 MiB/s
Receiving objects: 10% (8199/81983), 9.88 MiB | 19.74 MiB/s
Receiving objects: 11% (9019/81983), 9.88 MiB | 19.74 MiB/s
Receiving objects: 12% (9838/81983), 9.88 MiB | 19.74 MiB/s
Receiving objects: 13% (10658/81983), 9.88 MiB | 19.74 MiB/s
Receiving objects: 14% (11478/81983), 9.88 MiB | 19.74 MiB/s
Receiving objects: 15% (12298/81983), 9.88 MiB | 19.74 MiB/s
Receiving objects: 16% (13118/81983), 9.88 MiB | 19.74 MiB/s
Receiving objects: 17% (13938/81983), 9.88 MiB | 19.74 MiB/s
Receiving objects: 18% (14757/81983), 9.88 MiB | 19.74 MiB/s
Receiving objects: 19% (15577/81983), 9.88 MiB | 19.74 MiB/s
Receiving objects: 20% (16397/81983), 9.88 MiB | 19.74 MiB/s
Receiving objects: 21% (17217/81983), 9.88 MiB | 19.74 MiB/s
Receiving objects: 22% (18037/81983), 9.88 MiB | 19.74 MiB/s
Receiving objects: 23% (18857/81983), 9.88 MiB | 19.74 MiB/s
Receiving objects: 24% (19676/81983), 9.88 MiB | 19.74 MiB/s
Receiving objects: 25% (20496/81983), 9.88 MiB | 19.74 MiB/s
Receiving objects: 26% (21316/81983), 9.88 MiB | 19.74 MiB/s
Receiving objects: 27% (22136/81983), 9.88 MiB | 19.74 MiB/s
Receiving objects: 28% (22956/81983), 9.88 MiB | 19.74 MiB/s
Receiving objects: 29% (23776/81983), 9.88 MiB | 19.74 MiB/s
Receiving objects: 30% (24595/81983), 9.88 MiB | 19.74 MiB/s
Receiving objects: 31% (25415/81983), 9.88 MiB | 19.74 MiB/s
Receiving objects: 32% (26235/81983), 9.88 MiB | 19.74 MiB/s
Receiving objects: 33% (27055/81983), 9.88 MiB | 19.74 MiB/s
Receiving objects: 34% (27875/81983), 9.88 MiB | 19.74 MiB/s
Receiving objects: 35% (28695/81983), 9.88 MiB | 19.74 MiB/s
Receiving objects: 36% (29514/81983), 9.88 MiB | 19.74 MiB/s
Receiving objects: 37% (30334/81983), 9.88 MiB | 19.74 MiB/s
Receiving objects: 38% (31154/81983), 9.88 MiB | 19.74 MiB/s
Receiving objects: 38% (31444/81983), 27.70 MiB | 27.69 MiB/s
Receiving objects: 39% (31974/81983), 27.70 MiB | 27.69 MiB/s
Receiving objects: 40% (32794/81983), 27.70 MiB | 27.69 MiB/s
Receiving objects: 41% (33614/81983), 27.70 MiB | 27.69 MiB/s
Receiving objects: 42% (34433/81983), 27.70 MiB | 27.69 MiB/s
Receiving objects: 43% (35253/81983), 27.70 MiB | 27.69 MiB/s
Receiving objects: 44% (36073/81983), 27.70 MiB | 27.69 MiB/s
Receiving objects: 45% (36893/81983), 27.70 MiB | 27.69 MiB/s
Receiving objects: 46% (37713/81983), 27.70 MiB | 27.69 MiB/s
Receiving objects: 47% (38533/81983), 42.41 MiB | 28.14 MiB/s
Receiving objects: 48% (39352/81983), 42.41 MiB | 28.14 MiB/s
Receiving objects: 49% (40172/81983), 42.41 MiB | 28.14 MiB/s
Receiving objects: 50% (40992/81983), 42.41 MiB | 28.14 MiB/s
Receiving objects: 51% (41812/81983), 42.41 MiB | 28.14 MiB/s
Receiving objects: 52% (42632/81983), 42.41 MiB | 28.14 MiB/s
Receiving objects: 53% (43451/81983), 42.41 MiB | 28.14 MiB/s
Receiving objects: 54% (44271/81983), 42.41 MiB | 28.14 MiB/s
Receiving objects: 55% (45091/81983), 42.41 MiB | 28.14 MiB/s
Receiving objects: 56% (45911/81983), 42.41 MiB | 28.14 MiB/s
Receiving objects: 56% (46403/81983), 57.57 MiB | 28.52 MiB/s
Receiving objects: 57% (46731/81983), 57.57 MiB | 28.52 MiB/s
Receiving objects: 58% (47551/81983), 57.57 MiB | 28.52 MiB/s
Receiving objects: 59% (48370/81983), 57.57 MiB | 28.52 MiB/s
Receiving objects: 60% (49190/81983), 57.57 MiB | 28.52 MiB/s
Receiving objects: 61% (50010/81983), 57.57 MiB | 28.52 MiB/s
Receiving objects: 62% (50830/81983), 57.57 MiB | 28.52 MiB/s
Receiving objects: 63% (51650/81983), 73.21 MiB | 28.95 MiB/s
Receiving objects: 64% (52470/81983), 73.21 MiB | 28.95 MiB/s
Receiving objects: 65% (53289/81983), 73.21 MiB | 28.95 MiB/s
Receiving objects: 66% (54109/81983), 73.21 MiB | 28.95 MiB/s
Receiving objects: 67% (54929/81983), 73.21 MiB | 28.95 MiB/s
Receiving objects: 68% (55749/81983), 73.21 MiB | 28.95 MiB/s
Receiving objects: 69% (56569/81983), 73.21 MiB | 28.95 MiB/s
Receiving objects: 70% (57389/81983), 73.21 MiB | 28.95 MiB/s
Receiving objects: 71% (58208/81983), 73.21 MiB | 28.95 MiB/s
Receiving objects: 72% (59028/81983), 73.21 MiB | 28.95 MiB/s
Receiving objects: 72% (59212/81983), 73.21 MiB | 28.95 MiB/s
Receiving objects: 73% (59848/81983), 73.21 MiB | 28.95 MiB/s
Receiving objects: 74% (60668/81983), 89.21 MiB | 29.35 MiB/s
Receiving objects: 75% (61488/81983), 89.21 MiB | 29.35 MiB/s
Receiving objects: 76% (62308/81983), 89.21 MiB | 29.35 MiB/s
Receiving objects: 77% (63127/81983), 89.21 MiB | 29.35 MiB/s
Receiving objects: 78% (63947/81983), 105.46 MiB | 29.71 MiB/s
Receiving objects: 79% (64767/81983), 105.46 MiB | 29.71 MiB/s
Receiving objects: 80% (65587/81983), 105.46 MiB | 29.71 MiB/s
Receiving objects: 81% (66407/81983), 105.46 MiB | 29.71 MiB/s
Receiving objects: 82% (67227/81983), 105.46 MiB | 29.71 MiB/s
Receiving objects: 83% (68046/81983), 105.46 MiB | 29.71 MiB/s
Receiving objects: 84% (68866/81983), 105.46 MiB | 29.71 MiB/s
Receiving objects: 85% (69686/81983), 105.46 MiB | 29.71 MiB/s
Receiving objects: 86% (70506/81983), 105.46 MiB | 29.71 MiB/s
Receiving objects: 87% (71326/81983), 105.46 MiB | 29.71 MiB/s
Receiving objects: 88% (72146/81983), 105.46 MiB | 29.71 MiB/s
Receiving objects: 89% (72965/81983), 105.46 MiB | 29.71 MiB/s
Receiving objects: 90% (73785/81983), 105.46 MiB | 29.71 MiB/s
Receiving objects: 91% (74605/81983), 105.46 MiB | 29.71 MiB/s
Receiving objects: 92% (75425/81983), 105.46 MiB | 29.71 MiB/s
Receiving objects: 93% (76245/81983), 105.46 MiB | 29.71 MiB/s
Receiving objects: 94% (77065/81983), 105.46 MiB | 29.71 MiB/s
Receiving objects: 95% (77884/81983), 105.46 MiB | 29.71 MiB/s
Receiving objects: 95% (78179/81983), 105.46 MiB | 29.71 MiB/s
Receiving objects: 96% (78704/81983), 105.46 MiB | 29.71 MiB/s
Receiving objects: 97% (79524/81983), 121.61 MiB | 30.03 MiB/s
Receiving objects: 98% (80344/81983), 121.61 MiB | 30.03 MiB/s
Receiving objects: 99% (81164/81983), 121.61 MiB | 30.03 MiB/s
remote: Total 81983 (delta 8900), reused 9414 (delta 8005), pack-reused 70483 (from 2)
8.65 s
Receiving objects: 100% (81983/81983), 121.61 MiB | 30.03 MiB/s
Receiving objects: 100% (81983/81983), 127.89 MiB | 29.99 MiB/s, done.
9.47 s
Resolving deltas: 0% (0/55458)
Resolving deltas: 1% (555/55458)
Resolving deltas: 2% (1110/55458)
Resolving deltas: 3% (1664/55458)
Resolving deltas: 4% (2219/55458)
Resolving deltas: 5% (2773/55458)
Resolving deltas: 6% (3328/55458)
Resolving deltas: 7% (3883/55458)
Resolving deltas: 8% (4437/55458)
Resolving deltas: 9% (4992/55458)
Resolving deltas: 10% (5546/55458)
Resolving deltas: 11% (6102/55458)
Resolving deltas: 12% (6655/55458)
Resolving deltas: 13% (7211/55458)
Resolving deltas: 14% (7765/55458)
Resolving deltas: 15% (8321/55458)
Resolving deltas: 16% (8874/55458)
Resolving deltas: 17% (9428/55458)
Resolving deltas: 18% (9983/55458)
Resolving deltas: 19% (10538/55458)
Resolving deltas: 20% (11092/55458)
Resolving deltas: 21% (11649/55458)
Resolving deltas: 22% (12202/55458)
Resolving deltas: 23% (12756/55458)
Resolving deltas: 24% (13310/55458)
Resolving deltas: 25% (13865/55458)
Resolving deltas: 26% (14420/55458)
Resolving deltas: 27% (14974/55458)
Resolving deltas: 28% (15529/55458)
Resolving deltas: 29% (16083/55458)
Resolving deltas: 30% (16638/55458)
Resolving deltas: 31% (17192/55458)
Resolving deltas: 32% (17747/55458)
Resolving deltas: 33% (18302/55458)
Resolving deltas: 34% (18856/55458)
Resolving deltas: 35% (19412/55458)
Resolving deltas: 36% (19965/55458)
Resolving deltas: 37% (20520/55458)
Resolving deltas: 38% (21075/55458)
Resolving deltas: 39% (21629/55458)
Resolving deltas: 40% (22186/55458)
Resolving deltas: 41% (22738/55458)
Resolving deltas: 42% (23293/55458)
Resolving deltas: 43% (23847/55458)
Resolving deltas: 44% (24403/55458)
Resolving deltas: 45% (24957/55458)
Resolving deltas: 46% (25511/55458)
Resolving deltas: 47% (26066/55458)
Resolving deltas: 48% (26621/55458)
Resolving deltas: 49% (27175/55458)
Resolving deltas: 50% (27729/55458)
Resolving deltas: 51% (28284/55458)
Resolving deltas: 52% (28841/55458)
Resolving deltas: 53% (29393/55458)
Resolving deltas: 54% (29948/55458)
Resolving deltas: 55% (30502/55458)
Resolving deltas: 56% (31057/55458)
Resolving deltas: 57% (31612/55458)
Resolving deltas: 58% (32166/55458)
Resolving deltas: 59% (32721/55458)
Resolving deltas: 60% (33275/55458)
Resolving deltas: 61% (33830/55458)
Resolving deltas: 62% (34384/55458)
Resolving deltas: 63% (34939/55458)
Resolving deltas: 64% (35494/55458)
Resolving deltas: 65% (36048/55458)
Resolving deltas: 66% (36604/55458)
Resolving deltas: 67% (37158/55458)
Resolving deltas: 68% (37712/55458)
Resolving deltas: 69% (38267/55458)
Resolving deltas: 70% (38821/55458)
Resolving deltas: 71% (39376/55458)
Resolving deltas: 72% (39930/55458)
Resolving deltas: 73% (40485/55458)
Resolving deltas: 74% (41039/55458)
Resolving deltas: 75% (41594/55458)
Resolving deltas: 76% (42149/55458)
Resolving deltas: 77% (42704/55458)
Resolving deltas: 78% (43258/55458)
Resolving deltas: 79% (43812/55458)
Resolving deltas: 80% (44367/55458)
Resolving deltas: 81% (44921/55458)
Resolving deltas: 82% (45476/55458)
Resolving deltas: 83% (46031/55458)
Resolving deltas: 84% (46585/55458)
Resolving deltas: 85% (47140/55458)
Resolving deltas: 86% (47694/55458)
Resolving deltas: 87% (48249/55458)
Resolving deltas: 88% (48804/55458)
Resolving deltas: 89% (49358/55458)
Resolving deltas: 90% (49916/55458)
Resolving deltas: 91% (50467/55458)
Resolving deltas: 92% (51022/55458)
Resolving deltas: 93% (51576/55458)
Resolving deltas: 94% (52131/55458)
Resolving deltas: 95% (52688/55458)
Resolving deltas: 96% (53240/55458)
Resolving deltas: 97% (53795/55458)
Resolving deltas: 98% (54351/55458)
Resolving deltas: 99% (54904/55458)
Resolving deltas: 100% (55458/55458)
Resolving deltas: 100% (55458/55458), done.
9.76 s
Fetching commit 4536be27cf46d387134394bef7d376842a5ccfe5 for wip/native-symbolica-hyperbolics ...
9.76 s
$ /nix/store/bcnisk3ydfgv26v2gw3zlky24g00yww2-git-2.54.0/bin/git fetch origin 4536be27cf46d387134394bef7d376842a5ccfe5
10.24 s
From https://github.com/alphal00p/gammaloop
10.24 s
* branch 4536be27cf46d387134394bef7d376842a5ccfe5 -> FETCH_HEAD
10.25 s
$ /nix/store/9ypz3flqsrl5xl495mm8h645gadjsxi1-coreutils-9.11/bin/timeout --kill-after=15s 7200s /nix/store/bcnisk3ydfgv26v2gw3zlky24g00yww2-git-2.54.0/bin/git -c advice.detachedHead=false checkout 4536be27cf46d387134394bef7d376842a5ccfe5
10.41 s
HEAD is now at 4536be27c Update symjit and use it for thermal sunrise tests
10.41 s
$ /nix/store/9ypz3flqsrl5xl495mm8h645gadjsxi1-coreutils-9.11/bin/timeout --kill-after=15s 7200s /nix/store/23zk8sgzamrbmj1fday15szf7f2279s8-nix-2.34.7/bin/nix --extra-experimental-features nix-command --extra-experimental-features flakes --log-format internal-json run .#packages.x86_64-linux.nix-ci-check-gammaloop-nextest-core --print-build-logs
14.15 s
14.30 s
Downloading cached gammaloop-nextest-binaries-core-gammaloop-api from https://cache.nix-ci.com
14.30 s
Downloading cached gammaloop-nextest-binaries-core-gammaloop-tracing-filter from https://cache.nix-ci.com
14.30 s
Downloading cached gammaloop-nextest-binaries-core-gammaloop-tracing-filter-macros from https://cache.nix-ci.com
14.30 s
Downloading cached gammaloop-nextest-binaries-core-gammalooprs from https://cache.nix-ci.com
14.60 s
Downloaded cached gammaloop-nextest-binaries-core-gammaloop-tracing-filter-macros (1.7 MiB) in 301ms
14.60 s
Progress: 0 of 1 built, 1 of 6 downloaded from cache (3 downloading)
15.56 s
Downloaded cached gammaloop-nextest-binaries-core-gammaloop-api (68.5 MiB) in 1.2s
15.56 s
Progress: 0 of 1 built, 2 of 6 downloaded from cache (2 downloading)
15.61 s
Downloaded cached gammaloop-nextest-binaries-core-gammaloop-tracing-filter (8.1 MiB) in 1.3s
15.61 s
Progress: 0 of 1 built, 3 of 6 downloaded from cache (1 downloading)
16.57 s
Downloaded cached gammaloop-nextest-binaries-core-gammalooprs (79.6 MiB) in 2.2s
16.57 s
Progress: 0 of 1 built, 4 of 6 downloaded from cache
16.57 s
Downloading cached gammaloop-nextest-binaries-core from https://cache.nix-ci.com
16.61 s
Downloaded cached gammaloop-nextest-binaries-core (1640 B) in 38ms
16.61 s
Progress: 0 of 1 built, 5 of 6 downloaded from cache
16.61 s
Downloading cached nix-ci-check-gammaloop-nextest-core from https://cache.nix-ci.com
16.65 s
Downloaded cached nix-ci-check-gammaloop-nextest-core (1016 B) in 38ms
16.65 s
Progress: 0 of 1 built, 6 of 6 downloaded from cache
20.75 s
evaluating derivation 'g
copying '/nix/store/mc4j
evaluating derivation 'g
copying '/nix/store/mc4j
evaluating derivation 'g
copying '/nix/store/mc4j
evaluating derivation 'g
copying '/nix/store/mc4j
evaluating derivation 'g
copying '/nix/store/mc4j
evaluating derivation 'g
copying '/nix/store/mc4j
evaluating derivation 'g
querying gammaloop-nexte
[0 /1 built, 0.0 KiB DL]
[1 /0 /1 built, 0.0 KiB DLgammaloop-nextest-core> Extracting 3 binaries (including 1 non-test binary), 1 build script output directory, and 2 linked paths to /build/nextest-archive-ocZF4V
21.14 s
gammaloop-nextest-core> Extracted 18 files to /build/nextest-archive-ocZF4V in 0.39s
21.15 s
gammaloop-nextest-core> ------------
21.15 s
gammaloop-nextest-core> Nextest run ID b156a1cf-0e63-4889-a6d3-8a6074ed94a3 with nextest profile: ci_gammaloop
21.15 s
gammaloop-nextest-core> Starting 339 tests across 2 binaries
21.55 s
gammaloop-nextest-core> ------------
21.55 s
gammaloop-nextest-core> Summary [ 0.407s] 339 tests run: 339 passed , 0 skipped
21.65 s
gammaloop-nextest-core>
21.65 s
gammaloop-nextest-core> ========== nextest test summary ==========
21.65 s
gammaloop-nextest-core> report: target/nextest/ci_gammaloop/junit.xml
21.65 s
gammaloop-nextest-core> tests: 339, failures: 0, errors: 0
21.65 s
gammaloop-nextest-core> No failing testcases found.
21.65 s
gammaloop-nextest-core> =========================================
21.67 s
gammaloop-nextest-core> Extracting 1 binary and 1 linked path to /build/nextest-archive-nEFrtg
21.72 s
gammaloop-nextest-core> Extracted 7 files to /build/nextest-archive-nEFrtg in 0.06s
21.73 s
gammaloop-nextest-core> ------------
21.73 s
gammaloop-nextest-core> Nextest run ID 5d4917af-8cc4-4a1b-84bf-acabf2b77377 with nextest profile: ci_gammaloop
21.73 s
gammaloop-nextest-core> Starting 19 tests across 1 binary
21.74 s
gammaloop-nextest-core> ------------
21.74 s
gammaloop-nextest-core> Summary [ 0.010s] 19 tests run: 19 passed , 0 skipped
21.77 s
gammaloop-nextest-core>
21.77 s
gammaloop-nextest-core> ========== nextest test summary ==========
21.77 s
gammaloop-nextest-core> report: target/nextest/ci_gammaloop/junit.xml
21.77 s
gammaloop-nextest-core> tests: 19, failures: 0, errors: 0
21.77 s
gammaloop-nextest-core> No failing testcases found.
21.77 s
gammaloop-nextest-core> =========================================
21.79 s
gammaloop-nextest-core> Extracting 1 binary to /build/nextest-archive-XExa8G
21.81 s
gammaloop-nextest-core> Extracted 4 files to /build/nextest-archive-XExa8G in 0.03s
21.82 s
gammaloop-nextest-core> ------------
21.82 s
gammaloop-nextest-core> Nextest run ID 5f0b8542-db87-4f83-b24e-190edf506fdc with nextest profile: ci_gammaloop
21.82 s
gammaloop-nextest-core> Starting 0 tests across 1 binary
21.82 s
gammaloop-nextest-core> ------------
21.82 s
gammaloop-nextest-core> Summary [ 0.000s] 0 tests run: 0 passed , 0 skipped
21.84 s
gammaloop-nextest-core>
21.84 s
gammaloop-nextest-core> ========== nextest test summary ==========
21.84 s
gammaloop-nextest-core> report: target/nextest/ci_gammaloop/junit.xml
21.84 s
gammaloop-nextest-core> tests: 0, failures: 0, errors: 0
21.84 s
gammaloop-nextest-core> No failing testcases found.
21.84 s
gammaloop-nextest-core> =========================================
21.86 s
gammaloop-nextest-core> Extracting 4 binaries, 1 build script output directory, and 2 linked paths to /build/nextest-archive-3Wl95O
22.25 s
gammaloop-nextest-core> Extracted 18 files to /build/nextest-archive-3Wl95O in 0.40s
22.26 s
gammaloop-nextest-core> ------------
22.26 s
gammaloop-nextest-core> Nextest run ID b449860b-a396-41af-91f6-3ff3df4bf1ce with nextest profile: ci_gammaloop
22.26 s
gammaloop-nextest-core> Starting 483 tests across 4 binaries (61 tests skipped , including 60 tests via profile.ci_gammaloop.default-filter )
22.30 s
gammaloop-nextest-core> FAIL [ 0.015s] ( 49/483) gammalooprs cff::generation::tests_cff :: thermal_eight
22.30 s
gammaloop-nextest-core> stdout ---
22.30 s
gammaloop-nextest-core>
22.30 s
gammaloop-nextest-core> running 1 test
22.30 s
gammaloop-nextest-core> test cff::generation::tests_cff::thermal_eight ... FAILED
22.30 s
gammaloop-nextest-core>
22.30 s
gammaloop-nextest-core> failures:
22.30 s
gammaloop-nextest-core>
22.30 s
gammaloop-nextest-core> failures:
22.30 s
gammaloop-nextest-core> cff::generation::tests_cff::thermal_eight
22.30 s
gammaloop-nextest-core>
22.30 s
gammaloop-nextest-core> test result: FAILED. 0 passed; 1 failed; 0 ignored; 0 measured; 535 filtered out; finished in 0.01s
22.30 s
gammaloop-nextest-core>
22.30 s
gammaloop-nextest-core> stderr ---
22.30 s
gammaloop-nextest-core>
22.30 s
gammaloop-nextest-core> thread 'cff::generation::tests_cff::thermal_eight' (1282) panicked at /nix/store/l5xazfnr7k6r6p8mlkn38x2afab0rygz-vendor-cargo-deps/5929dab090e556a579e9f3b708cd2e67c60b3d84a12b5a276f2a36cb00473133/symbolica-2.2.0/src/evaluate/evaluator.rs:295:21:
22.30 s
gammaloop-nextest-core> External function 'symbolica_coth' does not have an implementation for gammalooprs::utils::F<f64>
22.30 s
gammaloop-nextest-core> stack backtrace:
22.30 s
gammaloop-nextest-core> 0: __rustc::rust_begin_unwind
22.30 s
gammaloop-nextest-core> 1: core::panicking::panic_fmt
22.30 s
gammaloop-nextest-core> 2: <symbolica::evaluate::evaluator::ExpressionEvaluator<gammalooprs::utils::F<f64>>>::evaluate_impl_no_ops
22.30 s
gammaloop-nextest-core> 3: <symbolica::evaluate::evaluator::ExpressionEvaluator<gammalooprs::utils::F<f64>>>::evaluate_single
22.30 s
gammaloop-nextest-core> 4: gammalooprs::cff::generation::tests_cff::thermal_eight
22.30 s
gammaloop-nextest-core> 5: <gammalooprs::cff::generation::tests_cff::thermal_eight::{closure#0} as core::ops::function::FnOnce<()>>::call_once
22.30 s
gammaloop-nextest-core> note: Some details are omitted, run with `RUST_BACKTRACE=full` for a verbose backtrace.
22.30 s
gammaloop-nextest-core>
22.30 s
gammaloop-nextest-core> FAIL [ 0.018s] ( 51/483) gammalooprs cff::generation::tests_cff :: thermal_bubble_chain
22.30 s
gammaloop-nextest-core> stdout ---
22.30 s
gammaloop-nextest-core>
22.30 s
gammaloop-nextest-core> running 1 test
22.30 s
gammaloop-nextest-core> test cff::generation::tests_cff::thermal_bubble_chain ... FAILED
22.30 s
gammaloop-nextest-core>
22.30 s
gammaloop-nextest-core> failures:
22.30 s
gammaloop-nextest-core>
22.30 s
gammaloop-nextest-core> failures:
22.30 s
gammaloop-nextest-core> cff::generation::tests_cff::thermal_bubble_chain
22.30 s
gammaloop-nextest-core>
22.30 s
gammaloop-nextest-core> test result: FAILED. 0 passed; 1 failed; 0 ignored; 0 measured; 535 filtered out; finished in 0.01s
22.30 s
gammaloop-nextest-core>
22.30 s
gammaloop-nextest-core> stderr ---
22.30 s
gammaloop-nextest-core>
22.30 s
gammaloop-nextest-core> thread 'cff::generation::tests_cff::thermal_bubble_chain' (1273) panicked at /nix/store/l5xazfnr7k6r6p8mlkn38x2afab0rygz-vendor-cargo-deps/5929dab090e556a579e9f3b708cd2e67c60b3d84a12b5a276f2a36cb00473133/symbolica-2.2.0/src/evaluate/evaluator.rs:295:21:
22.30 s
gammaloop-nextest-core> External function 'symbolica_coth' does not have an implementation for gammalooprs::utils::F<f64>
22.30 s
gammaloop-nextest-core> stack backtrace:
22.30 s
gammaloop-nextest-core> 0: __rustc::rust_begin_unwind
22.30 s
gammaloop-nextest-core> 1: core::panicking::panic_fmt
22.30 s
gammaloop-nextest-core> 2: <symbolica::evaluate::evaluator::ExpressionEvaluator<gammalooprs::utils::F<f64>>>::evaluate_impl_no_ops
22.30 s
gammaloop-nextest-core> 3: <symbolica::evaluate::evaluator::ExpressionEvaluator<gammalooprs::utils::F<f64>>>::evaluate_single
22.30 s
gammaloop-nextest-core> 4: gammalooprs::cff::generation::tests_cff::thermal_bubble_chain
22.30 s
gammaloop-nextest-core> 5: <gammalooprs::cff::generation::tests_cff::thermal_bubble_chain::{closure#0} as core::ops::function::FnOnce<()>>::call_once
22.30 s
gammaloop-nextest-core> note: Some details are omitted, run with `RUST_BACKTRACE=full` for a verbose backtrace.
22.30 s
gammaloop-nextest-core>
22.30 s
gammaloop-nextest-core> FAIL [ 0.021s] ( 58/483) gammalooprs cff::generation::tests_cff :: thermal_bubble
22.30 s
gammaloop-nextest-core> stdout ---
22.30 s
gammaloop-nextest-core>
22.30 s
gammaloop-nextest-core> running 1 test
22.30 s
gammaloop-nextest-core> test cff::generation::tests_cff::thermal_bubble ... FAILED
22.30 s
gammaloop-nextest-core>
22.30 s
gammaloop-nextest-core> failures:
22.30 s
gammaloop-nextest-core>
22.30 s
gammaloop-nextest-core> failures:
22.30 s
gammaloop-nextest-core> cff::generation::tests_cff::thermal_bubble
22.30 s
gammaloop-nextest-core>
22.30 s
gammaloop-nextest-core> test result: FAILED. 0 passed; 1 failed; 0 ignored; 0 measured; 535 filtered out; finished in 0.01s
22.30 s
gammaloop-nextest-core>
22.30 s
gammaloop-nextest-core> stderr ---
22.30 s
gammaloop-nextest-core>
22.30 s
gammaloop-nextest-core> thread 'cff::generation::tests_cff::thermal_bubble' (1280) panicked at /nix/store/l5xazfnr7k6r6p8mlkn38x2afab0rygz-vendor-cargo-deps/5929dab090e556a579e9f3b708cd2e67c60b3d84a12b5a276f2a36cb00473133/symbolica-2.2.0/src/evaluate/evaluator.rs:295:21:
22.30 s
gammaloop-nextest-core> External function 'symbolica_coth' does not have an implementation for gammalooprs::utils::F<f64>
22.30 s
gammaloop-nextest-core> stack backtrace:
22.30 s
gammaloop-nextest-core> 0: __rustc::rust_begin_unwind
22.30 s
gammaloop-nextest-core> 1: core::panicking::panic_fmt
22.30 s
gammaloop-nextest-core> 2: <symbolica::evaluate::evaluator::ExpressionEvaluator<gammalooprs::utils::F<f64>>>::evaluate_impl_no_ops
22.30 s
gammaloop-nextest-core> 3: <symbolica::evaluate::evaluator::ExpressionEvaluator<gammalooprs::utils::F<f64>>>::evaluate_single
22.30 s
gammaloop-nextest-core> 4: gammalooprs::cff::generation::tests_cff::thermal_bubble
22.30 s
gammaloop-nextest-core> 5: <gammalooprs::cff::generation::tests_cff::thermal_bubble::{closure#0} as core::ops::function::FnOnce<()>>::call_once
22.30 s
gammaloop-nextest-core> note: Some details are omitted, run with `RUST_BACKTRACE=full` for a verbose backtrace.
22.30 s
gammaloop-nextest-core>
22.35 s
gammaloop-nextest-core> FAIL [ 0.068s] ( 76/483) gammalooprs cff::generation::tests_cff :: thermal_ring
22.35 s
gammaloop-nextest-core> stdout ---
22.35 s
gammaloop-nextest-core>
22.35 s
gammaloop-nextest-core> running 1 test
22.35 s
gammaloop-nextest-core> test cff::generation::tests_cff::thermal_ring ... FAILED
22.35 s
gammaloop-nextest-core>
22.35 s
gammaloop-nextest-core> failures:
22.35 s
gammaloop-nextest-core>
22.35 s
gammaloop-nextest-core> failures:
22.35 s
gammaloop-nextest-core> cff::generation::tests_cff::thermal_ring
22.35 s
gammaloop-nextest-core>
22.35 s
gammaloop-nextest-core> test result: FAILED. 0 passed; 1 failed; 0 ignored; 0 measured; 535 filtered out; finished in 0.06s
22.35 s
gammaloop-nextest-core>
22.35 s
gammaloop-nextest-core> stderr ---
22.35 s
gammaloop-nextest-core>
22.35 s
gammaloop-nextest-core> thread 'cff::generation::tests_cff::thermal_ring' (1291) panicked at /nix/store/l5xazfnr7k6r6p8mlkn38x2afab0rygz-vendor-cargo-deps/5929dab090e556a579e9f3b708cd2e67c60b3d84a12b5a276f2a36cb00473133/symbolica-2.2.0/src/evaluate/evaluator.rs:295:21:
22.35 s
gammaloop-nextest-core> External function 'symbolica_coth' does not have an implementation for gammalooprs::utils::F<f64>
22.35 s
gammaloop-nextest-core> stack backtrace:
22.35 s
gammaloop-nextest-core> 0: __rustc::rust_begin_unwind
22.35 s
gammaloop-nextest-core> 1: core::panicking::panic_fmt
22.35 s
gammaloop-nextest-core> 2: <symbolica::evaluate::evaluator::ExpressionEvaluator<gammalooprs::utils::F<f64>>>::evaluate_impl_no_ops
22.35 s
gammaloop-nextest-core> 3: <symbolica::evaluate::evaluator::ExpressionEvaluator<gammalooprs::utils::F<f64>>>::evaluate_single
22.35 s
gammaloop-nextest-core> 4: gammalooprs::cff::generation::tests_cff::thermal_ring
22.35 s
gammaloop-nextest-core> 5: <gammalooprs::cff::generation::tests_cff::thermal_ring::{closure#0} as core::ops::function::FnOnce<()>>::call_once
22.35 s
gammaloop-nextest-core> note: Some details are omitted, run with `RUST_BACKTRACE=full` for a verbose backtrace.
22.35 s
gammaloop-nextest-core>
22.39 s
gammaloop-nextest-core> FAIL [ 0.111s] ( 83/483) gammalooprs cff::generation::tests_cff :: thermal_mercedes
22.39 s
gammaloop-nextest-core> stdout ---
22.39 s
gammaloop-nextest-core>
22.39 s
gammaloop-nextest-core> running 1 test
22.39 s
gammaloop-nextest-core> test cff::generation::tests_cff::thermal_mercedes ... FAILED
22.39 s
gammaloop-nextest-core>
22.39 s
gammaloop-nextest-core> failures:
22.39 s
gammaloop-nextest-core>
22.39 s
gammaloop-nextest-core> failures:
22.39 s
gammaloop-nextest-core> cff::generation::tests_cff::thermal_mercedes
22.39 s
gammaloop-nextest-core>
22.39 s
gammaloop-nextest-core> test result: FAILED. 0 passed; 1 failed; 0 ignored; 0 measured; 535 filtered out; finished in 0.10s
22.39 s
gammaloop-nextest-core>
22.39 s
gammaloop-nextest-core> stderr ---
22.39 s
gammaloop-nextest-core>
22.39 s
gammaloop-nextest-core> thread 'cff::generation::tests_cff::thermal_mercedes' (1276) panicked at /nix/store/l5xazfnr7k6r6p8mlkn38x2afab0rygz-vendor-cargo-deps/5929dab090e556a579e9f3b708cd2e67c60b3d84a12b5a276f2a36cb00473133/symbolica-2.2.0/src/evaluate/evaluator.rs:295:21:
22.39 s
gammaloop-nextest-core> External function 'symbolica_coth' does not have an implementation for gammalooprs::utils::F<f64>
22.39 s
gammaloop-nextest-core> stack backtrace:
22.39 s
gammaloop-nextest-core> 0: __rustc::rust_begin_unwind
22.39 s
gammaloop-nextest-core> 1: core::panicking::panic_fmt
22.39 s
gammaloop-nextest-core> 2: <symbolica::evaluate::evaluator::ExpressionEvaluator<gammalooprs::utils::F<f64>>>::evaluate_impl_no_ops
22.39 s
gammaloop-nextest-core> 3: <symbolica::evaluate::evaluator::ExpressionEvaluator<gammalooprs::utils::F<f64>>>::evaluate_single
22.39 s
gammaloop-nextest-core> 4: gammalooprs::cff::generation::tests_cff::thermal_mercedes
22.39 s
gammaloop-nextest-core> 5: <gammalooprs::cff::generation::tests_cff::thermal_mercedes::{closure#0} as core::ops::function::FnOnce<()>>::call_once
22.39 s
gammaloop-nextest-core> note: Some details are omitted, run with `RUST_BACKTRACE=full` for a verbose backtrace.
22.39 s
gammaloop-nextest-core>
22.76 s
gammaloop-nextest-core> FAIL [ 0.454s] (270/483) gammalooprs graph::feynman_graph::tests :: native_thermal_distributions
22.76 s
gammaloop-nextest-core> stdout ---
22.76 s
gammaloop-nextest-core>
22.76 s
gammaloop-nextest-core> running 1 test
22.76 s
gammaloop-nextest-core> test graph::feynman_graph::tests::native_thermal_distributions ... FAILED
22.76 s
gammaloop-nextest-core>
22.76 s
gammaloop-nextest-core> failures:
22.76 s
gammaloop-nextest-core>
22.76 s
gammaloop-nextest-core> failures:
22.76 s
gammaloop-nextest-core> graph::feynman_graph::tests::native_thermal_distributions
22.76 s
gammaloop-nextest-core>
22.76 s
gammaloop-nextest-core> test result: FAILED. 0 passed; 1 failed; 0 ignored; 0 measured; 535 filtered out; finished in 0.44s
22.76 s
gammaloop-nextest-core>
22.76 s
gammaloop-nextest-core> stderr ---
22.76 s
gammaloop-nextest-core> The application panicked (crashed).
22.76 s
gammaloop-nextest-core> Message: called `Result::unwrap()` on an `Err` value: Custom { kind: Other, error: "Could not compile code: g++ -shared -O3 -fPIC -ffast-math -funsafe-math-optimizations -march=native -o /build/gammaloop-native-thermal-1345/thermal_0_0.so /build/gammaloop-native-thermal-1345/thermal_0_0.cpp\nwarning: Skipping impure flag -march=native because NIX_ENFORCE_NO_NATIVE is set\n/build/gammaloop-native-thermal-1345/thermal_0_0.cpp: In function 'void thermal_realf64(const double*, double*, double*)':\n/build/gammaloop-native-thermal-1345/thermal_0_0.cpp:27:16: error: 'symbolica_tanh' was not declared in this scope\n 27 | Z[6] = symbolica_tanh(Z[6]);\n | ^~~~~~~~~~~~~~\n" }
22.76 s
gammaloop-nextest-core> Location: crates/gammalooprs/src/graph/feynman_graph.rs :937
22.76 s
gammaloop-nextest-core>
22.76 s
gammaloop-nextest-core> ━━━━━━━━━━━━━━━━━━━━━━━━━━━━━━━━━━ BACKTRACE ━━━━━━━━━━━━━━━━━━━━━━━━━━━━━━━━━━━
22.76 s
gammaloop-nextest-core> 1: <color_eyre[b0c9e66060e883b2]::config::PanicHook>::panic_report <unknown>
22.76 s
gammaloop-nextest-core> at <unknown source file> :<unknown line>
22.76 s
gammaloop-nextest-core> 2: <color_eyre[b0c9e66060e883b2]::config::PanicHook>::into_panic_hook::{closure#0} <unknown>
22.76 s
gammaloop-nextest-core> at <unknown source file> :<unknown line>
22.76 s
gammaloop-nextest-core> 3: std[bcb96dfbba0ab899]::panicking::panic_with_hook <unknown>
22.76 s
gammaloop-nextest-core> at <unknown source file> :<unknown line>
22.76 s
gammaloop-nextest-core> 4: std[bcb96dfbba0ab899]::panicking::panic_handler::{closure#0} <unknown>
22.76 s
gammaloop-nextest-core> at <unknown source file> :<unknown line>
22.76 s
gammaloop-nextest-core> 5: std[bcb96dfbba0ab899]::sys::backtrace::__rust_end_short_backtrace::<std[bcb96dfbba0ab899]::panicking::panic_handler::{closure#0}, !> <unknown>
22.76 s
gammaloop-nextest-core> at <unknown source file> :<unknown line>
22.76 s
gammaloop-nextest-core> 6: __rustc[6c289b9f9c454d21]::rust_begin_unwind <unknown>
22.76 s
gammaloop-nextest-core> at <unknown source file> :<unknown line>
22.76 s
gammaloop-nextest-core> 7: core[940e698046960fd5]::panicking::panic_fmt <unknown>
22.76 s
gammaloop-nextest-core> at <unknown source file> :<unknown line>
22.76 s
gammaloop-nextest-core> 8: core[940e698046960fd5]::result::unwrap_failed <unknown>
22.76 s
gammaloop-nextest-core> at <unknown source file> :<unknown line>
22.76 s
gammaloop-nextest-core> 9: gammalooprs[f21b74aec46f5289]::graph::feynman_graph::tests::native_thermal_distributions <unknown>
22.76 s
gammaloop-nextest-core> at <unknown source file> :<unknown line>
22.76 s
gammaloop-nextest-core> 10: <gammalooprs[f21b74aec46f5289]::graph::feynman_graph::tests::native_thermal_distributions::{closure#0} as core[940e698046960fd5]::ops::function::FnOnce<()>>::call_once <unknown>
22.76 s
gammaloop-nextest-core> at <unknown source file> :<unknown line>
22.76 s
gammaloop-nextest-core> 11: test[75d6903177b1d7e9]::__rust_begin_short_backtrace::<core[940e698046960fd5]::result::Result<(), alloc[2ea6bcb46fca0c42]::string::String>, fn() -> core[940e698046960fd5]::result::Result<(), alloc[2ea6bcb46fca0c42]::string::String>> <unknown>
22.76 s
gammaloop-nextest-core> at <unknown source file> :<unknown line>
22.76 s
gammaloop-nextest-core> 12: test[75d6903177b1d7e9]::run_test::{closure#0} <unknown>
22.76 s
gammaloop-nextest-core> at <unknown source file> :<unknown line>
22.76 s
gammaloop-nextest-core> 13: std[bcb96dfbba0ab899]::sys::backtrace::__rust_begin_short_backtrace::<test[75d6903177b1d7e9]::run_test::{closure#1}, ()> <unknown>
22.76 s
gammaloop-nextest-core> at <unknown source file> :<unknown line>
22.76 s
gammaloop-nextest-core> 14: <std[bcb96dfbba0ab899]::thread::lifecycle::spawn_unchecked<test[75d6903177b1d7e9]::run_test::{closure#1}, ()>::{closure#1} as core[940e698046960fd5]::ops::function::FnOnce<()>>::call_once::{shim:vtable#0} <unknown>
22.76 s
gammaloop-nextest-core> at <unknown source file> :<unknown line>
22.76 s
gammaloop-nextest-core> 15: <std[bcb96dfbba0ab899]::sys::thread::unix::Thread>::new::thread_start <unknown>
22.76 s
gammaloop-nextest-core> at <unknown source file> :<unknown line>
22.76 s
gammaloop-nextest-core> 16: start_thread <unknown>
22.76 s
gammaloop-nextest-core> at <unknown source file> :<unknown line>
22.76 s
gammaloop-nextest-core> 17: __clone3 <unknown>
22.76 s
gammaloop-nextest-core> at <unknown source file> :<unknown line>
22.76 s
gammaloop-nextest-core>
22.76 s
gammaloop-nextest-core> Run with COLORBT_SHOW_HIDDEN=1 environment variable to disable frame filtering.
22.76 s
gammaloop-nextest-core> Run with RUST_BACKTRACE=full to include source snippets.
22.76 s
gammaloop-nextest-core>
27.60 s
gammaloop-nextest-core> FAIL [ 5.321s] (479/483) gammalooprs cff::generation::tests_cff :: thermal_bugblatter
27.60 s
gammaloop-nextest-core> stdout ---
27.60 s
gammaloop-nextest-core>
27.60 s
gammaloop-nextest-core> running 1 test
27.60 s
gammaloop-nextest-core> test cff::generation::tests_cff::thermal_bugblatter ... FAILED
27.60 s
gammaloop-nextest-core>
27.60 s
gammaloop-nextest-core> failures:
27.60 s
gammaloop-nextest-core>
27.60 s
gammaloop-nextest-core> failures:
27.60 s
gammaloop-nextest-core> cff::generation::tests_cff::thermal_bugblatter
27.60 s
gammaloop-nextest-core>
27.60 s
gammaloop-nextest-core> test result: FAILED. 0 passed; 1 failed; 0 ignored; 0 measured; 535 filtered out; finished in 5.24s
27.60 s
gammaloop-nextest-core>
27.60 s
gammaloop-nextest-core> stderr ---
27.60 s
gammaloop-nextest-core>
27.60 s
gammaloop-nextest-core> thread 'cff::generation::tests_cff::thermal_bugblatter' (1274) panicked at /nix/store/l5xazfnr7k6r6p8mlkn38x2afab0rygz-vendor-cargo-deps/5929dab090e556a579e9f3b708cd2e67c60b3d84a12b5a276f2a36cb00473133/symbolica-2.2.0/src/evaluate/evaluator.rs:295:21:
27.60 s
gammaloop-nextest-core> External function 'symbolica_coth' does not have an implementation for gammalooprs::utils::F<f64>
27.60 s
gammaloop-nextest-core> stack backtrace:
27.60 s
gammaloop-nextest-core> 0: __rustc::rust_begin_unwind
27.60 s
gammaloop-nextest-core> 1: core::panicking::panic_fmt
27.60 s
gammaloop-nextest-core> 2: <symbolica::evaluate::evaluator::ExpressionEvaluator<gammalooprs::utils::F<f64>>>::evaluate_impl_no_ops
27.60 s
gammaloop-nextest-core> 3: <symbolica::evaluate::evaluator::ExpressionEvaluator<gammalooprs::utils::F<f64>>>::evaluate_single
27.60 s
gammaloop-nextest-core> 4: gammalooprs::cff::generation::tests_cff::thermal_bugblatter
27.60 s
gammaloop-nextest-core> 5: <gammalooprs::cff::generation::tests_cff::thermal_bugblatter::{closure#0} as core::ops::function::FnOnce<()>>::call_once
27.60 s
gammaloop-nextest-core> note: Some details are omitted, run with `RUST_BACKTRACE=full` for a verbose backtrace.
27.60 s
gammaloop-nextest-core>
30.31 s
gammaloop-nextest-core> ------------
30.31 s
gammaloop-nextest-core> Summary [ 8.041s] 483 tests run: 476 passed , 7 failed , 61 skipped
30.31 s
gammaloop-nextest-core> FAIL [ 0.015s] ( 49/483) gammalooprs cff::generation::tests_cff :: thermal_eight
30.31 s
gammaloop-nextest-core> stdout ---
30.31 s
gammaloop-nextest-core>
30.31 s
gammaloop-nextest-core> running 1 test
30.31 s
gammaloop-nextest-core> test cff::generation::tests_cff::thermal_eight ... FAILED
30.31 s
gammaloop-nextest-core>
30.31 s
gammaloop-nextest-core> failures:
30.31 s
gammaloop-nextest-core>
30.31 s
gammaloop-nextest-core> failures:
30.31 s
gammaloop-nextest-core> cff::generation::tests_cff::thermal_eight
30.31 s
gammaloop-nextest-core>
30.31 s
gammaloop-nextest-core> test result: FAILED. 0 passed; 1 failed; 0 ignored; 0 measured; 535 filtered out; finished in 0.01s
30.31 s
gammaloop-nextest-core>
30.31 s
gammaloop-nextest-core> stderr ---
30.31 s
gammaloop-nextest-core>
30.31 s
gammaloop-nextest-core> thread 'cff::generation::tests_cff::thermal_eight' (1282) panicked at /nix/store/l5xazfnr7k6r6p8mlkn38x2afab0rygz-vendor-cargo-deps/5929dab090e556a579e9f3b708cd2e67c60b3d84a12b5a276f2a36cb00473133/symbolica-2.2.0/src/evaluate/evaluator.rs:295:21:
30.31 s
gammaloop-nextest-core> External function 'symbolica_coth' does not have an implementation for gammalooprs::utils::F<f64>
30.31 s
gammaloop-nextest-core> stack backtrace:
30.31 s
gammaloop-nextest-core> 0: __rustc::rust_begin_unwind
30.31 s
gammaloop-nextest-core> 1: core::panicking::panic_fmt
30.31 s
gammaloop-nextest-core> 2: <symbolica::evaluate::evaluator::ExpressionEvaluator<gammalooprs::utils::F<f64>>>::evaluate_impl_no_ops
30.31 s
gammaloop-nextest-core> 3: <symbolica::evaluate::evaluator::ExpressionEvaluator<gammalooprs::utils::F<f64>>>::evaluate_single
30.31 s
gammaloop-nextest-core> 4: gammalooprs::cff::generation::tests_cff::thermal_eight
30.31 s
gammaloop-nextest-core> 5: <gammalooprs::cff::generation::tests_cff::thermal_eight::{closure#0} as core::ops::function::FnOnce<()>>::call_once
30.31 s
gammaloop-nextest-core> note: Some details are omitted, run with `RUST_BACKTRACE=full` for a verbose backtrace.
30.31 s
gammaloop-nextest-core>
30.31 s
gammaloop-nextest-core> FAIL [ 0.018s] ( 51/483) gammalooprs cff::generation::tests_cff :: thermal_bubble_chain
30.31 s
gammaloop-nextest-core> stdout ---
30.31 s
gammaloop-nextest-core>
30.31 s
gammaloop-nextest-core> running 1 test
30.31 s
gammaloop-nextest-core> test cff::generation::tests_cff::thermal_bubble_chain ... FAILED
30.31 s
gammaloop-nextest-core>
30.31 s
gammaloop-nextest-core> failures:
30.31 s
gammaloop-nextest-core>
30.31 s
gammaloop-nextest-core> failures:
30.31 s
gammaloop-nextest-core> cff::generation::tests_cff::thermal_bubble_chain
30.31 s
gammaloop-nextest-core>
30.31 s
gammaloop-nextest-core> test result: FAILED. 0 passed; 1 failed; 0 ignored; 0 measured; 535 filtered out; finished in 0.01s
30.31 s
gammaloop-nextest-core>
30.31 s
gammaloop-nextest-core> stderr ---
30.31 s
gammaloop-nextest-core>
30.31 s
gammaloop-nextest-core> thread 'cff::generation::tests_cff::thermal_bubble_chain' (1273) panicked at /nix/store/l5xazfnr7k6r6p8mlkn38x2afab0rygz-vendor-cargo-deps/5929dab090e556a579e9f3b708cd2e67c60b3d84a12b5a276f2a36cb00473133/symbolica-2.2.0/src/evaluate/evaluator.rs:295:21:
30.31 s
gammaloop-nextest-core> External function 'symbolica_coth' does not have an implementation for gammalooprs::utils::F<f64>
30.31 s
gammaloop-nextest-core> stack backtrace:
30.31 s
gammaloop-nextest-core> 0: __rustc::rust_begin_unwind
30.31 s
gammaloop-nextest-core> 1: core::panicking::panic_fmt
30.31 s
gammaloop-nextest-core> 2: <symbolica::evaluate::evaluator::ExpressionEvaluator<gammalooprs::utils::F<f64>>>::evaluate_impl_no_ops
30.31 s
gammaloop-nextest-core> 3: <symbolica::evaluate::evaluator::ExpressionEvaluator<gammalooprs::utils::F<f64>>>::evaluate_single
30.31 s
gammaloop-nextest-core> 4: gammalooprs::cff::generation::tests_cff::thermal_bubble_chain
30.31 s
gammaloop-nextest-core> 5: <gammalooprs::cff::generation::tests_cff::thermal_bubble_chain::{closure#0} as core::ops::function::FnOnce<()>>::call_once
30.31 s
gammaloop-nextest-core> note: Some details are omitted, run with `RUST_BACKTRACE=full` for a verbose backtrace.
30.31 s
gammaloop-nextest-core>
30.31 s
gammaloop-nextest-core> FAIL [ 0.021s] ( 58/483) gammalooprs cff::generation::tests_cff :: thermal_bubble
30.31 s
gammaloop-nextest-core> stdout ---
30.31 s
gammaloop-nextest-core>
30.31 s
gammaloop-nextest-core> running 1 test
30.31 s
gammaloop-nextest-core> test cff::generation::tests_cff::thermal_bubble ... FAILED
30.31 s
gammaloop-nextest-core>
30.31 s
gammaloop-nextest-core> failures:
30.31 s
gammaloop-nextest-core>
30.31 s
gammaloop-nextest-core> failures:
30.31 s
gammaloop-nextest-core> cff::generation::tests_cff::thermal_bubble
30.31 s
gammaloop-nextest-core>
30.31 s
gammaloop-nextest-core> test result: FAILED. 0 passed; 1 failed; 0 ignored; 0 measured; 535 filtered out; finished in 0.01s
30.31 s
gammaloop-nextest-core>
30.31 s
gammaloop-nextest-core> stderr ---
30.31 s
gammaloop-nextest-core>
30.31 s
gammaloop-nextest-core> thread 'cff::generation::tests_cff::thermal_bubble' (1280) panicked at /nix/store/l5xazfnr7k6r6p8mlkn38x2afab0rygz-vendor-cargo-deps/5929dab090e556a579e9f3b708cd2e67c60b3d84a12b5a276f2a36cb00473133/symbolica-2.2.0/src/evaluate/evaluator.rs:295:21:
30.31 s
gammaloop-nextest-core> External function 'symbolica_coth' does not have an implementation for gammalooprs::utils::F<f64>
30.31 s
gammaloop-nextest-core> stack backtrace:
30.31 s
gammaloop-nextest-core> 0: __rustc::rust_begin_unwind
30.31 s
gammaloop-nextest-core> 1: core::panicking::panic_fmt
30.31 s
gammaloop-nextest-core> 2: <symbolica::evaluate::evaluator::ExpressionEvaluator<gammalooprs::utils::F<f64>>>::evaluate_impl_no_ops
30.31 s
gammaloop-nextest-core> 3: <symbolica::evaluate::evaluator::ExpressionEvaluator<gammalooprs::utils::F<f64>>>::evaluate_single
30.31 s
gammaloop-nextest-core> 4: gammalooprs::cff::generation::tests_cff::thermal_bubble
30.31 s
gammaloop-nextest-core> 5: <gammalooprs::cff::generation::tests_cff::thermal_bubble::{closure#0} as core::ops::function::FnOnce<()>>::call_once
30.31 s
gammaloop-nextest-core> note: Some details are omitted, run with `RUST_BACKTRACE=full` for a verbose backtrace.
30.31 s
gammaloop-nextest-core>
30.31 s
gammaloop-nextest-core> FAIL [ 0.068s] ( 76/483) gammalooprs cff::generation::tests_cff :: thermal_ring
30.31 s
gammaloop-nextest-core> stdout ---
30.31 s
gammaloop-nextest-core>
30.31 s
gammaloop-nextest-core> running 1 test
30.31 s
gammaloop-nextest-core> test cff::generation::tests_cff::thermal_ring ... FAILED
30.31 s
gammaloop-nextest-core>
30.31 s
gammaloop-nextest-core> failures:
30.31 s
gammaloop-nextest-core>
30.31 s
gammaloop-nextest-core> failures:
30.31 s
gammaloop-nextest-core> cff::generation::tests_cff::thermal_ring
30.31 s
gammaloop-nextest-core>
30.31 s
gammaloop-nextest-core> test result: FAILED. 0 passed; 1 failed; 0 ignored; 0 measured; 535 filtered out; finished in 0.06s
30.31 s
gammaloop-nextest-core>
30.31 s
gammaloop-nextest-core> stderr ---
30.31 s
gammaloop-nextest-core>
30.31 s
gammaloop-nextest-core> thread 'cff::generation::tests_cff::thermal_ring' (1291) panicked at /nix/store/l5xazfnr7k6r6p8mlkn38x2afab0rygz-vendor-cargo-deps/5929dab090e556a579e9f3b708cd2e67c60b3d84a12b5a276f2a36cb00473133/symbolica-2.2.0/src/evaluate/evaluator.rs:295:21:
30.31 s
gammaloop-nextest-core> External function 'symbolica_coth' does not have an implementation for gammalooprs::utils::F<f64>
30.31 s
gammaloop-nextest-core> stack backtrace:
30.31 s
gammaloop-nextest-core> 0: __rustc::rust_begin_unwind
30.31 s
gammaloop-nextest-core> 1: core::panicking::panic_fmt
30.31 s
gammaloop-nextest-core> 2: <symbolica::evaluate::evaluator::ExpressionEvaluator<gammalooprs::utils::F<f64>>>::evaluate_impl_no_ops
30.31 s
gammaloop-nextest-core> 3: <symbolica::evaluate::evaluator::ExpressionEvaluator<gammalooprs::utils::F<f64>>>::evaluate_single
30.31 s
gammaloop-nextest-core> 4: gammalooprs::cff::generation::tests_cff::thermal_ring
30.31 s
gammaloop-nextest-core> 5: <gammalooprs::cff::generation::tests_cff::thermal_ring::{closure#0} as core::ops::function::FnOnce<()>>::call_once
30.31 s
gammaloop-nextest-core> note: Some details are omitted, run with `RUST_BACKTRACE=full` for a verbose backtrace.
30.31 s
gammaloop-nextest-core>
30.31 s
gammaloop-nextest-core> FAIL [ 0.111s] ( 83/483) gammalooprs cff::generation::tests_cff :: thermal_mercedes
30.31 s
gammaloop-nextest-core> stdout ---
30.31 s
gammaloop-nextest-core>
30.31 s
gammaloop-nextest-core> running 1 test
30.31 s
gammaloop-nextest-core> test cff::generation::tests_cff::thermal_mercedes ... FAILED
30.31 s
gammaloop-nextest-core>
30.31 s
gammaloop-nextest-core> failures:
30.31 s
gammaloop-nextest-core>
30.31 s
gammaloop-nextest-core> failures:
30.31 s
gammaloop-nextest-core> cff::generation::tests_cff::thermal_mercedes
30.31 s
gammaloop-nextest-core>
30.31 s
gammaloop-nextest-core> test result: FAILED. 0 passed; 1 failed; 0 ignored; 0 measured; 535 filtered out; finished in 0.10s
30.31 s
gammaloop-nextest-core>
30.31 s
gammaloop-nextest-core> stderr ---
30.31 s
gammaloop-nextest-core>
30.31 s
gammaloop-nextest-core> thread 'cff::generation::tests_cff::thermal_mercedes' (1276) panicked at /nix/store/l5xazfnr7k6r6p8mlkn38x2afab0rygz-vendor-cargo-deps/5929dab090e556a579e9f3b708cd2e67c60b3d84a12b5a276f2a36cb00473133/symbolica-2.2.0/src/evaluate/evaluator.rs:295:21:
30.31 s
gammaloop-nextest-core> External function 'symbolica_coth' does not have an implementation for gammalooprs::utils::F<f64>
30.31 s
gammaloop-nextest-core> stack backtrace:
30.31 s
gammaloop-nextest-core> 0: __rustc::rust_begin_unwind
30.31 s
gammaloop-nextest-core> 1: core::panicking::panic_fmt
30.31 s
gammaloop-nextest-core> 2: <symbolica::evaluate::evaluator::ExpressionEvaluator<gammalooprs::utils::F<f64>>>::evaluate_impl_no_ops
30.31 s
gammaloop-nextest-core> 3: <symbolica::evaluate::evaluator::ExpressionEvaluator<gammalooprs::utils::F<f64>>>::evaluate_single
30.31 s
gammaloop-nextest-core> 4: gammalooprs::cff::generation::tests_cff::thermal_mercedes
30.31 s
gammaloop-nextest-core> 5: <gammalooprs::cff::generation::tests_cff::thermal_mercedes::{closure#0} as core::ops::function::FnOnce<()>>::call_once
30.31 s
gammaloop-nextest-core> note: Some details are omitted, run with `RUST_BACKTRACE=full` for a verbose backtrace.
30.31 s
gammaloop-nextest-core>
30.31 s
gammaloop-nextest-core> FAIL [ 0.454s] (270/483) gammalooprs graph::feynman_graph::tests :: native_thermal_distributions
30.31 s
gammaloop-nextest-core> stdout ---
30.31 s
gammaloop-nextest-core>
30.31 s
gammaloop-nextest-core> running 1 test
30.31 s
gammaloop-nextest-core> test graph::feynman_graph::tests::native_thermal_distributions ... FAILED
30.31 s
gammaloop-nextest-core>
30.31 s
gammaloop-nextest-core> failures:
30.31 s
gammaloop-nextest-core>
30.31 s
gammaloop-nextest-core> failures:
30.31 s
gammaloop-nextest-core> graph::feynman_graph::tests::native_thermal_distributions
30.31 s
gammaloop-nextest-core>
30.31 s
gammaloop-nextest-core> test result: FAILED. 0 passed; 1 failed; 0 ignored; 0 measured; 535 filtered out; finished in 0.44s
30.31 s
gammaloop-nextest-core>
30.31 s
gammaloop-nextest-core> stderr ---
30.31 s
gammaloop-nextest-core> The application panicked (crashed).
30.31 s
gammaloop-nextest-core> Message: called `Result::unwrap()` on an `Err` value: Custom { kind: Other, error: "Could not compile code: g++ -shared -O3 -fPIC -ffast-math -funsafe-math-optimizations -march=native -o /build/gammaloop-native-thermal-1345/thermal_0_0.so /build/gammaloop-native-thermal-1345/thermal_0_0.cpp\nwarning: Skipping impure flag -march=native because NIX_ENFORCE_NO_NATIVE is set\n/build/gammaloop-native-thermal-1345/thermal_0_0.cpp: In function 'void thermal_realf64(const double*, double*, double*)':\n/build/gammaloop-native-thermal-1345/thermal_0_0.cpp:27:16: error: 'symbolica_tanh' was not declared in this scope\n 27 | Z[6] = symbolica_tanh(Z[6]);\n | ^~~~~~~~~~~~~~\n" }
30.31 s
gammaloop-nextest-core> Location: crates/gammalooprs/src/graph/feynman_graph.rs :937
30.31 s
gammaloop-nextest-core>
30.31 s
gammaloop-nextest-core> ━━━━━━━━━━━━━━━━━━━━━━━━━━━━━━━━━━ BACKTRACE ━━━━━━━━━━━━━━━━━━━━━━━━━━━━━━━━━━━
30.31 s
gammaloop-nextest-core> 1: <color_eyre[b0c9e66060e883b2]::config::PanicHook>::panic_report <unknown>
30.31 s
gammaloop-nextest-core> at <unknown source file> :<unknown line>
30.31 s
gammaloop-nextest-core> 2: <color_eyre[b0c9e66060e883b2]::config::PanicHook>::into_panic_hook::{closure#0} <unknown>
30.31 s
gammaloop-nextest-core> at <unknown source file> :<unknown line>
30.31 s
gammaloop-nextest-core> 3: std[bcb96dfbba0ab899]::panicking::panic_with_hook <unknown>
30.31 s
gammaloop-nextest-core> at <unknown source file> :<unknown line>
30.31 s
gammaloop-nextest-core> 4: std[bcb96dfbba0ab899]::panicking::panic_handler::{closure#0} <unknown>
30.31 s
gammaloop-nextest-core> at <unknown source file> :<unknown line>
30.31 s
gammaloop-nextest-core> 5: std[bcb96dfbba0ab899]::sys::backtrace::__rust_end_short_backtrace::<std[bcb96dfbba0ab899]::panicking::panic_handler::{closure#0}, !> <unknown>
30.31 s
gammaloop-nextest-core> at <unknown source file> :<unknown line>
30.31 s
gammaloop-nextest-core> 6: __rustc[6c289b9f9c454d21]::rust_begin_unwind <unknown>
30.31 s
gammaloop-nextest-core> at <unknown source file> :<unknown line>
30.31 s
gammaloop-nextest-core> 7: core[940e698046960fd5]::panicking::panic_fmt <unknown>
30.31 s
gammaloop-nextest-core> at <unknown source file> :<unknown line>
30.31 s
gammaloop-nextest-core> 8: core[940e698046960fd5]::result::unwrap_failed <unknown>
30.31 s
gammaloop-nextest-core> at <unknown source file> :<unknown line>
30.31 s
gammaloop-nextest-core> 9: gammalooprs[f21b74aec46f5289]::graph::feynman_graph::tests::native_thermal_distributions <unknown>
30.31 s
gammaloop-nextest-core> at <unknown source file> :<unknown line>
30.31 s
gammaloop-nextest-core> 10: <gammalooprs[f21b74aec46f5289]::graph::feynman_graph::tests::native_thermal_distributions::{closure#0} as core[940e698046960fd5]::ops::function::FnOnce<()>>::call_once <unknown>
30.31 s
gammaloop-nextest-core> at <unknown source file> :<unknown line>
30.31 s
gammaloop-nextest-core> 11: test[75d6903177b1d7e9]::__rust_begin_short_backtrace::<core[940e698046960fd5]::result::Result<(), alloc[2ea6bcb46fca0c42]::string::String>, fn() -> core[940e698046960fd5]::result::Result<(), alloc[2ea6bcb46fca0c42]::string::String>> <unknown>
30.31 s
gammaloop-nextest-core> at <unknown source file> :<unknown line>
30.31 s
gammaloop-nextest-core> 12: test[75d6903177b1d7e9]::run_test::{closure#0} <unknown>
30.31 s
gammaloop-nextest-core> at <unknown source file> :<unknown line>
30.31 s
gammaloop-nextest-core> 13: std[bcb96dfbba0ab899]::sys::backtrace::__rust_begin_short_backtrace::<test[75d6903177b1d7e9]::run_test::{closure#1}, ()> <unknown>
30.31 s
gammaloop-nextest-core> at <unknown source file> :<unknown line>
30.31 s
gammaloop-nextest-core> 14: <std[bcb96dfbba0ab899]::thread::lifecycle::spawn_unchecked<test[75d6903177b1d7e9]::run_test::{closure#1}, ()>::{closure#1} as core[940e698046960fd5]::ops::function::FnOnce<()>>::call_once::{shim:vtable#0} <unknown>
30.31 s
gammaloop-nextest-core> at <unknown source file> :<unknown line>
30.31 s
gammaloop-nextest-core> 15: <std[bcb96dfbba0ab899]::sys::thread::unix::Thread>::new::thread_start <unknown>
30.31 s
gammaloop-nextest-core> at <unknown source file> :<unknown line>
30.31 s
gammaloop-nextest-core> 16: start_thread <unknown>
30.31 s
gammaloop-nextest-core> at <unknown source file> :<unknown line>
30.31 s
gammaloop-nextest-core> 17: __clone3 <unknown>
30.31 s
gammaloop-nextest-core> at <unknown source file> :<unknown line>
30.31 s
gammaloop-nextest-core>
30.31 s
gammaloop-nextest-core> Run with COLORBT_SHOW_HIDDEN=1 environment variable to disable frame filtering.
30.31 s
gammaloop-nextest-core> Run with RUST_BACKTRACE=full to include source snippets.
30.31 s
gammaloop-nextest-core>
30.31 s
gammaloop-nextest-core> FAIL [ 5.321s] (479/483) gammalooprs cff::generation::tests_cff :: thermal_bugblatter
30.31 s
gammaloop-nextest-core> stdout ---
30.31 s
gammaloop-nextest-core>
30.31 s
gammaloop-nextest-core> running 1 test
30.31 s
gammaloop-nextest-core> test cff::generation::tests_cff::thermal_bugblatter ... FAILED
30.31 s
gammaloop-nextest-core>
30.31 s
gammaloop-nextest-core> failures:
30.31 s
gammaloop-nextest-core>
30.31 s
gammaloop-nextest-core> failures:
30.31 s
gammaloop-nextest-core> cff::generation::tests_cff::thermal_bugblatter
30.31 s
gammaloop-nextest-core>
30.31 s
gammaloop-nextest-core> test result: FAILED. 0 passed; 1 failed; 0 ignored; 0 measured; 535 filtered out; finished in 5.24s
30.31 s
gammaloop-nextest-core>
30.31 s
gammaloop-nextest-core> stderr ---
30.31 s
gammaloop-nextest-core>
30.31 s
gammaloop-nextest-core> thread 'cff::generation::tests_cff::thermal_bugblatter' (1274) panicked at /nix/store/l5xazfnr7k6r6p8mlkn38x2afab0rygz-vendor-cargo-deps/5929dab090e556a579e9f3b708cd2e67c60b3d84a12b5a276f2a36cb00473133/symbolica-2.2.0/src/evaluate/evaluator.rs:295:21:
30.31 s
gammaloop-nextest-core> External function 'symbolica_coth' does not have an implementation for gammalooprs::utils::F<f64>
30.31 s
gammaloop-nextest-core> stack backtrace:
30.31 s
gammaloop-nextest-core> 0: __rustc::rust_begin_unwind
30.31 s
gammaloop-nextest-core> 1: core::panicking::panic_fmt
30.31 s
gammaloop-nextest-core> 2: <symbolica::evaluate::evaluator::ExpressionEvaluator<gammalooprs::utils::F<f64>>>::evaluate_impl_no_ops
30.31 s
gammaloop-nextest-core> 3: <symbolica::evaluate::evaluator::ExpressionEvaluator<gammalooprs::utils::F<f64>>>::evaluate_single
30.31 s
gammaloop-nextest-core> 4: gammalooprs::cff::generation::tests_cff::thermal_bugblatter
30.31 s
gammaloop-nextest-core> 5: <gammalooprs::cff::generation::tests_cff::thermal_bugblatter::{closure#0} as core::ops::function::FnOnce<()>>::call_once
30.31 s
gammaloop-nextest-core> note: Some details are omitted, run with `RUST_BACKTRACE=full` for a verbose backtrace.
30.31 s
gammaloop-nextest-core>
30.37 s
gammaloop-nextest-core> error : test run failed
30.39 s
gammaloop-nextest-core>
30.39 s
gammaloop-nextest-core> ========== nextest test summary ==========
30.39 s
gammaloop-nextest-core> report: target/nextest/ci_gammaloop/junit.xml
30.39 s
gammaloop-nextest-core> tests: 483, failures: 7, errors: 0
30.39 s
gammaloop-nextest-core>
30.39 s
gammaloop-nextest-core> 1. gammalooprs::cff::generation::tests_cff::thermal_eight
30.39 s
gammaloop-nextest-core> failure: test failure with exit code 101
30.39 s
gammaloop-nextest-core> thread 'cff::generation::tests_cff::thermal_eight' (1282) panicked at /nix/store/l5xazfnr7k6r6p8mlkn38x2afab0rygz-vendor-cargo-deps/5929dab090e556a579e9f3b708cd2e67c60b3d84a12b5a276f2a36cb00473133/symbolica-2.2.0/src/evaluate/evaluator.rs:295:21:
30.39 s
gammaloop-nextest-core> External function 'symbolica_coth' does not have an implementation for gammalooprs::utils::F<f64>
30.39 s
gammaloop-nextest-core> stack backtrace:
30.39 s
gammaloop-nextest-core> 0: __rustc::rust_begin_unwind
30.39 s
gammaloop-nextest-core> 1: core::panicking::panic_fmt
30.39 s
gammaloop-nextest-core> 2: <symbolica::evaluate::evaluator::ExpressionEvaluator<gammalooprs::utils::F<f64>>>::evaluate_impl_no_ops
30.39 s
gammaloop-nextest-core> 3: <symbolica::evaluate::evaluator::ExpressionEvaluator<gammalooprs::utils::F<f64>>>::evaluate_single
30.39 s
gammaloop-nextest-core> 4: gammalooprs::cff::generation::tests_cff::thermal_eight
30.39 s
gammaloop-nextest-core> 5: <gammalooprs::cff::generation::tests_cff::thermal_eight::{closure#0} as core::ops::function::FnOnce<()>>::call_once
30.39 s
gammaloop-nextest-core> note: Some details are omitted, run with `RUST_BACKTRACE=full` for a verbose backtrace.
30.39 s
gammaloop-nextest-core> system-out
30.39 s
gammaloop-nextest-core> running 1 test
30.39 s
gammaloop-nextest-core> test cff::generation::tests_cff::thermal_eight ... FAILED
30.39 s
gammaloop-nextest-core>
30.39 s
gammaloop-nextest-core> failures:
30.39 s
gammaloop-nextest-core>
30.39 s
gammaloop-nextest-core> failures:
30.39 s
gammaloop-nextest-core> cff::generation::tests_cff::thermal_eight
30.39 s
gammaloop-nextest-core>
30.39 s
gammaloop-nextest-core> test result: FAILED. 0 passed; 1 failed; 0 ignored; 0 measured; 535 filtered out; finished in 0.01s
30.39 s
gammaloop-nextest-core> system-err
30.39 s
gammaloop-nextest-core> thread 'cff::generation::tests_cff::thermal_eight' (1282) panicked at /nix/store/l5xazfnr7k6r6p8mlkn38x2afab0rygz-vendor-cargo-deps/5929dab090e556a579e9f3b708cd2e67c60b3d84a12b5a276f2a36cb00473133/symbolica-2.2.0/src/evaluate/evaluator.rs:295:21:
30.39 s
gammaloop-nextest-core> External function 'symbolica_coth' does not have an implementation for gammalooprs::utils::F<f64>
30.39 s
gammaloop-nextest-core> stack backtrace:
30.39 s
gammaloop-nextest-core> 0: __rustc::rust_begin_unwind
30.39 s
gammaloop-nextest-core> 1: core::panicking::panic_fmt
30.39 s
gammaloop-nextest-core> 2: <symbolica::evaluate::evaluator::ExpressionEvaluator<gammalooprs::utils::F<f64>>>::evaluate_impl_no_ops
30.39 s
gammaloop-nextest-core> 3: <symbolica::evaluate::evaluator::ExpressionEvaluator<gammalooprs::utils::F<f64>>>::evaluate_single
30.39 s
gammaloop-nextest-core> 4: gammalooprs::cff::generation::tests_cff::thermal_eight
30.39 s
gammaloop-nextest-core> 5: <gammalooprs::cff::generation::tests_cff::thermal_eight::{closure#0} as core::ops::function::FnOnce<()>>::call_once
30.39 s
gammaloop-nextest-core> note: Some details are omitted, run with `RUST_BACKTRACE=full` for a verbose backtrace.
30.39 s
gammaloop-nextest-core>
30.39 s
gammaloop-nextest-core> 2. gammalooprs::cff::generation::tests_cff::thermal_bubble_chain
30.39 s
gammaloop-nextest-core> failure: test failure with exit code 101
30.39 s
gammaloop-nextest-core> thread 'cff::generation::tests_cff::thermal_bubble_chain' (1273) panicked at /nix/store/l5xazfnr7k6r6p8mlkn38x2afab0rygz-vendor-cargo-deps/5929dab090e556a579e9f3b708cd2e67c60b3d84a12b5a276f2a36cb00473133/symbolica-2.2.0/src/evaluate/evaluator.rs:295:21:
30.39 s
gammaloop-nextest-core> External function 'symbolica_coth' does not have an implementation for gammalooprs::utils::F<f64>
30.39 s
gammaloop-nextest-core> stack backtrace:
30.39 s
gammaloop-nextest-core> 0: __rustc::rust_begin_unwind
30.39 s
gammaloop-nextest-core> 1: core::panicking::panic_fmt
30.39 s
gammaloop-nextest-core> 2: <symbolica::evaluate::evaluator::ExpressionEvaluator<gammalooprs::utils::F<f64>>>::evaluate_impl_no_ops
30.39 s
gammaloop-nextest-core> 3: <symbolica::evaluate::evaluator::ExpressionEvaluator<gammalooprs::utils::F<f64>>>::evaluate_single
30.39 s
gammaloop-nextest-core> 4: gammalooprs::cff::generation::tests_cff::thermal_bubble_chain
30.39 s
gammaloop-nextest-core> 5: <gammalooprs::cff::generation::tests_cff::thermal_bubble_chain::{closure#0} as core::ops::function::FnOnce<()>>::call_once
30.39 s
gammaloop-nextest-core> note: Some details are omitted, run with `RUST_BACKTRACE=full` for a verbose backtrace.
30.39 s
gammaloop-nextest-core> system-out
30.39 s
gammaloop-nextest-core> running 1 test
30.39 s
gammaloop-nextest-core> test cff::generation::tests_cff::thermal_bubble_chain ... FAILED
30.39 s
gammaloop-nextest-core>
30.39 s
gammaloop-nextest-core> failures:
30.39 s
gammaloop-nextest-core>
30.39 s
gammaloop-nextest-core> failures:
30.39 s
gammaloop-nextest-core> cff::generation::tests_cff::thermal_bubble_chain
30.39 s
gammaloop-nextest-core>
30.39 s
gammaloop-nextest-core> test result: FAILED. 0 passed; 1 failed; 0 ignored; 0 measured; 535 filtered out; finished in 0.01s
30.39 s
gammaloop-nextest-core> system-err
30.39 s
gammaloop-nextest-core> thread 'cff::generation::tests_cff::thermal_bubble_chain' (1273) panicked at /nix/store/l5xazfnr7k6r6p8mlkn38x2afab0rygz-vendor-cargo-deps/5929dab090e556a579e9f3b708cd2e67c60b3d84a12b5a276f2a36cb00473133/symbolica-2.2.0/src/evaluate/evaluator.rs:295:21:
30.39 s
gammaloop-nextest-core> External function 'symbolica_coth' does not have an implementation for gammalooprs::utils::F<f64>
30.39 s
gammaloop-nextest-core> stack backtrace:
30.39 s
gammaloop-nextest-core> 0: __rustc::rust_begin_unwind
30.39 s
gammaloop-nextest-core> 1: core::panicking::panic_fmt
30.39 s
gammaloop-nextest-core> 2: <symbolica::evaluate::evaluator::ExpressionEvaluator<gammalooprs::utils::F<f64>>>::evaluate_impl_no_ops
30.39 s
gammaloop-nextest-core> 3: <symbolica::evaluate::evaluator::ExpressionEvaluator<gammalooprs::utils::F<f64>>>::evaluate_single
30.39 s
gammaloop-nextest-core> 4: gammalooprs::cff::generation::tests_cff::thermal_bubble_chain
30.39 s
gammaloop-nextest-core> 5: <gammalooprs::cff::generation::tests_cff::thermal_bubble_chain::{closure#0} as core::ops::function::FnOnce<()>>::call_once
30.39 s
gammaloop-nextest-core> note: Some details are omitted, run with `RUST_BACKTRACE=full` for a verbose backtrace.
30.39 s
gammaloop-nextest-core>
30.39 s
gammaloop-nextest-core> 3. gammalooprs::cff::generation::tests_cff::thermal_bubble
30.39 s
gammaloop-nextest-core> failure: test failure with exit code 101
30.39 s
gammaloop-nextest-core> thread 'cff::generation::tests_cff::thermal_bubble' (1280) panicked at /nix/store/l5xazfnr7k6r6p8mlkn38x2afab0rygz-vendor-cargo-deps/5929dab090e556a579e9f3b708cd2e67c60b3d84a12b5a276f2a36cb00473133/symbolica-2.2.0/src/evaluate/evaluator.rs:295:21:
30.39 s
gammaloop-nextest-core> External function 'symbolica_coth' does not have an implementation for gammalooprs::utils::F<f64>
30.39 s
gammaloop-nextest-core> stack backtrace:
30.39 s
gammaloop-nextest-core> 0: __rustc::rust_begin_unwind
30.39 s
gammaloop-nextest-core> 1: core::panicking::panic_fmt
30.39 s
gammaloop-nextest-core> 2: <symbolica::evaluate::evaluator::ExpressionEvaluator<gammalooprs::utils::F<f64>>>::evaluate_impl_no_ops
30.39 s
gammaloop-nextest-core> 3: <symbolica::evaluate::evaluator::ExpressionEvaluator<gammalooprs::utils::F<f64>>>::evaluate_single
30.39 s
gammaloop-nextest-core> 4: gammalooprs::cff::generation::tests_cff::thermal_bubble
30.39 s
gammaloop-nextest-core> 5: <gammalooprs::cff::generation::tests_cff::thermal_bubble::{closure#0} as core::ops::function::FnOnce<()>>::call_once
30.39 s
gammaloop-nextest-core> note: Some details are omitted, run with `RUST_BACKTRACE=full` for a verbose backtrace.
30.39 s
gammaloop-nextest-core> system-out
30.39 s
gammaloop-nextest-core> running 1 test
30.39 s
gammaloop-nextest-core> test cff::generation::tests_cff::thermal_bubble ... FAILED
30.39 s
gammaloop-nextest-core>
30.39 s
gammaloop-nextest-core> failures:
30.39 s
gammaloop-nextest-core>
30.39 s
gammaloop-nextest-core> failures:
30.39 s
gammaloop-nextest-core> cff::generation::tests_cff::thermal_bubble
30.39 s
gammaloop-nextest-core>
30.39 s
gammaloop-nextest-core> test result: FAILED. 0 passed; 1 failed; 0 ignored; 0 measured; 535 filtered out; finished in 0.01s
30.39 s
gammaloop-nextest-core> system-err
30.39 s
gammaloop-nextest-core> thread 'cff::generation::tests_cff::thermal_bubble' (1280) panicked at /nix/store/l5xazfnr7k6r6p8mlkn38x2afab0rygz-vendor-cargo-deps/5929dab090e556a579e9f3b708cd2e67c60b3d84a12b5a276f2a36cb00473133/symbolica-2.2.0/src/evaluate/evaluator.rs:295:21:
30.39 s
gammaloop-nextest-core> External function 'symbolica_coth' does not have an implementation for gammalooprs::utils::F<f64>
30.39 s
gammaloop-nextest-core> stack backtrace:
30.39 s
gammaloop-nextest-core> 0: __rustc::rust_begin_unwind
30.39 s
gammaloop-nextest-core> 1: core::panicking::panic_fmt
30.39 s
gammaloop-nextest-core> 2: <symbolica::evaluate::evaluator::ExpressionEvaluator<gammalooprs::utils::F<f64>>>::evaluate_impl_no_ops
30.39 s
gammaloop-nextest-core> 3: <symbolica::evaluate::evaluator::ExpressionEvaluator<gammalooprs::utils::F<f64>>>::evaluate_single
30.39 s
gammaloop-nextest-core> 4: gammalooprs::cff::generation::tests_cff::thermal_bubble
30.39 s
gammaloop-nextest-core> 5: <gammalooprs::cff::generation::tests_cff::thermal_bubble::{closure#0} as core::ops::function::FnOnce<()>>::call_once
30.39 s
gammaloop-nextest-core> note: Some details are omitted, run with `RUST_BACKTRACE=full` for a verbose backtrace.
30.39 s
gammaloop-nextest-core>
30.39 s
gammaloop-nextest-core> 4. gammalooprs::cff::generation::tests_cff::thermal_ring
30.39 s
gammaloop-nextest-core> failure: test failure with exit code 101
30.39 s
gammaloop-nextest-core> thread 'cff::generation::tests_cff::thermal_ring' (1291) panicked at /nix/store/l5xazfnr7k6r6p8mlkn38x2afab0rygz-vendor-cargo-deps/5929dab090e556a579e9f3b708cd2e67c60b3d84a12b5a276f2a36cb00473133/symbolica-2.2.0/src/evaluate/evaluator.rs:295:21:
30.39 s
gammaloop-nextest-core> External function 'symbolica_coth' does not have an implementation for gammalooprs::utils::F<f64>
30.39 s
gammaloop-nextest-core> stack backtrace:
30.39 s
gammaloop-nextest-core> 0: __rustc::rust_begin_unwind
30.39 s
gammaloop-nextest-core> 1: core::panicking::panic_fmt
30.39 s
gammaloop-nextest-core> 2: <symbolica::evaluate::evaluator::ExpressionEvaluator<gammalooprs::utils::F<f64>>>::evaluate_impl_no_ops
30.39 s
gammaloop-nextest-core> 3: <symbolica::evaluate::evaluator::ExpressionEvaluator<gammalooprs::utils::F<f64>>>::evaluate_single
30.39 s
gammaloop-nextest-core> 4: gammalooprs::cff::generation::tests_cff::thermal_ring
30.39 s
gammaloop-nextest-core> 5: <gammalooprs::cff::generation::tests_cff::thermal_ring::{closure#0} as core::ops::function::FnOnce<()>>::call_once
30.39 s
gammaloop-nextest-core> note: Some details are omitted, run with `RUST_BACKTRACE=full` for a verbose backtrace.
30.39 s
gammaloop-nextest-core> system-out
30.39 s
gammaloop-nextest-core> running 1 test
30.39 s
gammaloop-nextest-core> test cff::generation::tests_cff::thermal_ring ... FAILED
30.39 s
gammaloop-nextest-core>
30.39 s
gammaloop-nextest-core> failures:
30.39 s
gammaloop-nextest-core>
30.39 s
gammaloop-nextest-core> failures:
30.39 s
gammaloop-nextest-core> cff::generation::tests_cff::thermal_ring
30.39 s
gammaloop-nextest-core>
30.39 s
gammaloop-nextest-core> test result: FAILED. 0 passed; 1 failed; 0 ignored; 0 measured; 535 filtered out; finished in 0.06s
30.39 s
gammaloop-nextest-core> system-err
30.39 s
gammaloop-nextest-core> thread 'cff::generation::tests_cff::thermal_ring' (1291) panicked at /nix/store/l5xazfnr7k6r6p8mlkn38x2afab0rygz-vendor-cargo-deps/5929dab090e556a579e9f3b708cd2e67c60b3d84a12b5a276f2a36cb00473133/symbolica-2.2.0/src/evaluate/evaluator.rs:295:21:
30.39 s
gammaloop-nextest-core> External function 'symbolica_coth' does not have an implementation for gammalooprs::utils::F<f64>
30.39 s
gammaloop-nextest-core> stack backtrace:
30.39 s
gammaloop-nextest-core> 0: __rustc::rust_begin_unwind
30.39 s
gammaloop-nextest-core> 1: core::panicking::panic_fmt
30.39 s
gammaloop-nextest-core> 2: <symbolica::evaluate::evaluator::ExpressionEvaluator<gammalooprs::utils::F<f64>>>::evaluate_impl_no_ops
30.39 s
gammaloop-nextest-core> 3: <symbolica::evaluate::evaluator::ExpressionEvaluator<gammalooprs::utils::F<f64>>>::evaluate_single
30.39 s
gammaloop-nextest-core> 4: gammalooprs::cff::generation::tests_cff::thermal_ring
30.39 s
gammaloop-nextest-core> 5: <gammalooprs::cff::generation::tests_cff::thermal_ring::{closure#0} as core::ops::function::FnOnce<()>>::call_once
30.39 s
gammaloop-nextest-core> note: Some details are omitted, run with `RUST_BACKTRACE=full` for a verbose backtrace.
30.39 s
gammaloop-nextest-core>
30.39 s
gammaloop-nextest-core> 5. gammalooprs::cff::generation::tests_cff::thermal_mercedes
30.39 s
gammaloop-nextest-core> failure: test failure with exit code 101
30.39 s
gammaloop-nextest-core> thread 'cff::generation::tests_cff::thermal_mercedes' (1276) panicked at /nix/store/l5xazfnr7k6r6p8mlkn38x2afab0rygz-vendor-cargo-deps/5929dab090e556a579e9f3b708cd2e67c60b3d84a12b5a276f2a36cb00473133/symbolica-2.2.0/src/evaluate/evaluator.rs:295:21:
30.39 s
gammaloop-nextest-core> External function 'symbolica_coth' does not have an implementation for gammalooprs::utils::F<f64>
30.39 s
gammaloop-nextest-core> stack backtrace:
30.39 s
gammaloop-nextest-core> 0: __rustc::rust_begin_unwind
30.39 s
gammaloop-nextest-core> 1: core::panicking::panic_fmt
30.39 s
gammaloop-nextest-core> 2: <symbolica::evaluate::evaluator::ExpressionEvaluator<gammalooprs::utils::F<f64>>>::evaluate_impl_no_ops
30.39 s
gammaloop-nextest-core> 3: <symbolica::evaluate::evaluator::ExpressionEvaluator<gammalooprs::utils::F<f64>>>::evaluate_single
30.39 s
gammaloop-nextest-core> 4: gammalooprs::cff::generation::tests_cff::thermal_mercedes
30.39 s
gammaloop-nextest-core> 5: <gammalooprs::cff::generation::tests_cff::thermal_mercedes::{closure#0} as core::ops::function::FnOnce<()>>::call_once
30.39 s
gammaloop-nextest-core> note: Some details are omitted, run with `RUST_BACKTRACE=full` for a verbose backtrace.
30.39 s
gammaloop-nextest-core> system-out
30.39 s
gammaloop-nextest-core> running 1 test
30.39 s
gammaloop-nextest-core> test cff::generation::tests_cff::thermal_mercedes ... FAILED
30.39 s
gammaloop-nextest-core>
30.39 s
gammaloop-nextest-core> failures:
30.39 s
gammaloop-nextest-core>
30.39 s
gammaloop-nextest-core> failures:
30.39 s
gammaloop-nextest-core> cff::generation::tests_cff::thermal_mercedes
30.39 s
gammaloop-nextest-core>
30.39 s
gammaloop-nextest-core> test result: FAILED. 0 passed; 1 failed; 0 ignored; 0 measured; 535 filtered out; finished in 0.10s
30.39 s
gammaloop-nextest-core> system-err
30.39 s
gammaloop-nextest-core> thread 'cff::generation::tests_cff::thermal_mercedes' (1276) panicked at /nix/store/l5xazfnr7k6r6p8mlkn38x2afab0rygz-vendor-cargo-deps/5929dab090e556a579e9f3b708cd2e67c60b3d84a12b5a276f2a36cb00473133/symbolica-2.2.0/src/evaluate/evaluator.rs:295:21:
30.39 s
gammaloop-nextest-core> External function 'symbolica_coth' does not have an implementation for gammalooprs::utils::F<f64>
30.39 s
gammaloop-nextest-core> stack backtrace:
30.39 s
gammaloop-nextest-core> 0: __rustc::rust_begin_unwind
30.39 s
gammaloop-nextest-core> 1: core::panicking::panic_fmt
30.39 s
gammaloop-nextest-core> 2: <symbolica::evaluate::evaluator::ExpressionEvaluator<gammalooprs::utils::F<f64>>>::evaluate_impl_no_ops
30.39 s
gammaloop-nextest-core> 3: <symbolica::evaluate::evaluator::ExpressionEvaluator<gammalooprs::utils::F<f64>>>::evaluate_single
30.39 s
gammaloop-nextest-core> 4: gammalooprs::cff::generation::tests_cff::thermal_mercedes
30.39 s
gammaloop-nextest-core> 5: <gammalooprs::cff::generation::tests_cff::thermal_mercedes::{closure#0} as core::ops::function::FnOnce<()>>::call_once
30.39 s
gammaloop-nextest-core> note: Some details are omitted, run with `RUST_BACKTRACE=full` for a verbose backtrace.
30.39 s
gammaloop-nextest-core>
30.39 s
gammaloop-nextest-core> 6. gammalooprs::graph::feynman_graph::tests::native_thermal_distributions
30.39 s
gammaloop-nextest-core> failure: test failure with exit code 101
30.39 s
gammaloop-nextest-core> system-out
30.39 s
gammaloop-nextest-core> running 1 test
30.39 s
gammaloop-nextest-core> test graph::feynman_graph::tests::native_thermal_distributions ... FAILED
30.39 s
gammaloop-nextest-core>
30.39 s
gammaloop-nextest-core> failures:
30.39 s
gammaloop-nextest-core>
30.39 s
gammaloop-nextest-core> failures:
30.39 s
gammaloop-nextest-core> graph::feynman_graph::tests::native_thermal_distributions
30.39 s
gammaloop-nextest-core>
30.39 s
gammaloop-nextest-core> test result: FAILED. 0 passed; 1 failed; 0 ignored; 0 measured; 535 filtered out; finished in 0.44s
30.39 s
gammaloop-nextest-core> system-err
30.39 s
gammaloop-nextest-core> The application panicked (crashed).
30.39 s
gammaloop-nextest-core> Message: called `Result::unwrap()` on an `Err` value: Custom { kind: Other, error: "Could not compile code: g++ -shared -O3 -fPIC -ffast-math -funsafe-math-optimizations -march=native -o /build/gammaloop-native-thermal-1345/thermal_0_0.so /build/gammaloop-native-thermal-1345/thermal_0_0.cpp\nwarning: Skipping impure flag -march=native because NIX_ENFORCE_NO_NATIVE is set\n/build/gammaloop-native-thermal-1345/thermal_0_0.cpp: In function 'void thermal_realf64(const double*, double*, double*)':\n/build/gammaloop-native-thermal-1345/thermal_0_0.cpp:27:16: error: 'symbolica_tanh' was not declared in this scope\n 27 | Z[6] = symbolica_tanh(Z[6]);\n | ^~~~~~~~~~~~~~\n" }
30.39 s
gammaloop-nextest-core> Location: crates/gammalooprs/src/graph/feynman_graph.rs:937
30.39 s
gammaloop-nextest-core>
30.39 s
gammaloop-nextest-core> ━━━━━━━━━━━━━━━━━━━━━━━━━━━━━━━━━━ BACKTRACE ━━━━━━━━━━━━━━━━━━━━━━━━━━━━━━━━━━━
30.39 s
gammaloop-nextest-core> 1: <color_eyre[b0c9e66060e883b2]::config::PanicHook>::panic_report<unknown>
30.39 s
gammaloop-nextest-core> at <unknown source file>:<unknown line>
30.39 s
gammaloop-nextest-core> 2: <color_eyre[b0c9e66060e883b2]::config::PanicHook>::into_panic_hook::{closure#0}<unknown>
30.39 s
gammaloop-nextest-core> at <unknown source file>:<unknown line>
30.39 s
gammaloop-nextest-core> 3: std[bcb96dfbba0ab899]::panicking::panic_with_hook<unknown>
30.39 s
gammaloop-nextest-core> at <unknown source file>:<unknown line>
30.39 s
gammaloop-nextest-core> 4: std[bcb96dfbba0ab899]::panicking::panic_handler::{closure#0}<unknown>
30.39 s
gammaloop-nextest-core> at <unknown source file>:<unknown line>
30.39 s
gammaloop-nextest-core> 5: std[bcb96dfbba0ab899]::sys::backtrace::__rust_end_short_backtrace::<std[bcb96dfbba0ab899]::panicking::panic_handler::{closure#0}, !><unknown>
30.39 s
gammaloop-nextest-core> at <unknown source file>:<unknown line>
30.39 s
gammaloop-nextest-core> 6: __rustc[6c289b9f9c454d21]::rust_begin_unwind<unknown>
30.39 s
gammaloop-nextest-core> at <unknown source file>:<unknown line>
30.39 s
gammaloop-nextest-core> 7: core[940e698046960fd5]::panicking::panic_fmt<unknown>
30.39 s
gammaloop-nextest-core> at <unknown source file>:<unknown line>
30.39 s
gammaloop-nextest-core> 8: core[940e698046960fd5]::result::unwrap_failed<unknown>
30.39 s
gammaloop-nextest-core> at <unknown source file>:<unknown line>
30.39 s
gammaloop-nextest-core> 9: gammalooprs[f21b74aec46f5289]::graph::feynman_graph::tests::native_thermal_distributions<unknown>
30.39 s
gammaloop-nextest-core> at <unknown source file>:<unknown line>
30.39 s
gammaloop-nextest-core> 10: <gammalooprs[f21b74aec46f5289]::graph::feynman_graph::tests::native_thermal_distributions::{closure#0} as core[940e698046960fd5]::ops::function::FnOnce<()>>::call_once<unknown>
30.39 s
gammaloop-nextest-core> at <unknown source file>:<unknown line>
30.39 s
gammaloop-nextest-core> 11: test[75d6903177b1d7e9]::__rust_begin_short_backtrace::<core[940e698046960fd5]::result::Result<(), alloc[2ea6bcb46fca0c42]::string::String>, fn() -> core[940e698046960fd5]::result::Result<(), alloc[2ea6bcb46fca0c42]::string::String>><unknown>
30.39 s
gammaloop-nextest-core> at <unknown source file>:<unknown line>
30.39 s
gammaloop-nextest-core> 12: test[75d6903177b1d7e9]::run_test::{closure#0}<unknown>
30.39 s
gammaloop-nextest-core> at <unknown source file>:<unknown line>
30.39 s
gammaloop-nextest-core> 13: std[bcb96dfbba0ab899]::sys::backtrace::__rust_begin_short_backtrace::<test[75d6903177b1d7e9]::run_test::{closure#1}, ()><unknown>
30.39 s
gammaloop-nextest-core> at <unknown source file>:<unknown line>
30.39 s
gammaloop-nextest-core> 14: <std[bcb96dfbba0ab899]::thread::lifecycle::spawn_unchecked<test[75d6903177b1d7e9]::run_test::{closure#1}, ()>::{closure#1} as core[940e698046960fd5]::ops::function::FnOnce<()>>::call_once::{shim:vtable#0}<unknown>
30.39 s
gammaloop-nextest-core> at <unknown source file>:<unknown line>
30.39 s
gammaloop-nextest-core> 15: <std[bcb96dfbba0ab899]::sys::thread::unix::Thread>::new::thread_start<unknown>
30.39 s
gammaloop-nextest-core> at <unknown source file>:<unknown line>
30.39 s
gammaloop-nextest-core> 16: start_thread<unknown>
30.39 s
gammaloop-nextest-core> at <unknown source file>:<unknown line>
30.39 s
gammaloop-nextest-core> 17: __clone3<unknown>
30.39 s
gammaloop-nextest-core> at <unknown source file>:<unknown line>
30.39 s
gammaloop-nextest-core>
30.39 s
gammaloop-nextest-core> Run with COLORBT_SHOW_HIDDEN=1 environment variable to disable frame filtering.
30.39 s
gammaloop-nextest-core> Run with RUST_BACKTRACE=full to include source snippets.
30.39 s
gammaloop-nextest-core>
30.39 s
gammaloop-nextest-core> 7. gammalooprs::cff::generation::tests_cff::thermal_bugblatter
30.39 s
gammaloop-nextest-core> failure: test failure with exit code 101
30.39 s
gammaloop-nextest-core> thread 'cff::generation::tests_cff::thermal_bugblatter' (1274) panicked at /nix/store/l5xazfnr7k6r6p8mlkn38x2afab0rygz-vendor-cargo-deps/5929dab090e556a579e9f3b708cd2e67c60b3d84a12b5a276f2a36cb00473133/symbolica-2.2.0/src/evaluate/evaluator.rs:295:21:
30.39 s
gammaloop-nextest-core> External function 'symbolica_coth' does not have an implementation for gammalooprs::utils::F<f64>
30.39 s
gammaloop-nextest-core> stack backtrace:
30.39 s
gammaloop-nextest-core> 0: __rustc::rust_begin_unwind
30.39 s
gammaloop-nextest-core> 1: core::panicking::panic_fmt
30.39 s
gammaloop-nextest-core> 2: <symbolica::evaluate::evaluator::ExpressionEvaluator<gammalooprs::utils::F<f64>>>::evaluate_impl_no_ops
30.39 s
gammaloop-nextest-core> 3: <symbolica::evaluate::evaluator::ExpressionEvaluator<gammalooprs::utils::F<f64>>>::evaluate_single
30.39 s
gammaloop-nextest-core> 4: gammalooprs::cff::generation::tests_cff::thermal_bugblatter
30.39 s
gammaloop-nextest-core> 5: <gammalooprs::cff::generation::tests_cff::thermal_bugblatter::{closure#0} as core::ops::function::FnOnce<()>>::call_once
30.39 s
gammaloop-nextest-core> note: Some details are omitted, run with `RUST_BACKTRACE=full` for a verbose backtrace.
30.39 s
gammaloop-nextest-core> system-out
30.39 s
gammaloop-nextest-core> running 1 test
30.39 s
gammaloop-nextest-core> test cff::generation::tests_cff::thermal_bugblatter ... FAILED
30.39 s
gammaloop-nextest-core>
30.39 s
gammaloop-nextest-core> failures:
30.39 s
gammaloop-nextest-core>
30.39 s
gammaloop-nextest-core> failures:
30.39 s
gammaloop-nextest-core> cff::generation::tests_cff::thermal_bugblatter
30.39 s
gammaloop-nextest-core>
30.39 s
gammaloop-nextest-core> test result: FAILED. 0 passed; 1 failed; 0 ignored; 0 measured; 535 filtered out; finished in 5.24s
30.39 s
gammaloop-nextest-core> system-err
30.39 s
gammaloop-nextest-core> thread 'cff::generation::tests_cff::thermal_bugblatter' (1274) panicked at /nix/store/l5xazfnr7k6r6p8mlkn38x2afab0rygz-vendor-cargo-deps/5929dab090e556a579e9f3b708cd2e67c60b3d84a12b5a276f2a36cb00473133/symbolica-2.2.0/src/evaluate/evaluator.rs:295:21:
30.39 s
gammaloop-nextest-core> External function 'symbolica_coth' does not have an implementation for gammalooprs::utils::F<f64>
30.39 s
gammaloop-nextest-core> stack backtrace:
30.39 s
gammaloop-nextest-core> 0: __rustc::rust_begin_unwind
30.39 s
gammaloop-nextest-core> 1: core::panicking::panic_fmt
30.39 s
gammaloop-nextest-core> 2: <symbolica::evaluate::evaluator::ExpressionEvaluator<gammalooprs::utils::F<f64>>>::evaluate_impl_no_ops
30.39 s
gammaloop-nextest-core> 3: <symbolica::evaluate::evaluator::ExpressionEvaluator<gammalooprs::utils::F<f64>>>::evaluate_single
30.39 s
gammaloop-nextest-core> 4: gammalooprs::cff::generation::tests_cff::thermal_bugblatter
30.39 s
gammaloop-nextest-core> 5: <gammalooprs::cff::generation::tests_cff::thermal_bugblatter::{closure#0} as core::ops::function::FnOnce<()>>::call_once
30.39 s
gammaloop-nextest-core> note: Some details are omitted, run with `RUST_BACKTRACE=full` for a verbose backtrace.
30.39 s
gammaloop-nextest-core> =========================================
30.43 s
error: Cannot build '/nix/store/8r84j4srh5jz28101cd8xndlncp1i0gs-gammaloop-nextest-core.drv '.
30.43 s
Reason: builder failed with exit code 100 .
30.43 s
Output paths:
30.43 s
/nix/store/31q585g5sl9sp361gqhbqb1ds9nvb6js-gammaloop-nextest-core
30.43 s
Last 738 log lines:
30.43 s
> Extracting 3 binaries (including 1 non-test binary), 1 build script output directory, and 2 linked paths to /build/nextest-archive-ocZF4V
30.43 s
> Extracted 18 files to /build/nextest-archive-ocZF4V in 0.39s
30.43 s
> ------------
30.43 s
> Nextest run ID b156a1cf-0e63-4889-a6d3-8a6074ed94a3 with nextest profile: ci_gammaloop
30.43 s
> Starting 339 tests across 2 binaries
30.43 s
> ------------
30.43 s
> Summary [ 0.407s] 339 tests run: 339 passed , 0 skipped
30.43 s
>
30.43 s
> ========== nextest test summary ==========
30.43 s
> report: target/nextest/ci_gammaloop/junit.xml
30.43 s
> tests: 339, failures: 0, errors: 0
30.43 s
> No failing testcases found.
30.43 s
> =========================================
30.43 s
> Extracting 1 binary and 1 linked path to /build/nextest-archive-nEFrtg
30.43 s
> Extracted 7 files to /build/nextest-archive-nEFrtg in 0.06s
30.43 s
> ------------
30.43 s
> Nextest run ID 5d4917af-8cc4-4a1b-84bf-acabf2b77377 with nextest profile: ci_gammaloop
30.43 s
> Starting 19 tests across 1 binary
30.43 s
> ------------
30.43 s
> Summary [ 0.010s] 19 tests run: 19 passed , 0 skipped
30.43 s
>
30.43 s
> ========== nextest test summary ==========
30.43 s
> report: target/nextest/ci_gammaloop/junit.xml
30.43 s
> tests: 19, failures: 0, errors: 0
30.43 s
> No failing testcases found.
30.43 s
> =========================================
30.43 s
> Extracting 1 binary to /build/nextest-archive-XExa8G
30.43 s
> Extracted 4 files to /build/nextest-archive-XExa8G in 0.03s
30.43 s
> ------------
30.43 s
> Nextest run ID 5f0b8542-db87-4f83-b24e-190edf506fdc with nextest profile: ci_gammaloop
30.43 s
> Starting 0 tests across 1 binary
30.43 s
> ------------
30.43 s
> Summary [ 0.000s] 0 tests run: 0 passed , 0 skipped
30.43 s
>
30.43 s
> ========== nextest test summary ==========
30.43 s
> report: target/nextest/ci_gammaloop/junit.xml
30.43 s
> tests: 0, failures: 0, errors: 0
30.43 s
> No failing testcases found.
30.43 s
> =========================================
30.43 s
> Extracting 4 binaries, 1 build script output directory, and 2 linked paths to /build/nextest-archive-3Wl95O
30.43 s
> Extracted 18 files to /build/nextest-archive-3Wl95O in 0.40s
30.43 s
> ------------
30.43 s
> Nextest run ID b449860b-a396-41af-91f6-3ff3df4bf1ce with nextest profile: ci_gammaloop
30.43 s
> Starting 483 tests across 4 binaries (61 tests skipped , including 60 tests via profile.ci_gammaloop.default-filter )
30.43 s
> FAIL [ 0.015s] ( 49/483) gammalooprs cff::generation::tests_cff :: thermal_eight
30.43 s
> stdout ---
30.43 s
>
30.43 s
> running 1 test
30.43 s
> test cff::generation::tests_cff::thermal_eight ... FAILED
30.43 s
>
30.43 s
> failures:
30.43 s
>
30.43 s
> failures:
30.43 s
> cff::generation::tests_cff::thermal_eight
30.43 s
>
30.43 s
> test result: FAILED. 0 passed; 1 failed; 0 ignored; 0 measured; 535 filtered out; finished in 0.01s
30.43 s
>
30.43 s
> stderr ---
30.43 s
>
30.43 s
> thread 'cff::generation::tests_cff::thermal_eight' (1282) panicked at /nix/store/l5xazfnr7k6r6p8mlkn38x2afab0rygz-vendor-cargo-deps/5929dab090e556a579e9f3b708cd2e67c60b3d84a12b5a276f2a36cb00473133/symbolica-2.2.0/src/evaluate/evaluator.rs:295:21:
30.43 s
> External function 'symbolica_coth' does not have an implementation for gammalooprs::utils::F<f64>
30.43 s
> stack backtrace:
30.43 s
> 0: __rustc::rust_begin_unwind
30.43 s
> 1: core::panicking::panic_fmt
30.43 s
> 2: <symbolica::evaluate::evaluator::ExpressionEvaluator<gammalooprs::utils::F<f64>>>::evaluate_impl_no_ops
30.43 s
> 3: <symbolica::evaluate::evaluator::ExpressionEvaluator<gammalooprs::utils::F<f64>>>::evaluate_single
30.43 s
> 4: gammalooprs::cff::generation::tests_cff::thermal_eight
30.43 s
> 5: <gammalooprs::cff::generation::tests_cff::thermal_eight::{closure#0} as core::ops::function::FnOnce<()>>::call_once
30.43 s
> note: Some details are omitted, run with `RUST_BACKTRACE=full` for a verbose backtrace.
30.43 s
>
30.43 s
> FAIL [ 0.018s] ( 51/483) gammalooprs cff::generation::tests_cff :: thermal_bubble_chain
30.43 s
> stdout ---
30.43 s
>
30.43 s
> running 1 test
30.43 s
> test cff::generation::tests_cff::thermal_bubble_chain ... FAILED
30.43 s
>
30.43 s
> failures:
30.43 s
>
30.43 s
> failures:
30.43 s
> cff::generation::tests_cff::thermal_bubble_chain
30.43 s
>
30.43 s
> test result: FAILED. 0 passed; 1 failed; 0 ignored; 0 measured; 535 filtered out; finished in 0.01s
30.43 s
>
30.43 s
> stderr ---
30.43 s
>
30.43 s
> thread 'cff::generation::tests_cff::thermal_bubble_chain' (1273) panicked at /nix/store/l5xazfnr7k6r6p8mlkn38x2afab0rygz-vendor-cargo-deps/5929dab090e556a579e9f3b708cd2e67c60b3d84a12b5a276f2a36cb00473133/symbolica-2.2.0/src/evaluate/evaluator.rs:295:21:
30.43 s
> External function 'symbolica_coth' does not have an implementation for gammalooprs::utils::F<f64>
30.43 s
> stack backtrace:
30.43 s
> 0: __rustc::rust_begin_unwind
30.43 s
> 1: core::panicking::panic_fmt
30.43 s
> 2: <symbolica::evaluate::evaluator::ExpressionEvaluator<gammalooprs::utils::F<f64>>>::evaluate_impl_no_ops
30.43 s
> 3: <symbolica::evaluate::evaluator::ExpressionEvaluator<gammalooprs::utils::F<f64>>>::evaluate_single
30.43 s
> 4: gammalooprs::cff::generation::tests_cff::thermal_bubble_chain
30.43 s
> 5: <gammalooprs::cff::generation::tests_cff::thermal_bubble_chain::{closure#0} as core::ops::function::FnOnce<()>>::call_once
30.43 s
> note: Some details are omitted, run with `RUST_BACKTRACE=full` for a verbose backtrace.
30.43 s
>
30.43 s
> FAIL [ 0.021s] ( 58/483) gammalooprs cff::generation::tests_cff :: thermal_bubble
30.43 s
> stdout ---
30.43 s
>
30.43 s
> running 1 test
30.43 s
> test cff::generation::tests_cff::thermal_bubble ... FAILED
30.43 s
>
30.43 s
> failures:
30.43 s
>
30.43 s
> failures:
30.43 s
> cff::generation::tests_cff::thermal_bubble
30.43 s
>
30.43 s
> test result: FAILED. 0 passed; 1 failed; 0 ignored; 0 measured; 535 filtered out; finished in 0.01s
30.43 s
>
30.43 s
> stderr ---
30.43 s
>
30.43 s
> thread 'cff::generation::tests_cff::thermal_bubble' (1280) panicked at /nix/store/l5xazfnr7k6r6p8mlkn38x2afab0rygz-vendor-cargo-deps/5929dab090e556a579e9f3b708cd2e67c60b3d84a12b5a276f2a36cb00473133/symbolica-2.2.0/src/evaluate/evaluator.rs:295:21:
30.43 s
> External function 'symbolica_coth' does not have an implementation for gammalooprs::utils::F<f64>
30.43 s
> stack backtrace:
30.43 s
> 0: __rustc::rust_begin_unwind
30.43 s
> 1: core::panicking::panic_fmt
30.43 s
> 2: <symbolica::evaluate::evaluator::ExpressionEvaluator<gammalooprs::utils::F<f64>>>::evaluate_impl_no_ops
30.43 s
> 3: <symbolica::evaluate::evaluator::ExpressionEvaluator<gammalooprs::utils::F<f64>>>::evaluate_single
30.43 s
> 4: gammalooprs::cff::generation::tests_cff::thermal_bubble
30.43 s
> 5: <gammalooprs::cff::generation::tests_cff::thermal_bubble::{closure#0} as core::ops::function::FnOnce<()>>::call_once
30.43 s
> note: Some details are omitted, run with `RUST_BACKTRACE=full` for a verbose backtrace.
30.43 s
>
30.43 s
> FAIL [ 0.068s] ( 76/483) gammalooprs cff::generation::tests_cff :: thermal_ring
30.43 s
> stdout ---
30.43 s
>
30.43 s
> running 1 test
30.43 s
> test cff::generation::tests_cff::thermal_ring ... FAILED
30.43 s
>
30.43 s
> failures:
30.43 s
>
30.43 s
> failures:
30.44 s
> cff::generation::tests_cff::thermal_ring
30.44 s
>
30.44 s
> test result: FAILED. 0 passed; 1 failed; 0 ignored; 0 measured; 535 filtered out; finished in 0.06s
30.44 s
>
30.44 s
> stderr ---
30.44 s
>
30.44 s
> thread 'cff::generation::tests_cff::thermal_ring' (1291) panicked at /nix/store/l5xazfnr7k6r6p8mlkn38x2afab0rygz-vendor-cargo-deps/5929dab090e556a579e9f3b708cd2e67c60b3d84a12b5a276f2a36cb00473133/symbolica-2.2.0/src/evaluate/evaluator.rs:295:21:
30.44 s
> External function 'symbolica_coth' does not have an implementation for gammalooprs::utils::F<f64>
30.44 s
> stack backtrace:
30.44 s
> 0: __rustc::rust_begin_unwind
30.44 s
> 1: core::panicking::panic_fmt
30.44 s
> 2: <symbolica::evaluate::evaluator::ExpressionEvaluator<gammalooprs::utils::F<f64>>>::evaluate_impl_no_ops
30.44 s
> 3: <symbolica::evaluate::evaluator::ExpressionEvaluator<gammalooprs::utils::F<f64>>>::evaluate_single
30.44 s
> 4: gammalooprs::cff::generation::tests_cff::thermal_ring
30.44 s
> 5: <gammalooprs::cff::generation::tests_cff::thermal_ring::{closure#0} as core::ops::function::FnOnce<()>>::call_once
30.44 s
> note: Some details are omitted, run with `RUST_BACKTRACE=full` for a verbose backtrace.
30.44 s
>
30.44 s
> FAIL [ 0.111s] ( 83/483) gammalooprs cff::generation::tests_cff :: thermal_mercedes
30.44 s
> stdout ---
30.44 s
>
30.44 s
> running 1 test
30.44 s
> test cff::generation::tests_cff::thermal_mercedes ... FAILED
30.44 s
>
30.44 s
> failures:
30.44 s
>
30.44 s
> failures:
30.44 s
> cff::generation::tests_cff::thermal_mercedes
30.44 s
>
30.44 s
> test result: FAILED. 0 passed; 1 failed; 0 ignored; 0 measured; 535 filtered out; finished in 0.10s
30.44 s
>
30.44 s
> stderr ---
30.44 s
>
30.44 s
> thread 'cff::generation::tests_cff::thermal_mercedes' (1276) panicked at /nix/store/l5xazfnr7k6r6p8mlkn38x2afab0rygz-vendor-cargo-deps/5929dab090e556a579e9f3b708cd2e67c60b3d84a12b5a276f2a36cb00473133/symbolica-2.2.0/src/evaluate/evaluator.rs:295:21:
30.44 s
> External function 'symbolica_coth' does not have an implementation for gammalooprs::utils::F<f64>
30.44 s
> stack backtrace:
30.44 s
> 0: __rustc::rust_begin_unwind
30.44 s
> 1: core::panicking::panic_fmt
30.44 s
> 2: <symbolica::evaluate::evaluator::ExpressionEvaluator<gammalooprs::utils::F<f64>>>::evaluate_impl_no_ops
30.44 s
> 3: <symbolica::evaluate::evaluator::ExpressionEvaluator<gammalooprs::utils::F<f64>>>::evaluate_single
30.44 s
> 4: gammalooprs::cff::generation::tests_cff::thermal_mercedes
30.44 s
> 5: <gammalooprs::cff::generation::tests_cff::thermal_mercedes::{closure#0} as core::ops::function::FnOnce<()>>::call_once
30.44 s
> note: Some details are omitted, run with `RUST_BACKTRACE=full` for a verbose backtrace.
30.44 s
>
30.44 s
> FAIL [ 0.454s] (270/483) gammalooprs graph::feynman_graph::tests :: native_thermal_distributions
30.44 s
> stdout ---
30.44 s
>
30.44 s
> running 1 test
30.44 s
> test graph::feynman_graph::tests::native_thermal_distributions ... FAILED
30.44 s
>
30.44 s
> failures:
30.44 s
>
30.44 s
> failures:
30.44 s
> graph::feynman_graph::tests::native_thermal_distributions
30.44 s
>
30.44 s
> test result: FAILED. 0 passed; 1 failed; 0 ignored; 0 measured; 535 filtered out; finished in 0.44s
30.44 s
>
30.44 s
> stderr ---
30.44 s
> The application panicked (crashed).
30.44 s
> Message: called `Result::unwrap()` on an `Err` value: Custom { kind: Other, error: "Could not compile code: g++ -shared -O3 -fPIC -ffast-math -funsafe-math-optimizations -march=native -o /build/gammaloop-native-thermal-1345/thermal_0_0.so /build/gammaloop-native-thermal-1345/thermal_0_0.cpp\nwarning: Skipping impure flag -march=native because NIX_ENFORCE_NO_NATIVE is set\n/build/gammaloop-native-thermal-1345/thermal_0_0.cpp: In function 'void thermal_realf64(const double*, double*, double*)':\n/build/gammaloop-native-thermal-1345/thermal_0_0.cpp:27:16: error: 'symbolica_tanh' was not declared in this scope\n 27 | Z[6] = symbolica_tanh(Z[6]);\n | ^~~~~~~~~~~~~~\n" }
30.44 s
> Location: crates/gammalooprs/src/graph/feynman_graph.rs :937
30.44 s
>
30.44 s
> ━━━━━━━━━━━━━━━━━━━━━━━━━━━━━━━━━━ BACKTRACE ━━━━━━━━━━━━━━━━━━━━━━━━━━━━━━━━━━━
30.44 s
> 1: <color_eyre[b0c9e66060e883b2]::config::PanicHook>::panic_report <unknown>
30.44 s
> at <unknown source file> :<unknown line>
30.44 s
> 2: <color_eyre[b0c9e66060e883b2]::config::PanicHook>::into_panic_hook::{closure#0} <unknown>
30.44 s
> at <unknown source file> :<unknown line>
30.44 s
> 3: std[bcb96dfbba0ab899]::panicking::panic_with_hook <unknown>
30.44 s
> at <unknown source file> :<unknown line>
30.44 s
> 4: std[bcb96dfbba0ab899]::panicking::panic_handler::{closure#0} <unknown>
30.44 s
> at <unknown source file> :<unknown line>
30.44 s
> 5: std[bcb96dfbba0ab899]::sys::backtrace::__rust_end_short_backtrace::<std[bcb96dfbba0ab899]::panicking::panic_handler::{closure#0}, !> <unknown>
30.44 s
> at <unknown source file> :<unknown line>
30.44 s
> 6: __rustc[6c289b9f9c454d21]::rust_begin_unwind <unknown>
30.44 s
> at <unknown source file> :<unknown line>
30.44 s
> 7: core[940e698046960fd5]::panicking::panic_fmt <unknown>
30.44 s
> at <unknown source file> :<unknown line>
30.44 s
> 8: core[940e698046960fd5]::result::unwrap_failed <unknown>
30.44 s
> at <unknown source file> :<unknown line>
30.44 s
> 9: gammalooprs[f21b74aec46f5289]::graph::feynman_graph::tests::native_thermal_distributions <unknown>
30.44 s
> at <unknown source file> :<unknown line>
30.44 s
> 10: <gammalooprs[f21b74aec46f5289]::graph::feynman_graph::tests::native_thermal_distributions::{closure#0} as core[940e698046960fd5]::ops::function::FnOnce<()>>::call_once <unknown>
30.44 s
> at <unknown source file> :<unknown line>
30.44 s
> 11: test[75d6903177b1d7e9]::__rust_begin_short_backtrace::<core[940e698046960fd5]::result::Result<(), alloc[2ea6bcb46fca0c42]::string::String>, fn() -> core[940e698046960fd5]::result::Result<(), alloc[2ea6bcb46fca0c42]::string::String>> <unknown>
30.44 s
> at <unknown source file> :<unknown line>
30.44 s
> 12: test[75d6903177b1d7e9]::run_test::{closure#0} <unknown>
30.44 s
> at <unknown source file> :<unknown line>
30.44 s
> 13: std[bcb96dfbba0ab899]::sys::backtrace::__rust_begin_short_backtrace::<test[75d6903177b1d7e9]::run_test::{closure#1}, ()> <unknown>
30.44 s
> at <unknown source file> :<unknown line>
30.44 s
> 14: <std[bcb96dfbba0ab899]::thread::lifecycle::spawn_unchecked<test[75d6903177b1d7e9]::run_test::{closure#1}, ()>::{closure#1} as core[940e698046960fd5]::ops::function::FnOnce<()>>::call_once::{shim:vtable#0} <unknown>
30.44 s
> at <unknown source file> :<unknown line>
30.44 s
> 15: <std[bcb96dfbba0ab899]::sys::thread::unix::Thread>::new::thread_start <unknown>
30.44 s
> at <unknown source file> :<unknown line>
30.44 s
> 16: start_thread <unknown>
30.44 s
> at <unknown source file> :<unknown line>
30.44 s
> 17: __clone3 <unknown>
30.44 s
> at <unknown source file> :<unknown line>
30.44 s
>
30.44 s
> Run with COLORBT_SHOW_HIDDEN=1 environment variable to disable frame filtering.
30.44 s
> Run with RUST_BACKTRACE=full to include source snippets.
30.44 s
>
30.44 s
> FAIL [ 5.321s] (479/483) gammalooprs cff::generation::tests_cff :: thermal_bugblatter
30.44 s
> stdout ---
30.44 s
>
30.44 s
> running 1 test
30.44 s
> test cff::generation::tests_cff::thermal_bugblatter ... FAILED
30.44 s
>
30.44 s
> failures:
30.44 s
>
30.44 s
> failures:
30.44 s
> cff::generation::tests_cff::thermal_bugblatter
30.44 s
>
30.44 s
> test result: FAILED. 0 passed; 1 failed; 0 ignored; 0 measured; 535 filtered out; finished in 5.24s
30.44 s
>
30.44 s
> stderr ---
30.44 s
>
30.44 s
> thread 'cff::generation::tests_cff::thermal_bugblatter' (1274) panicked at /nix/store/l5xazfnr7k6r6p8mlkn38x2afab0rygz-vendor-cargo-deps/5929dab090e556a579e9f3b708cd2e67c60b3d84a12b5a276f2a36cb00473133/symbolica-2.2.0/src/evaluate/evaluator.rs:295:21:
30.44 s
> External function 'symbolica_coth' does not have an implementation for gammalooprs::utils::F<f64>
30.44 s
> stack backtrace:
30.44 s
> 0: __rustc::rust_begin_unwind
30.44 s
> 1: core::panicking::panic_fmt
30.44 s
> 2: <symbolica::evaluate::evaluator::ExpressionEvaluator<gammalooprs::utils::F<f64>>>::evaluate_impl_no_ops
30.44 s
> 3: <symbolica::evaluate::evaluator::ExpressionEvaluator<gammalooprs::utils::F<f64>>>::evaluate_single
30.44 s
> 4: gammalooprs::cff::generation::tests_cff::thermal_bugblatter
30.44 s
> 5: <gammalooprs::cff::generation::tests_cff::thermal_bugblatter::{closure#0} as core::ops::function::FnOnce<()>>::call_once
30.44 s
> note: Some details are omitted, run with `RUST_BACKTRACE=full` for a verbose backtrace.
30.44 s
>
30.44 s
> ------------
30.44 s
> Summary [ 8.041s] 483 tests run: 476 passed , 7 failed , 61 skipped
30.44 s
> FAIL [ 0.015s] ( 49/483) gammalooprs cff::generation::tests_cff :: thermal_eight
30.44 s
> stdout ---
30.44 s
>
30.44 s
> running 1 test
30.44 s
> test cff::generation::tests_cff::thermal_eight ... FAILED
30.44 s
>
30.44 s
> failures:
30.44 s
>
30.44 s
> failures:
30.44 s
> cff::generation::tests_cff::thermal_eight
30.44 s
>
30.44 s
> test result: FAILED. 0 passed; 1 failed; 0 ignored; 0 measured; 535 filtered out; finished in 0.01s
30.44 s
>
30.44 s
> stderr ---
30.44 s
>
30.44 s
> thread 'cff::generation::tests_cff::thermal_eight' (1282) panicked at /nix/store/l5xazfnr7k6r6p8mlkn38x2afab0rygz-vendor-cargo-deps/5929dab090e556a579e9f3b708cd2e67c60b3d84a12b5a276f2a36cb00473133/symbolica-2.2.0/src/evaluate/evaluator.rs:295:21:
30.44 s
> External function 'symbolica_coth' does not have an implementation for gammalooprs::utils::F<f64>
30.44 s
> stack backtrace:
30.44 s
> 0: __rustc::rust_begin_unwind
30.44 s
> 1: core::panicking::panic_fmt
30.44 s
> 2: <symbolica::evaluate::evaluator::ExpressionEvaluator<gammalooprs::utils::F<f64>>>::evaluate_impl_no_ops
30.44 s
> 3: <symbolica::evaluate::evaluator::ExpressionEvaluator<gammalooprs::utils::F<f64>>>::evaluate_single
30.44 s
> 4: gammalooprs::cff::generation::tests_cff::thermal_eight
30.44 s
> 5: <gammalooprs::cff::generation::tests_cff::thermal_eight::{closure#0} as core::ops::function::FnOnce<()>>::call_once
30.44 s
> note: Some details are omitted, run with `RUST_BACKTRACE=full` for a verbose backtrace.
30.44 s
>
30.44 s
> FAIL [ 0.018s] ( 51/483) gammalooprs cff::generation::tests_cff :: thermal_bubble_chain
30.44 s
> stdout ---
30.44 s
>
30.44 s
> running 1 test
30.44 s
> test cff::generation::tests_cff::thermal_bubble_chain ... FAILED
30.44 s
>
30.44 s
> failures:
30.44 s
>
30.44 s
> failures:
30.44 s
> cff::generation::tests_cff::thermal_bubble_chain
30.44 s
>
30.44 s
> test result: FAILED. 0 passed; 1 failed; 0 ignored; 0 measured; 535 filtered out; finished in 0.01s
30.44 s
>
30.44 s
> stderr ---
30.44 s
>
30.44 s
> thread 'cff::generation::tests_cff::thermal_bubble_chain' (1273) panicked at /nix/store/l5xazfnr7k6r6p8mlkn38x2afab0rygz-vendor-cargo-deps/5929dab090e556a579e9f3b708cd2e67c60b3d84a12b5a276f2a36cb00473133/symbolica-2.2.0/src/evaluate/evaluator.rs:295:21:
30.44 s
> External function 'symbolica_coth' does not have an implementation for gammalooprs::utils::F<f64>
30.44 s
> stack backtrace:
30.44 s
> 0: __rustc::rust_begin_unwind
30.44 s
> 1: core::panicking::panic_fmt
30.44 s
> 2: <symbolica::evaluate::evaluator::ExpressionEvaluator<gammalooprs::utils::F<f64>>>::evaluate_impl_no_ops
30.44 s
> 3: <symbolica::evaluate::evaluator::ExpressionEvaluator<gammalooprs::utils::F<f64>>>::evaluate_single
30.44 s
> 4: gammalooprs::cff::generation::tests_cff::thermal_bubble_chain
30.44 s
> 5: <gammalooprs::cff::generation::tests_cff::thermal_bubble_chain::{closure#0} as core::ops::function::FnOnce<()>>::call_once
30.44 s
> note: Some details are omitted, run with `RUST_BACKTRACE=full` for a verbose backtrace.
30.44 s
>
30.44 s
> FAIL [ 0.021s] ( 58/483) gammalooprs cff::generation::tests_cff :: thermal_bubble
30.44 s
> stdout ---
30.44 s
>
30.44 s
> running 1 test
30.44 s
> test cff::generation::tests_cff::thermal_bubble ... FAILED
30.44 s
>
30.44 s
> failures:
30.44 s
>
30.44 s
> failures:
30.44 s
> cff::generation::tests_cff::thermal_bubble
30.44 s
>
30.44 s
> test result: FAILED. 0 passed; 1 failed; 0 ignored; 0 measured; 535 filtered out; finished in 0.01s
30.44 s
>
30.44 s
> stderr ---
30.44 s
>
30.44 s
> thread 'cff::generation::tests_cff::thermal_bubble' (1280) panicked at /nix/store/l5xazfnr7k6r6p8mlkn38x2afab0rygz-vendor-cargo-deps/5929dab090e556a579e9f3b708cd2e67c60b3d84a12b5a276f2a36cb00473133/symbolica-2.2.0/src/evaluate/evaluator.rs:295:21:
30.44 s
> External function 'symbolica_coth' does not have an implementation for gammalooprs::utils::F<f64>
30.44 s
> stack backtrace:
30.44 s
> 0: __rustc::rust_begin_unwind
30.44 s
> 1: core::panicking::panic_fmt
30.44 s
> 2: <symbolica::evaluate::evaluator::ExpressionEvaluator<gammalooprs::utils::F<f64>>>::evaluate_impl_no_ops
30.44 s
> 3: <symbolica::evaluate::evaluator::ExpressionEvaluator<gammalooprs::utils::F<f64>>>::evaluate_single
30.44 s
> 4: gammalooprs::cff::generation::tests_cff::thermal_bubble
30.44 s
> 5: <gammalooprs::cff::generation::tests_cff::thermal_bubble::{closure#0} as core::ops::function::FnOnce<()>>::call_once
30.44 s
> note: Some details are omitted, run with `RUST_BACKTRACE=full` for a verbose backtrace.
30.44 s
>
30.44 s
> FAIL [ 0.068s] ( 76/483) gammalooprs cff::generation::tests_cff :: thermal_ring
30.44 s
> stdout ---
30.44 s
>
30.44 s
> running 1 test
30.44 s
> test cff::generation::tests_cff::thermal_ring ... FAILED
30.44 s
>
30.44 s
> failures:
30.44 s
>
30.44 s
> failures:
30.44 s
> cff::generation::tests_cff::thermal_ring
30.44 s
>
30.44 s
> test result: FAILED. 0 passed; 1 failed; 0 ignored; 0 measured; 535 filtered out; finished in 0.06s
30.44 s
>
30.44 s
> stderr ---
30.44 s
>
30.44 s
> thread 'cff::generation::tests_cff::thermal_ring' (1291) panicked at /nix/store/l5xazfnr7k6r6p8mlkn38x2afab0rygz-vendor-cargo-deps/5929dab090e556a579e9f3b708cd2e67c60b3d84a12b5a276f2a36cb00473133/symbolica-2.2.0/src/evaluate/evaluator.rs:295:21:
30.44 s
> External function 'symbolica_coth' does not have an implementation for gammalooprs::utils::F<f64>
30.44 s
> stack backtrace:
30.44 s
> 0: __rustc::rust_begin_unwind
30.44 s
> 1: core::panicking::panic_fmt
30.44 s
> 2: <symbolica::evaluate::evaluator::ExpressionEvaluator<gammalooprs::utils::F<f64>>>::evaluate_impl_no_ops
30.44 s
> 3: <symbolica::evaluate::evaluator::ExpressionEvaluator<gammalooprs::utils::F<f64>>>::evaluate_single
30.44 s
> 4: gammalooprs::cff::generation::tests_cff::thermal_ring
30.44 s
> 5: <gammalooprs::cff::generation::tests_cff::thermal_ring::{closure#0} as core::ops::function::FnOnce<()>>::call_once
30.44 s
> note: Some details are omitted, run with `RUST_BACKTRACE=full` for a verbose backtrace.
30.44 s
>
30.44 s
> FAIL [ 0.111s] ( 83/483) gammalooprs cff::generation::tests_cff :: thermal_mercedes
30.44 s
> stdout ---
30.44 s
>
30.44 s
> running 1 test
30.44 s
> test cff::generation::tests_cff::thermal_mercedes ... FAILED
30.44 s
>
30.44 s
> failures:
30.44 s
>
30.44 s
> failures:
30.44 s
> cff::generation::tests_cff::thermal_mercedes
30.44 s
>
30.44 s
> test result: FAILED. 0 passed; 1 failed; 0 ignored; 0 measured; 535 filtered out; finished in 0.10s
30.44 s
>
30.44 s
> stderr ---
30.44 s
>
30.44 s
> thread 'cff::generation::tests_cff::thermal_mercedes' (1276) panicked at /nix/store/l5xazfnr7k6r6p8mlkn38x2afab0rygz-vendor-cargo-deps/5929dab090e556a579e9f3b708cd2e67c60b3d84a12b5a276f2a36cb00473133/symbolica-2.2.0/src/evaluate/evaluator.rs:295:21:
30.44 s
> External function 'symbolica_coth' does not have an implementation for gammalooprs::utils::F<f64>
30.44 s
> stack backtrace:
30.44 s
> 0: __rustc::rust_begin_unwind
30.44 s
> 1: core::panicking::panic_fmt
30.44 s
> 2: <symbolica::evaluate::evaluator::ExpressionEvaluator<gammalooprs::utils::F<f64>>>::evaluate_impl_no_ops
30.44 s
> 3: <symbolica::evaluate::evaluator::ExpressionEvaluator<gammalooprs::utils::F<f64>>>::evaluate_single
30.44 s
> 4: gammalooprs::cff::generation::tests_cff::thermal_mercedes
30.44 s
> 5: <gammalooprs::cff::generation::tests_cff::thermal_mercedes::{closure#0} as core::ops::function::FnOnce<()>>::call_once
30.44 s
> note: Some details are omitted, run with `RUST_BACKTRACE=full` for a verbose backtrace.
30.44 s
>
30.44 s
> FAIL [ 0.454s] (270/483) gammalooprs graph::feynman_graph::tests :: native_thermal_distributions
30.44 s
> stdout ---
30.44 s
>
30.44 s
> running 1 test
30.44 s
> test graph::feynman_graph::tests::native_thermal_distributions ... FAILED
30.44 s
>
30.44 s
> failures:
30.44 s
>
30.44 s
> failures:
30.44 s
> graph::feynman_graph::tests::native_thermal_distributions
30.44 s
>
30.44 s
> test result: FAILED. 0 passed; 1 failed; 0 ignored; 0 measured; 535 filtered out; finished in 0.44s
30.44 s
>
30.44 s
> stderr ---
30.44 s
> The application panicked (crashed).
30.44 s
> Message: called `Result::unwrap()` on an `Err` value: Custom { kind: Other, error: "Could not compile code: g++ -shared -O3 -fPIC -ffast-math -funsafe-math-optimizations -march=native -o /build/gammaloop-native-thermal-1345/thermal_0_0.so /build/gammaloop-native-thermal-1345/thermal_0_0.cpp\nwarning: Skipping impure flag -march=native because NIX_ENFORCE_NO_NATIVE is set\n/build/gammaloop-native-thermal-1345/thermal_0_0.cpp: In function 'void thermal_realf64(const double*, double*, double*)':\n/build/gammaloop-native-thermal-1345/thermal_0_0.cpp:27:16: error: 'symbolica_tanh' was not declared in this scope\n 27 | Z[6] = symbolica_tanh(Z[6]);\n | ^~~~~~~~~~~~~~\n" }
30.44 s
> Location: crates/gammalooprs/src/graph/feynman_graph.rs :937
30.44 s
>
30.44 s
> ━━━━━━━━━━━━━━━━━━━━━━━━━━━━━━━━━━ BACKTRACE ━━━━━━━━━━━━━━━━━━━━━━━━━━━━━━━━━━━
30.44 s
> 1: <color_eyre[b0c9e66060e883b2]::config::PanicHook>::panic_report <unknown>
30.44 s
> at <unknown source file> :<unknown line>
30.44 s
> 2: <color_eyre[b0c9e66060e883b2]::config::PanicHook>::into_panic_hook::{closure#0} <unknown>
30.44 s
> at <unknown source file> :<unknown line>
30.44 s
> 3: std[bcb96dfbba0ab899]::panicking::panic_with_hook <unknown>
30.44 s
> at <unknown source file> :<unknown line>
30.44 s
> 4: std[bcb96dfbba0ab899]::panicking::panic_handler::{closure#0} <unknown>
30.44 s
> at <unknown source file> :<unknown line>
30.44 s
> 5: std[bcb96dfbba0ab899]::sys::backtrace::__rust_end_short_backtrace::<std[bcb96dfbba0ab899]::panicking::panic_handler::{closure#0}, !> <unknown>
30.44 s
> at <unknown source file> :<unknown line>
30.44 s
> 6: __rustc[6c289b9f9c454d21]::rust_begin_unwind <unknown>
30.44 s
> at <unknown source file> :<unknown line>
30.44 s
> 7: core[940e698046960fd5]::panicking::panic_fmt <unknown>
30.44 s
> at <unknown source file> :<unknown line>
30.44 s
> 8: core[940e698046960fd5]::result::unwrap_failed <unknown>
30.44 s
> at <unknown source file> :<unknown line>
30.44 s
> 9: gammalooprs[f21b74aec46f5289]::graph::feynman_graph::tests::native_thermal_distributions <unknown>
30.44 s
> at <unknown source file> :<unknown line>
30.44 s
> 10: <gammalooprs[f21b74aec46f5289]::graph::feynman_graph::tests::native_thermal_distributions::{closure#0} as core[940e698046960fd5]::ops::function::FnOnce<()>>::call_once <unknown>
30.44 s
> at <unknown source file> :<unknown line>
30.44 s
> 11: test[75d6903177b1d7e9]::__rust_begin_short_backtrace::<core[940e698046960fd5]::result::Result<(), alloc[2ea6bcb46fca0c42]::string::String>, fn() -> core[940e698046960fd5]::result::Result<(), alloc[2ea6bcb46fca0c42]::string::String>> <unknown>
30.44 s
> at <unknown source file> :<unknown line>
30.44 s
> 12: test[75d6903177b1d7e9]::run_test::{closure#0} <unknown>
30.44 s
> at <unknown source file> :<unknown line>
30.44 s
> 13: std[bcb96dfbba0ab899]::sys::backtrace::__rust_begin_short_backtrace::<test[75d6903177b1d7e9]::run_test::{closure#1}, ()> <unknown>
30.44 s
> at <unknown source file> :<unknown line>
30.44 s
> 14: <std[bcb96dfbba0ab899]::thread::lifecycle::spawn_unchecked<test[75d6903177b1d7e9]::run_test::{closure#1}, ()>::{closure#1} as core[940e698046960fd5]::ops::function::FnOnce<()>>::call_once::{shim:vtable#0} <unknown>
30.44 s
> at <unknown source file> :<unknown line>
30.44 s
> 15: <std[bcb96dfbba0ab899]::sys::thread::unix::Thread>::new::thread_start <unknown>
30.44 s
> at <unknown source file> :<unknown line>
30.44 s
> 16: start_thread <unknown>
30.44 s
> at <unknown source file> :<unknown line>
30.44 s
> 17: __clone3 <unknown>
30.44 s
> at <unknown source file> :<unknown line>
30.44 s
>
30.44 s
> Run with COLORBT_SHOW_HIDDEN=1 environment variable to disable frame filtering.
30.44 s
> Run with RUST_BACKTRACE=full to include source snippets.
30.44 s
>
30.44 s
> FAIL [ 5.321s] (479/483) gammalooprs cff::generation::tests_cff :: thermal_bugblatter
30.44 s
> stdout ---
30.44 s
>
30.44 s
> running 1 test
30.44 s
> test cff::generation::tests_cff::thermal_bugblatter ... FAILED
30.44 s
>
30.44 s
> failures:
30.44 s
>
30.44 s
> failures:
30.44 s
> cff::generation::tests_cff::thermal_bugblatter
30.44 s
>
30.44 s
> test result: FAILED. 0 passed; 1 failed; 0 ignored; 0 measured; 535 filtered out; finished in 5.24s
30.44 s
>
30.44 s
> stderr ---
30.44 s
>
30.44 s
> thread 'cff::generation::tests_cff::thermal_bugblatter' (1274) panicked at /nix/store/l5xazfnr7k6r6p8mlkn38x2afab0rygz-vendor-cargo-deps/5929dab090e556a579e9f3b708cd2e67c60b3d84a12b5a276f2a36cb00473133/symbolica-2.2.0/src/evaluate/evaluator.rs:295:21:
30.44 s
> External function 'symbolica_coth' does not have an implementation for gammalooprs::utils::F<f64>
30.44 s
> stack backtrace:
30.44 s
> 0: __rustc::rust_begin_unwind
30.44 s
> 1: core::panicking::panic_fmt
30.44 s
> 2: <symbolica::evaluate::evaluator::ExpressionEvaluator<gammalooprs::utils::F<f64>>>::evaluate_impl_no_ops
30.44 s
> 3: <symbolica::evaluate::evaluator::ExpressionEvaluator<gammalooprs::utils::F<f64>>>::evaluate_single
30.44 s
> 4: gammalooprs::cff::generation::tests_cff::thermal_bugblatter
30.44 s
> 5: <gammalooprs::cff::generation::tests_cff::thermal_bugblatter::{closure#0} as core::ops::function::FnOnce<()>>::call_once
30.44 s
> note: Some details are omitted, run with `RUST_BACKTRACE=full` for a verbose backtrace.
30.44 s
>
30.44 s
> error : test run failed
30.44 s
>
30.44 s
> ========== nextest test summary ==========
30.44 s
> report: target/nextest/ci_gammaloop/junit.xml
30.44 s
> tests: 483, failures: 7, errors: 0
30.44 s
>
30.44 s
> 1. gammalooprs::cff::generation::tests_cff::thermal_eight
30.44 s
> failure: test failure with exit code 101
30.44 s
> thread 'cff::generation::tests_cff::thermal_eight' (1282) panicked at /nix/store/l5xazfnr7k6r6p8mlkn38x2afab0rygz-vendor-cargo-deps/5929dab090e556a579e9f3b708cd2e67c60b3d84a12b5a276f2a36cb00473133/symbolica-2.2.0/src/evaluate/evaluator.rs:295:21:
30.44 s
> External function 'symbolica_coth' does not have an implementation for gammalooprs::utils::F<f64>
30.44 s
> stack backtrace:
30.44 s
> 0: __rustc::rust_begin_unwind
30.44 s
> 1: core::panicking::panic_fmt
30.44 s
> 2: <symbolica::evaluate::evaluator::ExpressionEvaluator<gammalooprs::utils::F<f64>>>::evaluate_impl_no_ops
30.44 s
> 3: <symbolica::evaluate::evaluator::ExpressionEvaluator<gammalooprs::utils::F<f64>>>::evaluate_single
30.44 s
> 4: gammalooprs::cff::generation::tests_cff::thermal_eight
30.44 s
> 5: <gammalooprs::cff::generation::tests_cff::thermal_eight::{closure#0} as core::ops::function::FnOnce<()>>::call_once
30.44 s
> note: Some details are omitted, run with `RUST_BACKTRACE=full` for a verbose backtrace.
30.44 s
> system-out
30.44 s
> running 1 test
30.44 s
> test cff::generation::tests_cff::thermal_eight ... FAILED
30.44 s
>
30.44 s
> failures:
30.44 s
>
30.44 s
> failures:
30.44 s
> cff::generation::tests_cff::thermal_eight
30.44 s
>
30.44 s
> test result: FAILED. 0 passed; 1 failed; 0 ignored; 0 measured; 535 filtered out; finished in 0.01s
30.44 s
> system-err
30.44 s
> thread 'cff::generation::tests_cff::thermal_eight' (1282) panicked at /nix/store/l5xazfnr7k6r6p8mlkn38x2afab0rygz-vendor-cargo-deps/5929dab090e556a579e9f3b708cd2e67c60b3d84a12b5a276f2a36cb00473133/symbolica-2.2.0/src/evaluate/evaluator.rs:295:21:
30.44 s
> External function 'symbolica_coth' does not have an implementation for gammalooprs::utils::F<f64>
30.44 s
> stack backtrace:
30.44 s
> 0: __rustc::rust_begin_unwind
30.44 s
> 1: core::panicking::panic_fmt
30.44 s
> 2: <symbolica::evaluate::evaluator::ExpressionEvaluator<gammalooprs::utils::F<f64>>>::evaluate_impl_no_ops
30.44 s
> 3: <symbolica::evaluate::evaluator::ExpressionEvaluator<gammalooprs::utils::F<f64>>>::evaluate_single
30.44 s
> 4: gammalooprs::cff::generation::tests_cff::thermal_eight
30.44 s
> 5: <gammalooprs::cff::generation::tests_cff::thermal_eight::{closure#0} as core::ops::function::FnOnce<()>>::call_once
30.44 s
> note: Some details are omitted, run with `RUST_BACKTRACE=full` for a verbose backtrace.
30.44 s
>
30.44 s
> 2. gammalooprs::cff::generation::tests_cff::thermal_bubble_chain
30.44 s
> failure: test failure with exit code 101
30.44 s
> thread 'cff::generation::tests_cff::thermal_bubble_chain' (1273) panicked at /nix/store/l5xazfnr7k6r6p8mlkn38x2afab0rygz-vendor-cargo-deps/5929dab090e556a579e9f3b708cd2e67c60b3d84a12b5a276f2a36cb00473133/symbolica-2.2.0/src/evaluate/evaluator.rs:295:21:
30.44 s
> External function 'symbolica_coth' does not have an implementation for gammalooprs::utils::F<f64>
30.44 s
> stack backtrace:
30.44 s
> 0: __rustc::rust_begin_unwind
30.44 s
> 1: core::panicking::panic_fmt
30.44 s
> 2: <symbolica::evaluate::evaluator::ExpressionEvaluator<gammalooprs::utils::F<f64>>>::evaluate_impl_no_ops
30.44 s
> 3: <symbolica::evaluate::evaluator::ExpressionEvaluator<gammalooprs::utils::F<f64>>>::evaluate_single
30.44 s
> 4: gammalooprs::cff::generation::tests_cff::thermal_bubble_chain
30.44 s
> 5: <gammalooprs::cff::generation::tests_cff::thermal_bubble_chain::{closure#0} as core::ops::function::FnOnce<()>>::call_once
30.44 s
> note: Some details are omitted, run with `RUST_BACKTRACE=full` for a verbose backtrace.
30.44 s
> system-out
30.44 s
> running 1 test
30.44 s
> test cff::generation::tests_cff::thermal_bubble_chain ... FAILED
30.44 s
>
30.44 s
> failures:
30.44 s
>
30.44 s
> failures:
30.44 s
> cff::generation::tests_cff::thermal_bubble_chain
30.44 s
>
30.44 s
> test result: FAILED. 0 passed; 1 failed; 0 ignored; 0 measured; 535 filtered out; finished in 0.01s
30.44 s
> system-err
30.44 s
> thread 'cff::generation::tests_cff::thermal_bubble_chain' (1273) panicked at /nix/store/l5xazfnr7k6r6p8mlkn38x2afab0rygz-vendor-cargo-deps/5929dab090e556a579e9f3b708cd2e67c60b3d84a12b5a276f2a36cb00473133/symbolica-2.2.0/src/evaluate/evaluator.rs:295:21:
30.44 s
> External function 'symbolica_coth' does not have an implementation for gammalooprs::utils::F<f64>
30.44 s
> stack backtrace:
30.44 s
> 0: __rustc::rust_begin_unwind
30.44 s
> 1: core::panicking::panic_fmt
30.44 s
> 2: <symbolica::evaluate::evaluator::ExpressionEvaluator<gammalooprs::utils::F<f64>>>::evaluate_impl_no_ops
30.44 s
> 3: <symbolica::evaluate::evaluator::ExpressionEvaluator<gammalooprs::utils::F<f64>>>::evaluate_single
30.44 s
> 4: gammalooprs::cff::generation::tests_cff::thermal_bubble_chain
30.44 s
> 5: <gammalooprs::cff::generation::tests_cff::thermal_bubble_chain::{closure#0} as core::ops::function::FnOnce<()>>::call_once
30.44 s
> note: Some details are omitted, run with `RUST_BACKTRACE=full` for a verbose backtrace.
30.44 s
>
30.44 s
> 3. gammalooprs::cff::generation::tests_cff::thermal_bubble
30.44 s
> failure: test failure with exit code 101
30.44 s
> thread 'cff::generation::tests_cff::thermal_bubble' (1280) panicked at /nix/store/l5xazfnr7k6r6p8mlkn38x2afab0rygz-vendor-cargo-deps/5929dab090e556a579e9f3b708cd2e67c60b3d84a12b5a276f2a36cb00473133/symbolica-2.2.0/src/evaluate/evaluator.rs:295:21:
30.44 s
> External function 'symbolica_coth' does not have an implementation for gammalooprs::utils::F<f64>
30.44 s
> stack backtrace:
30.44 s
> 0: __rustc::rust_begin_unwind
30.44 s
> 1: core::panicking::panic_fmt
30.44 s
> 2: <symbolica::evaluate::evaluator::ExpressionEvaluator<gammalooprs::utils::F<f64>>>::evaluate_impl_no_ops
30.44 s
> 3: <symbolica::evaluate::evaluator::ExpressionEvaluator<gammalooprs::utils::F<f64>>>::evaluate_single
30.44 s
> 4: gammalooprs::cff::generation::tests_cff::thermal_bubble
30.44 s
> 5: <gammalooprs::cff::generation::tests_cff::thermal_bubble::{closure#0} as core::ops::function::FnOnce<()>>::call_once
30.44 s
> note: Some details are omitted, run with `RUST_BACKTRACE=full` for a verbose backtrace.
30.44 s
> system-out
30.44 s
> running 1 test
30.44 s
> test cff::generation::tests_cff::thermal_bubble ... FAILED
30.44 s
>
30.44 s
> failures:
30.44 s
>
30.44 s
> failures:
30.44 s
> cff::generation::tests_cff::thermal_bubble
30.44 s
>
30.44 s
> test result: FAILED. 0 passed; 1 failed; 0 ignored; 0 measured; 535 filtered out; finished in 0.01s
30.44 s
> system-err
30.44 s
> thread 'cff::generation::tests_cff::thermal_bubble' (1280) panicked at /nix/store/l5xazfnr7k6r6p8mlkn38x2afab0rygz-vendor-cargo-deps/5929dab090e556a579e9f3b708cd2e67c60b3d84a12b5a276f2a36cb00473133/symbolica-2.2.0/src/evaluate/evaluator.rs:295:21:
30.44 s
> External function 'symbolica_coth' does not have an implementation for gammalooprs::utils::F<f64>
30.44 s
> stack backtrace:
30.44 s
> 0: __rustc::rust_begin_unwind
30.44 s
> 1: core::panicking::panic_fmt
30.44 s
> 2: <symbolica::evaluate::evaluator::ExpressionEvaluator<gammalooprs::utils::F<f64>>>::evaluate_impl_no_ops
30.44 s
> 3: <symbolica::evaluate::evaluator::ExpressionEvaluator<gammalooprs::utils::F<f64>>>::evaluate_single
30.44 s
> 4: gammalooprs::cff::generation::tests_cff::thermal_bubble
30.44 s
> 5: <gammalooprs::cff::generation::tests_cff::thermal_bubble::{closure#0} as core::ops::function::FnOnce<()>>::call_once
30.44 s
> note: Some details are omitted, run with `RUST_BACKTRACE=full` for a verbose backtrace.
30.44 s
>
30.44 s
> 4. gammalooprs::cff::generation::tests_cff::thermal_ring
30.44 s
> failure: test failure with exit code 101
30.44 s
> thread 'cff::generation::tests_cff::thermal_ring' (1291) panicked at /nix/store/l5xazfnr7k6r6p8mlkn38x2afab0rygz-vendor-cargo-deps/5929dab090e556a579e9f3b708cd2e67c60b3d84a12b5a276f2a36cb00473133/symbolica-2.2.0/src/evaluate/evaluator.rs:295:21:
30.44 s
> External function 'symbolica_coth' does not have an implementation for gammalooprs::utils::F<f64>
30.44 s
> stack backtrace:
30.44 s
> 0: __rustc::rust_begin_unwind
30.44 s
> 1: core::panicking::panic_fmt
30.44 s
> 2: <symbolica::evaluate::evaluator::ExpressionEvaluator<gammalooprs::utils::F<f64>>>::evaluate_impl_no_ops
30.44 s
> 3: <symbolica::evaluate::evaluator::ExpressionEvaluator<gammalooprs::utils::F<f64>>>::evaluate_single
30.44 s
> 4: gammalooprs::cff::generation::tests_cff::thermal_ring
30.44 s
> 5: <gammalooprs::cff::generation::tests_cff::thermal_ring::{closure#0} as core::ops::function::FnOnce<()>>::call_once
30.44 s
> note: Some details are omitted, run with `RUST_BACKTRACE=full` for a verbose backtrace.
30.44 s
> system-out
30.44 s
> running 1 test
30.44 s
> test cff::generation::tests_cff::thermal_ring ... FAILED
30.44 s
>
30.44 s
> failures:
30.44 s
>
30.44 s
> failures:
30.44 s
> cff::generation::tests_cff::thermal_ring
30.44 s
>
30.44 s
> test result: FAILED. 0 passed; 1 failed; 0 ignored; 0 measured; 535 filtered out; finished in 0.06s
30.44 s
> system-err
30.44 s
> thread 'cff::generation::tests_cff::thermal_ring' (1291) panicked at /nix/store/l5xazfnr7k6r6p8mlkn38x2afab0rygz-vendor-cargo-deps/5929dab090e556a579e9f3b708cd2e67c60b3d84a12b5a276f2a36cb00473133/symbolica-2.2.0/src/evaluate/evaluator.rs:295:21:
30.44 s
> External function 'symbolica_coth' does not have an implementation for gammalooprs::utils::F<f64>
30.44 s
> stack backtrace:
30.44 s
> 0: __rustc::rust_begin_unwind
30.44 s
> 1: core::panicking::panic_fmt
30.44 s
> 2: <symbolica::evaluate::evaluator::ExpressionEvaluator<gammalooprs::utils::F<f64>>>::evaluate_impl_no_ops
30.44 s
> 3: <symbolica::evaluate::evaluator::ExpressionEvaluator<gammalooprs::utils::F<f64>>>::evaluate_single
30.44 s
> 4: gammalooprs::cff::generation::tests_cff::thermal_ring
30.44 s
> 5: <gammalooprs::cff::generation::tests_cff::thermal_ring::{closure#0} as core::ops::function::FnOnce<()>>::call_once
30.44 s
> note: Some details are omitted, run with `RUST_BACKTRACE=full` for a verbose backtrace.
30.44 s
>
30.44 s
> 5. gammalooprs::cff::generation::tests_cff::thermal_mercedes
30.44 s
> failure: test failure with exit code 101
30.44 s
> thread 'cff::generation::tests_cff::thermal_mercedes' (1276) panicked at /nix/store/l5xazfnr7k6r6p8mlkn38x2afab0rygz-vendor-cargo-deps/5929dab090e556a579e9f3b708cd2e67c60b3d84a12b5a276f2a36cb00473133/symbolica-2.2.0/src/evaluate/evaluator.rs:295:21:
30.44 s
> External function 'symbolica_coth' does not have an implementation for gammalooprs::utils::F<f64>
30.44 s
> stack backtrace:
30.44 s
> 0: __rustc::rust_begin_unwind
30.44 s
> 1: core::panicking::panic_fmt
30.44 s
> 2: <symbolica::evaluate::evaluator::ExpressionEvaluator<gammalooprs::utils::F<f64>>>::evaluate_impl_no_ops
30.44 s
> 3: <symbolica::evaluate::evaluator::ExpressionEvaluator<gammalooprs::utils::F<f64>>>::evaluate_single
30.44 s
> 4: gammalooprs::cff::generation::tests_cff::thermal_mercedes
30.44 s
> 5: <gammalooprs::cff::generation::tests_cff::thermal_mercedes::{closure#0} as core::ops::function::FnOnce<()>>::call_once
30.44 s
> note: Some details are omitted, run with `RUST_BACKTRACE=full` for a verbose backtrace.
30.44 s
> system-out
30.44 s
> running 1 test
30.44 s
> test cff::generation::tests_cff::thermal_mercedes ... FAILED
30.44 s
>
30.44 s
> failures:
30.44 s
>
30.44 s
> failures:
30.44 s
> cff::generation::tests_cff::thermal_mercedes
30.44 s
>
30.44 s
> test result: FAILED. 0 passed; 1 failed; 0 ignored; 0 measured; 535 filtered out; finished in 0.10s
30.44 s
> system-err
30.44 s
> thread 'cff::generation::tests_cff::thermal_mercedes' (1276) panicked at /nix/store/l5xazfnr7k6r6p8mlkn38x2afab0rygz-vendor-cargo-deps/5929dab090e556a579e9f3b708cd2e67c60b3d84a12b5a276f2a36cb00473133/symbolica-2.2.0/src/evaluate/evaluator.rs:295:21:
30.44 s
> External function 'symbolica_coth' does not have an implementation for gammalooprs::utils::F<f64>
30.44 s
> stack backtrace:
30.44 s
> 0: __rustc::rust_begin_unwind
30.44 s
> 1: core::panicking::panic_fmt
30.44 s
> 2: <symbolica::evaluate::evaluator::ExpressionEvaluator<gammalooprs::utils::F<f64>>>::evaluate_impl_no_ops
30.44 s
> 3: <symbolica::evaluate::evaluator::ExpressionEvaluator<gammalooprs::utils::F<f64>>>::evaluate_single
30.44 s
> 4: gammalooprs::cff::generation::tests_cff::thermal_mercedes
30.44 s
> 5: <gammalooprs::cff::generation::tests_cff::thermal_mercedes::{closure#0} as core::ops::function::FnOnce<()>>::call_once
30.44 s
> note: Some details are omitted, run with `RUST_BACKTRACE=full` for a verbose backtrace.
30.44 s
>
30.44 s
> 6. gammalooprs::graph::feynman_graph::tests::native_thermal_distributions
30.44 s
> failure: test failure with exit code 101
30.44 s
> system-out
30.44 s
> running 1 test
30.44 s
> test graph::feynman_graph::tests::native_thermal_distributions ... FAILED
30.44 s
>
30.44 s
> failures:
30.44 s
>
30.44 s
> failures:
30.44 s
> graph::feynman_graph::tests::native_thermal_distributions
30.44 s
>
30.44 s
> test result: FAILED. 0 passed; 1 failed; 0 ignored; 0 measured; 535 filtered out; finished in 0.44s
30.44 s
> system-err
30.44 s
> The application panicked (crashed).
30.44 s
> Message: called `Result::unwrap()` on an `Err` value: Custom { kind: Other, error: "Could not compile code: g++ -shared -O3 -fPIC -ffast-math -funsafe-math-optimizations -march=native -o /build/gammaloop-native-thermal-1345/thermal_0_0.so /build/gammaloop-native-thermal-1345/thermal_0_0.cpp\nwarning: Skipping impure flag -march=native because NIX_ENFORCE_NO_NATIVE is set\n/build/gammaloop-native-thermal-1345/thermal_0_0.cpp: In function 'void thermal_realf64(const double*, double*, double*)':\n/build/gammaloop-native-thermal-1345/thermal_0_0.cpp:27:16: error: 'symbolica_tanh' was not declared in this scope\n 27 | Z[6] = symbolica_tanh(Z[6]);\n | ^~~~~~~~~~~~~~\n" }
30.44 s
> Location: crates/gammalooprs/src/graph/feynman_graph.rs:937
30.44 s
>
30.44 s
> ━━━━━━━━━━━━━━━━━━━━━━━━━━━━━━━━━━ BACKTRACE ━━━━━━━━━━━━━━━━━━━━━━━━━━━━━━━━━━━
30.44 s
> 1: <color_eyre[b0c9e66060e883b2]::config::PanicHook>::panic_report<unknown>
30.44 s
> at <unknown source file>:<unknown line>
30.44 s
> 2: <color_eyre[b0c9e66060e883b2]::config::PanicHook>::into_panic_hook::{closure#0}<unknown>
30.44 s
> at <unknown source file>:<unknown line>
30.44 s
> 3: std[bcb96dfbba0ab899]::panicking::panic_with_hook<unknown>
30.44 s
> at <unknown source file>:<unknown line>
30.44 s
> 4: std[bcb96dfbba0ab899]::panicking::panic_handler::{closure#0}<unknown>
30.44 s
> at <unknown source file>:<unknown line>
30.44 s
> 5: std[bcb96dfbba0ab899]::sys::backtrace::__rust_end_short_backtrace::<std[bcb96dfbba0ab899]::panicking::panic_handler::{closure#0}, !><unknown>
30.44 s
> at <unknown source file>:<unknown line>
30.44 s
> 6: __rustc[6c289b9f9c454d21]::rust_begin_unwind<unknown>
30.44 s
> at <unknown source file>:<unknown line>
30.44 s
> 7: core[940e698046960fd5]::panicking::panic_fmt<unknown>
30.44 s
> at <unknown source file>:<unknown line>
30.44 s
> 8: core[940e698046960fd5]::result::unwrap_failed<unknown>
30.44 s
> at <unknown source file>:<unknown line>
30.44 s
> 9: gammalooprs[f21b74aec46f5289]::graph::feynman_graph::tests::native_thermal_distributions<unknown>
30.44 s
> at <unknown source file>:<unknown line>
30.44 s
> 10: <gammalooprs[f21b74aec46f5289]::graph::feynman_graph::tests::native_thermal_distributions::{closure#0} as core[940e698046960fd5]::ops::function::FnOnce<()>>::call_once<unknown>
30.44 s
> at <unknown source file>:<unknown line>
30.44 s
> 11: test[75d6903177b1d7e9]::__rust_begin_short_backtrace::<core[940e698046960fd5]::result::Result<(), alloc[2ea6bcb46fca0c42]::string::String>, fn() -> core[940e698046960fd5]::result::Result<(), alloc[2ea6bcb46fca0c42]::string::String>><unknown>
30.44 s
> at <unknown source file>:<unknown line>
30.44 s
> 12: test[75d6903177b1d7e9]::run_test::{closure#0}<unknown>
30.44 s
> at <unknown source file>:<unknown line>
30.44 s
> 13: std[bcb96dfbba0ab899]::sys::backtrace::__rust_begin_short_backtrace::<test[75d6903177b1d7e9]::run_test::{closure#1}, ()><unknown>
30.44 s
> at <unknown source file>:<unknown line>
30.44 s
> 14: <std[bcb96dfbba0ab899]::thread::lifecycle::spawn_unchecked<test[75d6903177b1d7e9]::run_test::{closure#1}, ()>::{closure#1} as core[940e698046960fd5]::ops::function::FnOnce<()>>::call_once::{shim:vtable#0}<unknown>
30.44 s
> at <unknown source file>:<unknown line>
30.44 s
> 15: <std[bcb96dfbba0ab899]::sys::thread::unix::Thread>::new::thread_start<unknown>
30.44 s
> at <unknown source file>:<unknown line>
30.44 s
> 16: start_thread<unknown>
30.44 s
> at <unknown source file>:<unknown line>
30.44 s
> 17: __clone3<unknown>
30.44 s
> at <unknown source file>:<unknown line>
30.44 s
>
30.44 s
> Run with COLORBT_SHOW_HIDDEN=1 environment variable to disable frame filtering.
30.44 s
> Run with RUST_BACKTRACE=full to include source snippets.
30.44 s
>
30.44 s
> 7. gammalooprs::cff::generation::tests_cff::thermal_bugblatter
30.44 s
> failure: test failure with exit code 101
30.44 s
> thread 'cff::generation::tests_cff::thermal_bugblatter' (1274) panicked at /nix/store/l5xazfnr7k6r6p8mlkn38x2afab0rygz-vendor-cargo-deps/5929dab090e556a579e9f3b708cd2e67c60b3d84a12b5a276f2a36cb00473133/symbolica-2.2.0/src/evaluate/evaluator.rs:295:21:
30.44 s
> External function 'symbolica_coth' does not have an implementation for gammalooprs::utils::F<f64>
30.44 s
> stack backtrace:
30.44 s
> 0: __rustc::rust_begin_unwind
30.44 s
> 1: core::panicking::panic_fmt
30.44 s
> 2: <symbolica::evaluate::evaluator::ExpressionEvaluator<gammalooprs::utils::F<f64>>>::evaluate_impl_no_ops
30.44 s
> 3: <symbolica::evaluate::evaluator::ExpressionEvaluator<gammalooprs::utils::F<f64>>>::evaluate_single
30.44 s
> 4: gammalooprs::cff::generation::tests_cff::thermal_bugblatter
30.44 s
> 5: <gammalooprs::cff::generation::tests_cff::thermal_bugblatter::{closure#0} as core::ops::function::FnOnce<()>>::call_once
30.44 s
> note: Some details are omitted, run with `RUST_BACKTRACE=full` for a verbose backtrace.
30.44 s
> system-out
30.44 s
> running 1 test
30.44 s
> test cff::generation::tests_cff::thermal_bugblatter ... FAILED
30.44 s
>
30.44 s
> failures:
30.44 s
>
30.44 s
> failures:
30.44 s
> cff::generation::tests_cff::thermal_bugblatter
30.44 s
>
30.44 s
> test result: FAILED. 0 passed; 1 failed; 0 ignored; 0 measured; 535 filtered out; finished in 5.24s
30.44 s
> system-err
30.44 s
> thread 'cff::generation::tests_cff::thermal_bugblatter' (1274) panicked at /nix/store/l5xazfnr7k6r6p8mlkn38x2afab0rygz-vendor-cargo-deps/5929dab090e556a579e9f3b708cd2e67c60b3d84a12b5a276f2a36cb00473133/symbolica-2.2.0/src/evaluate/evaluator.rs:295:21:
30.44 s
> External function 'symbolica_coth' does not have an implementation for gammalooprs::utils::F<f64>
30.44 s
> stack backtrace:
30.44 s
> 0: __rustc::rust_begin_unwind
30.44 s
> 1: core::panicking::panic_fmt
30.44 s
> 2: <symbolica::evaluate::evaluator::ExpressionEvaluator<gammalooprs::utils::F<f64>>>::evaluate_impl_no_ops
30.44 s
> 3: <symbolica::evaluate::evaluator::ExpressionEvaluator<gammalooprs::utils::F<f64>>>::evaluate_single
30.44 s
> 4: gammalooprs::cff::generation::tests_cff::thermal_bugblatter
30.44 s
> 5: <gammalooprs::cff::generation::tests_cff::thermal_bugblatter::{closure#0} as core::ops::function::FnOnce<()>>::call_once
30.44 s
> note: Some details are omitted, run with `RUST_BACKTRACE=full` for a verbose backtrace.
30.44 s
> =========================================
30.44 s
For full logs, run:
30.44 s
nix log /nix/store/8r84j4srh5jz28101cd8xndlncp1i0gs-gammaloop-nextest-core.drv
30.54 s
[0 built (1 failed ), 0.0 Run failed.