test packages.x86_64-linux.nix-ci-check-gammaloop-nextest-core

Reproduce this run
Retry Run
  1. 0.01 s $ /nix/store/9ypz3flqsrl5xl495mm8h645gadjsxi1-coreutils-9.11/bin/timeout --kill-after=15s 7200s /nix/store/23zk8sgzamrbmj1fday15szf7f2279s8-nix-2.34.7/bin/nix --extra-experimental-features nix-command --extra-experimental-features flakes flake clone git+https://github.com/alphal00p/gammaloop --dest /tmp/nix-ci-worker/stable-pwd/repo/
  2. 0.18 s Cloning into '/tmp/nix-ci-worker/stable-pwd/repo'...
  3. 2.01 s remote: Enumerating objects: 78511, done.
  4. 2.24 s remote: Counting objects: 0% (1/8005) remote: Counting objects: 1% (81/8005) remote: Counting objects: 2% (161/8005) remote: Counting objects: 3% (241/8005) remote: Counting objects: 4% (321/8005) remote: Counting objects: 5% (401/8005) remote: Counting objects: 6% (481/8005) remote: Counting objects: 7% (561/8005) remote: Counting objects: 8% (641/8005) remote: Counting objects: 9% (721/8005) remote: Counting objects: 10% (801/8005) remote: Counting objects: 11% (881/8005) remote: Counting objects: 12% (961/8005) remote: Counting objects: 13% (1041/8005) remote: Counting objects: 14% (1121/8005) remote: Counting objects: 15% (1201/8005) remote: Counting objects: 16% (1281/8005) remote: Counting objects: 17% (1361/8005) remote: Counting objects: 18% (1441/8005) remote: Counting objects: 19% (1521/8005) remote: Counting objects: 20% (1601/8005) remote: Counting objects: 21% (1682/8005) remote: Counting objects: 22% (1762/8005) remote: Counting objects: 23% (1842/8005) remote: Counting objects: 24% (1922/8005) remote: Counting objects: 25% (2002/8005) remote: Counting objects: 26% (2082/8005) remote: Counting objects: 27% (2162/8005) remote: Counting objects: 28% (2242/8005) remote: Counting objects: 29% (2322/8005) remote: Counting objects: 30% (2402/8005) remote: Counting objects: 31% (2482/8005) remote: Counting objects: 32% (2562/8005) remote: Counting objects: 33% (2642/8005) remote: Counting objects: 34% (2722/8005) remote: Counting objects: 35% (2802/8005) remote: Counting objects: 36% (2882/8005) remote: Counting objects: 37% (2962/8005) remote: Counting objects: 38% (3042/8005) remote: Counting objects: 39% (3122/8005) remote: Counting objects: 40% (3202/8005) remote: Counting objects: 41% (3283/8005) remote: Counting objects: 42% (3363/8005) remote: Counting objects: 43% (3443/8005) remote: Counting objects: 44% (3523/8005) remote: Counting objects: 45% (3603/8005) remote: Counting objects: 46% (3683/8005) remote: Counting objects: 47% (3763/8005) remote: Counting objects: 48% (3843/8005) remote: Counting objects: 49% (3923/8005) remote: Counting objects: 50% (4003/8005) remote: Counting objects: 51% (4083/8005) remote: Counting objects: 52% (4163/8005) remote: Counting objects: 53% (4243/8005) remote: Counting objects: 54% (4323/8005) remote: Counting objects: 55% (4403/8005) remote: Counting objects: 56% (4483/8005) remote: Counting objects: 57% (4563/8005) remote: Counting objects: 58% (4643/8005) remote: Counting objects: 59% (4723/8005) remote: Counting objects: 60% (4803/8005) remote: Counting objects: 61% (4884/8005) remote: Counting objects: 62% (4964/8005) remote: Counting objects: 63% (5044/8005) remote: Counting objects: 64% (5124/8005) remote: Counting objects: 65% (5204/8005) remote: Counting objects: 66% (5284/8005) remote: Counting objects: 67% (5364/8005) remote: Counting objects: 68% (5444/8005) remote: Counting objects: 69% (5524/8005) remote: Counting objects: 70% (5604/8005) remote: Counting objects: 71% (5684/8005) remote: Counting objects: 72% (5764/8005) remote: Counting objects: 73% (5844/8005) remote: Counting objects: 74% (5924/8005) remote: Counting objects: 75% (6004/8005) remote: Counting objects: 76% (6084/8005) remote: Counting objects: 77% (6164/8005) remote: Counting objects: 78% (6244/8005) remote: Counting objects: 79% (6324/8005) remote: Counting objects: 80% (6404/8005) remote: Counting objects: 81% (6485/8005) remote: Counting objects: 82% (6565/8005) remote: Counting objects: 83% (6645/8005) remote: Counting objects: 84% (6725/8005) remote: Counting objects: 85% (6805/8005) remote: Counting objects: 86% (6885/8005) remote: Counting objects: 87% (6965/8005) remote: Counting objects: 88% (7045/8005) remote: Counting objects: 89% (7125/8005) remote: Counting objects: 90% (7205/8005) remote: Counting objects: 91% (7285/8005) remote: Counting objects: 92% (7365/8005) remote: Counting objects: 93% (7445/8005) remote: Counting objects: 94% (7525/8005) remote: Counting objects: 95% (7605/8005) remote: Counting objects: 96% (7685/8005) remote: Counting objects: 97% (7765/8005) remote: Counting objects: 98% (7845/8005) remote: Counting objects: 99% (7925/8005) remote: Counting objects: 100% (8005/8005) remote: Counting objects: 100% (8005/8005), done.
  5. 3.60 s remote: Compressing objects: 0% (1/1507) remote: Compressing objects: 1% (16/1507) remote: Compressing objects: 2% (31/1507) remote: Compressing objects: 3% (46/1507) remote: Compressing objects: 4% (61/1507) remote: Compressing objects: 5% (76/1507) remote: Compressing objects: 6% (91/1507) remote: Compressing objects: 7% (106/1507) remote: Compressing objects: 8% (121/1507) remote: Compressing objects: 9% (136/1507) remote: Compressing objects: 10% (151/1507) remote: Compressing objects: 11% (166/1507) remote: Compressing objects: 11% (170/1507) remote: Compressing objects: 12% (181/1507) remote: Compressing objects: 13% (196/1507) remote: Compressing objects: 14% (211/1507) remote: Compressing objects: 15% (227/1507) remote: Compressing objects: 16% (242/1507) remote: Compressing objects: 17% (257/1507) remote: Compressing objects: 18% (272/1507) remote: Compressing objects: 19% (287/1507) remote: Compressing objects: 20% (302/1507) remote: Compressing objects: 21% (317/1507) remote: Compressing objects: 22% (332/1507) remote: Compressing objects: 23% (347/1507) remote: Compressing objects: 24% (362/1507) remote: Compressing objects: 25% (377/1507) remote: Compressing objects: 26% (392/1507) remote: Compressing objects: 27% (407/1507) remote: Compressing objects: 28% (422/1507) remote: Compressing objects: 29% (438/1507) remote: Compressing objects: 30% (453/1507) remote: Compressing objects: 31% (468/1507) remote: Compressing objects: 32% (483/1507) remote: Compressing objects: 33% (498/1507) remote: Compressing objects: 34% (513/1507) remote: Compressing objects: 35% (528/1507) remote: Compressing objects: 36% (543/1507) remote: Compressing objects: 37% (558/1507) remote: Compressing objects: 38% (573/1507) remote: Compressing objects: 39% (588/1507) remote: Compressing objects: 40% (603/1507) remote: Compressing objects: 41% (618/1507) remote: Compressing objects: 42% (633/1507) remote: Compressing objects: 43% (649/1507) remote: Compressing objects: 44% (664/1507) remote: Compressing objects: 45% (679/1507) remote: Compressing objects: 46% (694/1507) remote: Compressing objects: 47% (709/1507) remote: Compressing objects: 48% (724/1507) remote: Compressing objects: 49% (739/1507) remote: Compressing objects: 50% (754/1507) remote: Compressing objects: 51% (769/1507) remote: Compressing objects: 52% (784/1507) remote: Compressing objects: 53% (799/1507) remote: Compressing objects: 54% (814/1507) remote: Compressing objects: 55% (829/1507) remote: Compressing objects: 56% (844/1507) remote: Compressing objects: 57% (859/1507) remote: Compressing objects: 58% (875/1507) remote: Compressing objects: 59% (890/1507) remote: Compressing objects: 60% (905/1507) remote: Compressing objects: 61% (920/1507) remote: Compressing objects: 62% (935/1507) remote: Compressing objects: 63% (950/1507) remote: Compressing objects: 64% (965/1507) remote: Compressing objects: 65% (980/1507) remote: Compressing objects: 66% (995/1507) remote: Compressing objects: 67% (1010/1507) remote: Compressing objects: 68% (1025/1507) remote: Compressing objects: 69% (1040/1507) remote: Compressing objects: 70% (1055/1507) remote: Compressing objects: 71% (1070/1507) remote: Compressing objects: 72% (1086/1507) remote: Compressing objects: 73% (1101/1507) remote: Compressing objects: 74% (1116/1507) remote: Compressing objects: 75% (1131/1507) remote: Compressing objects: 76% (1146/1507) remote: Compressing objects: 77% (1161/1507) remote: Compressing objects: 78% (1176/1507) remote: Compressing objects: 79% (1191/1507) remote: Compressing objects: 80% (1206/1507) remote: Compressing objects: 81% (1221/1507) remote: Compressing objects: 82% (1236/1507) remote: Compressing objects: 83% (1251/1507) remote: Compressing objects: 84% (1266/1507) remote: Compressing objects: 85% (1281/1507) remote: Compressing objects: 86% (1297/1507) remote: Compressing objects: 87% (1312/1507) remote: Compressing objects: 88% (1327/1507) remote: Compressing objects: 89% (1342/1507) remote: Compressing objects: 90% (1357/1507) remote: Compressing objects: 91% (1372/1507) remote: Compressing objects: 92% (1387/1507) remote: Compressing objects: 93% (1402/1507) remote: Compressing objects: 94% (1417/1507) remote: Compressing objects: 95% (1432/1507) remote: Compressing objects: 96% (1447/1507) remote: Compressing objects: 97% (1462/1507) remote: Compressing objects: 98% (1477/1507) remote: Compressing objects: 99% (1492/1507) remote: Compressing objects: 100% (1507/1507) remote: Compressing objects: 100% (1507/1507), done.
  6. 8.92 s Receiving objects: 0% (1/78511) Receiving objects: 1% (786/78511) Receiving objects: 2% (1571/78511) Receiving objects: 3% (2356/78511) Receiving objects: 4% (3141/78511) Receiving objects: 5% (3926/78511) Receiving objects: 6% (4711/78511) Receiving objects: 7% (5496/78511), 8.92 MiB | 17.82 MiB/s Receiving objects: 8% (6281/78511), 8.92 MiB | 17.82 MiB/s Receiving objects: 9% (7066/78511), 8.92 MiB | 17.82 MiB/s Receiving objects: 10% (7852/78511), 8.92 MiB | 17.82 MiB/s Receiving objects: 11% (8637/78511), 8.92 MiB | 17.82 MiB/s Receiving objects: 12% (9422/78511), 8.92 MiB | 17.82 MiB/s Receiving objects: 13% (10207/78511), 8.92 MiB | 17.82 MiB/s Receiving objects: 14% (10992/78511), 8.92 MiB | 17.82 MiB/s Receiving objects: 15% (11777/78511), 8.92 MiB | 17.82 MiB/s Receiving objects: 16% (12562/78511), 8.92 MiB | 17.82 MiB/s Receiving objects: 17% (13347/78511), 8.92 MiB | 17.82 MiB/s Receiving objects: 18% (14132/78511), 8.92 MiB | 17.82 MiB/s Receiving objects: 19% (14918/78511), 8.92 MiB | 17.82 MiB/s Receiving objects: 20% (15703/78511), 8.92 MiB | 17.82 MiB/s Receiving objects: 21% (16488/78511), 8.92 MiB | 17.82 MiB/s Receiving objects: 22% (17273/78511), 8.92 MiB | 17.82 MiB/s Receiving objects: 23% (18058/78511), 8.92 MiB | 17.82 MiB/s Receiving objects: 24% (18843/78511), 8.92 MiB | 17.82 MiB/s Receiving objects: 25% (19628/78511), 8.92 MiB | 17.82 MiB/s Receiving objects: 26% (20413/78511), 8.92 MiB | 17.82 MiB/s Receiving objects: 27% (21198/78511), 8.92 MiB | 17.82 MiB/s Receiving objects: 28% (21984/78511), 8.92 MiB | 17.82 MiB/s Receiving objects: 29% (22769/78511), 8.92 MiB | 17.82 MiB/s Receiving objects: 30% (23554/78511), 8.92 MiB | 17.82 MiB/s Receiving objects: 31% (24339/78511), 8.92 MiB | 17.82 MiB/s Receiving objects: 32% (25124/78511), 8.92 MiB | 17.82 MiB/s Receiving objects: 33% (25909/78511), 8.92 MiB | 17.82 MiB/s Receiving objects: 34% (26694/78511), 8.92 MiB | 17.82 MiB/s Receiving objects: 35% (27479/78511), 8.92 MiB | 17.82 MiB/s Receiving objects: 36% (28264/78511), 8.92 MiB | 17.82 MiB/s Receiving objects: 37% (29050/78511), 8.92 MiB | 17.82 MiB/s Receiving objects: 38% (29835/78511), 8.92 MiB | 17.82 MiB/s Receiving objects: 39% (30620/78511), 8.92 MiB | 17.82 MiB/s Receiving objects: 40% (31405/78511), 8.92 MiB | 17.82 MiB/s Receiving objects: 40% (31421/78511), 28.52 MiB | 28.52 MiB/s Receiving objects: 41% (32190/78511), 28.52 MiB | 28.52 MiB/s Receiving objects: 42% (32975/78511), 28.52 MiB | 28.52 MiB/s Receiving objects: 43% (33760/78511), 28.52 MiB | 28.52 MiB/s Receiving objects: 44% (34545/78511), 28.52 MiB | 28.52 MiB/s Receiving objects: 45% (35330/78511), 28.52 MiB | 28.52 MiB/s Receiving objects: 46% (36116/78511), 28.52 MiB | 28.52 MiB/s Receiving objects: 47% (36901/78511), 28.52 MiB | 28.52 MiB/s Receiving objects: 48% (37686/78511), 28.52 MiB | 28.52 MiB/s Receiving objects: 49% (38471/78511), 28.52 MiB | 28.52 MiB/s Receiving objects: 50% (39256/78511), 44.15 MiB | 29.43 MiB/s Receiving objects: 51% (40041/78511), 44.15 MiB | 29.43 MiB/s Receiving objects: 52% (40826/78511), 44.15 MiB | 29.43 MiB/s Receiving objects: 53% (41611/78511), 44.15 MiB | 29.43 MiB/s Receiving objects: 54% (42396/78511), 44.15 MiB | 29.43 MiB/s Receiving objects: 55% (43182/78511), 44.15 MiB | 29.43 MiB/s Receiving objects: 56% (43967/78511), 44.15 MiB | 29.43 MiB/s Receiving objects: 57% (44752/78511), 44.15 MiB | 29.43 MiB/s Receiving objects: 58% (45537/78511), 44.15 MiB | 29.43 MiB/s Receiving objects: 59% (46322/78511), 44.15 MiB | 29.43 MiB/s Receiving objects: 60% (47107/78511), 44.15 MiB | 29.43 MiB/s Receiving objects: 60% (47412/78511), 44.15 MiB | 29.43 MiB/s Receiving objects: 61% (47892/78511), 59.95 MiB | 29.93 MiB/s Receiving objects: 62% (48677/78511), 59.95 MiB | 29.93 MiB/s Receiving objects: 63% (49462/78511), 59.95 MiB | 29.93 MiB/s Receiving objects: 64% (50248/78511), 59.95 MiB | 29.93 MiB/s Receiving objects: 65% (51033/78511), 59.95 MiB | 29.93 MiB/s Receiving objects: 66% (51818/78511), 59.95 MiB | 29.93 MiB/s Receiving objects: 67% (52603/78511), 59.95 MiB | 29.93 MiB/s Receiving objects: 68% (53388/78511), 76.27 MiB | 30.47 MiB/s Receiving objects: 69% (54173/78511), 76.27 MiB | 30.47 MiB/s Receiving objects: 70% (54958/78511), 76.27 MiB | 30.47 MiB/s Receiving objects: 71% (55743/78511), 76.27 MiB | 30.47 MiB/s Receiving objects: 72% (56528/78511), 76.27 MiB | 30.47 MiB/s Receiving objects: 73% (57314/78511), 76.27 MiB | 30.47 MiB/s Receiving objects: 74% (58099/78511), 76.27 MiB | 30.47 MiB/s Receiving objects: 74% (58143/78511), 76.27 MiB | 30.47 MiB/s Receiving objects: 75% (58884/78511), 86.50 MiB | 28.79 MiB/s Receiving objects: 76% (59669/78511), 86.50 MiB | 28.79 MiB/s Receiving objects: 77% (60454/78511), 86.50 MiB | 28.79 MiB/s Receiving objects: 78% (61239/78511), 86.50 MiB | 28.79 MiB/s Receiving objects: 79% (62024/78511), 93.10 MiB | 26.57 MiB/s Receiving objects: 79% (62721/78511), 93.10 MiB | 26.57 MiB/s Receiving objects: 80% (62809/78511), 93.10 MiB | 26.57 MiB/s Receiving objects: 81% (63594/78511), 100.18 MiB | 25.02 MiB/s Receiving objects: 82% (64380/78511), 107.43 MiB | 23.85 MiB/s Receiving objects: 83% (65165/78511), 107.43 MiB | 23.85 MiB/s Receiving objects: 84% (65950/78511), 107.43 MiB | 23.85 MiB/s Receiving objects: 85% (66735/78511), 107.43 MiB | 23.85 MiB/s Receiving objects: 86% (67520/78511), 107.43 MiB | 23.85 MiB/s Receiving objects: 87% (68305/78511), 107.43 MiB | 23.85 MiB/s Receiving objects: 88% (69090/78511), 107.43 MiB | 23.85 MiB/s Receiving objects: 88% (69824/78511), 107.43 MiB | 23.85 MiB/s Receiving objects: 89% (69875/78511), 107.43 MiB | 23.85 MiB/s Receiving objects: 90% (70660/78511), 115.04 MiB | 23.56 MiB/s Receiving objects: 91% (71446/78511), 115.04 MiB | 23.56 MiB/s Receiving objects: 92% (72231/78511), 115.04 MiB | 23.56 MiB/s Receiving objects: 93% (73016/78511), 115.04 MiB | 23.56 MiB/s Receiving objects: 94% (73801/78511), 115.04 MiB | 23.56 MiB/s Receiving objects: 95% (74586/78511), 115.04 MiB | 23.56 MiB/s Receiving objects: 96% (75371/78511), 115.04 MiB | 23.56 MiB/s Receiving objects: 97% (76156/78511), 115.04 MiB | 23.56 MiB/s Receiving objects: 98% (76941/78511), 115.04 MiB | 23.56 MiB/s Receiving objects: 99% (77726/78511), 115.04 MiB | 23.56 MiB/s remote: Total 78511 (delta 7045), reused 6500 (delta 6498), pack-reused 70506 (from 2)
  7. 8.92 s Receiving objects: 100% (78511/78511), 115.04 MiB | 23.56 MiB/s Receiving objects: 100% (78511/78511), 120.01 MiB | 22.54 MiB/s, done.
  8. 11.29 s Resolving deltas: 0% (0/53617) Resolving deltas: 1% (537/53617) Resolving deltas: 2% (1073/53617) Resolving deltas: 3% (1609/53617) Resolving deltas: 4% (2145/53617) Resolving deltas: 5% (2681/53617) Resolving deltas: 6% (3218/53617) Resolving deltas: 7% (3754/53617) Resolving deltas: 8% (4290/53617) Resolving deltas: 9% (4826/53617) Resolving deltas: 10% (5362/53617) Resolving deltas: 11% (5898/53617) Resolving deltas: 12% (6435/53617) Resolving deltas: 13% (6971/53617) Resolving deltas: 14% (7507/53617) Resolving deltas: 15% (8043/53617) Resolving deltas: 16% (8579/53617) Resolving deltas: 17% (9115/53617) Resolving deltas: 18% (9652/53617) Resolving deltas: 19% (10188/53617) Resolving deltas: 20% (10724/53617) Resolving deltas: 21% (11260/53617) Resolving deltas: 22% (11796/53617) Resolving deltas: 23% (12332/53617) Resolving deltas: 24% (12869/53617) Resolving deltas: 25% (13405/53617) Resolving deltas: 26% (13941/53617) Resolving deltas: 27% (14477/53617) Resolving deltas: 28% (15013/53617) Resolving deltas: 29% (15549/53617) Resolving deltas: 30% (16086/53617) Resolving deltas: 31% (16622/53617) Resolving deltas: 32% (17158/53617) Resolving deltas: 33% (17694/53617) Resolving deltas: 34% (18230/53617) Resolving deltas: 35% (18766/53617) Resolving deltas: 36% (19303/53617) Resolving deltas: 37% (19839/53617) Resolving deltas: 38% (20375/53617) Resolving deltas: 39% (20913/53617) Resolving deltas: 40% (21447/53617) Resolving deltas: 41% (21983/53617) Resolving deltas: 42% (22520/53617) Resolving deltas: 43% (23056/53617) Resolving deltas: 44% (23592/53617) Resolving deltas: 45% (24128/53617) Resolving deltas: 46% (24664/53617) Resolving deltas: 47% (25200/53617) Resolving deltas: 48% (25737/53617) Resolving deltas: 49% (26273/53617) Resolving deltas: 50% (26809/53617) Resolving deltas: 51% (27345/53617) Resolving deltas: 52% (27881/53617) Resolving deltas: 53% (28418/53617) Resolving deltas: 54% (28955/53617) Resolving deltas: 55% (29490/53617) Resolving deltas: 56% (30026/53617) Resolving deltas: 57% (30562/53617) Resolving deltas: 57% (30747/53617) Resolving deltas: 58% (31098/53617) Resolving deltas: 59% (31635/53617) Resolving deltas: 60% (32171/53617) Resolving deltas: 61% (32707/53617) Resolving deltas: 62% (33243/53617) Resolving deltas: 63% (33779/53617) Resolving deltas: 64% (34315/53617) Resolving deltas: 65% (34853/53617) Resolving deltas: 66% (35388/53617) Resolving deltas: 67% (35924/53617) Resolving deltas: 68% (36460/53617) Resolving deltas: 69% (36996/53617) Resolving deltas: 70% (37532/53617) Resolving deltas: 71% (38069/53617) Resolving deltas: 72% (38605/53617) Resolving deltas: 73% (39141/53617) Resolving deltas: 74% (39677/53617) Resolving deltas: 75% (40213/53617) Resolving deltas: 76% (40749/53617) Resolving deltas: 77% (41286/53617) Resolving deltas: 78% (41822/53617) Resolving deltas: 79% (42358/53617) Resolving deltas: 80% (42894/53617) Resolving deltas: 81% (43430/53617) Resolving deltas: 82% (43966/53617) Resolving deltas: 83% (44503/53617) Resolving deltas: 83% (44588/53617) Resolving deltas: 84% (45039/53617) Resolving deltas: 85% (45575/53617) Resolving deltas: 86% (46111/53617) Resolving deltas: 87% (46647/53617) Resolving deltas: 88% (47184/53617) Resolving deltas: 89% (47720/53617) Resolving deltas: 90% (48256/53617) Resolving deltas: 91% (48793/53617) Resolving deltas: 92% (49329/53617) Resolving deltas: 93% (49864/53617) Resolving deltas: 94% (50400/53617) Resolving deltas: 95% (50937/53617) Resolving deltas: 96% (51474/53617) Resolving deltas: 97% (52009/53617) Resolving deltas: 98% (52545/53617) Resolving deltas: 99% (53081/53617) Resolving deltas: 100% (53617/53617) Resolving deltas: 100% (53617/53617), done.
  9. 11.85 s Fetching commit d2939d705e8a50d3412afbd503f2e4868476dca1 for wip/native-symbolica-hyperbolics ...
  10. 11.86 s $ /nix/store/bcnisk3ydfgv26v2gw3zlky24g00yww2-git-2.54.0/bin/git fetch origin d2939d705e8a50d3412afbd503f2e4868476dca1
  11. 12.52 s From https://github.com/alphal00p/gammaloop
  12. 12.52 s * branch d2939d705e8a50d3412afbd503f2e4868476dca1 -> FETCH_HEAD
  13. 12.59 s $ /nix/store/9ypz3flqsrl5xl495mm8h645gadjsxi1-coreutils-9.11/bin/timeout --kill-after=15s 7200s /nix/store/bcnisk3ydfgv26v2gw3zlky24g00yww2-git-2.54.0/bin/git -c advice.detachedHead=false checkout d2939d705e8a50d3412afbd503f2e4868476dca1
  14. 12.94 s HEAD is now at d2939d705 wip: native hyperbolic functions, blocked on symbolica evaluator support
  15. 12.97 s $ /nix/store/9ypz3flqsrl5xl495mm8h645gadjsxi1-coreutils-9.11/bin/timeout --kill-after=15s 7200s /nix/store/23zk8sgzamrbmj1fday15szf7f2279s8-nix-2.34.7/bin/nix --extra-experimental-features nix-command --extra-experimental-features flakes --log-format internal-json run .#packages.x86_64-linux.nix-ci-check-gammaloop-nextest-core --print-build-logs
  16. 43.48 s
  17. 44.92 s Downloading cached boehm-gc from https://cache.nix-ci.com
  18. 44.92 s Downloading cached busybox from https://cache.nix-ci.com
  19. 44.92 s Downloading cached aws-c-common from https://cache.nix-ci.com
  20. 44.92 s Downloading cached brotli-1.2.0-lib from https://cache.nix-ci.com
  21. 44.92 s Downloading cached editline-1.17.1-unstable-2025-05 from https://cache.nix-ci.com
  22. 44.92 s Downloading cached libcpuid from https://cache.nix-ci.com
  23. 44.92 s Downloading cached libseccomp-2.6.0-lib from https://cache.nix-ci.com
  24. 44.92 s Downloading cached libsodium-1.0.22-unstable-2026-04 from https://cache.nix-ci.com
  25. 44.92 s Downloading cached lowdown-3.0.1-lib from https://cache.nix-ci.com
  26. 44.92 s Downloading cached publicsuffix-list-0-unstable-2026-05 from https://cache.nix-ci.com
  27. 44.92 s Downloading cached icu4c from https://cache.nix-ci.com
  28. 44.92 s Downloading cached libssh2 from https://cache.nix-ci.com
  29. 44.92 s Downloading cached libxml2 from https://cache.nix-ci.com
  30. 44.92 s Downloading cached llhttp from https://cache.nix-ci.com
  31. 44.92 s Downloading cached nghttp3 from https://cache.nix-ci.com
  32. 44.92 s Downloading cached nghttp2-1.69.0-lib from https://cache.nix-ci.com
  33. 45.01 s Downloaded cached libcpuid (326 KiB) in 85ms
  34. 45.01 s Progress: 0 of 1 built, 1 of 50 downloaded from cache (15 downloading)
  35. 45.01 s Downloading cached hwloc-2.14.0-lib from https://cache.nix-ci.com
  36. 45.03 s Downloaded cached llhttp (89 KiB) in 104ms
  37. 45.03 s Progress: 0 of 1 built, 2 of 50 downloaded from cache (15 downloading)
  38. 45.03 s Downloaded cached editline-1.17.1-unstable-2025-05 (58 KiB) in 109ms
  39. 45.03 s Progress: 0 of 1 built, 3 of 50 downloaded from cache (15 downloading)
  40. 45.03 s Downloading cached keyutils-1.6.3-lib from https://cache.nix-ci.com
  41. 45.03 s Downloading cached ngtcp2 from https://cache.nix-ci.com
  42. 45.06 s Downloaded cached nghttp3 (228 KiB) in 134ms
  43. 45.06 s Downloaded cached libseccomp-2.6.0-lib (193 KiB) in 135ms
  44. 45.06 s Downloaded cached busybox (230 KiB) in 139ms
  45. 45.06 s Downloaded cached publicsuffix-list-0-unstable-2026-05 (329 KiB) in 134ms
  46. 45.06 s Progress: 0 of 1 built, 4 of 50 downloaded from cache (15 downloading)
  47. 45.06 s Progress: 0 of 1 built, 5 of 50 downloaded from cache (15 downloading)
  48. 45.06 s Downloading cached s2n-tls from https://cache.nix-ci.com
  49. 45.06 s Progress: 0 of 1 built, 6 of 50 downloaded from cache (14 downloading)
  50. 45.06 s Progress: 0 of 1 built, 7 of 50 downloaded from cache (13 downloading)
  51. 45.06 s Downloaded cached nghttp2-1.69.0-lib (225 KiB) in 134ms
  52. 45.07 s Downloaded cached boehm-gc (312 KiB) in 149ms
  53. 45.07 s Downloading cached libpsl from https://cache.nix-ci.com
  54. 45.07 s Downloaded cached libssh2 (330 KiB) in 146ms
  55. 45.07 s Progress: 0 of 1 built, 8 of 50 downloaded from cache (13 downloading)
  56. 45.07 s Progress: 0 of 1 built, 9 of 50 downloaded from cache (12 downloading)
  57. 45.07 s Downloaded cached lowdown-3.0.1-lib (341 KiB) in 149ms
  58. 45.07 s Progress: 0 of 1 built, 10 of 50 downloaded from cache (11 downloading)
  59. 45.07 s Progress: 0 of 1 built, 11 of 50 downloaded from cache (11 downloading)
  60. 45.07 s Downloading cached libgit2-1.9.4-lib from https://cache.nix-ci.com
  61. 45.08 s Downloaded cached aws-c-common (1.1 MiB) in 164ms
  62. 45.09 s Downloaded cached libsodium-1.0.22-unstable-2026-04 (666 KiB) in 165ms
  63. 45.11 s Downloaded cached brotli-1.2.0-lib (961 KiB) in 188ms
  64. 45.11 s Progress: 0 of 1 built, 12 of 50 downloaded from cache (10 downloading)
  65. 45.11 s Downloaded cached libxml2 (1.4 MiB) in 190ms
  66. 45.11 s Downloaded cached hwloc-2.14.0-lib (459 KiB) in 106ms
  67. 45.11 s Downloading cached aws-c-sdkutils from https://cache.nix-ci.com
  68. 45.11 s Downloading cached aws-c-compression from https://cache.nix-ci.com
  69. 45.11 s Downloading cached aws-c-cal from https://cache.nix-ci.com
  70. 45.11 s Downloading cached aws-checksums from https://cache.nix-ci.com
  71. 45.11 s Progress: 0 of 1 built, 13 of 50 downloaded from cache (13 downloading)
  72. 45.11 s Progress: 0 of 1 built, 14 of 50 downloaded from cache (12 downloading)
  73. 45.11 s Progress: 0 of 1 built, 15 of 50 downloaded from cache (11 downloading)
  74. 45.11 s Progress: 0 of 1 built, 16 of 50 downloaded from cache (10 downloading)
  75. 45.11 s Downloading cached libarchive-3.8.8-lib from https://cache.nix-ci.com
  76. 45.11 s Downloading cached onetbb from https://cache.nix-ci.com
  77. 45.13 s Downloaded cached keyutils-1.6.3-lib (41 KiB) in 101ms
  78. 45.13 s Progress: 0 of 1 built, 17 of 50 downloaded from cache (11 downloading)
  79. 45.13 s Downloading cached krb5-1.22.2-lib from https://cache.nix-ci.com
  80. 45.16 s Downloaded cached ngtcp2 (515 KiB) in 129ms
  81. 45.16 s Progress: 0 of 1 built, 18 of 50 downloaded from cache (11 downloading)
  82. 45.17 s Downloaded cached libpsl (114 KiB) in 103ms
  83. 45.17 s Progress: 0 of 1 built, 19 of 50 downloaded from cache (10 downloading)
  84. 45.19 s Downloaded cached s2n-tls (1.3 MiB) in 134ms
  85. 45.19 s Progress: 0 of 1 built, 20 of 50 downloaded from cache (9 downloading)
  86. 45.20 s Downloaded cached libgit2-1.9.4-lib (1.6 MiB) in 124ms
  87. 45.20 s Progress: 0 of 1 built, 21 of 50 downloaded from cache (8 downloading)
  88. 45.21 s Downloaded cached aws-c-compression (31 KiB) in 94ms
  89. 45.21 s Progress: 0 of 1 built, 22 of 50 downloaded from cache (7 downloading)
  90. 45.22 s Downloaded cached aws-checksums (86 KiB) in 100ms
  91. 45.22 s Downloaded cached aws-c-sdkutils (155 KiB) in 102ms
  92. 45.22 s Progress: 0 of 1 built, 23 of 50 downloaded from cache (6 downloading)
  93. 45.22 s Progress: 0 of 1 built, 24 of 50 downloaded from cache (5 downloading)
  94. 45.22 s Downloaded cached aws-c-cal (158 KiB) in 107ms
  95. 45.22 s Progress: 0 of 1 built, 25 of 50 downloaded from cache (4 downloading)
  96. 45.22 s Downloading cached aws-c-io from https://cache.nix-ci.com
  97. 45.23 s Downloaded cached libarchive-3.8.8-lib (953 KiB) in 115ms
  98. 45.24 s Progress: 0 of 1 built, 26 of 50 downloaded from cache (4 downloading)
  99. 45.24 s Downloaded cached onetbb (626 KiB) in 120ms
  100. 45.24 s Progress: 0 of 1 built, 27 of 50 downloaded from cache (3 downloading)
  101. 45.24 s Downloading cached libblake3 from https://cache.nix-ci.com
  102. 45.26 s Downloaded cached krb5-1.22.2-lib (2.7 MiB) in 126ms
  103. 45.26 s Progress: 0 of 1 built, 28 of 50 downloaded from cache (3 downloading)
  104. 45.26 s Downloading cached curl from https://cache.nix-ci.com
  105. 45.32 s Downloaded cached libblake3 (117 KiB) in 86ms
  106. 45.32 s Progress: 0 of 1 built, 29 of 50 downloaded from cache (3 downloading)
  107. 45.32 s Downloaded cached aws-c-io (648 KiB) in 99ms
  108. 45.32 s Progress: 0 of 1 built, 30 of 50 downloaded from cache (2 downloading)
  109. 45.33 s Downloading cached aws-c-http from https://cache.nix-ci.com
  110. 45.33 s Downloading cached aws-c-event-stream from https://cache.nix-ci.com
  111. 45.34 s Downloaded cached icu4c (38.2 MiB) in 416ms
  112. 45.34 s Progress: 0 of 1 built, 31 of 50 downloaded from cache (3 downloading)
  113. 45.34 s Downloading cached boost from https://cache.nix-ci.com
  114. 45.34 s Downloaded cached curl (1.2 MiB) in 81ms
  115. 45.34 s Progress: 0 of 1 built, 32 of 50 downloaded from cache (3 downloading)
  116. 45.38 s Downloaded cached aws-c-event-stream (176 KiB) in 48ms
  117. 45.38 s Progress: 0 of 1 built, 33 of 50 downloaded from cache (2 downloading)
  118. 45.38 s Downloaded cached aws-c-http (641 KiB) in 50ms
  119. 45.38 s Progress: 0 of 1 built, 34 of 50 downloaded from cache (1 downloading)
  120. 45.38 s Downloading cached aws-c-auth from https://cache.nix-ci.com
  121. 45.38 s Downloading cached aws-c-mqtt from https://cache.nix-ci.com
  122. 45.46 s Downloaded cached boost (14.5 MiB) in 123ms
  123. 45.46 s Progress: 0 of 1 built, 35 of 50 downloaded from cache (2 downloading)
  124. 45.47 s Downloaded cached aws-c-mqtt (557 KiB) in 88ms
  125. 45.47 s Downloading cached nix-util from https://cache.nix-ci.com
  126. 45.47 s Progress: 0 of 1 built, 36 of 50 downloaded from cache (2 downloading)
  127. 45.47 s Downloaded cached aws-c-auth (387 KiB) in 91ms
  128. 45.47 s Progress: 0 of 1 built, 37 of 50 downloaded from cache (1 downloading)
  129. 45.47 s Downloading cached aws-c-s3 from https://cache.nix-ci.com
  130. 45.53 s Downloaded cached aws-c-s3 (384 KiB) in 58ms
  131. 45.53 s Progress: 0 of 1 built, 38 of 50 downloaded from cache (1 downloading)
  132. 45.53 s Downloading cached aws-crt-cpp from https://cache.nix-ci.com
  133. 45.54 s Downloaded cached nix-util (2.4 MiB) in 69ms
  134. 45.54 s Progress: 0 of 1 built, 39 of 50 downloaded from cache (1 downloading)
  135. 45.54 s Downloading cached nix-nswrapper from https://cache.nix-ci.com
  136. 45.59 s Downloaded cached aws-crt-cpp (979 KiB) in 58ms
  137. 45.59 s Progress: 0 of 1 built, 40 of 50 downloaded from cache (1 downloading)
  138. 45.59 s Downloaded cached nix-nswrapper (131 KiB) in 52ms
  139. 45.59 s Downloading cached nix-store from https://cache.nix-ci.com
  140. 45.59 s Progress: 0 of 1 built, 41 of 50 downloaded from cache (1 downloading)
  141. 45.67 s Downloaded cached nix-store (5.8 MiB) in 85ms
  142. 45.67 s Progress: 0 of 1 built, 42 of 50 downloaded from cache
  143. 45.68 s Downloading cached nix-main from https://cache.nix-ci.com
  144. 45.68 s Downloading cached nix-fetchers from https://cache.nix-ci.com
  145. 45.74 s Downloaded cached nix-main (393 KiB) in 62ms
  146. 45.74 s Progress: 0 of 1 built, 43 of 50 downloaded from cache (1 downloading)
  147. 45.74 s Downloaded cached nix-fetchers (1.5 MiB) in 65ms
  148. 45.74 s Progress: 0 of 1 built, 44 of 50 downloaded from cache
  149. 45.74 s Downloading cached nix-expr from https://cache.nix-ci.com
  150. 45.82 s Downloaded cached nix-expr (3.3 MiB) in 77ms
  151. 45.82 s Progress: 0 of 1 built, 45 of 50 downloaded from cache
  152. 45.82 s Downloading cached nix-flake from https://cache.nix-ci.com
  153. 45.89 s Downloaded cached nix-flake (956 KiB) in 65ms
  154. 45.89 s Progress: 0 of 1 built, 46 of 50 downloaded from cache
  155. 45.89 s Downloading cached nix-cmd from https://cache.nix-ci.com
  156. 45.95 s Downloaded cached nix-cmd (1 MiB) in 60ms
  157. 45.95 s Progress: 0 of 1 built, 47 of 50 downloaded from cache
  158. 45.95 s Downloading cached nix from https://cache.nix-ci.com
  159. 46.02 s Downloaded cached nix (3.9 MiB) in 74ms
  160. 46.02 s Progress: 0 of 1 built, 48 of 50 downloaded from cache
  161. 46.02 s Downloading cached nix from https://cache.nix-ci.com
  162. 46.08 s Downloaded cached nix (8848 B) in 54ms
  163. 46.08 s Progress: 0 of 1 built, 49 of 50 downloaded from cache
  164. 46.08 s Downloading cached nix-ci-check-gammaloop-nextest-core from https://cache.nix-ci.com
  165. 46.12 s Downloaded cached nix-ci-check-gammaloop-nextest-core (1016 B) in 43ms
  166. 46.12 s Progress: 0 of 1 built, 50 of 50 downloaded from cache
  167. 53.83 s evaluating derivation 'g copying '/nix/store/jxqs evaluating derivation 'g copying '/nix/store/jxqs evaluating derivation 'g copying '/nix/store/jxqs evaluating derivation 'g copying '/nix/store/jxqs evaluating derivation 'g copying '/nix/store/jxqs evaluating derivation 'g copying '/nix/store/jxqs evaluating derivation 'g copying '/nix/store/jxqs evaluating derivation 'g copying '/nix/store/jxqs evaluating derivation 'g copying '/nix/store/jxqs evaluating derivation 'g querying info about miss querying gammaloop-nexte [0.0 KiB DL] querying in [0/2 built, 0/1 copied ( [0/1 built, 1 copied (4. [1/0/1 built, 1 copied (gammaloop-nextest-core> Extracting 3 binaries (including 1 non-test binary), 1 build script output directory, and 2 linked paths to /build/nextest-archive-cJt5oy
  168. 54.46 s gammaloop-nextest-core> Extracted 18 files to /build/nextest-archive-cJt5oy in 0.64s
  169. 54.48 s gammaloop-nextest-core> ------------
  170. 54.48 s gammaloop-nextest-core> Nextest run ID 7d9553b6-0867-4608-833a-b3a6943beca7 with nextest profile: ci_gammaloop
  171. 54.48 s gammaloop-nextest-core> Starting 339 tests across 2 binaries
  172. 55.33 s gammaloop-nextest-core> ------------
  173. 55.33 s gammaloop-nextest-core> Summary [ 0.845s] 339 tests run: 339 passed, 0 skipped
  174. 55.49 s gammaloop-nextest-core>
  175. 55.49 s gammaloop-nextest-core> ========== nextest test summary ==========
  176. 55.49 s gammaloop-nextest-core> report: target/nextest/ci_gammaloop/junit.xml
  177. 55.49 s gammaloop-nextest-core> tests: 339, failures: 0, errors: 0
  178. 55.49 s gammaloop-nextest-core> No failing testcases found.
  179. 55.49 s gammaloop-nextest-core> =========================================
  180. 55.52 s gammaloop-nextest-core> Extracting 1 binary and 1 linked path to /build/nextest-archive-AgT9JB
  181. 55.64 s gammaloop-nextest-core> Extracted 7 files to /build/nextest-archive-AgT9JB in 0.12s
  182. 55.66 s gammaloop-nextest-core> ------------
  183. 55.66 s gammaloop-nextest-core> Nextest run ID 758b8826-12d3-496f-9c5e-f79d3c6d09e2 with nextest profile: ci_gammaloop
  184. 55.66 s gammaloop-nextest-core> Starting 19 tests across 1 binary
  185. 55.68 s gammaloop-nextest-core> ------------
  186. 55.68 s gammaloop-nextest-core> Summary [ 0.019s] 19 tests run: 19 passed, 0 skipped
  187. 55.75 s gammaloop-nextest-core>
  188. 55.75 s gammaloop-nextest-core> ========== nextest test summary ==========
  189. 55.75 s gammaloop-nextest-core> report: target/nextest/ci_gammaloop/junit.xml
  190. 55.75 s gammaloop-nextest-core> tests: 19, failures: 0, errors: 0
  191. 55.75 s gammaloop-nextest-core> No failing testcases found.
  192. 55.75 s gammaloop-nextest-core> =========================================
  193. 55.78 s gammaloop-nextest-core> Extracting 1 binary to /build/nextest-archive-65JCC6
  194. 55.83 s gammaloop-nextest-core> Extracted 4 files to /build/nextest-archive-65JCC6 in 0.06s
  195. 55.85 s gammaloop-nextest-core> ------------
  196. 55.85 s gammaloop-nextest-core> Nextest run ID f078f704-3418-4f25-ae62-bbe5ecfe9011 with nextest profile: ci_gammaloop
  197. 55.85 s gammaloop-nextest-core> Starting 0 tests across 1 binary
  198. 55.85 s gammaloop-nextest-core> ------------
  199. 55.85 s gammaloop-nextest-core> Summary [ 0.000s] 0 tests run: 0 passed, 0 skipped
  200. 55.92 s gammaloop-nextest-core>
  201. 55.92 s gammaloop-nextest-core> ========== nextest test summary ==========
  202. 55.92 s gammaloop-nextest-core> report: target/nextest/ci_gammaloop/junit.xml
  203. 55.92 s gammaloop-nextest-core> tests: 0, failures: 0, errors: 0
  204. 55.92 s gammaloop-nextest-core> No failing testcases found.
  205. 55.92 s gammaloop-nextest-core> =========================================
  206. 55.95 s gammaloop-nextest-core> Extracting 4 binaries, 1 build script output directory, and 2 linked paths to /build/nextest-archive-BKLYTg
  207. 56.61 s gammaloop-nextest-core> Extracted 18 files to /build/nextest-archive-BKLYTg in 0.66s
  208. 56.63 s gammaloop-nextest-core> ------------
  209. 56.63 s gammaloop-nextest-core> Nextest run ID 8d0dafa4-ec1d-443c-a26d-ca482e339a54 with nextest profile: ci_gammaloop
  210. 56.63 s gammaloop-nextest-core> Starting 483 tests across 4 binaries (61 tests skipped, including 60 tests via profile.ci_gammaloop.default-filter)
  211. 56.70 s gammaloop-nextest-core> FAIL [ 0.026s] ( 44/483) gammalooprs cff::generation::tests_cff::thermal_bubble
  212. 56.70 s gammaloop-nextest-core> stdout ---
  213. 56.70 s gammaloop-nextest-core>
  214. 56.70 s gammaloop-nextest-core> running 1 test
  215. 56.70 s gammaloop-nextest-core> test cff::generation::tests_cff::thermal_bubble ... FAILED
  216. 56.70 s gammaloop-nextest-core>
  217. 56.70 s gammaloop-nextest-core> failures:
  218. 56.70 s gammaloop-nextest-core>
  219. 56.70 s gammaloop-nextest-core> failures:
  220. 56.70 s gammaloop-nextest-core> cff::generation::tests_cff::thermal_bubble
  221. 56.70 s gammaloop-nextest-core>
  222. 56.70 s gammaloop-nextest-core> test result: FAILED. 0 passed; 1 failed; 0 ignored; 0 measured; 535 filtered out; finished in 0.02s
  223. 56.70 s gammaloop-nextest-core>
  224. 56.70 s gammaloop-nextest-core> stderr ---
  225. 56.70 s gammaloop-nextest-core>
  226. 56.70 s gammaloop-nextest-core> thread 'cff::generation::tests_cff::thermal_bubble' (1264) panicked at /nix/store/1sigmg52bb61pfngmk9k8wq5fz9r7bf1-vendor-cargo-deps/5929dab090e556a579e9f3b708cd2e67c60b3d84a12b5a276f2a36cb00473133/symbolica-2.2.0/src/evaluate/evaluator.rs:295:21:
  227. 56.70 s gammaloop-nextest-core> External function 'symbolica_coth' does not have an implementation for gammalooprs::utils::F<f64>
  228. 56.70 s gammaloop-nextest-core> stack backtrace:
  229. 56.70 s gammaloop-nextest-core> 0: __rustc::rust_begin_unwind
  230. 56.70 s gammaloop-nextest-core> 1: core::panicking::panic_fmt
  231. 56.70 s gammaloop-nextest-core> 2: <symbolica::evaluate::evaluator::ExpressionEvaluator<gammalooprs::utils::F<f64>>>::evaluate_impl_no_ops
  232. 56.70 s gammaloop-nextest-core> 3: <symbolica::evaluate::evaluator::ExpressionEvaluator<gammalooprs::utils::F<f64>>>::evaluate_single
  233. 56.70 s gammaloop-nextest-core> 4: gammalooprs::cff::generation::tests_cff::thermal_bubble
  234. 56.70 s gammaloop-nextest-core> 5: <gammalooprs::cff::generation::tests_cff::thermal_bubble::{closure#0} as core::ops::function::FnOnce<()>>::call_once
  235. 56.70 s gammaloop-nextest-core> note: Some details are omitted, run with `RUST_BACKTRACE=full` for a verbose backtrace.
  236. 56.70 s gammaloop-nextest-core>
  237. 56.71 s gammaloop-nextest-core> FAIL [ 0.030s] ( 50/483) gammalooprs cff::generation::tests_cff::thermal_eight
  238. 56.71 s gammaloop-nextest-core> stdout ---
  239. 56.71 s gammaloop-nextest-core>
  240. 56.71 s gammaloop-nextest-core> running 1 test
  241. 56.71 s gammaloop-nextest-core> test cff::generation::tests_cff::thermal_eight ... FAILED
  242. 56.71 s gammaloop-nextest-core>
  243. 56.71 s gammaloop-nextest-core> failures:
  244. 56.71 s gammaloop-nextest-core>
  245. 56.71 s gammaloop-nextest-core> failures:
  246. 56.71 s gammaloop-nextest-core> cff::generation::tests_cff::thermal_eight
  247. 56.71 s gammaloop-nextest-core>
  248. 56.71 s gammaloop-nextest-core> test result: FAILED. 0 passed; 1 failed; 0 ignored; 0 measured; 535 filtered out; finished in 0.02s
  249. 56.71 s gammaloop-nextest-core>
  250. 56.71 s gammaloop-nextest-core> stderr ---
  251. 56.71 s gammaloop-nextest-core>
  252. 56.71 s gammaloop-nextest-core> thread 'cff::generation::tests_cff::thermal_eight' (1281) panicked at /nix/store/1sigmg52bb61pfngmk9k8wq5fz9r7bf1-vendor-cargo-deps/5929dab090e556a579e9f3b708cd2e67c60b3d84a12b5a276f2a36cb00473133/symbolica-2.2.0/src/evaluate/evaluator.rs:295:21:
  253. 56.71 s gammaloop-nextest-core> External function 'symbolica_coth' does not have an implementation for gammalooprs::utils::F<f64>
  254. 56.71 s gammaloop-nextest-core> stack backtrace:
  255. 56.71 s gammaloop-nextest-core> 0: __rustc::rust_begin_unwind
  256. 56.71 s gammaloop-nextest-core> 1: core::panicking::panic_fmt
  257. 56.71 s gammaloop-nextest-core> 2: <symbolica::evaluate::evaluator::ExpressionEvaluator<gammalooprs::utils::F<f64>>>::evaluate_impl_no_ops
  258. 56.71 s gammaloop-nextest-core> 3: <symbolica::evaluate::evaluator::ExpressionEvaluator<gammalooprs::utils::F<f64>>>::evaluate_single
  259. 56.71 s gammaloop-nextest-core> 4: gammalooprs::cff::generation::tests_cff::thermal_eight
  260. 56.71 s gammaloop-nextest-core> 5: <gammalooprs::cff::generation::tests_cff::thermal_eight::{closure#0} as core::ops::function::FnOnce<()>>::call_once
  261. 56.71 s gammaloop-nextest-core> note: Some details are omitted, run with `RUST_BACKTRACE=full` for a verbose backtrace.
  262. 56.71 s gammaloop-nextest-core>
  263. 56.72 s gammaloop-nextest-core> FAIL [ 0.046s] ( 59/483) gammalooprs cff::generation::tests_cff::thermal_bubble_chain
  264. 56.72 s gammaloop-nextest-core> stdout ---
  265. 56.72 s gammaloop-nextest-core>
  266. 56.72 s gammaloop-nextest-core> running 1 test
  267. 56.72 s gammaloop-nextest-core> test cff::generation::tests_cff::thermal_bubble_chain ... FAILED
  268. 56.72 s gammaloop-nextest-core>
  269. 56.72 s gammaloop-nextest-core> failures:
  270. 56.72 s gammaloop-nextest-core>
  271. 56.72 s gammaloop-nextest-core> failures:
  272. 56.72 s gammaloop-nextest-core> cff::generation::tests_cff::thermal_bubble_chain
  273. 56.72 s gammaloop-nextest-core>
  274. 56.72 s gammaloop-nextest-core> test result: FAILED. 0 passed; 1 failed; 0 ignored; 0 measured; 535 filtered out; finished in 0.01s
  275. 56.72 s gammaloop-nextest-core>
  276. 56.72 s gammaloop-nextest-core> stderr ---
  277. 56.72 s gammaloop-nextest-core>
  278. 56.72 s gammaloop-nextest-core> thread 'cff::generation::tests_cff::thermal_bubble_chain' (1301) panicked at /nix/store/1sigmg52bb61pfngmk9k8wq5fz9r7bf1-vendor-cargo-deps/5929dab090e556a579e9f3b708cd2e67c60b3d84a12b5a276f2a36cb00473133/symbolica-2.2.0/src/evaluate/evaluator.rs:295:21:
  279. 56.72 s gammaloop-nextest-core> External function 'symbolica_coth' does not have an implementation for gammalooprs::utils::F<f64>
  280. 56.72 s gammaloop-nextest-core> stack backtrace:
  281. 56.72 s gammaloop-nextest-core> 0: __rustc::rust_begin_unwind
  282. 56.72 s gammaloop-nextest-core> 1: core::panicking::panic_fmt
  283. 56.72 s gammaloop-nextest-core> 2: <symbolica::evaluate::evaluator::ExpressionEvaluator<gammalooprs::utils::F<f64>>>::evaluate_impl_no_ops
  284. 56.72 s gammaloop-nextest-core> 3: <symbolica::evaluate::evaluator::ExpressionEvaluator<gammalooprs::utils::F<f64>>>::evaluate_single
  285. 56.72 s gammaloop-nextest-core> 4: gammalooprs::cff::generation::tests_cff::thermal_bubble_chain
  286. 56.72 s gammaloop-nextest-core> 5: <gammalooprs::cff::generation::tests_cff::thermal_bubble_chain::{closure#0} as core::ops::function::FnOnce<()>>::call_once
  287. 56.72 s gammaloop-nextest-core> note: Some details are omitted, run with `RUST_BACKTRACE=full` for a verbose backtrace.
  288. 56.72 s gammaloop-nextest-core>
  289. 56.81 s gammaloop-nextest-core> FAIL [ 0.132s] ( 76/483) gammalooprs cff::generation::tests_cff::thermal_ring
  290. 56.81 s gammaloop-nextest-core> stdout ---
  291. 56.81 s gammaloop-nextest-core>
  292. 56.81 s gammaloop-nextest-core> running 1 test
  293. 56.81 s gammaloop-nextest-core> test cff::generation::tests_cff::thermal_ring ... FAILED
  294. 56.81 s gammaloop-nextest-core>
  295. 56.81 s gammaloop-nextest-core> failures:
  296. 56.81 s gammaloop-nextest-core>
  297. 56.81 s gammaloop-nextest-core> failures:
  298. 56.81 s gammaloop-nextest-core> cff::generation::tests_cff::thermal_ring
  299. 56.81 s gammaloop-nextest-core>
  300. 56.81 s gammaloop-nextest-core> test result: FAILED. 0 passed; 1 failed; 0 ignored; 0 measured; 535 filtered out; finished in 0.12s
  301. 56.81 s gammaloop-nextest-core>
  302. 56.81 s gammaloop-nextest-core> stderr ---
  303. 56.81 s gammaloop-nextest-core>
  304. 56.82 s gammaloop-nextest-core> thread 'cff::generation::tests_cff::thermal_ring' (1286) panicked at /nix/store/1sigmg52bb61pfngmk9k8wq5fz9r7bf1-vendor-cargo-deps/5929dab090e556a579e9f3b708cd2e67c60b3d84a12b5a276f2a36cb00473133/symbolica-2.2.0/src/evaluate/evaluator.rs:295:21:
  305. 56.82 s gammaloop-nextest-core> External function 'symbolica_coth' does not have an implementation for gammalooprs::utils::F<f64>
  306. 56.82 s gammaloop-nextest-core> stack backtrace:
  307. 56.82 s gammaloop-nextest-core> 0: __rustc::rust_begin_unwind
  308. 56.82 s gammaloop-nextest-core> 1: core::panicking::panic_fmt
  309. 56.82 s gammaloop-nextest-core> 2: <symbolica::evaluate::evaluator::ExpressionEvaluator<gammalooprs::utils::F<f64>>>::evaluate_impl_no_ops
  310. 56.82 s gammaloop-nextest-core> 3: <symbolica::evaluate::evaluator::ExpressionEvaluator<gammalooprs::utils::F<f64>>>::evaluate_single
  311. 56.82 s gammaloop-nextest-core> 4: gammalooprs::cff::generation::tests_cff::thermal_ring
  312. 56.82 s gammaloop-nextest-core> 5: <gammalooprs::cff::generation::tests_cff::thermal_ring::{closure#0} as core::ops::function::FnOnce<()>>::call_once
  313. 56.82 s gammaloop-nextest-core> note: Some details are omitted, run with `RUST_BACKTRACE=full` for a verbose backtrace.
  314. 56.82 s gammaloop-nextest-core>
  315. 56.85 s gammaloop-nextest-core> FAIL [ 0.174s] ( 79/483) gammalooprs cff::generation::tests_cff::thermal_mercedes
  316. 56.85 s gammaloop-nextest-core> stdout ---
  317. 56.85 s gammaloop-nextest-core>
  318. 56.85 s gammaloop-nextest-core> running 1 test
  319. 56.85 s gammaloop-nextest-core> test cff::generation::tests_cff::thermal_mercedes ... FAILED
  320. 56.85 s gammaloop-nextest-core>
  321. 56.85 s gammaloop-nextest-core> failures:
  322. 56.85 s gammaloop-nextest-core>
  323. 56.85 s gammaloop-nextest-core> failures:
  324. 56.85 s gammaloop-nextest-core> cff::generation::tests_cff::thermal_mercedes
  325. 56.85 s gammaloop-nextest-core>
  326. 56.85 s gammaloop-nextest-core> test result: FAILED. 0 passed; 1 failed; 0 ignored; 0 measured; 535 filtered out; finished in 0.15s
  327. 56.85 s gammaloop-nextest-core>
  328. 56.85 s gammaloop-nextest-core> stderr ---
  329. 56.85 s gammaloop-nextest-core>
  330. 56.85 s gammaloop-nextest-core> thread 'cff::generation::tests_cff::thermal_mercedes' (1306) panicked at /nix/store/1sigmg52bb61pfngmk9k8wq5fz9r7bf1-vendor-cargo-deps/5929dab090e556a579e9f3b708cd2e67c60b3d84a12b5a276f2a36cb00473133/symbolica-2.2.0/src/evaluate/evaluator.rs:295:21:
  331. 56.85 s gammaloop-nextest-core> External function 'symbolica_coth' does not have an implementation for gammalooprs::utils::F<f64>
  332. 56.85 s gammaloop-nextest-core> stack backtrace:
  333. 56.85 s gammaloop-nextest-core> 0: __rustc::rust_begin_unwind
  334. 56.85 s gammaloop-nextest-core> 1: core::panicking::panic_fmt
  335. 56.85 s gammaloop-nextest-core> 2: <symbolica::evaluate::evaluator::ExpressionEvaluator<gammalooprs::utils::F<f64>>>::evaluate_impl_no_ops
  336. 56.85 s gammaloop-nextest-core> 3: <symbolica::evaluate::evaluator::ExpressionEvaluator<gammalooprs::utils::F<f64>>>::evaluate_single
  337. 56.85 s gammaloop-nextest-core> 4: gammalooprs::cff::generation::tests_cff::thermal_mercedes
  338. 56.85 s gammaloop-nextest-core> 5: <gammalooprs::cff::generation::tests_cff::thermal_mercedes::{closure#0} as core::ops::function::FnOnce<()>>::call_once
  339. 56.85 s gammaloop-nextest-core> note: Some details are omitted, run with `RUST_BACKTRACE=full` for a verbose backtrace.
  340. 56.85 s gammaloop-nextest-core>
  341. 57.99 s gammaloop-nextest-core> FAIL [ 1.263s] (423/483) gammalooprs graph::feynman_graph::tests::native_thermal_distributions
  342. 57.99 s gammaloop-nextest-core> stdout ---
  343. 57.99 s gammaloop-nextest-core>
  344. 57.99 s gammaloop-nextest-core> running 1 test
  345. 57.99 s gammaloop-nextest-core> test graph::feynman_graph::tests::native_thermal_distributions ... FAILED
  346. 57.99 s gammaloop-nextest-core>
  347. 57.99 s gammaloop-nextest-core> failures:
  348. 57.99 s gammaloop-nextest-core>
  349. 57.99 s gammaloop-nextest-core> failures:
  350. 57.99 s gammaloop-nextest-core> graph::feynman_graph::tests::native_thermal_distributions
  351. 57.99 s gammaloop-nextest-core>
  352. 57.99 s gammaloop-nextest-core> test result: FAILED. 0 passed; 1 failed; 0 ignored; 0 measured; 535 filtered out; finished in 1.25s
  353. 57.99 s gammaloop-nextest-core>
  354. 57.99 s gammaloop-nextest-core> stderr ---
  355. 57.99 s gammaloop-nextest-core> The application panicked (crashed).
  356. 57.99 s gammaloop-nextest-core> Message: called `Result::unwrap()` on an `Err` value: Custom { kind: Other, error: "Could not compile code: g++ -shared -O3 -fPIC -ffast-math -funsafe-math-optimizations -march=native -o /build/gammaloop-native-thermal-1340/thermal_0_0.so /build/gammaloop-native-thermal-1340/thermal_0_0.cpp\nwarning: Skipping impure flag -march=native because NIX_ENFORCE_NO_NATIVE is set\n/build/gammaloop-native-thermal-1340/thermal_0_0.cpp: In function 'void thermal_realf64(const double*, double*, double*)':\n/build/gammaloop-native-thermal-1340/thermal_0_0.cpp:27:16: error: 'symbolica_tanh' was not declared in this scope\n 27 | Z[6] = symbolica_tanh(Z[6]);\n | ^~~~~~~~~~~~~~\n" }
  357. 57.99 s gammaloop-nextest-core> Location: crates/gammalooprs/src/graph/feynman_graph.rs:937
  358. 57.99 s gammaloop-nextest-core>
  359. 57.99 s gammaloop-nextest-core> ━━━━━━━━━━━━━━━━━━━━━━━━━━━━━━━━━━ BACKTRACE ━━━━━━━━━━━━━━━━━━━━━━━━━━━━━━━━━━━
  360. 57.99 s gammaloop-nextest-core> 1: <color_eyre[b0c9e66060e883b2]::config::PanicHook>::panic_report<unknown>
  361. 57.99 s gammaloop-nextest-core> at <unknown source file>:<unknown line>
  362. 57.99 s gammaloop-nextest-core> 2: <color_eyre[b0c9e66060e883b2]::config::PanicHook>::into_panic_hook::{closure#0}<unknown>
  363. 57.99 s gammaloop-nextest-core> at <unknown source file>:<unknown line>
  364. 57.99 s gammaloop-nextest-core> 3: std[bcb96dfbba0ab899]::panicking::panic_with_hook<unknown>
  365. 57.99 s gammaloop-nextest-core> at <unknown source file>:<unknown line>
  366. 57.99 s gammaloop-nextest-core> 4: std[bcb96dfbba0ab899]::panicking::panic_handler::{closure#0}<unknown>
  367. 57.99 s gammaloop-nextest-core> at <unknown source file>:<unknown line>
  368. 57.99 s gammaloop-nextest-core> 5: std[bcb96dfbba0ab899]::sys::backtrace::__rust_end_short_backtrace::<std[bcb96dfbba0ab899]::panicking::panic_handler::{closure#0}, !><unknown>
  369. 57.99 s gammaloop-nextest-core> at <unknown source file>:<unknown line>
  370. 57.99 s gammaloop-nextest-core> 6: __rustc[6c289b9f9c454d21]::rust_begin_unwind<unknown>
  371. 57.99 s gammaloop-nextest-core> at <unknown source file>:<unknown line>
  372. 57.99 s gammaloop-nextest-core> 7: core[940e698046960fd5]::panicking::panic_fmt<unknown>
  373. 57.99 s gammaloop-nextest-core> at <unknown source file>:<unknown line>
  374. 57.99 s gammaloop-nextest-core> 8: core[940e698046960fd5]::result::unwrap_failed<unknown>
  375. 57.99 s gammaloop-nextest-core> at <unknown source file>:<unknown line>
  376. 57.99 s gammaloop-nextest-core> 9: gammalooprs[5490727360442cce]::graph::feynman_graph::tests::native_thermal_distributions<unknown>
  377. 57.99 s gammaloop-nextest-core> at <unknown source file>:<unknown line>
  378. 57.99 s gammaloop-nextest-core> 10: <gammalooprs[5490727360442cce]::graph::feynman_graph::tests::native_thermal_distributions::{closure#0} as core[940e698046960fd5]::ops::function::FnOnce<()>>::call_once<unknown>
  379. 57.99 s gammaloop-nextest-core> at <unknown source file>:<unknown line>
  380. 57.99 s gammaloop-nextest-core> 11: test[75d6903177b1d7e9]::__rust_begin_short_backtrace::<core[940e698046960fd5]::result::Result<(), alloc[2ea6bcb46fca0c42]::string::String>, fn() -> core[940e698046960fd5]::result::Result<(), alloc[2ea6bcb46fca0c42]::string::String>><unknown>
  381. 57.99 s gammaloop-nextest-core> at <unknown source file>:<unknown line>
  382. 57.99 s gammaloop-nextest-core> 12: test[75d6903177b1d7e9]::run_test::{closure#0}<unknown>
  383. 57.99 s gammaloop-nextest-core> at <unknown source file>:<unknown line>
  384. 57.99 s gammaloop-nextest-core> 13: std[bcb96dfbba0ab899]::sys::backtrace::__rust_begin_short_backtrace::<test[75d6903177b1d7e9]::run_test::{closure#1}, ()><unknown>
  385. 57.99 s gammaloop-nextest-core> at <unknown source file>:<unknown line>
  386. 57.99 s gammaloop-nextest-core> 14: <std[bcb96dfbba0ab899]::thread::lifecycle::spawn_unchecked<test[75d6903177b1d7e9]::run_test::{closure#1}, ()>::{closure#1} as core[940e698046960fd5]::ops::function::FnOnce<()>>::call_once::{shim:vtable#0}<unknown>
  387. 57.99 s gammaloop-nextest-core> at <unknown source file>:<unknown line>
  388. 57.99 s gammaloop-nextest-core> 15: <std[bcb96dfbba0ab899]::sys::thread::unix::Thread>::new::thread_start<unknown>
  389. 57.99 s gammaloop-nextest-core> at <unknown source file>:<unknown line>
  390. 57.99 s gammaloop-nextest-core> 16: start_thread<unknown>
  391. 57.99 s gammaloop-nextest-core> at <unknown source file>:<unknown line>
  392. 57.99 s gammaloop-nextest-core> 17: __clone3<unknown>
  393. 57.99 s gammaloop-nextest-core> at <unknown source file>:<unknown line>
  394. 57.99 s gammaloop-nextest-core>
  395. 57.99 s gammaloop-nextest-core> Run with COLORBT_SHOW_HIDDEN=1 environment variable to disable frame filtering.
  396. 57.99 s gammaloop-nextest-core> Run with RUST_BACKTRACE=full to include source snippets.
  397. 57.99 s gammaloop-nextest-core>
  398. 68.52 s gammaloop-nextest-core> FAIL [ 11.844s] (481/483) gammalooprs cff::generation::tests_cff::thermal_bugblatter
  399. 68.52 s gammaloop-nextest-core> stdout ---
  400. 68.52 s gammaloop-nextest-core>
  401. 68.52 s gammaloop-nextest-core> running 1 test
  402. 68.52 s gammaloop-nextest-core> test cff::generation::tests_cff::thermal_bugblatter ... FAILED
  403. 68.52 s gammaloop-nextest-core>
  404. 68.52 s gammaloop-nextest-core> failures:
  405. 68.52 s gammaloop-nextest-core>
  406. 68.52 s gammaloop-nextest-core> failures:
  407. 68.52 s gammaloop-nextest-core> cff::generation::tests_cff::thermal_bugblatter
  408. 68.52 s gammaloop-nextest-core>
  409. 68.52 s gammaloop-nextest-core> test result: FAILED. 0 passed; 1 failed; 0 ignored; 0 measured; 535 filtered out; finished in 11.78s
  410. 68.52 s gammaloop-nextest-core>
  411. 68.52 s gammaloop-nextest-core> stderr ---
  412. 68.52 s gammaloop-nextest-core>
  413. 68.52 s gammaloop-nextest-core> thread 'cff::generation::tests_cff::thermal_bugblatter' (1296) panicked at /nix/store/1sigmg52bb61pfngmk9k8wq5fz9r7bf1-vendor-cargo-deps/5929dab090e556a579e9f3b708cd2e67c60b3d84a12b5a276f2a36cb00473133/symbolica-2.2.0/src/evaluate/evaluator.rs:295:21:
  414. 68.52 s gammaloop-nextest-core> External function 'symbolica_coth' does not have an implementation for gammalooprs::utils::F<f64>
  415. 68.52 s gammaloop-nextest-core> stack backtrace:
  416. 68.52 s gammaloop-nextest-core> 0: __rustc::rust_begin_unwind
  417. 68.52 s gammaloop-nextest-core> 1: core::panicking::panic_fmt
  418. 68.52 s gammaloop-nextest-core> 2: <symbolica::evaluate::evaluator::ExpressionEvaluator<gammalooprs::utils::F<f64>>>::evaluate_impl_no_ops
  419. 68.52 s gammaloop-nextest-core> 3: <symbolica::evaluate::evaluator::ExpressionEvaluator<gammalooprs::utils::F<f64>>>::evaluate_single
  420. 68.52 s gammaloop-nextest-core> 4: gammalooprs::cff::generation::tests_cff::thermal_bugblatter
  421. 68.52 s gammaloop-nextest-core> 5: <gammalooprs::cff::generation::tests_cff::thermal_bugblatter::{closure#0} as core::ops::function::FnOnce<()>>::call_once
  422. 68.52 s gammaloop-nextest-core> note: Some details are omitted, run with `RUST_BACKTRACE=full` for a verbose backtrace.
  423. 68.52 s gammaloop-nextest-core>
  424. 71.37 s gammaloop-nextest-core> ------------
  425. 71.37 s gammaloop-nextest-core> Summary [ 14.736s] 483 tests run: 476 passed, 7 failed, 61 skipped
  426. 71.37 s gammaloop-nextest-core> FAIL [ 0.026s] ( 44/483) gammalooprs cff::generation::tests_cff::thermal_bubble
  427. 71.37 s gammaloop-nextest-core> stdout ---
  428. 71.37 s gammaloop-nextest-core>
  429. 71.37 s gammaloop-nextest-core> running 1 test
  430. 71.37 s gammaloop-nextest-core> test cff::generation::tests_cff::thermal_bubble ... FAILED
  431. 71.37 s gammaloop-nextest-core>
  432. 71.37 s gammaloop-nextest-core> failures:
  433. 71.37 s gammaloop-nextest-core>
  434. 71.37 s gammaloop-nextest-core> failures:
  435. 71.37 s gammaloop-nextest-core> cff::generation::tests_cff::thermal_bubble
  436. 71.37 s gammaloop-nextest-core>
  437. 71.37 s gammaloop-nextest-core> test result: FAILED. 0 passed; 1 failed; 0 ignored; 0 measured; 535 filtered out; finished in 0.02s
  438. 71.37 s gammaloop-nextest-core>
  439. 71.37 s gammaloop-nextest-core> stderr ---
  440. 71.37 s gammaloop-nextest-core>
  441. 71.37 s gammaloop-nextest-core> thread 'cff::generation::tests_cff::thermal_bubble' (1264) panicked at /nix/store/1sigmg52bb61pfngmk9k8wq5fz9r7bf1-vendor-cargo-deps/5929dab090e556a579e9f3b708cd2e67c60b3d84a12b5a276f2a36cb00473133/symbolica-2.2.0/src/evaluate/evaluator.rs:295:21:
  442. 71.37 s gammaloop-nextest-core> External function 'symbolica_coth' does not have an implementation for gammalooprs::utils::F<f64>
  443. 71.37 s gammaloop-nextest-core> stack backtrace:
  444. 71.37 s gammaloop-nextest-core> 0: __rustc::rust_begin_unwind
  445. 71.37 s gammaloop-nextest-core> 1: core::panicking::panic_fmt
  446. 71.37 s gammaloop-nextest-core> 2: <symbolica::evaluate::evaluator::ExpressionEvaluator<gammalooprs::utils::F<f64>>>::evaluate_impl_no_ops
  447. 71.37 s gammaloop-nextest-core> 3: <symbolica::evaluate::evaluator::ExpressionEvaluator<gammalooprs::utils::F<f64>>>::evaluate_single
  448. 71.37 s gammaloop-nextest-core> 4: gammalooprs::cff::generation::tests_cff::thermal_bubble
  449. 71.37 s gammaloop-nextest-core> 5: <gammalooprs::cff::generation::tests_cff::thermal_bubble::{closure#0} as core::ops::function::FnOnce<()>>::call_once
  450. 71.37 s gammaloop-nextest-core> note: Some details are omitted, run with `RUST_BACKTRACE=full` for a verbose backtrace.
  451. 71.37 s gammaloop-nextest-core>
  452. 71.37 s gammaloop-nextest-core> FAIL [ 0.030s] ( 50/483) gammalooprs cff::generation::tests_cff::thermal_eight
  453. 71.37 s gammaloop-nextest-core> stdout ---
  454. 71.37 s gammaloop-nextest-core>
  455. 71.37 s gammaloop-nextest-core> running 1 test
  456. 71.37 s gammaloop-nextest-core> test cff::generation::tests_cff::thermal_eight ... FAILED
  457. 71.37 s gammaloop-nextest-core>
  458. 71.37 s gammaloop-nextest-core> failures:
  459. 71.37 s gammaloop-nextest-core>
  460. 71.37 s gammaloop-nextest-core> failures:
  461. 71.37 s gammaloop-nextest-core> cff::generation::tests_cff::thermal_eight
  462. 71.37 s gammaloop-nextest-core>
  463. 71.37 s gammaloop-nextest-core> test result: FAILED. 0 passed; 1 failed; 0 ignored; 0 measured; 535 filtered out; finished in 0.02s
  464. 71.37 s gammaloop-nextest-core>
  465. 71.37 s gammaloop-nextest-core> stderr ---
  466. 71.37 s gammaloop-nextest-core>
  467. 71.37 s gammaloop-nextest-core> thread 'cff::generation::tests_cff::thermal_eight' (1281) panicked at /nix/store/1sigmg52bb61pfngmk9k8wq5fz9r7bf1-vendor-cargo-deps/5929dab090e556a579e9f3b708cd2e67c60b3d84a12b5a276f2a36cb00473133/symbolica-2.2.0/src/evaluate/evaluator.rs:295:21:
  468. 71.37 s gammaloop-nextest-core> External function 'symbolica_coth' does not have an implementation for gammalooprs::utils::F<f64>
  469. 71.37 s gammaloop-nextest-core> stack backtrace:
  470. 71.37 s gammaloop-nextest-core> 0: __rustc::rust_begin_unwind
  471. 71.37 s gammaloop-nextest-core> 1: core::panicking::panic_fmt
  472. 71.37 s gammaloop-nextest-core> 2: <symbolica::evaluate::evaluator::ExpressionEvaluator<gammalooprs::utils::F<f64>>>::evaluate_impl_no_ops
  473. 71.37 s gammaloop-nextest-core> 3: <symbolica::evaluate::evaluator::ExpressionEvaluator<gammalooprs::utils::F<f64>>>::evaluate_single
  474. 71.37 s gammaloop-nextest-core> 4: gammalooprs::cff::generation::tests_cff::thermal_eight
  475. 71.37 s gammaloop-nextest-core> 5: <gammalooprs::cff::generation::tests_cff::thermal_eight::{closure#0} as core::ops::function::FnOnce<()>>::call_once
  476. 71.37 s gammaloop-nextest-core> note: Some details are omitted, run with `RUST_BACKTRACE=full` for a verbose backtrace.
  477. 71.37 s gammaloop-nextest-core>
  478. 71.37 s gammaloop-nextest-core> FAIL [ 0.046s] ( 59/483) gammalooprs cff::generation::tests_cff::thermal_bubble_chain
  479. 71.37 s gammaloop-nextest-core> stdout ---
  480. 71.37 s gammaloop-nextest-core>
  481. 71.37 s gammaloop-nextest-core> running 1 test
  482. 71.37 s gammaloop-nextest-core> test cff::generation::tests_cff::thermal_bubble_chain ... FAILED
  483. 71.37 s gammaloop-nextest-core>
  484. 71.37 s gammaloop-nextest-core> failures:
  485. 71.37 s gammaloop-nextest-core>
  486. 71.37 s gammaloop-nextest-core> failures:
  487. 71.37 s gammaloop-nextest-core> cff::generation::tests_cff::thermal_bubble_chain
  488. 71.37 s gammaloop-nextest-core>
  489. 71.37 s gammaloop-nextest-core> test result: FAILED. 0 passed; 1 failed; 0 ignored; 0 measured; 535 filtered out; finished in 0.01s
  490. 71.37 s gammaloop-nextest-core>
  491. 71.37 s gammaloop-nextest-core> stderr ---
  492. 71.37 s gammaloop-nextest-core>
  493. 71.37 s gammaloop-nextest-core> thread 'cff::generation::tests_cff::thermal_bubble_chain' (1301) panicked at /nix/store/1sigmg52bb61pfngmk9k8wq5fz9r7bf1-vendor-cargo-deps/5929dab090e556a579e9f3b708cd2e67c60b3d84a12b5a276f2a36cb00473133/symbolica-2.2.0/src/evaluate/evaluator.rs:295:21:
  494. 71.37 s gammaloop-nextest-core> External function 'symbolica_coth' does not have an implementation for gammalooprs::utils::F<f64>
  495. 71.37 s gammaloop-nextest-core> stack backtrace:
  496. 71.37 s gammaloop-nextest-core> 0: __rustc::rust_begin_unwind
  497. 71.37 s gammaloop-nextest-core> 1: core::panicking::panic_fmt
  498. 71.37 s gammaloop-nextest-core> 2: <symbolica::evaluate::evaluator::ExpressionEvaluator<gammalooprs::utils::F<f64>>>::evaluate_impl_no_ops
  499. 71.37 s gammaloop-nextest-core> 3: <symbolica::evaluate::evaluator::ExpressionEvaluator<gammalooprs::utils::F<f64>>>::evaluate_single
  500. 71.37 s gammaloop-nextest-core> 4: gammalooprs::cff::generation::tests_cff::thermal_bubble_chain
  501. 71.37 s gammaloop-nextest-core> 5: <gammalooprs::cff::generation::tests_cff::thermal_bubble_chain::{closure#0} as core::ops::function::FnOnce<()>>::call_once
  502. 71.37 s gammaloop-nextest-core> note: Some details are omitted, run with `RUST_BACKTRACE=full` for a verbose backtrace.
  503. 71.37 s gammaloop-nextest-core>
  504. 71.37 s gammaloop-nextest-core> FAIL [ 0.132s] ( 76/483) gammalooprs cff::generation::tests_cff::thermal_ring
  505. 71.37 s gammaloop-nextest-core> stdout ---
  506. 71.37 s gammaloop-nextest-core>
  507. 71.37 s gammaloop-nextest-core> running 1 test
  508. 71.37 s gammaloop-nextest-core> test cff::generation::tests_cff::thermal_ring ... FAILED
  509. 71.37 s gammaloop-nextest-core>
  510. 71.37 s gammaloop-nextest-core> failures:
  511. 71.37 s gammaloop-nextest-core>
  512. 71.37 s gammaloop-nextest-core> failures:
  513. 71.37 s gammaloop-nextest-core> cff::generation::tests_cff::thermal_ring
  514. 71.37 s gammaloop-nextest-core>
  515. 71.37 s gammaloop-nextest-core> test result: FAILED. 0 passed; 1 failed; 0 ignored; 0 measured; 535 filtered out; finished in 0.12s
  516. 71.37 s gammaloop-nextest-core>
  517. 71.37 s gammaloop-nextest-core> stderr ---
  518. 71.37 s gammaloop-nextest-core>
  519. 71.37 s gammaloop-nextest-core> thread 'cff::generation::tests_cff::thermal_ring' (1286) panicked at /nix/store/1sigmg52bb61pfngmk9k8wq5fz9r7bf1-vendor-cargo-deps/5929dab090e556a579e9f3b708cd2e67c60b3d84a12b5a276f2a36cb00473133/symbolica-2.2.0/src/evaluate/evaluator.rs:295:21:
  520. 71.37 s gammaloop-nextest-core> External function 'symbolica_coth' does not have an implementation for gammalooprs::utils::F<f64>
  521. 71.37 s gammaloop-nextest-core> stack backtrace:
  522. 71.37 s gammaloop-nextest-core> 0: __rustc::rust_begin_unwind
  523. 71.37 s gammaloop-nextest-core> 1: core::panicking::panic_fmt
  524. 71.37 s gammaloop-nextest-core> 2: <symbolica::evaluate::evaluator::ExpressionEvaluator<gammalooprs::utils::F<f64>>>::evaluate_impl_no_ops
  525. 71.37 s gammaloop-nextest-core> 3: <symbolica::evaluate::evaluator::ExpressionEvaluator<gammalooprs::utils::F<f64>>>::evaluate_single
  526. 71.37 s gammaloop-nextest-core> 4: gammalooprs::cff::generation::tests_cff::thermal_ring
  527. 71.37 s gammaloop-nextest-core> 5: <gammalooprs::cff::generation::tests_cff::thermal_ring::{closure#0} as core::ops::function::FnOnce<()>>::call_once
  528. 71.37 s gammaloop-nextest-core> note: Some details are omitted, run with `RUST_BACKTRACE=full` for a verbose backtrace.
  529. 71.37 s gammaloop-nextest-core>
  530. 71.37 s gammaloop-nextest-core> FAIL [ 0.174s] ( 79/483) gammalooprs cff::generation::tests_cff::thermal_mercedes
  531. 71.37 s gammaloop-nextest-core> stdout ---
  532. 71.37 s gammaloop-nextest-core>
  533. 71.37 s gammaloop-nextest-core> running 1 test
  534. 71.37 s gammaloop-nextest-core> test cff::generation::tests_cff::thermal_mercedes ... FAILED
  535. 71.37 s gammaloop-nextest-core>
  536. 71.37 s gammaloop-nextest-core> failures:
  537. 71.37 s gammaloop-nextest-core>
  538. 71.37 s gammaloop-nextest-core> failures:
  539. 71.37 s gammaloop-nextest-core> cff::generation::tests_cff::thermal_mercedes
  540. 71.37 s gammaloop-nextest-core>
  541. 71.37 s gammaloop-nextest-core> test result: FAILED. 0 passed; 1 failed; 0 ignored; 0 measured; 535 filtered out; finished in 0.15s
  542. 71.37 s gammaloop-nextest-core>
  543. 71.37 s gammaloop-nextest-core> stderr ---
  544. 71.37 s gammaloop-nextest-core>
  545. 71.37 s gammaloop-nextest-core> thread 'cff::generation::tests_cff::thermal_mercedes' (1306) panicked at /nix/store/1sigmg52bb61pfngmk9k8wq5fz9r7bf1-vendor-cargo-deps/5929dab090e556a579e9f3b708cd2e67c60b3d84a12b5a276f2a36cb00473133/symbolica-2.2.0/src/evaluate/evaluator.rs:295:21:
  546. 71.37 s gammaloop-nextest-core> External function 'symbolica_coth' does not have an implementation for gammalooprs::utils::F<f64>
  547. 71.37 s gammaloop-nextest-core> stack backtrace:
  548. 71.37 s gammaloop-nextest-core> 0: __rustc::rust_begin_unwind
  549. 71.37 s gammaloop-nextest-core> 1: core::panicking::panic_fmt
  550. 71.37 s gammaloop-nextest-core> 2: <symbolica::evaluate::evaluator::ExpressionEvaluator<gammalooprs::utils::F<f64>>>::evaluate_impl_no_ops
  551. 71.37 s gammaloop-nextest-core> 3: <symbolica::evaluate::evaluator::ExpressionEvaluator<gammalooprs::utils::F<f64>>>::evaluate_single
  552. 71.37 s gammaloop-nextest-core> 4: gammalooprs::cff::generation::tests_cff::thermal_mercedes
  553. 71.37 s gammaloop-nextest-core> 5: <gammalooprs::cff::generation::tests_cff::thermal_mercedes::{closure#0} as core::ops::function::FnOnce<()>>::call_once
  554. 71.37 s gammaloop-nextest-core> note: Some details are omitted, run with `RUST_BACKTRACE=full` for a verbose backtrace.
  555. 71.37 s gammaloop-nextest-core>
  556. 71.37 s gammaloop-nextest-core> FAIL [ 1.263s] (423/483) gammalooprs graph::feynman_graph::tests::native_thermal_distributions
  557. 71.37 s gammaloop-nextest-core> stdout ---
  558. 71.37 s gammaloop-nextest-core>
  559. 71.37 s gammaloop-nextest-core> running 1 test
  560. 71.37 s gammaloop-nextest-core> test graph::feynman_graph::tests::native_thermal_distributions ... FAILED
  561. 71.37 s gammaloop-nextest-core>
  562. 71.37 s gammaloop-nextest-core> failures:
  563. 71.37 s gammaloop-nextest-core>
  564. 71.37 s gammaloop-nextest-core> failures:
  565. 71.37 s gammaloop-nextest-core> graph::feynman_graph::tests::native_thermal_distributions
  566. 71.37 s gammaloop-nextest-core>
  567. 71.37 s gammaloop-nextest-core> test result: FAILED. 0 passed; 1 failed; 0 ignored; 0 measured; 535 filtered out; finished in 1.25s
  568. 71.37 s gammaloop-nextest-core>
  569. 71.37 s gammaloop-nextest-core> stderr ---
  570. 71.37 s gammaloop-nextest-core> The application panicked (crashed).
  571. 71.37 s gammaloop-nextest-core> Message: called `Result::unwrap()` on an `Err` value: Custom { kind: Other, error: "Could not compile code: g++ -shared -O3 -fPIC -ffast-math -funsafe-math-optimizations -march=native -o /build/gammaloop-native-thermal-1340/thermal_0_0.so /build/gammaloop-native-thermal-1340/thermal_0_0.cpp\nwarning: Skipping impure flag -march=native because NIX_ENFORCE_NO_NATIVE is set\n/build/gammaloop-native-thermal-1340/thermal_0_0.cpp: In function 'void thermal_realf64(const double*, double*, double*)':\n/build/gammaloop-native-thermal-1340/thermal_0_0.cpp:27:16: error: 'symbolica_tanh' was not declared in this scope\n 27 | Z[6] = symbolica_tanh(Z[6]);\n | ^~~~~~~~~~~~~~\n" }
  572. 71.37 s gammaloop-nextest-core> Location: crates/gammalooprs/src/graph/feynman_graph.rs:937
  573. 71.37 s gammaloop-nextest-core>
  574. 71.37 s gammaloop-nextest-core> ━━━━━━━━━━━━━━━━━━━━━━━━━━━━━━━━━━ BACKTRACE ━━━━━━━━━━━━━━━━━━━━━━━━━━━━━━━━━━━
  575. 71.37 s gammaloop-nextest-core> 1: <color_eyre[b0c9e66060e883b2]::config::PanicHook>::panic_report<unknown>
  576. 71.37 s gammaloop-nextest-core> at <unknown source file>:<unknown line>
  577. 71.37 s gammaloop-nextest-core> 2: <color_eyre[b0c9e66060e883b2]::config::PanicHook>::into_panic_hook::{closure#0}<unknown>
  578. 71.37 s gammaloop-nextest-core> at <unknown source file>:<unknown line>
  579. 71.37 s gammaloop-nextest-core> 3: std[bcb96dfbba0ab899]::panicking::panic_with_hook<unknown>
  580. 71.37 s gammaloop-nextest-core> at <unknown source file>:<unknown line>
  581. 71.37 s gammaloop-nextest-core> 4: std[bcb96dfbba0ab899]::panicking::panic_handler::{closure#0}<unknown>
  582. 71.37 s gammaloop-nextest-core> at <unknown source file>:<unknown line>
  583. 71.37 s gammaloop-nextest-core> 5: std[bcb96dfbba0ab899]::sys::backtrace::__rust_end_short_backtrace::<std[bcb96dfbba0ab899]::panicking::panic_handler::{closure#0}, !><unknown>
  584. 71.37 s gammaloop-nextest-core> at <unknown source file>:<unknown line>
  585. 71.37 s gammaloop-nextest-core> 6: __rustc[6c289b9f9c454d21]::rust_begin_unwind<unknown>
  586. 71.37 s gammaloop-nextest-core> at <unknown source file>:<unknown line>
  587. 71.37 s gammaloop-nextest-core> 7: core[940e698046960fd5]::panicking::panic_fmt<unknown>
  588. 71.37 s gammaloop-nextest-core> at <unknown source file>:<unknown line>
  589. 71.37 s gammaloop-nextest-core> 8: core[940e698046960fd5]::result::unwrap_failed<unknown>
  590. 71.37 s gammaloop-nextest-core> at <unknown source file>:<unknown line>
  591. 71.37 s gammaloop-nextest-core> 9: gammalooprs[5490727360442cce]::graph::feynman_graph::tests::native_thermal_distributions<unknown>
  592. 71.37 s gammaloop-nextest-core> at <unknown source file>:<unknown line>
  593. 71.37 s gammaloop-nextest-core> 10: <gammalooprs[5490727360442cce]::graph::feynman_graph::tests::native_thermal_distributions::{closure#0} as core[940e698046960fd5]::ops::function::FnOnce<()>>::call_once<unknown>
  594. 71.37 s gammaloop-nextest-core> at <unknown source file>:<unknown line>
  595. 71.37 s gammaloop-nextest-core> 11: test[75d6903177b1d7e9]::__rust_begin_short_backtrace::<core[940e698046960fd5]::result::Result<(), alloc[2ea6bcb46fca0c42]::string::String>, fn() -> core[940e698046960fd5]::result::Result<(), alloc[2ea6bcb46fca0c42]::string::String>><unknown>
  596. 71.37 s gammaloop-nextest-core> at <unknown source file>:<unknown line>
  597. 71.37 s gammaloop-nextest-core> 12: test[75d6903177b1d7e9]::run_test::{closure#0}<unknown>
  598. 71.37 s gammaloop-nextest-core> at <unknown source file>:<unknown line>
  599. 71.37 s gammaloop-nextest-core> 13: std[bcb96dfbba0ab899]::sys::backtrace::__rust_begin_short_backtrace::<test[75d6903177b1d7e9]::run_test::{closure#1}, ()><unknown>
  600. 71.37 s gammaloop-nextest-core> at <unknown source file>:<unknown line>
  601. 71.37 s gammaloop-nextest-core> 14: <std[bcb96dfbba0ab899]::thread::lifecycle::spawn_unchecked<test[75d6903177b1d7e9]::run_test::{closure#1}, ()>::{closure#1} as core[940e698046960fd5]::ops::function::FnOnce<()>>::call_once::{shim:vtable#0}<unknown>
  602. 71.37 s gammaloop-nextest-core> at <unknown source file>:<unknown line>
  603. 71.37 s gammaloop-nextest-core> 15: <std[bcb96dfbba0ab899]::sys::thread::unix::Thread>::new::thread_start<unknown>
  604. 71.37 s gammaloop-nextest-core> at <unknown source file>:<unknown line>
  605. 71.37 s gammaloop-nextest-core> 16: start_thread<unknown>
  606. 71.37 s gammaloop-nextest-core> at <unknown source file>:<unknown line>
  607. 71.37 s gammaloop-nextest-core> 17: __clone3<unknown>
  608. 71.37 s gammaloop-nextest-core> at <unknown source file>:<unknown line>
  609. 71.37 s gammaloop-nextest-core>
  610. 71.37 s gammaloop-nextest-core> Run with COLORBT_SHOW_HIDDEN=1 environment variable to disable frame filtering.
  611. 71.37 s gammaloop-nextest-core> Run with RUST_BACKTRACE=full to include source snippets.
  612. 71.37 s gammaloop-nextest-core>
  613. 71.37 s gammaloop-nextest-core> FAIL [ 11.844s] (481/483) gammalooprs cff::generation::tests_cff::thermal_bugblatter
  614. 71.37 s gammaloop-nextest-core> stdout ---
  615. 71.37 s gammaloop-nextest-core>
  616. 71.37 s gammaloop-nextest-core> running 1 test
  617. 71.37 s gammaloop-nextest-core> test cff::generation::tests_cff::thermal_bugblatter ... FAILED
  618. 71.37 s gammaloop-nextest-core>
  619. 71.37 s gammaloop-nextest-core> failures:
  620. 71.37 s gammaloop-nextest-core>
  621. 71.37 s gammaloop-nextest-core> failures:
  622. 71.37 s gammaloop-nextest-core> cff::generation::tests_cff::thermal_bugblatter
  623. 71.37 s gammaloop-nextest-core>
  624. 71.37 s gammaloop-nextest-core> test result: FAILED. 0 passed; 1 failed; 0 ignored; 0 measured; 535 filtered out; finished in 11.78s
  625. 71.37 s gammaloop-nextest-core>
  626. 71.37 s gammaloop-nextest-core> stderr ---
  627. 71.37 s gammaloop-nextest-core>
  628. 71.37 s gammaloop-nextest-core> thread 'cff::generation::tests_cff::thermal_bugblatter' (1296) panicked at /nix/store/1sigmg52bb61pfngmk9k8wq5fz9r7bf1-vendor-cargo-deps/5929dab090e556a579e9f3b708cd2e67c60b3d84a12b5a276f2a36cb00473133/symbolica-2.2.0/src/evaluate/evaluator.rs:295:21:
  629. 71.37 s gammaloop-nextest-core> External function 'symbolica_coth' does not have an implementation for gammalooprs::utils::F<f64>
  630. 71.37 s gammaloop-nextest-core> stack backtrace:
  631. 71.37 s gammaloop-nextest-core> 0: __rustc::rust_begin_unwind
  632. 71.37 s gammaloop-nextest-core> 1: core::panicking::panic_fmt
  633. 71.37 s gammaloop-nextest-core> 2: <symbolica::evaluate::evaluator::ExpressionEvaluator<gammalooprs::utils::F<f64>>>::evaluate_impl_no_ops
  634. 71.37 s gammaloop-nextest-core> 3: <symbolica::evaluate::evaluator::ExpressionEvaluator<gammalooprs::utils::F<f64>>>::evaluate_single
  635. 71.37 s gammaloop-nextest-core> 4: gammalooprs::cff::generation::tests_cff::thermal_bugblatter
  636. 71.37 s gammaloop-nextest-core> 5: <gammalooprs::cff::generation::tests_cff::thermal_bugblatter::{closure#0} as core::ops::function::FnOnce<()>>::call_once
  637. 71.37 s gammaloop-nextest-core> note: Some details are omitted, run with `RUST_BACKTRACE=full` for a verbose backtrace.
  638. 71.37 s gammaloop-nextest-core>
  639. 71.45 s gammaloop-nextest-core> error: test run failed
  640. 71.50 s gammaloop-nextest-core>
  641. 71.50 s gammaloop-nextest-core> ========== nextest test summary ==========
  642. 71.50 s gammaloop-nextest-core> report: target/nextest/ci_gammaloop/junit.xml
  643. 71.50 s gammaloop-nextest-core> tests: 483, failures: 7, errors: 0
  644. 71.50 s gammaloop-nextest-core>
  645. 71.50 s gammaloop-nextest-core> 1. gammalooprs::cff::generation::tests_cff::thermal_bubble
  646. 71.50 s gammaloop-nextest-core> failure: test failure with exit code 101
  647. 71.50 s gammaloop-nextest-core> thread 'cff::generation::tests_cff::thermal_bubble' (1264) panicked at /nix/store/1sigmg52bb61pfngmk9k8wq5fz9r7bf1-vendor-cargo-deps/5929dab090e556a579e9f3b708cd2e67c60b3d84a12b5a276f2a36cb00473133/symbolica-2.2.0/src/evaluate/evaluator.rs:295:21:
  648. 71.50 s gammaloop-nextest-core> External function 'symbolica_coth' does not have an implementation for gammalooprs::utils::F<f64>
  649. 71.50 s gammaloop-nextest-core> stack backtrace:
  650. 71.50 s gammaloop-nextest-core> 0: __rustc::rust_begin_unwind
  651. 71.50 s gammaloop-nextest-core> 1: core::panicking::panic_fmt
  652. 71.50 s gammaloop-nextest-core> 2: <symbolica::evaluate::evaluator::ExpressionEvaluator<gammalooprs::utils::F<f64>>>::evaluate_impl_no_ops
  653. 71.50 s gammaloop-nextest-core> 3: <symbolica::evaluate::evaluator::ExpressionEvaluator<gammalooprs::utils::F<f64>>>::evaluate_single
  654. 71.50 s gammaloop-nextest-core> 4: gammalooprs::cff::generation::tests_cff::thermal_bubble
  655. 71.50 s gammaloop-nextest-core> 5: <gammalooprs::cff::generation::tests_cff::thermal_bubble::{closure#0} as core::ops::function::FnOnce<()>>::call_once
  656. 71.50 s gammaloop-nextest-core> note: Some details are omitted, run with `RUST_BACKTRACE=full` for a verbose backtrace.
  657. 71.50 s gammaloop-nextest-core> system-out
  658. 71.50 s gammaloop-nextest-core> running 1 test
  659. 71.50 s gammaloop-nextest-core> test cff::generation::tests_cff::thermal_bubble ... FAILED
  660. 71.50 s gammaloop-nextest-core>
  661. 71.50 s gammaloop-nextest-core> failures:
  662. 71.50 s gammaloop-nextest-core>
  663. 71.50 s gammaloop-nextest-core> failures:
  664. 71.50 s gammaloop-nextest-core> cff::generation::tests_cff::thermal_bubble
  665. 71.50 s gammaloop-nextest-core>
  666. 71.50 s gammaloop-nextest-core> test result: FAILED. 0 passed; 1 failed; 0 ignored; 0 measured; 535 filtered out; finished in 0.02s
  667. 71.50 s gammaloop-nextest-core> system-err
  668. 71.50 s gammaloop-nextest-core> thread 'cff::generation::tests_cff::thermal_bubble' (1264) panicked at /nix/store/1sigmg52bb61pfngmk9k8wq5fz9r7bf1-vendor-cargo-deps/5929dab090e556a579e9f3b708cd2e67c60b3d84a12b5a276f2a36cb00473133/symbolica-2.2.0/src/evaluate/evaluator.rs:295:21:
  669. 71.50 s gammaloop-nextest-core> External function 'symbolica_coth' does not have an implementation for gammalooprs::utils::F<f64>
  670. 71.50 s gammaloop-nextest-core> stack backtrace:
  671. 71.50 s gammaloop-nextest-core> 0: __rustc::rust_begin_unwind
  672. 71.50 s gammaloop-nextest-core> 1: core::panicking::panic_fmt
  673. 71.50 s gammaloop-nextest-core> 2: <symbolica::evaluate::evaluator::ExpressionEvaluator<gammalooprs::utils::F<f64>>>::evaluate_impl_no_ops
  674. 71.50 s gammaloop-nextest-core> 3: <symbolica::evaluate::evaluator::ExpressionEvaluator<gammalooprs::utils::F<f64>>>::evaluate_single
  675. 71.50 s gammaloop-nextest-core> 4: gammalooprs::cff::generation::tests_cff::thermal_bubble
  676. 71.50 s gammaloop-nextest-core> 5: <gammalooprs::cff::generation::tests_cff::thermal_bubble::{closure#0} as core::ops::function::FnOnce<()>>::call_once
  677. 71.50 s gammaloop-nextest-core> note: Some details are omitted, run with `RUST_BACKTRACE=full` for a verbose backtrace.
  678. 71.50 s gammaloop-nextest-core>
  679. 71.50 s gammaloop-nextest-core> 2. gammalooprs::cff::generation::tests_cff::thermal_eight
  680. 71.50 s gammaloop-nextest-core> failure: test failure with exit code 101
  681. 71.50 s gammaloop-nextest-core> thread 'cff::generation::tests_cff::thermal_eight' (1281) panicked at /nix/store/1sigmg52bb61pfngmk9k8wq5fz9r7bf1-vendor-cargo-deps/5929dab090e556a579e9f3b708cd2e67c60b3d84a12b5a276f2a36cb00473133/symbolica-2.2.0/src/evaluate/evaluator.rs:295:21:
  682. 71.50 s gammaloop-nextest-core> External function 'symbolica_coth' does not have an implementation for gammalooprs::utils::F<f64>
  683. 71.50 s gammaloop-nextest-core> stack backtrace:
  684. 71.50 s gammaloop-nextest-core> 0: __rustc::rust_begin_unwind
  685. 71.50 s gammaloop-nextest-core> 1: core::panicking::panic_fmt
  686. 71.50 s gammaloop-nextest-core> 2: <symbolica::evaluate::evaluator::ExpressionEvaluator<gammalooprs::utils::F<f64>>>::evaluate_impl_no_ops
  687. 71.50 s gammaloop-nextest-core> 3: <symbolica::evaluate::evaluator::ExpressionEvaluator<gammalooprs::utils::F<f64>>>::evaluate_single
  688. 71.50 s gammaloop-nextest-core> 4: gammalooprs::cff::generation::tests_cff::thermal_eight
  689. 71.50 s gammaloop-nextest-core> 5: <gammalooprs::cff::generation::tests_cff::thermal_eight::{closure#0} as core::ops::function::FnOnce<()>>::call_once
  690. 71.50 s gammaloop-nextest-core> note: Some details are omitted, run with `RUST_BACKTRACE=full` for a verbose backtrace.
  691. 71.50 s gammaloop-nextest-core> system-out
  692. 71.50 s gammaloop-nextest-core> running 1 test
  693. 71.50 s gammaloop-nextest-core> test cff::generation::tests_cff::thermal_eight ... FAILED
  694. 71.50 s gammaloop-nextest-core>
  695. 71.50 s gammaloop-nextest-core> failures:
  696. 71.50 s gammaloop-nextest-core>
  697. 71.50 s gammaloop-nextest-core> failures:
  698. 71.50 s gammaloop-nextest-core> cff::generation::tests_cff::thermal_eight
  699. 71.50 s gammaloop-nextest-core>
  700. 71.50 s gammaloop-nextest-core> test result: FAILED. 0 passed; 1 failed; 0 ignored; 0 measured; 535 filtered out; finished in 0.02s
  701. 71.50 s gammaloop-nextest-core> system-err
  702. 71.50 s gammaloop-nextest-core> thread 'cff::generation::tests_cff::thermal_eight' (1281) panicked at /nix/store/1sigmg52bb61pfngmk9k8wq5fz9r7bf1-vendor-cargo-deps/5929dab090e556a579e9f3b708cd2e67c60b3d84a12b5a276f2a36cb00473133/symbolica-2.2.0/src/evaluate/evaluator.rs:295:21:
  703. 71.50 s gammaloop-nextest-core> External function 'symbolica_coth' does not have an implementation for gammalooprs::utils::F<f64>
  704. 71.50 s gammaloop-nextest-core> stack backtrace:
  705. 71.50 s gammaloop-nextest-core> 0: __rustc::rust_begin_unwind
  706. 71.50 s gammaloop-nextest-core> 1: core::panicking::panic_fmt
  707. 71.50 s gammaloop-nextest-core> 2: <symbolica::evaluate::evaluator::ExpressionEvaluator<gammalooprs::utils::F<f64>>>::evaluate_impl_no_ops
  708. 71.50 s gammaloop-nextest-core> 3: <symbolica::evaluate::evaluator::ExpressionEvaluator<gammalooprs::utils::F<f64>>>::evaluate_single
  709. 71.50 s gammaloop-nextest-core> 4: gammalooprs::cff::generation::tests_cff::thermal_eight
  710. 71.50 s gammaloop-nextest-core> 5: <gammalooprs::cff::generation::tests_cff::thermal_eight::{closure#0} as core::ops::function::FnOnce<()>>::call_once
  711. 71.50 s gammaloop-nextest-core> note: Some details are omitted, run with `RUST_BACKTRACE=full` for a verbose backtrace.
  712. 71.50 s gammaloop-nextest-core>
  713. 71.50 s gammaloop-nextest-core> 3. gammalooprs::cff::generation::tests_cff::thermal_bubble_chain
  714. 71.50 s gammaloop-nextest-core> failure: test failure with exit code 101
  715. 71.50 s gammaloop-nextest-core> thread 'cff::generation::tests_cff::thermal_bubble_chain' (1301) panicked at /nix/store/1sigmg52bb61pfngmk9k8wq5fz9r7bf1-vendor-cargo-deps/5929dab090e556a579e9f3b708cd2e67c60b3d84a12b5a276f2a36cb00473133/symbolica-2.2.0/src/evaluate/evaluator.rs:295:21:
  716. 71.50 s gammaloop-nextest-core> External function 'symbolica_coth' does not have an implementation for gammalooprs::utils::F<f64>
  717. 71.50 s gammaloop-nextest-core> stack backtrace:
  718. 71.50 s gammaloop-nextest-core> 0: __rustc::rust_begin_unwind
  719. 71.50 s gammaloop-nextest-core> 1: core::panicking::panic_fmt
  720. 71.50 s gammaloop-nextest-core> 2: <symbolica::evaluate::evaluator::ExpressionEvaluator<gammalooprs::utils::F<f64>>>::evaluate_impl_no_ops
  721. 71.50 s gammaloop-nextest-core> 3: <symbolica::evaluate::evaluator::ExpressionEvaluator<gammalooprs::utils::F<f64>>>::evaluate_single
  722. 71.50 s gammaloop-nextest-core> 4: gammalooprs::cff::generation::tests_cff::thermal_bubble_chain
  723. 71.50 s gammaloop-nextest-core> 5: <gammalooprs::cff::generation::tests_cff::thermal_bubble_chain::{closure#0} as core::ops::function::FnOnce<()>>::call_once
  724. 71.50 s gammaloop-nextest-core> note: Some details are omitted, run with `RUST_BACKTRACE=full` for a verbose backtrace.
  725. 71.50 s gammaloop-nextest-core> system-out
  726. 71.50 s gammaloop-nextest-core> running 1 test
  727. 71.50 s gammaloop-nextest-core> test cff::generation::tests_cff::thermal_bubble_chain ... FAILED
  728. 71.50 s gammaloop-nextest-core>
  729. 71.50 s gammaloop-nextest-core> failures:
  730. 71.50 s gammaloop-nextest-core>
  731. 71.50 s gammaloop-nextest-core> failures:
  732. 71.50 s gammaloop-nextest-core> cff::generation::tests_cff::thermal_bubble_chain
  733. 71.50 s gammaloop-nextest-core>
  734. 71.50 s gammaloop-nextest-core> test result: FAILED. 0 passed; 1 failed; 0 ignored; 0 measured; 535 filtered out; finished in 0.01s
  735. 71.50 s gammaloop-nextest-core> system-err
  736. 71.50 s gammaloop-nextest-core> thread 'cff::generation::tests_cff::thermal_bubble_chain' (1301) panicked at /nix/store/1sigmg52bb61pfngmk9k8wq5fz9r7bf1-vendor-cargo-deps/5929dab090e556a579e9f3b708cd2e67c60b3d84a12b5a276f2a36cb00473133/symbolica-2.2.0/src/evaluate/evaluator.rs:295:21:
  737. 71.50 s gammaloop-nextest-core> External function 'symbolica_coth' does not have an implementation for gammalooprs::utils::F<f64>
  738. 71.50 s gammaloop-nextest-core> stack backtrace:
  739. 71.50 s gammaloop-nextest-core> 0: __rustc::rust_begin_unwind
  740. 71.50 s gammaloop-nextest-core> 1: core::panicking::panic_fmt
  741. 71.50 s gammaloop-nextest-core> 2: <symbolica::evaluate::evaluator::ExpressionEvaluator<gammalooprs::utils::F<f64>>>::evaluate_impl_no_ops
  742. 71.50 s gammaloop-nextest-core> 3: <symbolica::evaluate::evaluator::ExpressionEvaluator<gammalooprs::utils::F<f64>>>::evaluate_single
  743. 71.50 s gammaloop-nextest-core> 4: gammalooprs::cff::generation::tests_cff::thermal_bubble_chain
  744. 71.50 s gammaloop-nextest-core> 5: <gammalooprs::cff::generation::tests_cff::thermal_bubble_chain::{closure#0} as core::ops::function::FnOnce<()>>::call_once
  745. 71.50 s gammaloop-nextest-core> note: Some details are omitted, run with `RUST_BACKTRACE=full` for a verbose backtrace.
  746. 71.50 s gammaloop-nextest-core>
  747. 71.50 s gammaloop-nextest-core> 4. gammalooprs::cff::generation::tests_cff::thermal_ring
  748. 71.50 s gammaloop-nextest-core> failure: test failure with exit code 101
  749. 71.50 s gammaloop-nextest-core> thread 'cff::generation::tests_cff::thermal_ring' (1286) panicked at /nix/store/1sigmg52bb61pfngmk9k8wq5fz9r7bf1-vendor-cargo-deps/5929dab090e556a579e9f3b708cd2e67c60b3d84a12b5a276f2a36cb00473133/symbolica-2.2.0/src/evaluate/evaluator.rs:295:21:
  750. 71.50 s gammaloop-nextest-core> External function 'symbolica_coth' does not have an implementation for gammalooprs::utils::F<f64>
  751. 71.50 s gammaloop-nextest-core> stack backtrace:
  752. 71.50 s gammaloop-nextest-core> 0: __rustc::rust_begin_unwind
  753. 71.50 s gammaloop-nextest-core> 1: core::panicking::panic_fmt
  754. 71.50 s gammaloop-nextest-core> 2: <symbolica::evaluate::evaluator::ExpressionEvaluator<gammalooprs::utils::F<f64>>>::evaluate_impl_no_ops
  755. 71.50 s gammaloop-nextest-core> 3: <symbolica::evaluate::evaluator::ExpressionEvaluator<gammalooprs::utils::F<f64>>>::evaluate_single
  756. 71.50 s gammaloop-nextest-core> 4: gammalooprs::cff::generation::tests_cff::thermal_ring
  757. 71.50 s gammaloop-nextest-core> 5: <gammalooprs::cff::generation::tests_cff::thermal_ring::{closure#0} as core::ops::function::FnOnce<()>>::call_once
  758. 71.50 s gammaloop-nextest-core> note: Some details are omitted, run with `RUST_BACKTRACE=full` for a verbose backtrace.
  759. 71.50 s gammaloop-nextest-core> system-out
  760. 71.50 s gammaloop-nextest-core> running 1 test
  761. 71.50 s gammaloop-nextest-core> test cff::generation::tests_cff::thermal_ring ... FAILED
  762. 71.50 s gammaloop-nextest-core>
  763. 71.50 s gammaloop-nextest-core> failures:
  764. 71.50 s gammaloop-nextest-core>
  765. 71.50 s gammaloop-nextest-core> failures:
  766. 71.50 s gammaloop-nextest-core> cff::generation::tests_cff::thermal_ring
  767. 71.50 s gammaloop-nextest-core>
  768. 71.50 s gammaloop-nextest-core> test result: FAILED. 0 passed; 1 failed; 0 ignored; 0 measured; 535 filtered out; finished in 0.12s
  769. 71.50 s gammaloop-nextest-core> system-err
  770. 71.50 s gammaloop-nextest-core> thread 'cff::generation::tests_cff::thermal_ring' (1286) panicked at /nix/store/1sigmg52bb61pfngmk9k8wq5fz9r7bf1-vendor-cargo-deps/5929dab090e556a579e9f3b708cd2e67c60b3d84a12b5a276f2a36cb00473133/symbolica-2.2.0/src/evaluate/evaluator.rs:295:21:
  771. 71.50 s gammaloop-nextest-core> External function 'symbolica_coth' does not have an implementation for gammalooprs::utils::F<f64>
  772. 71.50 s gammaloop-nextest-core> stack backtrace:
  773. 71.50 s gammaloop-nextest-core> 0: __rustc::rust_begin_unwind
  774. 71.50 s gammaloop-nextest-core> 1: core::panicking::panic_fmt
  775. 71.50 s gammaloop-nextest-core> 2: <symbolica::evaluate::evaluator::ExpressionEvaluator<gammalooprs::utils::F<f64>>>::evaluate_impl_no_ops
  776. 71.50 s gammaloop-nextest-core> 3: <symbolica::evaluate::evaluator::ExpressionEvaluator<gammalooprs::utils::F<f64>>>::evaluate_single
  777. 71.50 s gammaloop-nextest-core> 4: gammalooprs::cff::generation::tests_cff::thermal_ring
  778. 71.50 s gammaloop-nextest-core> 5: <gammalooprs::cff::generation::tests_cff::thermal_ring::{closure#0} as core::ops::function::FnOnce<()>>::call_once
  779. 71.50 s gammaloop-nextest-core> note: Some details are omitted, run with `RUST_BACKTRACE=full` for a verbose backtrace.
  780. 71.50 s gammaloop-nextest-core>
  781. 71.50 s gammaloop-nextest-core> 5. gammalooprs::cff::generation::tests_cff::thermal_mercedes
  782. 71.50 s gammaloop-nextest-core> failure: test failure with exit code 101
  783. 71.50 s gammaloop-nextest-core> thread 'cff::generation::tests_cff::thermal_mercedes' (1306) panicked at /nix/store/1sigmg52bb61pfngmk9k8wq5fz9r7bf1-vendor-cargo-deps/5929dab090e556a579e9f3b708cd2e67c60b3d84a12b5a276f2a36cb00473133/symbolica-2.2.0/src/evaluate/evaluator.rs:295:21:
  784. 71.50 s gammaloop-nextest-core> External function 'symbolica_coth' does not have an implementation for gammalooprs::utils::F<f64>
  785. 71.50 s gammaloop-nextest-core> stack backtrace:
  786. 71.50 s gammaloop-nextest-core> 0: __rustc::rust_begin_unwind
  787. 71.50 s gammaloop-nextest-core> 1: core::panicking::panic_fmt
  788. 71.50 s gammaloop-nextest-core> 2: <symbolica::evaluate::evaluator::ExpressionEvaluator<gammalooprs::utils::F<f64>>>::evaluate_impl_no_ops
  789. 71.50 s gammaloop-nextest-core> 3: <symbolica::evaluate::evaluator::ExpressionEvaluator<gammalooprs::utils::F<f64>>>::evaluate_single
  790. 71.50 s gammaloop-nextest-core> 4: gammalooprs::cff::generation::tests_cff::thermal_mercedes
  791. 71.50 s gammaloop-nextest-core> 5: <gammalooprs::cff::generation::tests_cff::thermal_mercedes::{closure#0} as core::ops::function::FnOnce<()>>::call_once
  792. 71.50 s gammaloop-nextest-core> note: Some details are omitted, run with `RUST_BACKTRACE=full` for a verbose backtrace.
  793. 71.50 s gammaloop-nextest-core> system-out
  794. 71.50 s gammaloop-nextest-core> running 1 test
  795. 71.50 s gammaloop-nextest-core> test cff::generation::tests_cff::thermal_mercedes ... FAILED
  796. 71.50 s gammaloop-nextest-core>
  797. 71.50 s gammaloop-nextest-core> failures:
  798. 71.50 s gammaloop-nextest-core>
  799. 71.50 s gammaloop-nextest-core> failures:
  800. 71.50 s gammaloop-nextest-core> cff::generation::tests_cff::thermal_mercedes
  801. 71.50 s gammaloop-nextest-core>
  802. 71.50 s gammaloop-nextest-core> test result: FAILED. 0 passed; 1 failed; 0 ignored; 0 measured; 535 filtered out; finished in 0.15s
  803. 71.50 s gammaloop-nextest-core> system-err
  804. 71.50 s gammaloop-nextest-core> thread 'cff::generation::tests_cff::thermal_mercedes' (1306) panicked at /nix/store/1sigmg52bb61pfngmk9k8wq5fz9r7bf1-vendor-cargo-deps/5929dab090e556a579e9f3b708cd2e67c60b3d84a12b5a276f2a36cb00473133/symbolica-2.2.0/src/evaluate/evaluator.rs:295:21:
  805. 71.50 s gammaloop-nextest-core> External function 'symbolica_coth' does not have an implementation for gammalooprs::utils::F<f64>
  806. 71.50 s gammaloop-nextest-core> stack backtrace:
  807. 71.50 s gammaloop-nextest-core> 0: __rustc::rust_begin_unwind
  808. 71.50 s gammaloop-nextest-core> 1: core::panicking::panic_fmt
  809. 71.50 s gammaloop-nextest-core> 2: <symbolica::evaluate::evaluator::ExpressionEvaluator<gammalooprs::utils::F<f64>>>::evaluate_impl_no_ops
  810. 71.50 s gammaloop-nextest-core> 3: <symbolica::evaluate::evaluator::ExpressionEvaluator<gammalooprs::utils::F<f64>>>::evaluate_single
  811. 71.50 s gammaloop-nextest-core> 4: gammalooprs::cff::generation::tests_cff::thermal_mercedes
  812. 71.50 s gammaloop-nextest-core> 5: <gammalooprs::cff::generation::tests_cff::thermal_mercedes::{closure#0} as core::ops::function::FnOnce<()>>::call_once
  813. 71.50 s gammaloop-nextest-core> note: Some details are omitted, run with `RUST_BACKTRACE=full` for a verbose backtrace.
  814. 71.50 s gammaloop-nextest-core>
  815. 71.50 s gammaloop-nextest-core> 6. gammalooprs::graph::feynman_graph::tests::native_thermal_distributions
  816. 71.50 s gammaloop-nextest-core> failure: test failure with exit code 101
  817. 71.50 s gammaloop-nextest-core> system-out
  818. 71.50 s gammaloop-nextest-core> running 1 test
  819. 71.50 s gammaloop-nextest-core> test graph::feynman_graph::tests::native_thermal_distributions ... FAILED
  820. 71.50 s gammaloop-nextest-core>
  821. 71.50 s gammaloop-nextest-core> failures:
  822. 71.50 s gammaloop-nextest-core>
  823. 71.50 s gammaloop-nextest-core> failures:
  824. 71.50 s gammaloop-nextest-core> graph::feynman_graph::tests::native_thermal_distributions
  825. 71.50 s gammaloop-nextest-core>
  826. 71.50 s gammaloop-nextest-core> test result: FAILED. 0 passed; 1 failed; 0 ignored; 0 measured; 535 filtered out; finished in 1.25s
  827. 71.50 s gammaloop-nextest-core> system-err
  828. 71.50 s gammaloop-nextest-core> The application panicked (crashed).
  829. 71.50 s gammaloop-nextest-core> Message: called `Result::unwrap()` on an `Err` value: Custom { kind: Other, error: "Could not compile code: g++ -shared -O3 -fPIC -ffast-math -funsafe-math-optimizations -march=native -o /build/gammaloop-native-thermal-1340/thermal_0_0.so /build/gammaloop-native-thermal-1340/thermal_0_0.cpp\nwarning: Skipping impure flag -march=native because NIX_ENFORCE_NO_NATIVE is set\n/build/gammaloop-native-thermal-1340/thermal_0_0.cpp: In function 'void thermal_realf64(const double*, double*, double*)':\n/build/gammaloop-native-thermal-1340/thermal_0_0.cpp:27:16: error: 'symbolica_tanh' was not declared in this scope\n 27 | Z[6] = symbolica_tanh(Z[6]);\n | ^~~~~~~~~~~~~~\n" }
  830. 71.50 s gammaloop-nextest-core> Location: crates/gammalooprs/src/graph/feynman_graph.rs:937
  831. 71.50 s gammaloop-nextest-core>
  832. 71.50 s gammaloop-nextest-core> ━━━━━━━━━━━━━━━━━━━━━━━━━━━━━━━━━━ BACKTRACE ━━━━━━━━━━━━━━━━━━━━━━━━━━━━━━━━━━━
  833. 71.50 s gammaloop-nextest-core> 1: <color_eyre[b0c9e66060e883b2]::config::PanicHook>::panic_report<unknown>
  834. 71.50 s gammaloop-nextest-core> at <unknown source file>:<unknown line>
  835. 71.50 s gammaloop-nextest-core> 2: <color_eyre[b0c9e66060e883b2]::config::PanicHook>::into_panic_hook::{closure#0}<unknown>
  836. 71.50 s gammaloop-nextest-core> at <unknown source file>:<unknown line>
  837. 71.50 s gammaloop-nextest-core> 3: std[bcb96dfbba0ab899]::panicking::panic_with_hook<unknown>
  838. 71.50 s gammaloop-nextest-core> at <unknown source file>:<unknown line>
  839. 71.50 s gammaloop-nextest-core> 4: std[bcb96dfbba0ab899]::panicking::panic_handler::{closure#0}<unknown>
  840. 71.50 s gammaloop-nextest-core> at <unknown source file>:<unknown line>
  841. 71.50 s gammaloop-nextest-core> 5: std[bcb96dfbba0ab899]::sys::backtrace::__rust_end_short_backtrace::<std[bcb96dfbba0ab899]::panicking::panic_handler::{closure#0}, !><unknown>
  842. 71.50 s gammaloop-nextest-core> at <unknown source file>:<unknown line>
  843. 71.50 s gammaloop-nextest-core> 6: __rustc[6c289b9f9c454d21]::rust_begin_unwind<unknown>
  844. 71.50 s gammaloop-nextest-core> at <unknown source file>:<unknown line>
  845. 71.50 s gammaloop-nextest-core> 7: core[940e698046960fd5]::panicking::panic_fmt<unknown>
  846. 71.50 s gammaloop-nextest-core> at <unknown source file>:<unknown line>
  847. 71.50 s gammaloop-nextest-core> 8: core[940e698046960fd5]::result::unwrap_failed<unknown>
  848. 71.50 s gammaloop-nextest-core> at <unknown source file>:<unknown line>
  849. 71.50 s gammaloop-nextest-core> 9: gammalooprs[5490727360442cce]::graph::feynman_graph::tests::native_thermal_distributions<unknown>
  850. 71.50 s gammaloop-nextest-core> at <unknown source file>:<unknown line>
  851. 71.50 s gammaloop-nextest-core> 10: <gammalooprs[5490727360442cce]::graph::feynman_graph::tests::native_thermal_distributions::{closure#0} as core[940e698046960fd5]::ops::function::FnOnce<()>>::call_once<unknown>
  852. 71.50 s gammaloop-nextest-core> at <unknown source file>:<unknown line>
  853. 71.50 s gammaloop-nextest-core> 11: test[75d6903177b1d7e9]::__rust_begin_short_backtrace::<core[940e698046960fd5]::result::Result<(), alloc[2ea6bcb46fca0c42]::string::String>, fn() -> core[940e698046960fd5]::result::Result<(), alloc[2ea6bcb46fca0c42]::string::String>><unknown>
  854. 71.50 s gammaloop-nextest-core> at <unknown source file>:<unknown line>
  855. 71.50 s gammaloop-nextest-core> 12: test[75d6903177b1d7e9]::run_test::{closure#0}<unknown>
  856. 71.50 s gammaloop-nextest-core> at <unknown source file>:<unknown line>
  857. 71.50 s gammaloop-nextest-core> 13: std[bcb96dfbba0ab899]::sys::backtrace::__rust_begin_short_backtrace::<test[75d6903177b1d7e9]::run_test::{closure#1}, ()><unknown>
  858. 71.50 s gammaloop-nextest-core> at <unknown source file>:<unknown line>
  859. 71.50 s gammaloop-nextest-core> 14: <std[bcb96dfbba0ab899]::thread::lifecycle::spawn_unchecked<test[75d6903177b1d7e9]::run_test::{closure#1}, ()>::{closure#1} as core[940e698046960fd5]::ops::function::FnOnce<()>>::call_once::{shim:vtable#0}<unknown>
  860. 71.50 s gammaloop-nextest-core> at <unknown source file>:<unknown line>
  861. 71.50 s gammaloop-nextest-core> 15: <std[bcb96dfbba0ab899]::sys::thread::unix::Thread>::new::thread_start<unknown>
  862. 71.50 s gammaloop-nextest-core> at <unknown source file>:<unknown line>
  863. 71.50 s gammaloop-nextest-core> 16: start_thread<unknown>
  864. 71.50 s gammaloop-nextest-core> at <unknown source file>:<unknown line>
  865. 71.50 s gammaloop-nextest-core> 17: __clone3<unknown>
  866. 71.50 s gammaloop-nextest-core> at <unknown source file>:<unknown line>
  867. 71.50 s gammaloop-nextest-core>
  868. 71.50 s gammaloop-nextest-core> Run with COLORBT_SHOW_HIDDEN=1 environment variable to disable frame filtering.
  869. 71.50 s gammaloop-nextest-core> Run with RUST_BACKTRACE=full to include source snippets.
  870. 71.50 s gammaloop-nextest-core>
  871. 71.50 s gammaloop-nextest-core> 7. gammalooprs::cff::generation::tests_cff::thermal_bugblatter
  872. 71.50 s gammaloop-nextest-core> failure: test failure with exit code 101
  873. 71.50 s gammaloop-nextest-core> thread 'cff::generation::tests_cff::thermal_bugblatter' (1296) panicked at /nix/store/1sigmg52bb61pfngmk9k8wq5fz9r7bf1-vendor-cargo-deps/5929dab090e556a579e9f3b708cd2e67c60b3d84a12b5a276f2a36cb00473133/symbolica-2.2.0/src/evaluate/evaluator.rs:295:21:
  874. 71.50 s gammaloop-nextest-core> External function 'symbolica_coth' does not have an implementation for gammalooprs::utils::F<f64>
  875. 71.50 s gammaloop-nextest-core> stack backtrace:
  876. 71.50 s gammaloop-nextest-core> 0: __rustc::rust_begin_unwind
  877. 71.50 s gammaloop-nextest-core> 1: core::panicking::panic_fmt
  878. 71.50 s gammaloop-nextest-core> 2: <symbolica::evaluate::evaluator::ExpressionEvaluator<gammalooprs::utils::F<f64>>>::evaluate_impl_no_ops
  879. 71.50 s gammaloop-nextest-core> 3: <symbolica::evaluate::evaluator::ExpressionEvaluator<gammalooprs::utils::F<f64>>>::evaluate_single
  880. 71.50 s gammaloop-nextest-core> 4: gammalooprs::cff::generation::tests_cff::thermal_bugblatter
  881. 71.50 s gammaloop-nextest-core> 5: <gammalooprs::cff::generation::tests_cff::thermal_bugblatter::{closure#0} as core::ops::function::FnOnce<()>>::call_once
  882. 71.50 s gammaloop-nextest-core> note: Some details are omitted, run with `RUST_BACKTRACE=full` for a verbose backtrace.
  883. 71.50 s gammaloop-nextest-core> system-out
  884. 71.50 s gammaloop-nextest-core> running 1 test
  885. 71.50 s gammaloop-nextest-core> test cff::generation::tests_cff::thermal_bugblatter ... FAILED
  886. 71.50 s gammaloop-nextest-core>
  887. 71.50 s gammaloop-nextest-core> failures:
  888. 71.50 s gammaloop-nextest-core>
  889. 71.50 s gammaloop-nextest-core> failures:
  890. 71.50 s gammaloop-nextest-core> cff::generation::tests_cff::thermal_bugblatter
  891. 71.50 s gammaloop-nextest-core>
  892. 71.50 s gammaloop-nextest-core> test result: FAILED. 0 passed; 1 failed; 0 ignored; 0 measured; 535 filtered out; finished in 11.78s
  893. 71.50 s gammaloop-nextest-core> system-err
  894. 71.50 s gammaloop-nextest-core> thread 'cff::generation::tests_cff::thermal_bugblatter' (1296) panicked at /nix/store/1sigmg52bb61pfngmk9k8wq5fz9r7bf1-vendor-cargo-deps/5929dab090e556a579e9f3b708cd2e67c60b3d84a12b5a276f2a36cb00473133/symbolica-2.2.0/src/evaluate/evaluator.rs:295:21:
  895. 71.50 s gammaloop-nextest-core> External function 'symbolica_coth' does not have an implementation for gammalooprs::utils::F<f64>
  896. 71.50 s gammaloop-nextest-core> stack backtrace:
  897. 71.50 s gammaloop-nextest-core> 0: __rustc::rust_begin_unwind
  898. 71.50 s gammaloop-nextest-core> 1: core::panicking::panic_fmt
  899. 71.50 s gammaloop-nextest-core> 2: <symbolica::evaluate::evaluator::ExpressionEvaluator<gammalooprs::utils::F<f64>>>::evaluate_impl_no_ops
  900. 71.50 s gammaloop-nextest-core> 3: <symbolica::evaluate::evaluator::ExpressionEvaluator<gammalooprs::utils::F<f64>>>::evaluate_single
  901. 71.50 s gammaloop-nextest-core> 4: gammalooprs::cff::generation::tests_cff::thermal_bugblatter
  902. 71.50 s gammaloop-nextest-core> 5: <gammalooprs::cff::generation::tests_cff::thermal_bugblatter::{closure#0} as core::ops::function::FnOnce<()>>::call_once
  903. 71.50 s gammaloop-nextest-core> note: Some details are omitted, run with `RUST_BACKTRACE=full` for a verbose backtrace.
  904. 71.50 s gammaloop-nextest-core> =========================================
  905. 71.57 s [0 built (1 failed), 1 cerror: Cannot build '/nix/store/4m6xcddxcb2ycplv2r6vd1qc57nv11md-gammaloop-nextest-core.drv'.
  906. 71.57 s Reason: builder failed with exit code 100.
  907. 71.57 s Output paths:
  908. 71.57 s /nix/store/k6a030dwps85a4jw4c4nah6vga1kas45-gammaloop-nextest-core
  909. 71.57 s Last 738 log lines:
  910. 71.57 s > Extracting 3 binaries (including 1 non-test binary), 1 build script output directory, and 2 linked paths to /build/nextest-archive-cJt5oy
  911. 71.57 s > Extracted 18 files to /build/nextest-archive-cJt5oy in 0.64s
  912. 71.57 s > ------------
  913. 71.57 s > Nextest run ID 7d9553b6-0867-4608-833a-b3a6943beca7 with nextest profile: ci_gammaloop
  914. 71.57 s > Starting 339 tests across 2 binaries
  915. 71.57 s > ------------
  916. 71.57 s > Summary [ 0.845s] 339 tests run: 339 passed, 0 skipped
  917. 71.57 s >
  918. 71.57 s > ========== nextest test summary ==========
  919. 71.57 s > report: target/nextest/ci_gammaloop/junit.xml
  920. 71.57 s > tests: 339, failures: 0, errors: 0
  921. 71.57 s > No failing testcases found.
  922. 71.57 s > =========================================
  923. 71.57 s > Extracting 1 binary and 1 linked path to /build/nextest-archive-AgT9JB
  924. 71.57 s > Extracted 7 files to /build/nextest-archive-AgT9JB in 0.12s
  925. 71.57 s > ------------
  926. 71.57 s > Nextest run ID 758b8826-12d3-496f-9c5e-f79d3c6d09e2 with nextest profile: ci_gammaloop
  927. 71.57 s > Starting 19 tests across 1 binary
  928. 71.57 s > ------------
  929. 71.57 s > Summary [ 0.019s] 19 tests run: 19 passed, 0 skipped
  930. 71.57 s >
  931. 71.57 s > ========== nextest test summary ==========
  932. 71.57 s > report: target/nextest/ci_gammaloop/junit.xml
  933. 71.57 s > tests: 19, failures: 0, errors: 0
  934. 71.57 s > No failing testcases found.
  935. 71.57 s > =========================================
  936. 71.57 s > Extracting 1 binary to /build/nextest-archive-65JCC6
  937. 71.57 s > Extracted 4 files to /build/nextest-archive-65JCC6 in 0.06s
  938. 71.57 s > ------------
  939. 71.57 s > Nextest run ID f078f704-3418-4f25-ae62-bbe5ecfe9011 with nextest profile: ci_gammaloop
  940. 71.57 s > Starting 0 tests across 1 binary
  941. 71.57 s > ------------
  942. 71.57 s > Summary [ 0.000s] 0 tests run: 0 passed, 0 skipped
  943. 71.57 s >
  944. 71.57 s > ========== nextest test summary ==========
  945. 71.57 s > report: target/nextest/ci_gammaloop/junit.xml
  946. 71.57 s > tests: 0, failures: 0, errors: 0
  947. 71.57 s > No failing testcases found.
  948. 71.57 s > =========================================
  949. 71.57 s > Extracting 4 binaries, 1 build script output directory, and 2 linked paths to /build/nextest-archive-BKLYTg
  950. 71.57 s > Extracted 18 files to /build/nextest-archive-BKLYTg in 0.66s
  951. 71.57 s > ------------
  952. 71.57 s > Nextest run ID 8d0dafa4-ec1d-443c-a26d-ca482e339a54 with nextest profile: ci_gammaloop
  953. 71.57 s > Starting 483 tests across 4 binaries (61 tests skipped, including 60 tests via profile.ci_gammaloop.default-filter)
  954. 71.57 s > FAIL [ 0.026s] ( 44/483) gammalooprs cff::generation::tests_cff::thermal_bubble
  955. 71.57 s > stdout ---
  956. 71.57 s >
  957. 71.57 s > running 1 test
  958. 71.57 s > test cff::generation::tests_cff::thermal_bubble ... FAILED
  959. 71.57 s >
  960. 71.57 s > failures:
  961. 71.57 s >
  962. 71.57 s > failures:
  963. 71.57 s > cff::generation::tests_cff::thermal_bubble
  964. 71.57 s >
  965. 71.57 s > test result: FAILED. 0 passed; 1 failed; 0 ignored; 0 measured; 535 filtered out; finished in 0.02s
  966. 71.57 s >
  967. 71.57 s > stderr ---
  968. 71.57 s >
  969. 71.57 s > thread 'cff::generation::tests_cff::thermal_bubble' (1264) panicked at /nix/store/1sigmg52bb61pfngmk9k8wq5fz9r7bf1-vendor-cargo-deps/5929dab090e556a579e9f3b708cd2e67c60b3d84a12b5a276f2a36cb00473133/symbolica-2.2.0/src/evaluate/evaluator.rs:295:21:
  970. 71.57 s > External function 'symbolica_coth' does not have an implementation for gammalooprs::utils::F<f64>
  971. 71.57 s > stack backtrace:
  972. 71.57 s > 0: __rustc::rust_begin_unwind
  973. 71.57 s > 1: core::panicking::panic_fmt
  974. 71.57 s > 2: <symbolica::evaluate::evaluator::ExpressionEvaluator<gammalooprs::utils::F<f64>>>::evaluate_impl_no_ops
  975. 71.57 s > 3: <symbolica::evaluate::evaluator::ExpressionEvaluator<gammalooprs::utils::F<f64>>>::evaluate_single
  976. 71.57 s > 4: gammalooprs::cff::generation::tests_cff::thermal_bubble
  977. 71.57 s > 5: <gammalooprs::cff::generation::tests_cff::thermal_bubble::{closure#0} as core::ops::function::FnOnce<()>>::call_once
  978. 71.57 s > note: Some details are omitted, run with `RUST_BACKTRACE=full` for a verbose backtrace.
  979. 71.57 s >
  980. 71.57 s > FAIL [ 0.030s] ( 50/483) gammalooprs cff::generation::tests_cff::thermal_eight
  981. 71.57 s > stdout ---
  982. 71.57 s >
  983. 71.57 s > running 1 test
  984. 71.57 s > test cff::generation::tests_cff::thermal_eight ... FAILED
  985. 71.57 s >
  986. 71.57 s > failures:
  987. 71.57 s >
  988. 71.57 s > failures:
  989. 71.57 s > cff::generation::tests_cff::thermal_eight
  990. 71.57 s >
  991. 71.57 s > test result: FAILED. 0 passed; 1 failed; 0 ignored; 0 measured; 535 filtered out; finished in 0.02s
  992. 71.57 s >
  993. 71.57 s > stderr ---
  994. 71.57 s >
  995. 71.57 s > thread 'cff::generation::tests_cff::thermal_eight' (1281) panicked at /nix/store/1sigmg52bb61pfngmk9k8wq5fz9r7bf1-vendor-cargo-deps/5929dab090e556a579e9f3b708cd2e67c60b3d84a12b5a276f2a36cb00473133/symbolica-2.2.0/src/evaluate/evaluator.rs:295:21:
  996. 71.57 s > External function 'symbolica_coth' does not have an implementation for gammalooprs::utils::F<f64>
  997. 71.57 s > stack backtrace:
  998. 71.57 s > 0: __rustc::rust_begin_unwind
  999. 71.57 s > 1: core::panicking::panic_fmt
  1000. 71.57 s > 2: <symbolica::evaluate::evaluator::ExpressionEvaluator<gammalooprs::utils::F<f64>>>::evaluate_impl_no_ops
  1001. 71.57 s > 3: <symbolica::evaluate::evaluator::ExpressionEvaluator<gammalooprs::utils::F<f64>>>::evaluate_single
  1002. 71.57 s > 4: gammalooprs::cff::generation::tests_cff::thermal_eight
  1003. 71.57 s > 5: <gammalooprs::cff::generation::tests_cff::thermal_eight::{closure#0} as core::ops::function::FnOnce<()>>::call_once
  1004. 71.57 s > note: Some details are omitted, run with `RUST_BACKTRACE=full` for a verbose backtrace.
  1005. 71.57 s >
  1006. 71.57 s > FAIL [ 0.046s] ( 59/483) gammalooprs cff::generation::tests_cff::thermal_bubble_chain
  1007. 71.57 s > stdout ---
  1008. 71.57 s >
  1009. 71.57 s > running 1 test
  1010. 71.57 s > test cff::generation::tests_cff::thermal_bubble_chain ... FAILED
  1011. 71.57 s >
  1012. 71.57 s > failures:
  1013. 71.57 s >
  1014. 71.57 s > failures:
  1015. 71.57 s > cff::generation::tests_cff::thermal_bubble_chain
  1016. 71.57 s >
  1017. 71.57 s > test result: FAILED. 0 passed; 1 failed; 0 ignored; 0 measured; 535 filtered out; finished in 0.01s
  1018. 71.57 s >
  1019. 71.57 s > stderr ---
  1020. 71.57 s >
  1021. 71.57 s > thread 'cff::generation::tests_cff::thermal_bubble_chain' (1301) panicked at /nix/store/1sigmg52bb61pfngmk9k8wq5fz9r7bf1-vendor-cargo-deps/5929dab090e556a579e9f3b708cd2e67c60b3d84a12b5a276f2a36cb00473133/symbolica-2.2.0/src/evaluate/evaluator.rs:295:21:
  1022. 71.57 s > External function 'symbolica_coth' does not have an implementation for gammalooprs::utils::F<f64>
  1023. 71.57 s > stack backtrace:
  1024. 71.57 s > 0: __rustc::rust_begin_unwind
  1025. 71.57 s > 1: core::panicking::panic_fmt
  1026. 71.57 s > 2: <symbolica::evaluate::evaluator::ExpressionEvaluator<gammalooprs::utils::F<f64>>>::evaluate_impl_no_ops
  1027. 71.57 s > 3: <symbolica::evaluate::evaluator::ExpressionEvaluator<gammalooprs::utils::F<f64>>>::evaluate_single
  1028. 71.57 s > 4: gammalooprs::cff::generation::tests_cff::thermal_bubble_chain
  1029. 71.57 s > 5: <gammalooprs::cff::generation::tests_cff::thermal_bubble_chain::{closure#0} as core::ops::function::FnOnce<()>>::call_once
  1030. 71.57 s > note: Some details are omitted, run with `RUST_BACKTRACE=full` for a verbose backtrace.
  1031. 71.57 s >
  1032. 71.57 s > FAIL [ 0.132s] ( 76/483) gammalooprs cff::generation::tests_cff::thermal_ring
  1033. 71.57 s > stdout ---
  1034. 71.57 s >
  1035. 71.57 s > running 1 test
  1036. 71.57 s > test cff::generation::tests_cff::thermal_ring ... FAILED
  1037. 71.57 s >
  1038. 71.57 s > failures:
  1039. 71.57 s >
  1040. 71.57 s > failures:
  1041. 71.57 s > cff::generation::tests_cff::thermal_ring
  1042. 71.57 s >
  1043. 71.57 s > test result: FAILED. 0 passed; 1 failed; 0 ignored; 0 measured; 535 filtered out; finished in 0.12s
  1044. 71.57 s >
  1045. 71.57 s > stderr ---
  1046. 71.57 s >
  1047. 71.57 s > thread 'cff::generation::tests_cff::thermal_ring' (1286) panicked at /nix/store/1sigmg52bb61pfngmk9k8wq5fz9r7bf1-vendor-cargo-deps/5929dab090e556a579e9f3b708cd2e67c60b3d84a12b5a276f2a36cb00473133/symbolica-2.2.0/src/evaluate/evaluator.rs:295:21:
  1048. 71.57 s > External function 'symbolica_coth' does not have an implementation for gammalooprs::utils::F<f64>
  1049. 71.57 s > stack backtrace:
  1050. 71.57 s > 0: __rustc::rust_begin_unwind
  1051. 71.57 s > 1: core::panicking::panic_fmt
  1052. 71.57 s > 2: <symbolica::evaluate::evaluator::ExpressionEvaluator<gammalooprs::utils::F<f64>>>::evaluate_impl_no_ops
  1053. 71.57 s > 3: <symbolica::evaluate::evaluator::ExpressionEvaluator<gammalooprs::utils::F<f64>>>::evaluate_single
  1054. 71.57 s > 4: gammalooprs::cff::generation::tests_cff::thermal_ring
  1055. 71.57 s > 5: <gammalooprs::cff::generation::tests_cff::thermal_ring::{closure#0} as core::ops::function::FnOnce<()>>::call_once
  1056. 71.57 s > note: Some details are omitted, run with `RUST_BACKTRACE=full` for a verbose backtrace.
  1057. 71.57 s >
  1058. 71.57 s > FAIL [ 0.174s] ( 79/483) gammalooprs cff::generation::tests_cff::thermal_mercedes
  1059. 71.57 s > stdout ---
  1060. 71.57 s >
  1061. 71.57 s > running 1 test
  1062. 71.57 s > test cff::generation::tests_cff::thermal_mercedes ... FAILED
  1063. 71.57 s >
  1064. 71.57 s > failures:
  1065. 71.57 s >
  1066. 71.57 s > failures:
  1067. 71.57 s > cff::generation::tests_cff::thermal_mercedes
  1068. 71.57 s >
  1069. 71.57 s > test result: FAILED. 0 passed; 1 failed; 0 ignored; 0 measured; 535 filtered out; finished in 0.15s
  1070. 71.57 s >
  1071. 71.57 s > stderr ---
  1072. 71.57 s >
  1073. 71.57 s > thread 'cff::generation::tests_cff::thermal_mercedes' (1306) panicked at /nix/store/1sigmg52bb61pfngmk9k8wq5fz9r7bf1-vendor-cargo-deps/5929dab090e556a579e9f3b708cd2e67c60b3d84a12b5a276f2a36cb00473133/symbolica-2.2.0/src/evaluate/evaluator.rs:295:21:
  1074. 71.57 s > External function 'symbolica_coth' does not have an implementation for gammalooprs::utils::F<f64>
  1075. 71.57 s > stack backtrace:
  1076. 71.57 s > 0: __rustc::rust_begin_unwind
  1077. 71.57 s > 1: core::panicking::panic_fmt
  1078. 71.57 s > 2: <symbolica::evaluate::evaluator::ExpressionEvaluator<gammalooprs::utils::F<f64>>>::evaluate_impl_no_ops
  1079. 71.57 s > 3: <symbolica::evaluate::evaluator::ExpressionEvaluator<gammalooprs::utils::F<f64>>>::evaluate_single
  1080. 71.57 s > 4: gammalooprs::cff::generation::tests_cff::thermal_mercedes
  1081. 71.57 s > 5: <gammalooprs::cff::generation::tests_cff::thermal_mercedes::{closure#0} as core::ops::function::FnOnce<()>>::call_once
  1082. 71.57 s > note: Some details are omitted, run with `RUST_BACKTRACE=full` for a verbose backtrace.
  1083. 71.57 s >
  1084. 71.57 s > FAIL [ 1.263s] (423/483) gammalooprs graph::feynman_graph::tests::native_thermal_distributions
  1085. 71.57 s > stdout ---
  1086. 71.57 s >
  1087. 71.57 s > running 1 test
  1088. 71.57 s > test graph::feynman_graph::tests::native_thermal_distributions ... FAILED
  1089. 71.57 s >
  1090. 71.57 s > failures:
  1091. 71.57 s >
  1092. 71.57 s > failures:
  1093. 71.57 s > graph::feynman_graph::tests::native_thermal_distributions
  1094. 71.57 s >
  1095. 71.57 s > test result: FAILED. 0 passed; 1 failed; 0 ignored; 0 measured; 535 filtered out; finished in 1.25s
  1096. 71.57 s >
  1097. 71.57 s > stderr ---
  1098. 71.57 s > The application panicked (crashed).
  1099. 71.57 s > Message: called `Result::unwrap()` on an `Err` value: Custom { kind: Other, error: "Could not compile code: g++ -shared -O3 -fPIC -ffast-math -funsafe-math-optimizations -march=native -o /build/gammaloop-native-thermal-1340/thermal_0_0.so /build/gammaloop-native-thermal-1340/thermal_0_0.cpp\nwarning: Skipping impure flag -march=native because NIX_ENFORCE_NO_NATIVE is set\n/build/gammaloop-native-thermal-1340/thermal_0_0.cpp: In function 'void thermal_realf64(const double*, double*, double*)':\n/build/gammaloop-native-thermal-1340/thermal_0_0.cpp:27:16: error: 'symbolica_tanh' was not declared in this scope\n 27 | Z[6] = symbolica_tanh(Z[6]);\n | ^~~~~~~~~~~~~~\n" }
  1100. 71.57 s > Location: crates/gammalooprs/src/graph/feynman_graph.rs:937
  1101. 71.57 s >
  1102. 71.57 s > ━━━━━━━━━━━━━━━━━━━━━━━━━━━━━━━━━━ BACKTRACE ━━━━━━━━━━━━━━━━━━━━━━━━━━━━━━━━━━━
  1103. 71.57 s > 1: <color_eyre[b0c9e66060e883b2]::config::PanicHook>::panic_report<unknown>
  1104. 71.57 s > at <unknown source file>:<unknown line>
  1105. 71.57 s > 2: <color_eyre[b0c9e66060e883b2]::config::PanicHook>::into_panic_hook::{closure#0}<unknown>
  1106. 71.57 s > at <unknown source file>:<unknown line>
  1107. 71.57 s > 3: std[bcb96dfbba0ab899]::panicking::panic_with_hook<unknown>
  1108. 71.57 s > at <unknown source file>:<unknown line>
  1109. 71.57 s > 4: std[bcb96dfbba0ab899]::panicking::panic_handler::{closure#0}<unknown>
  1110. 71.57 s > at <unknown source file>:<unknown line>
  1111. 71.57 s > 5: std[bcb96dfbba0ab899]::sys::backtrace::__rust_end_short_backtrace::<std[bcb96dfbba0ab899]::panicking::panic_handler::{closure#0}, !><unknown>
  1112. 71.57 s > at <unknown source file>:<unknown line>
  1113. 71.57 s > 6: __rustc[6c289b9f9c454d21]::rust_begin_unwind<unknown>
  1114. 71.57 s > at <unknown source file>:<unknown line>
  1115. 71.57 s > 7: core[940e698046960fd5]::panicking::panic_fmt<unknown>
  1116. 71.57 s > at <unknown source file>:<unknown line>
  1117. 71.57 s > 8: core[940e698046960fd5]::result::unwrap_failed<unknown>
  1118. 71.57 s > at <unknown source file>:<unknown line>
  1119. 71.57 s > 9: gammalooprs[5490727360442cce]::graph::feynman_graph::tests::native_thermal_distributions<unknown>
  1120. 71.57 s > at <unknown source file>:<unknown line>
  1121. 71.57 s > 10: <gammalooprs[5490727360442cce]::graph::feynman_graph::tests::native_thermal_distributions::{closure#0} as core[940e698046960fd5]::ops::function::FnOnce<()>>::call_once<unknown>
  1122. 71.57 s > at <unknown source file>:<unknown line>
  1123. 71.57 s > 11: test[75d6903177b1d7e9]::__rust_begin_short_backtrace::<core[940e698046960fd5]::result::Result<(), alloc[2ea6bcb46fca0c42]::string::String>, fn() -> core[940e698046960fd5]::result::Result<(), alloc[2ea6bcb46fca0c42]::string::String>><unknown>
  1124. 71.57 s > at <unknown source file>:<unknown line>
  1125. 71.57 s > 12: test[75d6903177b1d7e9]::run_test::{closure#0}<unknown>
  1126. 71.57 s > at <unknown source file>:<unknown line>
  1127. 71.57 s > 13: std[bcb96dfbba0ab899]::sys::backtrace::__rust_begin_short_backtrace::<test[75d6903177b1d7e9]::run_test::{closure#1}, ()><unknown>
  1128. 71.57 s > at <unknown source file>:<unknown line>
  1129. 71.57 s > 14: <std[bcb96dfbba0ab899]::thread::lifecycle::spawn_unchecked<test[75d6903177b1d7e9]::run_test::{closure#1}, ()>::{closure#1} as core[940e698046960fd5]::ops::function::FnOnce<()>>::call_once::{shim:vtable#0}<unknown>
  1130. 71.57 s > at <unknown source file>:<unknown line>
  1131. 71.57 s > 15: <std[bcb96dfbba0ab899]::sys::thread::unix::Thread>::new::thread_start<unknown>
  1132. 71.57 s > at <unknown source file>:<unknown line>
  1133. 71.57 s > 16: start_thread<unknown>
  1134. 71.57 s > at <unknown source file>:<unknown line>
  1135. 71.57 s > 17: __clone3<unknown>
  1136. 71.57 s > at <unknown source file>:<unknown line>
  1137. 71.57 s >
  1138. 71.57 s > Run with COLORBT_SHOW_HIDDEN=1 environment variable to disable frame filtering.
  1139. 71.57 s > Run with RUST_BACKTRACE=full to include source snippets.
  1140. 71.57 s >
  1141. 71.57 s > FAIL [ 11.844s] (481/483) gammalooprs cff::generation::tests_cff::thermal_bugblatter
  1142. 71.57 s > stdout ---
  1143. 71.57 s >
  1144. 71.57 s > running 1 test
  1145. 71.57 s > test cff::generation::tests_cff::thermal_bugblatter ... FAILED
  1146. 71.57 s >
  1147. 71.57 s > failures:
  1148. 71.57 s >
  1149. 71.57 s > failures:
  1150. 71.57 s > cff::generation::tests_cff::thermal_bugblatter
  1151. 71.57 s >
  1152. 71.57 s > test result: FAILED. 0 passed; 1 failed; 0 ignored; 0 measured; 535 filtered out; finished in 11.78s
  1153. 71.57 s >
  1154. 71.57 s > stderr ---
  1155. 71.57 s >
  1156. 71.57 s > thread 'cff::generation::tests_cff::thermal_bugblatter' (1296) panicked at /nix/store/1sigmg52bb61pfngmk9k8wq5fz9r7bf1-vendor-cargo-deps/5929dab090e556a579e9f3b708cd2e67c60b3d84a12b5a276f2a36cb00473133/symbolica-2.2.0/src/evaluate/evaluator.rs:295:21:
  1157. 71.57 s > External function 'symbolica_coth' does not have an implementation for gammalooprs::utils::F<f64>
  1158. 71.57 s > stack backtrace:
  1159. 71.57 s > 0: __rustc::rust_begin_unwind
  1160. 71.57 s > 1: core::panicking::panic_fmt
  1161. 71.57 s > 2: <symbolica::evaluate::evaluator::ExpressionEvaluator<gammalooprs::utils::F<f64>>>::evaluate_impl_no_ops
  1162. 71.57 s > 3: <symbolica::evaluate::evaluator::ExpressionEvaluator<gammalooprs::utils::F<f64>>>::evaluate_single
  1163. 71.57 s > 4: gammalooprs::cff::generation::tests_cff::thermal_bugblatter
  1164. 71.57 s > 5: <gammalooprs::cff::generation::tests_cff::thermal_bugblatter::{closure#0} as core::ops::function::FnOnce<()>>::call_once
  1165. 71.57 s > note: Some details are omitted, run with `RUST_BACKTRACE=full` for a verbose backtrace.
  1166. 71.57 s >
  1167. 71.57 s > ------------
  1168. 71.57 s > Summary [ 14.736s] 483 tests run: 476 passed, 7 failed, 61 skipped
  1169. 71.57 s > FAIL [ 0.026s] ( 44/483) gammalooprs cff::generation::tests_cff::thermal_bubble
  1170. 71.57 s > stdout ---
  1171. 71.57 s >
  1172. 71.57 s > running 1 test
  1173. 71.57 s > test cff::generation::tests_cff::thermal_bubble ... FAILED
  1174. 71.57 s >
  1175. 71.57 s > failures:
  1176. 71.57 s >
  1177. 71.57 s > failures:
  1178. 71.57 s > cff::generation::tests_cff::thermal_bubble
  1179. 71.57 s >
  1180. 71.57 s > test result: FAILED. 0 passed; 1 failed; 0 ignored; 0 measured; 535 filtered out; finished in 0.02s
  1181. 71.57 s >
  1182. 71.57 s > stderr ---
  1183. 71.57 s >
  1184. 71.57 s > thread 'cff::generation::tests_cff::thermal_bubble' (1264) panicked at /nix/store/1sigmg52bb61pfngmk9k8wq5fz9r7bf1-vendor-cargo-deps/5929dab090e556a579e9f3b708cd2e67c60b3d84a12b5a276f2a36cb00473133/symbolica-2.2.0/src/evaluate/evaluator.rs:295:21:
  1185. 71.57 s > External function 'symbolica_coth' does not have an implementation for gammalooprs::utils::F<f64>
  1186. 71.57 s > stack backtrace:
  1187. 71.57 s > 0: __rustc::rust_begin_unwind
  1188. 71.57 s > 1: core::panicking::panic_fmt
  1189. 71.57 s > 2: <symbolica::evaluate::evaluator::ExpressionEvaluator<gammalooprs::utils::F<f64>>>::evaluate_impl_no_ops
  1190. 71.57 s > 3: <symbolica::evaluate::evaluator::ExpressionEvaluator<gammalooprs::utils::F<f64>>>::evaluate_single
  1191. 71.57 s > 4: gammalooprs::cff::generation::tests_cff::thermal_bubble
  1192. 71.57 s > 5: <gammalooprs::cff::generation::tests_cff::thermal_bubble::{closure#0} as core::ops::function::FnOnce<()>>::call_once
  1193. 71.57 s > note: Some details are omitted, run with `RUST_BACKTRACE=full` for a verbose backtrace.
  1194. 71.57 s >
  1195. 71.57 s > FAIL [ 0.030s] ( 50/483) gammalooprs cff::generation::tests_cff::thermal_eight
  1196. 71.57 s > stdout ---
  1197. 71.57 s >
  1198. 71.57 s > running 1 test
  1199. 71.57 s > test cff::generation::tests_cff::thermal_eight ... FAILED
  1200. 71.57 s >
  1201. 71.57 s > failures:
  1202. 71.57 s >
  1203. 71.57 s > failures:
  1204. 71.57 s > cff::generation::tests_cff::thermal_eight
  1205. 71.57 s >
  1206. 71.57 s > test result: FAILED. 0 passed; 1 failed; 0 ignored; 0 measured; 535 filtered out; finished in 0.02s
  1207. 71.57 s >
  1208. 71.57 s > stderr ---
  1209. 71.57 s >
  1210. 71.57 s > thread 'cff::generation::tests_cff::thermal_eight' (1281) panicked at /nix/store/1sigmg52bb61pfngmk9k8wq5fz9r7bf1-vendor-cargo-deps/5929dab090e556a579e9f3b708cd2e67c60b3d84a12b5a276f2a36cb00473133/symbolica-2.2.0/src/evaluate/evaluator.rs:295:21:
  1211. 71.57 s > External function 'symbolica_coth' does not have an implementation for gammalooprs::utils::F<f64>
  1212. 71.57 s > stack backtrace:
  1213. 71.57 s > 0: __rustc::rust_begin_unwind
  1214. 71.57 s > 1: core::panicking::panic_fmt
  1215. 71.57 s > 2: <symbolica::evaluate::evaluator::ExpressionEvaluator<gammalooprs::utils::F<f64>>>::evaluate_impl_no_ops
  1216. 71.57 s > 3: <symbolica::evaluate::evaluator::ExpressionEvaluator<gammalooprs::utils::F<f64>>>::evaluate_single
  1217. 71.57 s > 4: gammalooprs::cff::generation::tests_cff::thermal_eight
  1218. 71.57 s > 5: <gammalooprs::cff::generation::tests_cff::thermal_eight::{closure#0} as core::ops::function::FnOnce<()>>::call_once
  1219. 71.57 s > note: Some details are omitted, run with `RUST_BACKTRACE=full` for a verbose backtrace.
  1220. 71.57 s >
  1221. 71.57 s > FAIL [ 0.046s] ( 59/483) gammalooprs cff::generation::tests_cff::thermal_bubble_chain
  1222. 71.57 s > stdout ---
  1223. 71.57 s >
  1224. 71.57 s > running 1 test
  1225. 71.57 s > test cff::generation::tests_cff::thermal_bubble_chain ... FAILED
  1226. 71.57 s >
  1227. 71.57 s > failures:
  1228. 71.57 s >
  1229. 71.57 s > failures:
  1230. 71.57 s > cff::generation::tests_cff::thermal_bubble_chain
  1231. 71.57 s >
  1232. 71.57 s > test result: FAILED. 0 passed; 1 failed; 0 ignored; 0 measured; 535 filtered out; finished in 0.01s
  1233. 71.57 s >
  1234. 71.57 s > stderr ---
  1235. 71.57 s >
  1236. 71.57 s > thread 'cff::generation::tests_cff::thermal_bubble_chain' (1301) panicked at /nix/store/1sigmg52bb61pfngmk9k8wq5fz9r7bf1-vendor-cargo-deps/5929dab090e556a579e9f3b708cd2e67c60b3d84a12b5a276f2a36cb00473133/symbolica-2.2.0/src/evaluate/evaluator.rs:295:21:
  1237. 71.57 s > External function 'symbolica_coth' does not have an implementation for gammalooprs::utils::F<f64>
  1238. 71.57 s > stack backtrace:
  1239. 71.57 s > 0: __rustc::rust_begin_unwind
  1240. 71.57 s > 1: core::panicking::panic_fmt
  1241. 71.57 s > 2: <symbolica::evaluate::evaluator::ExpressionEvaluator<gammalooprs::utils::F<f64>>>::evaluate_impl_no_ops
  1242. 71.57 s > 3: <symbolica::evaluate::evaluator::ExpressionEvaluator<gammalooprs::utils::F<f64>>>::evaluate_single
  1243. 71.57 s > 4: gammalooprs::cff::generation::tests_cff::thermal_bubble_chain
  1244. 71.57 s > 5: <gammalooprs::cff::generation::tests_cff::thermal_bubble_chain::{closure#0} as core::ops::function::FnOnce<()>>::call_once
  1245. 71.57 s > note: Some details are omitted, run with `RUST_BACKTRACE=full` for a verbose backtrace.
  1246. 71.57 s >
  1247. 71.57 s > FAIL [ 0.132s] ( 76/483) gammalooprs cff::generation::tests_cff::thermal_ring
  1248. 71.57 s > stdout ---
  1249. 71.57 s >
  1250. 71.57 s > running 1 test
  1251. 71.57 s > test cff::generation::tests_cff::thermal_ring ... FAILED
  1252. 71.57 s >
  1253. 71.57 s > failures:
  1254. 71.57 s >
  1255. 71.57 s > failures:
  1256. 71.57 s > cff::generation::tests_cff::thermal_ring
  1257. 71.57 s >
  1258. 71.57 s > test result: FAILED. 0 passed; 1 failed; 0 ignored; 0 measured; 535 filtered out; finished in 0.12s
  1259. 71.57 s >
  1260. 71.57 s > stderr ---
  1261. 71.57 s >
  1262. 71.57 s > thread 'cff::generation::tests_cff::thermal_ring' (1286) panicked at /nix/store/1sigmg52bb61pfngmk9k8wq5fz9r7bf1-vendor-cargo-deps/5929dab090e556a579e9f3b708cd2e67c60b3d84a12b5a276f2a36cb00473133/symbolica-2.2.0/src/evaluate/evaluator.rs:295:21:
  1263. 71.57 s > External function 'symbolica_coth' does not have an implementation for gammalooprs::utils::F<f64>
  1264. 71.57 s > stack backtrace:
  1265. 71.57 s > 0: __rustc::rust_begin_unwind
  1266. 71.57 s > 1: core::panicking::panic_fmt
  1267. 71.57 s > 2: <symbolica::evaluate::evaluator::ExpressionEvaluator<gammalooprs::utils::F<f64>>>::evaluate_impl_no_ops
  1268. 71.57 s > 3: <symbolica::evaluate::evaluator::ExpressionEvaluator<gammalooprs::utils::F<f64>>>::evaluate_single
  1269. 71.57 s > 4: gammalooprs::cff::generation::tests_cff::thermal_ring
  1270. 71.57 s > 5: <gammalooprs::cff::generation::tests_cff::thermal_ring::{closure#0} as core::ops::function::FnOnce<()>>::call_once
  1271. 71.57 s > note: Some details are omitted, run with `RUST_BACKTRACE=full` for a verbose backtrace.
  1272. 71.57 s >
  1273. 71.57 s > FAIL [ 0.174s] ( 79/483) gammalooprs cff::generation::tests_cff::thermal_mercedes
  1274. 71.57 s > stdout ---
  1275. 71.57 s >
  1276. 71.57 s > running 1 test
  1277. 71.57 s > test cff::generation::tests_cff::thermal_mercedes ... FAILED
  1278. 71.57 s >
  1279. 71.57 s > failures:
  1280. 71.57 s >
  1281. 71.57 s > failures:
  1282. 71.57 s > cff::generation::tests_cff::thermal_mercedes
  1283. 71.57 s >
  1284. 71.57 s > test result: FAILED. 0 passed; 1 failed; 0 ignored; 0 measured; 535 filtered out; finished in 0.15s
  1285. 71.57 s >
  1286. 71.57 s > stderr ---
  1287. 71.57 s >
  1288. 71.57 s > thread 'cff::generation::tests_cff::thermal_mercedes' (1306) panicked at /nix/store/1sigmg52bb61pfngmk9k8wq5fz9r7bf1-vendor-cargo-deps/5929dab090e556a579e9f3b708cd2e67c60b3d84a12b5a276f2a36cb00473133/symbolica-2.2.0/src/evaluate/evaluator.rs:295:21:
  1289. 71.57 s > External function 'symbolica_coth' does not have an implementation for gammalooprs::utils::F<f64>
  1290. 71.57 s > stack backtrace:
  1291. 71.57 s > 0: __rustc::rust_begin_unwind
  1292. 71.57 s > 1: core::panicking::panic_fmt
  1293. 71.57 s > 2: <symbolica::evaluate::evaluator::ExpressionEvaluator<gammalooprs::utils::F<f64>>>::evaluate_impl_no_ops
  1294. 71.57 s > 3: <symbolica::evaluate::evaluator::ExpressionEvaluator<gammalooprs::utils::F<f64>>>::evaluate_single
  1295. 71.57 s > 4: gammalooprs::cff::generation::tests_cff::thermal_mercedes
  1296. 71.57 s > 5: <gammalooprs::cff::generation::tests_cff::thermal_mercedes::{closure#0} as core::ops::function::FnOnce<()>>::call_once
  1297. 71.57 s > note: Some details are omitted, run with `RUST_BACKTRACE=full` for a verbose backtrace.
  1298. 71.57 s >
  1299. 71.57 s > FAIL [ 1.263s] (423/483) gammalooprs graph::feynman_graph::tests::native_thermal_distributions
  1300. 71.57 s > stdout ---
  1301. 71.57 s >
  1302. 71.57 s > running 1 test
  1303. 71.57 s > test graph::feynman_graph::tests::native_thermal_distributions ... FAILED
  1304. 71.57 s >
  1305. 71.57 s > failures:
  1306. 71.57 s >
  1307. 71.57 s > failures:
  1308. 71.57 s > graph::feynman_graph::tests::native_thermal_distributions
  1309. 71.57 s >
  1310. 71.57 s > test result: FAILED. 0 passed; 1 failed; 0 ignored; 0 measured; 535 filtered out; finished in 1.25s
  1311. 71.57 s >
  1312. 71.57 s > stderr ---
  1313. 71.57 s > The application panicked (crashed).
  1314. 71.57 s > Message: called `Result::unwrap()` on an `Err` value: Custom { kind: Other, error: "Could not compile code: g++ -shared -O3 -fPIC -ffast-math -funsafe-math-optimizations -march=native -o /build/gammaloop-native-thermal-1340/thermal_0_0.so /build/gammaloop-native-thermal-1340/thermal_0_0.cpp\nwarning: Skipping impure flag -march=native because NIX_ENFORCE_NO_NATIVE is set\n/build/gammaloop-native-thermal-1340/thermal_0_0.cpp: In function 'void thermal_realf64(const double*, double*, double*)':\n/build/gammaloop-native-thermal-1340/thermal_0_0.cpp:27:16: error: 'symbolica_tanh' was not declared in this scope\n 27 | Z[6] = symbolica_tanh(Z[6]);\n | ^~~~~~~~~~~~~~\n" }
  1315. 71.57 s > Location: crates/gammalooprs/src/graph/feynman_graph.rs:937
  1316. 71.57 s >
  1317. 71.57 s > ━━━━━━━━━━━━━━━━━━━━━━━━━━━━━━━━━━ BACKTRACE ━━━━━━━━━━━━━━━━━━━━━━━━━━━━━━━━━━━
  1318. 71.57 s > 1: <color_eyre[b0c9e66060e883b2]::config::PanicHook>::panic_report<unknown>
  1319. 71.57 s > at <unknown source file>:<unknown line>
  1320. 71.57 s > 2: <color_eyre[b0c9e66060e883b2]::config::PanicHook>::into_panic_hook::{closure#0}<unknown>
  1321. 71.57 s > at <unknown source file>:<unknown line>
  1322. 71.57 s > 3: std[bcb96dfbba0ab899]::panicking::panic_with_hook<unknown>
  1323. 71.57 s > at <unknown source file>:<unknown line>
  1324. 71.57 s > 4: std[bcb96dfbba0ab899]::panicking::panic_handler::{closure#0}<unknown>
  1325. 71.57 s > at <unknown source file>:<unknown line>
  1326. 71.57 s > 5: std[bcb96dfbba0ab899]::sys::backtrace::__rust_end_short_backtrace::<std[bcb96dfbba0ab899]::panicking::panic_handler::{closure#0}, !><unknown>
  1327. 71.57 s > at <unknown source file>:<unknown line>
  1328. 71.57 s > 6: __rustc[6c289b9f9c454d21]::rust_begin_unwind<unknown>
  1329. 71.57 s > at <unknown source file>:<unknown line>
  1330. 71.57 s > 7: core[940e698046960fd5]::panicking::panic_fmt<unknown>
  1331. 71.57 s > at <unknown source file>:<unknown line>
  1332. 71.57 s > 8: core[940e698046960fd5]::result::unwrap_failed<unknown>
  1333. 71.57 s > at <unknown source file>:<unknown line>
  1334. 71.57 s > 9: gammalooprs[5490727360442cce]::graph::feynman_graph::tests::native_thermal_distributions<unknown>
  1335. 71.57 s > at <unknown source file>:<unknown line>
  1336. 71.57 s > 10: <gammalooprs[5490727360442cce]::graph::feynman_graph::tests::native_thermal_distributions::{closure#0} as core[940e698046960fd5]::ops::function::FnOnce<()>>::call_once<unknown>
  1337. 71.57 s > at <unknown source file>:<unknown line>
  1338. 71.57 s > 11: test[75d6903177b1d7e9]::__rust_begin_short_backtrace::<core[940e698046960fd5]::result::Result<(), alloc[2ea6bcb46fca0c42]::string::String>, fn() -> core[940e698046960fd5]::result::Result<(), alloc[2ea6bcb46fca0c42]::string::String>><unknown>
  1339. 71.57 s > at <unknown source file>:<unknown line>
  1340. 71.57 s > 12: test[75d6903177b1d7e9]::run_test::{closure#0}<unknown>
  1341. 71.57 s > at <unknown source file>:<unknown line>
  1342. 71.57 s > 13: std[bcb96dfbba0ab899]::sys::backtrace::__rust_begin_short_backtrace::<test[75d6903177b1d7e9]::run_test::{closure#1}, ()><unknown>
  1343. 71.57 s > at <unknown source file>:<unknown line>
  1344. 71.57 s > 14: <std[bcb96dfbba0ab899]::thread::lifecycle::spawn_unchecked<test[75d6903177b1d7e9]::run_test::{closure#1}, ()>::{closure#1} as core[940e698046960fd5]::ops::function::FnOnce<()>>::call_once::{shim:vtable#0}<unknown>
  1345. 71.57 s > at <unknown source file>:<unknown line>
  1346. 71.57 s > 15: <std[bcb96dfbba0ab899]::sys::thread::unix::Thread>::new::thread_start<unknown>
  1347. 71.57 s > at <unknown source file>:<unknown line>
  1348. 71.57 s > 16: start_thread<unknown>
  1349. 71.57 s > at <unknown source file>:<unknown line>
  1350. 71.57 s > 17: __clone3<unknown>
  1351. 71.57 s > at <unknown source file>:<unknown line>
  1352. 71.57 s >
  1353. 71.57 s > Run with COLORBT_SHOW_HIDDEN=1 environment variable to disable frame filtering.
  1354. 71.57 s > Run with RUST_BACKTRACE=full to include source snippets.
  1355. 71.57 s >
  1356. 71.57 s > FAIL [ 11.844s] (481/483) gammalooprs cff::generation::tests_cff::thermal_bugblatter
  1357. 71.57 s > stdout ---
  1358. 71.57 s >
  1359. 71.57 s > running 1 test
  1360. 71.57 s > test cff::generation::tests_cff::thermal_bugblatter ... FAILED
  1361. 71.57 s >
  1362. 71.57 s > failures:
  1363. 71.57 s >
  1364. 71.57 s > failures:
  1365. 71.57 s > cff::generation::tests_cff::thermal_bugblatter
  1366. 71.57 s >
  1367. 71.57 s > test result: FAILED. 0 passed; 1 failed; 0 ignored; 0 measured; 535 filtered out; finished in 11.78s
  1368. 71.57 s >
  1369. 71.57 s > stderr ---
  1370. 71.57 s >
  1371. 71.57 s > thread 'cff::generation::tests_cff::thermal_bugblatter' (1296) panicked at /nix/store/1sigmg52bb61pfngmk9k8wq5fz9r7bf1-vendor-cargo-deps/5929dab090e556a579e9f3b708cd2e67c60b3d84a12b5a276f2a36cb00473133/symbolica-2.2.0/src/evaluate/evaluator.rs:295:21:
  1372. 71.57 s > External function 'symbolica_coth' does not have an implementation for gammalooprs::utils::F<f64>
  1373. 71.57 s > stack backtrace:
  1374. 71.57 s > 0: __rustc::rust_begin_unwind
  1375. 71.57 s > 1: core::panicking::panic_fmt
  1376. 71.57 s > 2: <symbolica::evaluate::evaluator::ExpressionEvaluator<gammalooprs::utils::F<f64>>>::evaluate_impl_no_ops
  1377. 71.57 s > 3: <symbolica::evaluate::evaluator::ExpressionEvaluator<gammalooprs::utils::F<f64>>>::evaluate_single
  1378. 71.57 s > 4: gammalooprs::cff::generation::tests_cff::thermal_bugblatter
  1379. 71.57 s > 5: <gammalooprs::cff::generation::tests_cff::thermal_bugblatter::{closure#0} as core::ops::function::FnOnce<()>>::call_once
  1380. 71.57 s > note: Some details are omitted, run with `RUST_BACKTRACE=full` for a verbose backtrace.
  1381. 71.57 s >
  1382. 71.57 s > error: test run failed
  1383. 71.57 s >
  1384. 71.57 s > ========== nextest test summary ==========
  1385. 71.57 s > report: target/nextest/ci_gammaloop/junit.xml
  1386. 71.57 s > tests: 483, failures: 7, errors: 0
  1387. 71.57 s >
  1388. 71.57 s > 1. gammalooprs::cff::generation::tests_cff::thermal_bubble
  1389. 71.57 s > failure: test failure with exit code 101
  1390. 71.57 s > thread 'cff::generation::tests_cff::thermal_bubble' (1264) panicked at /nix/store/1sigmg52bb61pfngmk9k8wq5fz9r7bf1-vendor-cargo-deps/5929dab090e556a579e9f3b708cd2e67c60b3d84a12b5a276f2a36cb00473133/symbolica-2.2.0/src/evaluate/evaluator.rs:295:21:
  1391. 71.57 s > External function 'symbolica_coth' does not have an implementation for gammalooprs::utils::F<f64>
  1392. 71.57 s > stack backtrace:
  1393. 71.57 s > 0: __rustc::rust_begin_unwind
  1394. 71.57 s > 1: core::panicking::panic_fmt
  1395. 71.57 s > 2: <symbolica::evaluate::evaluator::ExpressionEvaluator<gammalooprs::utils::F<f64>>>::evaluate_impl_no_ops
  1396. 71.57 s > 3: <symbolica::evaluate::evaluator::ExpressionEvaluator<gammalooprs::utils::F<f64>>>::evaluate_single
  1397. 71.57 s > 4: gammalooprs::cff::generation::tests_cff::thermal_bubble
  1398. 71.57 s > 5: <gammalooprs::cff::generation::tests_cff::thermal_bubble::{closure#0} as core::ops::function::FnOnce<()>>::call_once
  1399. 71.57 s > note: Some details are omitted, run with `RUST_BACKTRACE=full` for a verbose backtrace.
  1400. 71.57 s > system-out
  1401. 71.57 s > running 1 test
  1402. 71.57 s > test cff::generation::tests_cff::thermal_bubble ... FAILED
  1403. 71.57 s >
  1404. 71.57 s > failures:
  1405. 71.57 s >
  1406. 71.57 s > failures:
  1407. 71.57 s > cff::generation::tests_cff::thermal_bubble
  1408. 71.57 s >
  1409. 71.57 s > test result: FAILED. 0 passed; 1 failed; 0 ignored; 0 measured; 535 filtered out; finished in 0.02s
  1410. 71.57 s > system-err
  1411. 71.57 s > thread 'cff::generation::tests_cff::thermal_bubble' (1264) panicked at /nix/store/1sigmg52bb61pfngmk9k8wq5fz9r7bf1-vendor-cargo-deps/5929dab090e556a579e9f3b708cd2e67c60b3d84a12b5a276f2a36cb00473133/symbolica-2.2.0/src/evaluate/evaluator.rs:295:21:
  1412. 71.57 s > External function 'symbolica_coth' does not have an implementation for gammalooprs::utils::F<f64>
  1413. 71.57 s > stack backtrace:
  1414. 71.57 s > 0: __rustc::rust_begin_unwind
  1415. 71.57 s > 1: core::panicking::panic_fmt
  1416. 71.57 s > 2: <symbolica::evaluate::evaluator::ExpressionEvaluator<gammalooprs::utils::F<f64>>>::evaluate_impl_no_ops
  1417. 71.57 s > 3: <symbolica::evaluate::evaluator::ExpressionEvaluator<gammalooprs::utils::F<f64>>>::evaluate_single
  1418. 71.57 s > 4: gammalooprs::cff::generation::tests_cff::thermal_bubble
  1419. 71.57 s > 5: <gammalooprs::cff::generation::tests_cff::thermal_bubble::{closure#0} as core::ops::function::FnOnce<()>>::call_once
  1420. 71.57 s > note: Some details are omitted, run with `RUST_BACKTRACE=full` for a verbose backtrace.
  1421. 71.57 s >
  1422. 71.57 s > 2. gammalooprs::cff::generation::tests_cff::thermal_eight
  1423. 71.57 s > failure: test failure with exit code 101
  1424. 71.57 s > thread 'cff::generation::tests_cff::thermal_eight' (1281) panicked at /nix/store/1sigmg52bb61pfngmk9k8wq5fz9r7bf1-vendor-cargo-deps/5929dab090e556a579e9f3b708cd2e67c60b3d84a12b5a276f2a36cb00473133/symbolica-2.2.0/src/evaluate/evaluator.rs:295:21:
  1425. 71.57 s > External function 'symbolica_coth' does not have an implementation for gammalooprs::utils::F<f64>
  1426. 71.57 s > stack backtrace:
  1427. 71.57 s > 0: __rustc::rust_begin_unwind
  1428. 71.57 s > 1: core::panicking::panic_fmt
  1429. 71.57 s > 2: <symbolica::evaluate::evaluator::ExpressionEvaluator<gammalooprs::utils::F<f64>>>::evaluate_impl_no_ops
  1430. 71.57 s > 3: <symbolica::evaluate::evaluator::ExpressionEvaluator<gammalooprs::utils::F<f64>>>::evaluate_single
  1431. 71.57 s > 4: gammalooprs::cff::generation::tests_cff::thermal_eight
  1432. 71.57 s > 5: <gammalooprs::cff::generation::tests_cff::thermal_eight::{closure#0} as core::ops::function::FnOnce<()>>::call_once
  1433. 71.57 s > note: Some details are omitted, run with `RUST_BACKTRACE=full` for a verbose backtrace.
  1434. 71.57 s > system-out
  1435. 71.57 s > running 1 test
  1436. 71.57 s > test cff::generation::tests_cff::thermal_eight ... FAILED
  1437. 71.57 s >
  1438. 71.57 s > failures:
  1439. 71.57 s >
  1440. 71.57 s > failures:
  1441. 71.57 s > cff::generation::tests_cff::thermal_eight
  1442. 71.57 s >
  1443. 71.57 s > test result: FAILED. 0 passed; 1 failed; 0 ignored; 0 measured; 535 filtered out; finished in 0.02s
  1444. 71.57 s > system-err
  1445. 71.57 s > thread 'cff::generation::tests_cff::thermal_eight' (1281) panicked at /nix/store/1sigmg52bb61pfngmk9k8wq5fz9r7bf1-vendor-cargo-deps/5929dab090e556a579e9f3b708cd2e67c60b3d84a12b5a276f2a36cb00473133/symbolica-2.2.0/src/evaluate/evaluator.rs:295:21:
  1446. 71.57 s > External function 'symbolica_coth' does not have an implementation for gammalooprs::utils::F<f64>
  1447. 71.57 s > stack backtrace:
  1448. 71.57 s > 0: __rustc::rust_begin_unwind
  1449. 71.57 s > 1: core::panicking::panic_fmt
  1450. 71.57 s > 2: <symbolica::evaluate::evaluator::ExpressionEvaluator<gammalooprs::utils::F<f64>>>::evaluate_impl_no_ops
  1451. 71.57 s > 3: <symbolica::evaluate::evaluator::ExpressionEvaluator<gammalooprs::utils::F<f64>>>::evaluate_single
  1452. 71.57 s > 4: gammalooprs::cff::generation::tests_cff::thermal_eight
  1453. 71.57 s > 5: <gammalooprs::cff::generation::tests_cff::thermal_eight::{closure#0} as core::ops::function::FnOnce<()>>::call_once
  1454. 71.57 s > note: Some details are omitted, run with `RUST_BACKTRACE=full` for a verbose backtrace.
  1455. 71.57 s >
  1456. 71.57 s > 3. gammalooprs::cff::generation::tests_cff::thermal_bubble_chain
  1457. 71.57 s > failure: test failure with exit code 101
  1458. 71.57 s > thread 'cff::generation::tests_cff::thermal_bubble_chain' (1301) panicked at /nix/store/1sigmg52bb61pfngmk9k8wq5fz9r7bf1-vendor-cargo-deps/5929dab090e556a579e9f3b708cd2e67c60b3d84a12b5a276f2a36cb00473133/symbolica-2.2.0/src/evaluate/evaluator.rs:295:21:
  1459. 71.57 s > External function 'symbolica_coth' does not have an implementation for gammalooprs::utils::F<f64>
  1460. 71.57 s > stack backtrace:
  1461. 71.57 s > 0: __rustc::rust_begin_unwind
  1462. 71.57 s > 1: core::panicking::panic_fmt
  1463. 71.57 s > 2: <symbolica::evaluate::evaluator::ExpressionEvaluator<gammalooprs::utils::F<f64>>>::evaluate_impl_no_ops
  1464. 71.57 s > 3: <symbolica::evaluate::evaluator::ExpressionEvaluator<gammalooprs::utils::F<f64>>>::evaluate_single
  1465. 71.57 s > 4: gammalooprs::cff::generation::tests_cff::thermal_bubble_chain
  1466. 71.57 s > 5: <gammalooprs::cff::generation::tests_cff::thermal_bubble_chain::{closure#0} as core::ops::function::FnOnce<()>>::call_once
  1467. 71.57 s > note: Some details are omitted, run with `RUST_BACKTRACE=full` for a verbose backtrace.
  1468. 71.57 s > system-out
  1469. 71.57 s > running 1 test
  1470. 71.57 s > test cff::generation::tests_cff::thermal_bubble_chain ... FAILED
  1471. 71.57 s >
  1472. 71.57 s > failures:
  1473. 71.57 s >
  1474. 71.57 s > failures:
  1475. 71.57 s > cff::generation::tests_cff::thermal_bubble_chain
  1476. 71.57 s >
  1477. 71.57 s > test result: FAILED. 0 passed; 1 failed; 0 ignored; 0 measured; 535 filtered out; finished in 0.01s
  1478. 71.57 s > system-err
  1479. 71.57 s > thread 'cff::generation::tests_cff::thermal_bubble_chain' (1301) panicked at /nix/store/1sigmg52bb61pfngmk9k8wq5fz9r7bf1-vendor-cargo-deps/5929dab090e556a579e9f3b708cd2e67c60b3d84a12b5a276f2a36cb00473133/symbolica-2.2.0/src/evaluate/evaluator.rs:295:21:
  1480. 71.57 s > External function 'symbolica_coth' does not have an implementation for gammalooprs::utils::F<f64>
  1481. 71.57 s > stack backtrace:
  1482. 71.57 s > 0: __rustc::rust_begin_unwind
  1483. 71.57 s > 1: core::panicking::panic_fmt
  1484. 71.57 s > 2: <symbolica::evaluate::evaluator::ExpressionEvaluator<gammalooprs::utils::F<f64>>>::evaluate_impl_no_ops
  1485. 71.57 s > 3: <symbolica::evaluate::evaluator::ExpressionEvaluator<gammalooprs::utils::F<f64>>>::evaluate_single
  1486. 71.57 s > 4: gammalooprs::cff::generation::tests_cff::thermal_bubble_chain
  1487. 71.57 s > 5: <gammalooprs::cff::generation::tests_cff::thermal_bubble_chain::{closure#0} as core::ops::function::FnOnce<()>>::call_once
  1488. 71.57 s > note: Some details are omitted, run with `RUST_BACKTRACE=full` for a verbose backtrace.
  1489. 71.57 s >
  1490. 71.57 s > 4. gammalooprs::cff::generation::tests_cff::thermal_ring
  1491. 71.57 s > failure: test failure with exit code 101
  1492. 71.57 s > thread 'cff::generation::tests_cff::thermal_ring' (1286) panicked at /nix/store/1sigmg52bb61pfngmk9k8wq5fz9r7bf1-vendor-cargo-deps/5929dab090e556a579e9f3b708cd2e67c60b3d84a12b5a276f2a36cb00473133/symbolica-2.2.0/src/evaluate/evaluator.rs:295:21:
  1493. 71.57 s > External function 'symbolica_coth' does not have an implementation for gammalooprs::utils::F<f64>
  1494. 71.57 s > stack backtrace:
  1495. 71.57 s > 0: __rustc::rust_begin_unwind
  1496. 71.57 s > 1: core::panicking::panic_fmt
  1497. 71.57 s > 2: <symbolica::evaluate::evaluator::ExpressionEvaluator<gammalooprs::utils::F<f64>>>::evaluate_impl_no_ops
  1498. 71.57 s > 3: <symbolica::evaluate::evaluator::ExpressionEvaluator<gammalooprs::utils::F<f64>>>::evaluate_single
  1499. 71.57 s > 4: gammalooprs::cff::generation::tests_cff::thermal_ring
  1500. 71.57 s > 5: <gammalooprs::cff::generation::tests_cff::thermal_ring::{closure#0} as core::ops::function::FnOnce<()>>::call_once
  1501. 71.57 s > note: Some details are omitted, run with `RUST_BACKTRACE=full` for a verbose backtrace.
  1502. 71.57 s > system-out
  1503. 71.57 s > running 1 test
  1504. 71.57 s > test cff::generation::tests_cff::thermal_ring ... FAILED
  1505. 71.57 s >
  1506. 71.57 s > failures:
  1507. 71.57 s >
  1508. 71.57 s > failures:
  1509. 71.57 s > cff::generation::tests_cff::thermal_ring
  1510. 71.57 s >
  1511. 71.57 s > test result: FAILED. 0 passed; 1 failed; 0 ignored; 0 measured; 535 filtered out; finished in 0.12s
  1512. 71.57 s > system-err
  1513. 71.57 s > thread 'cff::generation::tests_cff::thermal_ring' (1286) panicked at /nix/store/1sigmg52bb61pfngmk9k8wq5fz9r7bf1-vendor-cargo-deps/5929dab090e556a579e9f3b708cd2e67c60b3d84a12b5a276f2a36cb00473133/symbolica-2.2.0/src/evaluate/evaluator.rs:295:21:
  1514. 71.57 s > External function 'symbolica_coth' does not have an implementation for gammalooprs::utils::F<f64>
  1515. 71.57 s > stack backtrace:
  1516. 71.57 s > 0: __rustc::rust_begin_unwind
  1517. 71.57 s > 1: core::panicking::panic_fmt
  1518. 71.57 s > 2: <symbolica::evaluate::evaluator::ExpressionEvaluator<gammalooprs::utils::F<f64>>>::evaluate_impl_no_ops
  1519. 71.57 s > 3: <symbolica::evaluate::evaluator::ExpressionEvaluator<gammalooprs::utils::F<f64>>>::evaluate_single
  1520. 71.57 s > 4: gammalooprs::cff::generation::tests_cff::thermal_ring
  1521. 71.57 s > 5: <gammalooprs::cff::generation::tests_cff::thermal_ring::{closure#0} as core::ops::function::FnOnce<()>>::call_once
  1522. 71.57 s > note: Some details are omitted, run with `RUST_BACKTRACE=full` for a verbose backtrace.
  1523. 71.57 s >
  1524. 71.57 s > 5. gammalooprs::cff::generation::tests_cff::thermal_mercedes
  1525. 71.57 s > failure: test failure with exit code 101
  1526. 71.57 s > thread 'cff::generation::tests_cff::thermal_mercedes' (1306) panicked at /nix/store/1sigmg52bb61pfngmk9k8wq5fz9r7bf1-vendor-cargo-deps/5929dab090e556a579e9f3b708cd2e67c60b3d84a12b5a276f2a36cb00473133/symbolica-2.2.0/src/evaluate/evaluator.rs:295:21:
  1527. 71.57 s > External function 'symbolica_coth' does not have an implementation for gammalooprs::utils::F<f64>
  1528. 71.57 s > stack backtrace:
  1529. 71.57 s > 0: __rustc::rust_begin_unwind
  1530. 71.57 s > 1: core::panicking::panic_fmt
  1531. 71.57 s > 2: <symbolica::evaluate::evaluator::ExpressionEvaluator<gammalooprs::utils::F<f64>>>::evaluate_impl_no_ops
  1532. 71.57 s > 3: <symbolica::evaluate::evaluator::ExpressionEvaluator<gammalooprs::utils::F<f64>>>::evaluate_single
  1533. 71.57 s > 4: gammalooprs::cff::generation::tests_cff::thermal_mercedes
  1534. 71.57 s > 5: <gammalooprs::cff::generation::tests_cff::thermal_mercedes::{closure#0} as core::ops::function::FnOnce<()>>::call_once
  1535. 71.57 s > note: Some details are omitted, run with `RUST_BACKTRACE=full` for a verbose backtrace.
  1536. 71.57 s > system-out
  1537. 71.57 s > running 1 test
  1538. 71.57 s > test cff::generation::tests_cff::thermal_mercedes ... FAILED
  1539. 71.57 s >
  1540. 71.57 s > failures:
  1541. 71.57 s >
  1542. 71.57 s > failures:
  1543. 71.57 s > cff::generation::tests_cff::thermal_mercedes
  1544. 71.57 s >
  1545. 71.57 s > test result: FAILED. 0 passed; 1 failed; 0 ignored; 0 measured; 535 filtered out; finished in 0.15s
  1546. 71.58 s > system-err
  1547. 71.58 s > thread 'cff::generation::tests_cff::thermal_mercedes' (1306) panicked at /nix/store/1sigmg52bb61pfngmk9k8wq5fz9r7bf1-vendor-cargo-deps/5929dab090e556a579e9f3b708cd2e67c60b3d84a12b5a276f2a36cb00473133/symbolica-2.2.0/src/evaluate/evaluator.rs:295:21:
  1548. 71.58 s > External function 'symbolica_coth' does not have an implementation for gammalooprs::utils::F<f64>
  1549. 71.58 s > stack backtrace:
  1550. 71.58 s > 0: __rustc::rust_begin_unwind
  1551. 71.58 s > 1: core::panicking::panic_fmt
  1552. 71.58 s > 2: <symbolica::evaluate::evaluator::ExpressionEvaluator<gammalooprs::utils::F<f64>>>::evaluate_impl_no_ops
  1553. 71.58 s > 3: <symbolica::evaluate::evaluator::ExpressionEvaluator<gammalooprs::utils::F<f64>>>::evaluate_single
  1554. 71.58 s > 4: gammalooprs::cff::generation::tests_cff::thermal_mercedes
  1555. 71.58 s > 5: <gammalooprs::cff::generation::tests_cff::thermal_mercedes::{closure#0} as core::ops::function::FnOnce<()>>::call_once
  1556. 71.58 s > note: Some details are omitted, run with `RUST_BACKTRACE=full` for a verbose backtrace.
  1557. 71.58 s >
  1558. 71.58 s > 6. gammalooprs::graph::feynman_graph::tests::native_thermal_distributions
  1559. 71.58 s > failure: test failure with exit code 101
  1560. 71.58 s > system-out
  1561. 71.58 s > running 1 test
  1562. 71.58 s > test graph::feynman_graph::tests::native_thermal_distributions ... FAILED
  1563. 71.58 s >
  1564. 71.58 s > failures:
  1565. 71.58 s >
  1566. 71.58 s > failures:
  1567. 71.58 s > graph::feynman_graph::tests::native_thermal_distributions
  1568. 71.58 s >
  1569. 71.58 s > test result: FAILED. 0 passed; 1 failed; 0 ignored; 0 measured; 535 filtered out; finished in 1.25s
  1570. 71.58 s > system-err
  1571. 71.58 s > The application panicked (crashed).
  1572. 71.58 s > Message: called `Result::unwrap()` on an `Err` value: Custom { kind: Other, error: "Could not compile code: g++ -shared -O3 -fPIC -ffast-math -funsafe-math-optimizations -march=native -o /build/gammaloop-native-thermal-1340/thermal_0_0.so /build/gammaloop-native-thermal-1340/thermal_0_0.cpp\nwarning: Skipping impure flag -march=native because NIX_ENFORCE_NO_NATIVE is set\n/build/gammaloop-native-thermal-1340/thermal_0_0.cpp: In function 'void thermal_realf64(const double*, double*, double*)':\n/build/gammaloop-native-thermal-1340/thermal_0_0.cpp:27:16: error: 'symbolica_tanh' was not declared in this scope\n 27 | Z[6] = symbolica_tanh(Z[6]);\n | ^~~~~~~~~~~~~~\n" }
  1573. 71.58 s > Location: crates/gammalooprs/src/graph/feynman_graph.rs:937
  1574. 71.58 s >
  1575. 71.58 s > ━━━━━━━━━━━━━━━━━━━━━━━━━━━━━━━━━━ BACKTRACE ━━━━━━━━━━━━━━━━━━━━━━━━━━━━━━━━━━━
  1576. 71.58 s > 1: <color_eyre[b0c9e66060e883b2]::config::PanicHook>::panic_report<unknown>
  1577. 71.58 s > at <unknown source file>:<unknown line>
  1578. 71.58 s > 2: <color_eyre[b0c9e66060e883b2]::config::PanicHook>::into_panic_hook::{closure#0}<unknown>
  1579. 71.58 s > at <unknown source file>:<unknown line>
  1580. 71.58 s > 3: std[bcb96dfbba0ab899]::panicking::panic_with_hook<unknown>
  1581. 71.58 s > at <unknown source file>:<unknown line>
  1582. 71.58 s > 4: std[bcb96dfbba0ab899]::panicking::panic_handler::{closure#0}<unknown>
  1583. 71.58 s > at <unknown source file>:<unknown line>
  1584. 71.58 s > 5: std[bcb96dfbba0ab899]::sys::backtrace::__rust_end_short_backtrace::<std[bcb96dfbba0ab899]::panicking::panic_handler::{closure#0}, !><unknown>
  1585. 71.58 s > at <unknown source file>:<unknown line>
  1586. 71.58 s > 6: __rustc[6c289b9f9c454d21]::rust_begin_unwind<unknown>
  1587. 71.58 s > at <unknown source file>:<unknown line>
  1588. 71.58 s > 7: core[940e698046960fd5]::panicking::panic_fmt<unknown>
  1589. 71.58 s > at <unknown source file>:<unknown line>
  1590. 71.58 s > 8: core[940e698046960fd5]::result::unwrap_failed<unknown>
  1591. 71.58 s > at <unknown source file>:<unknown line>
  1592. 71.58 s > 9: gammalooprs[5490727360442cce]::graph::feynman_graph::tests::native_thermal_distributions<unknown>
  1593. 71.58 s > at <unknown source file>:<unknown line>
  1594. 71.58 s > 10: <gammalooprs[5490727360442cce]::graph::feynman_graph::tests::native_thermal_distributions::{closure#0} as core[940e698046960fd5]::ops::function::FnOnce<()>>::call_once<unknown>
  1595. 71.58 s > at <unknown source file>:<unknown line>
  1596. 71.58 s > 11: test[75d6903177b1d7e9]::__rust_begin_short_backtrace::<core[940e698046960fd5]::result::Result<(), alloc[2ea6bcb46fca0c42]::string::String>, fn() -> core[940e698046960fd5]::result::Result<(), alloc[2ea6bcb46fca0c42]::string::String>><unknown>
  1597. 71.58 s > at <unknown source file>:<unknown line>
  1598. 71.58 s > 12: test[75d6903177b1d7e9]::run_test::{closure#0}<unknown>
  1599. 71.58 s > at <unknown source file>:<unknown line>
  1600. 71.58 s > 13: std[bcb96dfbba0ab899]::sys::backtrace::__rust_begin_short_backtrace::<test[75d6903177b1d7e9]::run_test::{closure#1}, ()><unknown>
  1601. 71.58 s > at <unknown source file>:<unknown line>
  1602. 71.58 s > 14: <std[bcb96dfbba0ab899]::thread::lifecycle::spawn_unchecked<test[75d6903177b1d7e9]::run_test::{closure#1}, ()>::{closure#1} as core[940e698046960fd5]::ops::function::FnOnce<()>>::call_once::{shim:vtable#0}<unknown>
  1603. 71.58 s > at <unknown source file>:<unknown line>
  1604. 71.58 s > 15: <std[bcb96dfbba0ab899]::sys::thread::unix::Thread>::new::thread_start<unknown>
  1605. 71.58 s > at <unknown source file>:<unknown line>
  1606. 71.58 s > 16: start_thread<unknown>
  1607. 71.58 s > at <unknown source file>:<unknown line>
  1608. 71.58 s > 17: __clone3<unknown>
  1609. 71.58 s > at <unknown source file>:<unknown line>
  1610. 71.58 s >
  1611. 71.58 s > Run with COLORBT_SHOW_HIDDEN=1 environment variable to disable frame filtering.
  1612. 71.58 s > Run with RUST_BACKTRACE=full to include source snippets.
  1613. 71.58 s >
  1614. 71.58 s > 7. gammalooprs::cff::generation::tests_cff::thermal_bugblatter
  1615. 71.58 s > failure: test failure with exit code 101
  1616. 71.58 s > thread 'cff::generation::tests_cff::thermal_bugblatter' (1296) panicked at /nix/store/1sigmg52bb61pfngmk9k8wq5fz9r7bf1-vendor-cargo-deps/5929dab090e556a579e9f3b708cd2e67c60b3d84a12b5a276f2a36cb00473133/symbolica-2.2.0/src/evaluate/evaluator.rs:295:21:
  1617. 71.58 s > External function 'symbolica_coth' does not have an implementation for gammalooprs::utils::F<f64>
  1618. 71.58 s > stack backtrace:
  1619. 71.58 s > 0: __rustc::rust_begin_unwind
  1620. 71.58 s > 1: core::panicking::panic_fmt
  1621. 71.58 s > 2: <symbolica::evaluate::evaluator::ExpressionEvaluator<gammalooprs::utils::F<f64>>>::evaluate_impl_no_ops
  1622. 71.58 s > 3: <symbolica::evaluate::evaluator::ExpressionEvaluator<gammalooprs::utils::F<f64>>>::evaluate_single
  1623. 71.58 s > 4: gammalooprs::cff::generation::tests_cff::thermal_bugblatter
  1624. 71.58 s > 5: <gammalooprs::cff::generation::tests_cff::thermal_bugblatter::{closure#0} as core::ops::function::FnOnce<()>>::call_once
  1625. 71.58 s > note: Some details are omitted, run with `RUST_BACKTRACE=full` for a verbose backtrace.
  1626. 71.58 s > system-out
  1627. 71.58 s > running 1 test
  1628. 71.58 s > test cff::generation::tests_cff::thermal_bugblatter ... FAILED
  1629. 71.58 s >
  1630. 71.58 s > failures:
  1631. 71.58 s >
  1632. 71.58 s > failures:
  1633. 71.58 s > cff::generation::tests_cff::thermal_bugblatter
  1634. 71.58 s >
  1635. 71.58 s > test result: FAILED. 0 passed; 1 failed; 0 ignored; 0 measured; 535 filtered out; finished in 11.78s
  1636. 71.58 s > system-err
  1637. 71.58 s > thread 'cff::generation::tests_cff::thermal_bugblatter' (1296) panicked at /nix/store/1sigmg52bb61pfngmk9k8wq5fz9r7bf1-vendor-cargo-deps/5929dab090e556a579e9f3b708cd2e67c60b3d84a12b5a276f2a36cb00473133/symbolica-2.2.0/src/evaluate/evaluator.rs:295:21:
  1638. 71.58 s > External function 'symbolica_coth' does not have an implementation for gammalooprs::utils::F<f64>
  1639. 71.58 s > stack backtrace:
  1640. 71.58 s > 0: __rustc::rust_begin_unwind
  1641. 71.58 s > 1: core::panicking::panic_fmt
  1642. 71.58 s > 2: <symbolica::evaluate::evaluator::ExpressionEvaluator<gammalooprs::utils::F<f64>>>::evaluate_impl_no_ops
  1643. 71.58 s > 3: <symbolica::evaluate::evaluator::ExpressionEvaluator<gammalooprs::utils::F<f64>>>::evaluate_single
  1644. 71.58 s > 4: gammalooprs::cff::generation::tests_cff::thermal_bugblatter
  1645. 71.58 s > 5: <gammalooprs::cff::generation::tests_cff::thermal_bugblatter::{closure#0} as core::ops::function::FnOnce<()>>::call_once
  1646. 71.58 s > note: Some details are omitted, run with `RUST_BACKTRACE=full` for a verbose backtrace.
  1647. 71.58 s > =========================================
  1648. 71.58 s For full logs, run:
  1649. 71.58 s nix log /nix/store/4m6xcddxcb2ycplv2r6vd1qc57nv11md-gammaloop-nextest-core.drv
  1650. 71.71 s Run failed.