test packages.x86_64-linux.nix-ci-check-gammaloop-nextest-core

Reproduce this run
Original Run
  1. 0.01 s $ /nix/store/9ypz3flqsrl5xl495mm8h645gadjsxi1-coreutils-9.11/bin/timeout --kill-after=15s 7200s /nix/store/23zk8sgzamrbmj1fday15szf7f2279s8-nix-2.34.7/bin/nix --extra-experimental-features nix-command --extra-experimental-features flakes flake clone git+https://github.com/alphal00p/gammaloop --dest /tmp/nix-ci-worker/stable-pwd/repo/
  2. 0.11 s Cloning into '/tmp/nix-ci-worker/stable-pwd/repo'...
  3. 0.91 s remote: Enumerating objects: 78511, done.
  4. 1.02 s remote: Counting objects: 0% (1/8005) remote: Counting objects: 1% (81/8005) remote: Counting objects: 2% (161/8005) remote: Counting objects: 3% (241/8005) remote: Counting objects: 4% (321/8005) remote: Counting objects: 5% (401/8005) remote: Counting objects: 6% (481/8005) remote: Counting objects: 7% (561/8005) remote: Counting objects: 8% (641/8005) remote: Counting objects: 9% (721/8005) remote: Counting objects: 10% (801/8005) remote: Counting objects: 11% (881/8005) remote: Counting objects: 12% (961/8005) remote: Counting objects: 13% (1041/8005) remote: Counting objects: 14% (1121/8005) remote: Counting objects: 15% (1201/8005) remote: Counting objects: 16% (1281/8005) remote: Counting objects: 17% (1361/8005) remote: Counting objects: 18% (1441/8005) remote: Counting objects: 19% (1521/8005) remote: Counting objects: 20% (1601/8005) remote: Counting objects: 21% (1682/8005) remote: Counting objects: 22% (1762/8005) remote: Counting objects: 23% (1842/8005) remote: Counting objects: 24% (1922/8005) remote: Counting objects: 25% (2002/8005) remote: Counting objects: 26% (2082/8005) remote: Counting objects: 27% (2162/8005) remote: Counting objects: 28% (2242/8005) remote: Counting objects: 29% (2322/8005) remote: Counting objects: 30% (2402/8005) remote: Counting objects: 31% (2482/8005) remote: Counting objects: 32% (2562/8005) remote: Counting objects: 33% (2642/8005) remote: Counting objects: 34% (2722/8005) remote: Counting objects: 35% (2802/8005) remote: Counting objects: 36% (2882/8005) remote: Counting objects: 37% (2962/8005) remote: Counting objects: 38% (3042/8005) remote: Counting objects: 39% (3122/8005) remote: Counting objects: 40% (3202/8005) remote: Counting objects: 41% (3283/8005) remote: Counting objects: 42% (3363/8005) remote: Counting objects: 43% (3443/8005) remote: Counting objects: 44% (3523/8005) remote: Counting objects: 45% (3603/8005) remote: Counting objects: 46% (3683/8005) remote: Counting objects: 47% (3763/8005) remote: Counting objects: 48% (3843/8005) remote: Counting objects: 49% (3923/8005) remote: Counting objects: 50% (4003/8005) remote: Counting objects: 51% (4083/8005) remote: Counting objects: 52% (4163/8005) remote: Counting objects: 53% (4243/8005) remote: Counting objects: 54% (4323/8005) remote: Counting objects: 55% (4403/8005) remote: Counting objects: 56% (4483/8005) remote: Counting objects: 57% (4563/8005) remote: Counting objects: 58% (4643/8005) remote: Counting objects: 59% (4723/8005) remote: Counting objects: 60% (4803/8005) remote: Counting objects: 61% (4884/8005) remote: Counting objects: 62% (4964/8005) remote: Counting objects: 63% (5044/8005) remote: Counting objects: 64% (5124/8005) remote: Counting objects: 65% (5204/8005) remote: Counting objects: 66% (5284/8005) remote: Counting objects: 67% (5364/8005) remote: Counting objects: 68% (5444/8005) remote: Counting objects: 69% (5524/8005) remote: Counting objects: 70% (5604/8005) remote: Counting objects: 71% (5684/8005) remote: Counting objects: 72% (5764/8005) remote: Counting objects: 73% (5844/8005) remote: Counting objects: 74% (5924/8005) remote: Counting objects: 75% (6004/8005) remote: Counting objects: 76% (6084/8005) remote: Counting objects: 77% (6164/8005) remote: Counting objects: 78% (6244/8005) remote: Counting objects: 79% (6324/8005) remote: Counting objects: 80% (6404/8005) remote: Counting objects: 81% (6485/8005) remote: Counting objects: 82% (6565/8005) remote: Counting objects: 83% (6645/8005) remote: Counting objects: 84% (6725/8005) remote: Counting objects: 85% (6805/8005) remote: Counting objects: 86% (6885/8005) remote: Counting objects: 87% (6965/8005) remote: Counting objects: 88% (7045/8005) remote: Counting objects: 89% (7125/8005) remote: Counting objects: 90% (7205/8005) remote: Counting objects: 91% (7285/8005) remote: Counting objects: 92% (7365/8005) remote: Counting objects: 93% (7445/8005) remote: Counting objects: 94% (7525/8005) remote: Counting objects: 95% (7605/8005) remote: Counting objects: 96% (7685/8005) remote: Counting objects: 97% (7765/8005) remote: Counting objects: 98% (7845/8005) remote: Counting objects: 99% (7925/8005) remote: Counting objects: 100% (8005/8005) remote: Counting objects: 100% (8005/8005), done.
  5. 2.67 s remote: Compressing objects: 0% (1/1507) remote: Compressing objects: 1% (16/1507) remote: Compressing objects: 2% (31/1507) remote: Compressing objects: 3% (46/1507) remote: Compressing objects: 4% (61/1507) remote: Compressing objects: 5% (76/1507) remote: Compressing objects: 6% (91/1507) remote: Compressing objects: 7% (106/1507) remote: Compressing objects: 8% (121/1507) remote: Compressing objects: 9% (136/1507) remote: Compressing objects: 9% (140/1507) remote: Compressing objects: 10% (151/1507) remote: Compressing objects: 11% (166/1507) remote: Compressing objects: 12% (181/1507) remote: Compressing objects: 13% (196/1507) remote: Compressing objects: 14% (211/1507) remote: Compressing objects: 15% (227/1507) remote: Compressing objects: 16% (242/1507) remote: Compressing objects: 17% (257/1507) remote: Compressing objects: 18% (272/1507) remote: Compressing objects: 19% (287/1507) remote: Compressing objects: 20% (302/1507) remote: Compressing objects: 21% (317/1507) remote: Compressing objects: 22% (332/1507) remote: Compressing objects: 23% (347/1507) remote: Compressing objects: 24% (362/1507) remote: Compressing objects: 25% (377/1507) remote: Compressing objects: 26% (392/1507) remote: Compressing objects: 27% (407/1507) remote: Compressing objects: 28% (422/1507) remote: Compressing objects: 29% (438/1507) remote: Compressing objects: 30% (453/1507) remote: Compressing objects: 31% (468/1507) remote: Compressing objects: 32% (483/1507) remote: Compressing objects: 33% (498/1507) remote: Compressing objects: 34% (513/1507) remote: Compressing objects: 35% (528/1507) remote: Compressing objects: 36% (543/1507) remote: Compressing objects: 37% (558/1507) remote: Compressing objects: 38% (573/1507) remote: Compressing objects: 39% (588/1507) remote: Compressing objects: 40% (603/1507) remote: Compressing objects: 41% (618/1507) remote: Compressing objects: 42% (633/1507) remote: Compressing objects: 43% (649/1507) remote: Compressing objects: 44% (664/1507) remote: Compressing objects: 45% (679/1507) remote: Compressing objects: 46% (694/1507) remote: Compressing objects: 47% (709/1507) remote: Compressing objects: 48% (724/1507) remote: Compressing objects: 49% (739/1507) remote: Compressing objects: 50% (754/1507) remote: Compressing objects: 51% (769/1507) remote: Compressing objects: 52% (784/1507) remote: Compressing objects: 53% (799/1507) remote: Compressing objects: 54% (814/1507) remote: Compressing objects: 55% (829/1507) remote: Compressing objects: 56% (844/1507) remote: Compressing objects: 57% (859/1507) remote: Compressing objects: 58% (875/1507) remote: Compressing objects: 59% (890/1507) remote: Compressing objects: 60% (905/1507) remote: Compressing objects: 61% (920/1507) remote: Compressing objects: 62% (935/1507) remote: Compressing objects: 63% (950/1507) remote: Compressing objects: 64% (965/1507) remote: Compressing objects: 65% (980/1507) remote: Compressing objects: 66% (995/1507) remote: Compressing objects: 67% (1010/1507) remote: Compressing objects: 68% (1025/1507) remote: Compressing objects: 69% (1040/1507) remote: Compressing objects: 70% (1055/1507) remote: Compressing objects: 71% (1070/1507) remote: Compressing objects: 72% (1086/1507) remote: Compressing objects: 73% (1101/1507) remote: Compressing objects: 74% (1116/1507) remote: Compressing objects: 75% (1131/1507) remote: Compressing objects: 76% (1146/1507) remote: Compressing objects: 77% (1161/1507) remote: Compressing objects: 78% (1176/1507) remote: Compressing objects: 79% (1191/1507) remote: Compressing objects: 80% (1206/1507) remote: Compressing objects: 81% (1221/1507) remote: Compressing objects: 82% (1236/1507) remote: Compressing objects: 83% (1251/1507) remote: Compressing objects: 84% (1266/1507) remote: Compressing objects: 85% (1281/1507) remote: Compressing objects: 86% (1297/1507) remote: Compressing objects: 87% (1312/1507) remote: Compressing objects: 88% (1327/1507) remote: Compressing objects: 89% (1342/1507) remote: Compressing objects: 90% (1357/1507) remote: Compressing objects: 91% (1372/1507) remote: Compressing objects: 92% (1387/1507) remote: Compressing objects: 93% (1402/1507) remote: Compressing objects: 94% (1417/1507) remote: Compressing objects: 95% (1432/1507) remote: Compressing objects: 96% (1447/1507) remote: Compressing objects: 97% (1462/1507) remote: Compressing objects: 98% (1477/1507) remote: Compressing objects: 99% (1492/1507) remote: Compressing objects: 100% (1507/1507) remote: Compressing objects: 100% (1507/1507), done.
  6. 6.82 s Receiving objects: 0% (1/78511) Receiving objects: 1% (786/78511), 932.00 KiB | 1.80 MiB/s Receiving objects: 2% (1571/78511), 932.00 KiB | 1.80 MiB/s Receiving objects: 3% (2356/78511), 932.00 KiB | 1.80 MiB/s Receiving objects: 4% (3141/78511), 932.00 KiB | 1.80 MiB/s Receiving objects: 5% (3926/78511), 932.00 KiB | 1.80 MiB/s Receiving objects: 6% (4711/78511), 932.00 KiB | 1.80 MiB/s Receiving objects: 6% (4746/78511), 8.91 MiB | 8.89 MiB/s Receiving objects: 7% (5496/78511), 8.91 MiB | 8.89 MiB/s Receiving objects: 8% (6281/78511), 8.91 MiB | 8.89 MiB/s Receiving objects: 9% (7066/78511), 8.91 MiB | 8.89 MiB/s Receiving objects: 10% (7852/78511), 8.91 MiB | 8.89 MiB/s Receiving objects: 11% (8637/78511), 8.91 MiB | 8.89 MiB/s Receiving objects: 12% (9422/78511), 8.91 MiB | 8.89 MiB/s Receiving objects: 13% (10207/78511), 8.91 MiB | 8.89 MiB/s Receiving objects: 14% (10992/78511), 8.91 MiB | 8.89 MiB/s Receiving objects: 15% (11777/78511), 8.91 MiB | 8.89 MiB/s Receiving objects: 16% (12562/78511), 8.91 MiB | 8.89 MiB/s Receiving objects: 17% (13347/78511), 8.91 MiB | 8.89 MiB/s Receiving objects: 18% (14132/78511), 8.91 MiB | 8.89 MiB/s Receiving objects: 19% (14918/78511), 8.91 MiB | 8.89 MiB/s Receiving objects: 20% (15703/78511), 8.91 MiB | 8.89 MiB/s Receiving objects: 21% (16488/78511), 8.91 MiB | 8.89 MiB/s Receiving objects: 22% (17273/78511), 8.91 MiB | 8.89 MiB/s Receiving objects: 23% (18058/78511), 8.91 MiB | 8.89 MiB/s Receiving objects: 24% (18843/78511), 8.91 MiB | 8.89 MiB/s Receiving objects: 25% (19628/78511), 8.91 MiB | 8.89 MiB/s Receiving objects: 26% (20413/78511), 8.91 MiB | 8.89 MiB/s Receiving objects: 27% (21198/78511), 8.91 MiB | 8.89 MiB/s Receiving objects: 28% (21984/78511), 8.91 MiB | 8.89 MiB/s Receiving objects: 29% (22769/78511), 23.51 MiB | 15.66 MiB/s Receiving objects: 30% (23554/78511), 23.51 MiB | 15.66 MiB/s Receiving objects: 31% (24339/78511), 23.51 MiB | 15.66 MiB/s Receiving objects: 32% (25124/78511), 23.51 MiB | 15.66 MiB/s Receiving objects: 33% (25909/78511), 23.51 MiB | 15.66 MiB/s Receiving objects: 34% (26694/78511), 23.51 MiB | 15.66 MiB/s Receiving objects: 35% (27479/78511), 23.51 MiB | 15.66 MiB/s Receiving objects: 36% (28264/78511), 23.51 MiB | 15.66 MiB/s Receiving objects: 37% (29050/78511), 23.51 MiB | 15.66 MiB/s Receiving objects: 38% (29835/78511), 23.51 MiB | 15.66 MiB/s Receiving objects: 39% (30620/78511), 23.51 MiB | 15.66 MiB/s Receiving objects: 40% (31405/78511), 23.51 MiB | 15.66 MiB/s Receiving objects: 41% (32190/78511), 23.51 MiB | 15.66 MiB/s Receiving objects: 42% (32975/78511), 23.51 MiB | 15.66 MiB/s Receiving objects: 43% (33760/78511), 23.51 MiB | 15.66 MiB/s Receiving objects: 44% (34545/78511), 23.51 MiB | 15.66 MiB/s Receiving objects: 45% (35330/78511), 23.51 MiB | 15.66 MiB/s Receiving objects: 46% (36116/78511), 23.51 MiB | 15.66 MiB/s Receiving objects: 47% (36901/78511), 23.51 MiB | 15.66 MiB/s Receiving objects: 48% (37686/78511), 23.51 MiB | 15.66 MiB/s Receiving objects: 49% (38471/78511), 23.51 MiB | 15.66 MiB/s Receiving objects: 50% (39256/78511), 23.51 MiB | 15.66 MiB/s Receiving objects: 50% (39453/78511), 45.39 MiB | 22.68 MiB/s Receiving objects: 51% (40041/78511), 45.39 MiB | 22.68 MiB/s Receiving objects: 52% (40826/78511), 45.39 MiB | 22.68 MiB/s Receiving objects: 53% (41611/78511), 45.39 MiB | 22.68 MiB/s Receiving objects: 54% (42396/78511), 45.39 MiB | 22.68 MiB/s Receiving objects: 55% (43182/78511), 45.39 MiB | 22.68 MiB/s Receiving objects: 56% (43967/78511), 45.39 MiB | 22.68 MiB/s Receiving objects: 57% (44752/78511), 45.39 MiB | 22.68 MiB/s Receiving objects: 58% (45537/78511), 45.39 MiB | 22.68 MiB/s Receiving objects: 59% (46322/78511), 45.39 MiB | 22.68 MiB/s Receiving objects: 60% (47107/78511), 45.39 MiB | 22.68 MiB/s Receiving objects: 61% (47892/78511), 45.39 MiB | 22.68 MiB/s Receiving objects: 62% (48677/78511), 45.39 MiB | 22.68 MiB/s Receiving objects: 63% (49462/78511), 63.63 MiB | 25.44 MiB/s Receiving objects: 64% (50248/78511), 63.63 MiB | 25.44 MiB/s Receiving objects: 65% (51033/78511), 63.63 MiB | 25.44 MiB/s Receiving objects: 66% (51818/78511), 63.63 MiB | 25.44 MiB/s Receiving objects: 67% (52603/78511), 63.63 MiB | 25.44 MiB/s Receiving objects: 68% (53388/78511), 63.63 MiB | 25.44 MiB/s Receiving objects: 69% (54173/78511), 63.63 MiB | 25.44 MiB/s Receiving objects: 70% (54958/78511), 63.63 MiB | 25.44 MiB/s Receiving objects: 71% (55743/78511), 63.63 MiB | 25.44 MiB/s Receiving objects: 72% (56528/78511), 63.63 MiB | 25.44 MiB/s Receiving objects: 72% (56736/78511), 81.71 MiB | 27.19 MiB/s Receiving objects: 73% (57314/78511), 81.71 MiB | 27.19 MiB/s Receiving objects: 74% (58099/78511), 81.71 MiB | 27.19 MiB/s Receiving objects: 75% (58884/78511), 81.71 MiB | 27.19 MiB/s Receiving objects: 76% (59669/78511), 81.71 MiB | 27.19 MiB/s Receiving objects: 77% (60454/78511), 81.71 MiB | 27.19 MiB/s Receiving objects: 78% (61239/78511), 81.71 MiB | 27.19 MiB/s Receiving objects: 79% (62024/78511), 81.71 MiB | 27.19 MiB/s Receiving objects: 80% (62809/78511), 100.10 MiB | 28.54 MiB/s Receiving objects: 81% (63594/78511), 100.10 MiB | 28.54 MiB/s Receiving objects: 82% (64380/78511), 100.10 MiB | 28.54 MiB/s Receiving objects: 83% (65165/78511), 100.10 MiB | 28.54 MiB/s Receiving objects: 84% (65950/78511), 100.10 MiB | 28.54 MiB/s Receiving objects: 85% (66735/78511), 100.10 MiB | 28.54 MiB/s Receiving objects: 86% (67520/78511), 100.10 MiB | 28.54 MiB/s Receiving objects: 87% (68305/78511), 100.10 MiB | 28.54 MiB/s Receiving objects: 88% (69090/78511), 100.10 MiB | 28.54 MiB/s Receiving objects: 89% (69875/78511), 100.10 MiB | 28.54 MiB/s Receiving objects: 90% (70660/78511), 100.10 MiB | 28.54 MiB/s Receiving objects: 91% (71446/78511), 100.10 MiB | 28.54 MiB/s Receiving objects: 92% (72231/78511), 100.10 MiB | 28.54 MiB/s Receiving objects: 93% (73016/78511), 100.10 MiB | 28.54 MiB/s Receiving objects: 94% (73801/78511), 100.10 MiB | 28.54 MiB/s Receiving objects: 95% (74586/78511), 100.10 MiB | 28.54 MiB/s Receiving objects: 96% (75371/78511), 100.10 MiB | 28.54 MiB/s Receiving objects: 96% (76128/78511), 100.10 MiB | 28.54 MiB/s Receiving objects: 97% (76156/78511), 100.10 MiB | 28.54 MiB/s Receiving objects: 98% (76941/78511), 100.10 MiB | 28.54 MiB/s Receiving objects: 99% (77726/78511), 118.53 MiB | 29.57 MiB/s remote: Total 78511 (delta 7045), reused 6500 (delta 6498), pack-reused 70506 (from 2)
  7. 6.83 s Receiving objects: 100% (78511/78511), 118.53 MiB | 29.57 MiB/s Receiving objects: 100% (78511/78511), 120.01 MiB | 29.65 MiB/s, done.
  8. 8.12 s Resolving deltas: 0% (0/53617) Resolving deltas: 1% (537/53617) Resolving deltas: 2% (1073/53617) Resolving deltas: 3% (1609/53617) Resolving deltas: 4% (2145/53617) Resolving deltas: 5% (2681/53617) Resolving deltas: 6% (3219/53617) Resolving deltas: 7% (3754/53617) Resolving deltas: 8% (4290/53617) Resolving deltas: 9% (4827/53617) Resolving deltas: 10% (5362/53617) Resolving deltas: 11% (5898/53617) Resolving deltas: 12% (6435/53617) Resolving deltas: 13% (6971/53617) Resolving deltas: 14% (7507/53617) Resolving deltas: 15% (8043/53617) Resolving deltas: 16% (8580/53617) Resolving deltas: 17% (9115/53617) Resolving deltas: 18% (9652/53617) Resolving deltas: 19% (10188/53617) Resolving deltas: 20% (10725/53617) Resolving deltas: 21% (11260/53617) Resolving deltas: 22% (11801/53617) Resolving deltas: 23% (12332/53617) Resolving deltas: 24% (12869/53617) Resolving deltas: 25% (13410/53617) Resolving deltas: 26% (13941/53617) Resolving deltas: 27% (14477/53617) Resolving deltas: 28% (15013/53617) Resolving deltas: 29% (15549/53617) Resolving deltas: 30% (16086/53617) Resolving deltas: 31% (16622/53617) Resolving deltas: 32% (17158/53617) Resolving deltas: 33% (17694/53617) Resolving deltas: 34% (18230/53617) Resolving deltas: 35% (18766/53617) Resolving deltas: 36% (19303/53617) Resolving deltas: 37% (19839/53617) Resolving deltas: 38% (20375/53617) Resolving deltas: 39% (20913/53617) Resolving deltas: 40% (21449/53617) Resolving deltas: 41% (21983/53617) Resolving deltas: 42% (22521/53617) Resolving deltas: 43% (23058/53617) Resolving deltas: 44% (23593/53617) Resolving deltas: 45% (24128/53617) Resolving deltas: 46% (24667/53617) Resolving deltas: 47% (25200/53617) Resolving deltas: 48% (25738/53617) Resolving deltas: 49% (26273/53617) Resolving deltas: 50% (26809/53617) Resolving deltas: 51% (27347/53617) Resolving deltas: 52% (27881/53617) Resolving deltas: 53% (28420/53617) Resolving deltas: 54% (28954/53617) Resolving deltas: 55% (29490/53617) Resolving deltas: 56% (30026/53617) Resolving deltas: 57% (30562/53617) Resolving deltas: 58% (31098/53617) Resolving deltas: 59% (31635/53617) Resolving deltas: 60% (32171/53617) Resolving deltas: 61% (32710/53617) Resolving deltas: 62% (33243/53617) Resolving deltas: 63% (33779/53617) Resolving deltas: 64% (34315/53617) Resolving deltas: 65% (34852/53617) Resolving deltas: 66% (35388/53617) Resolving deltas: 67% (35924/53617) Resolving deltas: 68% (36460/53617) Resolving deltas: 69% (36996/53617) Resolving deltas: 70% (37532/53617) Resolving deltas: 71% (38070/53617) Resolving deltas: 72% (38605/53617) Resolving deltas: 73% (39141/53617) Resolving deltas: 74% (39677/53617) Resolving deltas: 75% (40213/53617) Resolving deltas: 76% (40749/53617) Resolving deltas: 77% (41287/53617) Resolving deltas: 78% (41824/53617) Resolving deltas: 79% (42358/53617) Resolving deltas: 79% (42555/53617) Resolving deltas: 80% (42894/53617) Resolving deltas: 81% (43430/53617) Resolving deltas: 82% (43966/53617) Resolving deltas: 83% (44503/53617) Resolving deltas: 84% (45039/53617) Resolving deltas: 85% (45575/53617) Resolving deltas: 86% (46113/53617) Resolving deltas: 87% (46647/53617) Resolving deltas: 88% (47183/53617) Resolving deltas: 89% (47720/53617) Resolving deltas: 90% (48257/53617) Resolving deltas: 91% (48792/53617) Resolving deltas: 92% (49328/53617) Resolving deltas: 93% (49864/53617) Resolving deltas: 94% (50400/53617) Resolving deltas: 95% (50939/53617) Resolving deltas: 96% (51474/53617) Resolving deltas: 97% (52009/53617) Resolving deltas: 98% (52545/53617) Resolving deltas: 99% (53081/53617) Resolving deltas: 100% (53617/53617) Resolving deltas: 100% (53617/53617), done.
  9. 8.69 s Fetching commit d2939d705e8a50d3412afbd503f2e4868476dca1 for wip/native-symbolica-hyperbolics ...
  10. 8.69 s $ /nix/store/bcnisk3ydfgv26v2gw3zlky24g00yww2-git-2.54.0/bin/git fetch origin d2939d705e8a50d3412afbd503f2e4868476dca1
  11. 9.18 s From https://github.com/alphal00p/gammaloop
  12. 9.18 s * branch d2939d705e8a50d3412afbd503f2e4868476dca1 -> FETCH_HEAD
  13. 9.21 s $ /nix/store/9ypz3flqsrl5xl495mm8h645gadjsxi1-coreutils-9.11/bin/timeout --kill-after=15s 7200s /nix/store/bcnisk3ydfgv26v2gw3zlky24g00yww2-git-2.54.0/bin/git -c advice.detachedHead=false checkout d2939d705e8a50d3412afbd503f2e4868476dca1
  14. 9.45 s HEAD is now at d2939d705 wip: native hyperbolic functions, blocked on symbolica evaluator support
  15. 9.46 s $ /nix/store/9ypz3flqsrl5xl495mm8h645gadjsxi1-coreutils-9.11/bin/timeout --kill-after=15s 7200s /nix/store/23zk8sgzamrbmj1fday15szf7f2279s8-nix-2.34.7/bin/nix --extra-experimental-features nix-command --extra-experimental-features flakes --log-format internal-json run .#packages.x86_64-linux.nix-ci-check-gammaloop-nextest-core --print-build-logs
  16. 15.02 s
  17. 24.70 s evaluating derivation 'g copying '/nix/store/jxqs evaluating derivation 'g copying '/nix/store/jxqs evaluating derivation 'g copying '/nix/store/jxqs evaluating derivation 'g copying '/nix/store/jxqs evaluating derivation 'g copying '/nix/store/jxqs evaluating derivation 'g copying '/nix/store/jxqs evaluating derivation 'g copying '/nix/store/jxqs evaluating derivation 'g copying '/nix/store/jxqs evaluating derivation 'g copying '/nix/store/jxqs evaluating derivation 'g copying '/nix/store/jxqs evaluating derivation 'g copying '/nix/store/jxqs evaluating derivation 'g copying '/nix/store/jxqs evaluating derivation 'g copying '/nix/store/jxqs evaluating derivation 'g copying '/nix/store/jxqs evaluating derivation 'g [0/1 built] [1/0/1 built] [1/0/1 built] building ggammaloop-nextest-core> Extracting 3 binaries (including 1 non-test binary), 1 build script output directory, and 2 linked paths to /build/nextest-archive-WBj1XP
  18. 25.40 s gammaloop-nextest-core> Extracted 18 files to /build/nextest-archive-WBj1XP in 0.70s
  19. 25.44 s gammaloop-nextest-core> ------------
  20. 25.44 s gammaloop-nextest-core> Nextest run ID 00105aa6-5128-4ed8-8bb3-95196a0172d4 with nextest profile: ci_gammaloop
  21. 25.44 s gammaloop-nextest-core> Starting 339 tests across 2 binaries
  22. 26.32 s gammaloop-nextest-core> ------------
  23. 26.32 s gammaloop-nextest-core> Summary [ 0.886s] 339 tests run: 339 passed, 0 skipped
  24. 26.45 s gammaloop-nextest-core>
  25. 26.45 s gammaloop-nextest-core> ========== nextest test summary ==========
  26. 26.45 s gammaloop-nextest-core> report: target/nextest/ci_gammaloop/junit.xml
  27. 26.45 s gammaloop-nextest-core> tests: 339, failures: 0, errors: 0
  28. 26.45 s gammaloop-nextest-core> No failing testcases found.
  29. 26.45 s gammaloop-nextest-core> =========================================
  30. 26.48 s gammaloop-nextest-core> Extracting 1 binary and 1 linked path to /build/nextest-archive-WcbpHJ
  31. 26.57 s gammaloop-nextest-core> Extracted 7 files to /build/nextest-archive-WcbpHJ in 0.09s
  32. 26.60 s gammaloop-nextest-core> ------------
  33. 26.60 s gammaloop-nextest-core> Nextest run ID 0412c7bd-e978-4748-b6d3-5b74cae3cdc4 with nextest profile: ci_gammaloop
  34. 26.60 s gammaloop-nextest-core> Starting 19 tests across 1 binary
  35. 26.66 s gammaloop-nextest-core> ------------
  36. 26.66 s gammaloop-nextest-core> Summary [ 0.057s] 19 tests run: 19 passed, 0 skipped
  37. 26.73 s gammaloop-nextest-core>
  38. 26.73 s gammaloop-nextest-core> ========== nextest test summary ==========
  39. 26.73 s gammaloop-nextest-core> report: target/nextest/ci_gammaloop/junit.xml
  40. 26.73 s gammaloop-nextest-core> tests: 19, failures: 0, errors: 0
  41. 26.73 s gammaloop-nextest-core> No failing testcases found.
  42. 26.73 s gammaloop-nextest-core> =========================================
  43. 26.76 s gammaloop-nextest-core> Extracting 1 binary to /build/nextest-archive-qJcgg5
  44. 26.82 s gammaloop-nextest-core> Extracted 4 files to /build/nextest-archive-qJcgg5 in 0.06s
  45. 26.85 s gammaloop-nextest-core> ------------
  46. 26.85 s gammaloop-nextest-core> Nextest run ID 97f49356-59c2-4a37-924c-a78917712a49 with nextest profile: ci_gammaloop
  47. 26.85 s gammaloop-nextest-core> Starting 0 tests across 1 binary
  48. 26.86 s gammaloop-nextest-core> ------------
  49. 26.86 s gammaloop-nextest-core> Summary [ 0.005s] 0 tests run: 0 passed, 0 skipped
  50. 26.94 s gammaloop-nextest-core>
  51. 26.94 s gammaloop-nextest-core> ========== nextest test summary ==========
  52. 26.94 s gammaloop-nextest-core> report: target/nextest/ci_gammaloop/junit.xml
  53. 26.94 s gammaloop-nextest-core> tests: 0, failures: 0, errors: 0
  54. 26.94 s gammaloop-nextest-core> No failing testcases found.
  55. 26.94 s gammaloop-nextest-core> =========================================
  56. 26.97 s gammaloop-nextest-core> Extracting 4 binaries, 1 build script output directory, and 2 linked paths to /build/nextest-archive-ODiQiD
  57. 27.70 s gammaloop-nextest-core> Extracted 18 files to /build/nextest-archive-ODiQiD in 0.73s
  58. 27.75 s gammaloop-nextest-core> ------------
  59. 27.75 s gammaloop-nextest-core> Nextest run ID cd5ff5c2-9bca-4e36-9540-a1030804533b with nextest profile: ci_gammaloop
  60. 27.75 s gammaloop-nextest-core> Starting 483 tests across 4 binaries (61 tests skipped, including 60 tests via profile.ci_gammaloop.default-filter)
  61. 27.84 s gammaloop-nextest-core> FAIL [ 0.024s] ( 43/483) gammalooprs cff::generation::tests_cff::thermal_bubble_chain
  62. 27.84 s gammaloop-nextest-core> stdout ---
  63. 27.84 s gammaloop-nextest-core>
  64. 27.84 s gammaloop-nextest-core> running 1 test
  65. 27.84 s gammaloop-nextest-core> test cff::generation::tests_cff::thermal_bubble_chain ... FAILED
  66. 27.84 s gammaloop-nextest-core>
  67. 27.84 s gammaloop-nextest-core> failures:
  68. 27.84 s gammaloop-nextest-core>
  69. 27.84 s gammaloop-nextest-core> failures:
  70. 27.84 s gammaloop-nextest-core> cff::generation::tests_cff::thermal_bubble_chain
  71. 27.84 s gammaloop-nextest-core>
  72. 27.84 s gammaloop-nextest-core> test result: FAILED. 0 passed; 1 failed; 0 ignored; 0 measured; 535 filtered out; finished in 0.01s
  73. 27.84 s gammaloop-nextest-core>
  74. 27.84 s gammaloop-nextest-core> stderr ---
  75. 27.84 s gammaloop-nextest-core>
  76. 27.84 s gammaloop-nextest-core> thread 'cff::generation::tests_cff::thermal_bubble_chain' (1271) panicked at /nix/store/1sigmg52bb61pfngmk9k8wq5fz9r7bf1-vendor-cargo-deps/5929dab090e556a579e9f3b708cd2e67c60b3d84a12b5a276f2a36cb00473133/symbolica-2.2.0/src/evaluate/evaluator.rs:295:21:
  77. 27.84 s gammaloop-nextest-core> External function 'symbolica_coth' does not have an implementation for gammalooprs::utils::F<f64>
  78. 27.84 s gammaloop-nextest-core> stack backtrace:
  79. 27.84 s gammaloop-nextest-core> 0: __rustc::rust_begin_unwind
  80. 27.84 s gammaloop-nextest-core> 1: core::panicking::panic_fmt
  81. 27.84 s gammaloop-nextest-core> 2: <symbolica::evaluate::evaluator::ExpressionEvaluator<gammalooprs::utils::F<f64>>>::evaluate_impl_no_ops
  82. 27.84 s gammaloop-nextest-core> 3: <symbolica::evaluate::evaluator::ExpressionEvaluator<gammalooprs::utils::F<f64>>>::evaluate_single
  83. 27.84 s gammaloop-nextest-core> 4: gammalooprs::cff::generation::tests_cff::thermal_bubble_chain
  84. 27.84 s gammaloop-nextest-core> 5: <gammalooprs::cff::generation::tests_cff::thermal_bubble_chain::{closure#0} as core::ops::function::FnOnce<()>>::call_once
  85. 27.84 s gammaloop-nextest-core> note: Some details are omitted, run with `RUST_BACKTRACE=full` for a verbose backtrace.
  86. 27.84 s gammaloop-nextest-core>
  87. 27.84 s gammaloop-nextest-core> FAIL [ 0.028s] ( 46/483) gammalooprs cff::generation::tests_cff::thermal_bubble
  88. 27.84 s gammaloop-nextest-core> stdout ---
  89. 27.84 s gammaloop-nextest-core>
  90. 27.84 s gammaloop-nextest-core> running 1 test
  91. 27.84 s gammaloop-nextest-core> test cff::generation::tests_cff::thermal_bubble ... FAILED
  92. 27.84 s gammaloop-nextest-core>
  93. 27.84 s gammaloop-nextest-core> failures:
  94. 27.84 s gammaloop-nextest-core>
  95. 27.84 s gammaloop-nextest-core> failures:
  96. 27.84 s gammaloop-nextest-core> cff::generation::tests_cff::thermal_bubble
  97. 27.84 s gammaloop-nextest-core>
  98. 27.84 s gammaloop-nextest-core> test result: FAILED. 0 passed; 1 failed; 0 ignored; 0 measured; 535 filtered out; finished in 0.01s
  99. 27.84 s gammaloop-nextest-core>
  100. 27.84 s gammaloop-nextest-core> stderr ---
  101. 27.84 s gammaloop-nextest-core>
  102. 27.84 s gammaloop-nextest-core> thread 'cff::generation::tests_cff::thermal_bubble' (1282) panicked at /nix/store/1sigmg52bb61pfngmk9k8wq5fz9r7bf1-vendor-cargo-deps/5929dab090e556a579e9f3b708cd2e67c60b3d84a12b5a276f2a36cb00473133/symbolica-2.2.0/src/evaluate/evaluator.rs:295:21:
  103. 27.84 s gammaloop-nextest-core> External function 'symbolica_coth' does not have an implementation for gammalooprs::utils::F<f64>
  104. 27.84 s gammaloop-nextest-core> stack backtrace:
  105. 27.84 s gammaloop-nextest-core> 0: __rustc::rust_begin_unwind
  106. 27.84 s gammaloop-nextest-core> 1: core::panicking::panic_fmt
  107. 27.84 s gammaloop-nextest-core> 2: <symbolica::evaluate::evaluator::ExpressionEvaluator<gammalooprs::utils::F<f64>>>::evaluate_impl_no_ops
  108. 27.84 s gammaloop-nextest-core> 3: <symbolica::evaluate::evaluator::ExpressionEvaluator<gammalooprs::utils::F<f64>>>::evaluate_single
  109. 27.84 s gammaloop-nextest-core> 4: gammalooprs::cff::generation::tests_cff::thermal_bubble
  110. 27.84 s gammaloop-nextest-core> 5: <gammalooprs::cff::generation::tests_cff::thermal_bubble::{closure#0} as core::ops::function::FnOnce<()>>::call_once
  111. 27.84 s gammaloop-nextest-core> note: Some details are omitted, run with `RUST_BACKTRACE=full` for a verbose backtrace.
  112. 27.84 s gammaloop-nextest-core>
  113. 27.85 s gammaloop-nextest-core> FAIL [ 0.032s] ( 48/483) gammalooprs cff::generation::tests_cff::thermal_eight
  114. 27.85 s gammaloop-nextest-core> stdout ---
  115. 27.85 s gammaloop-nextest-core>
  116. 27.85 s gammaloop-nextest-core> running 1 test
  117. 27.85 s gammaloop-nextest-core> test cff::generation::tests_cff::thermal_eight ... FAILED
  118. 27.85 s gammaloop-nextest-core>
  119. 27.85 s gammaloop-nextest-core> failures:
  120. 27.85 s gammaloop-nextest-core>
  121. 27.85 s gammaloop-nextest-core> failures:
  122. 27.85 s gammaloop-nextest-core> cff::generation::tests_cff::thermal_eight
  123. 27.85 s gammaloop-nextest-core>
  124. 27.85 s gammaloop-nextest-core> test result: FAILED. 0 passed; 1 failed; 0 ignored; 0 measured; 535 filtered out; finished in 0.02s
  125. 27.85 s gammaloop-nextest-core>
  126. 27.85 s gammaloop-nextest-core> stderr ---
  127. 27.85 s gammaloop-nextest-core>
  128. 27.85 s gammaloop-nextest-core> thread 'cff::generation::tests_cff::thermal_eight' (1281) panicked at /nix/store/1sigmg52bb61pfngmk9k8wq5fz9r7bf1-vendor-cargo-deps/5929dab090e556a579e9f3b708cd2e67c60b3d84a12b5a276f2a36cb00473133/symbolica-2.2.0/src/evaluate/evaluator.rs:295:21:
  129. 27.85 s gammaloop-nextest-core> External function 'symbolica_coth' does not have an implementation for gammalooprs::utils::F<f64>
  130. 27.85 s gammaloop-nextest-core> stack backtrace:
  131. 27.85 s gammaloop-nextest-core> 0: __rustc::rust_begin_unwind
  132. 27.85 s gammaloop-nextest-core> 1: core::panicking::panic_fmt
  133. 27.85 s gammaloop-nextest-core> 2: <symbolica::evaluate::evaluator::ExpressionEvaluator<gammalooprs::utils::F<f64>>>::evaluate_impl_no_ops
  134. 27.85 s gammaloop-nextest-core> 3: <symbolica::evaluate::evaluator::ExpressionEvaluator<gammalooprs::utils::F<f64>>>::evaluate_single
  135. 27.85 s gammaloop-nextest-core> 4: gammalooprs::cff::generation::tests_cff::thermal_eight
  136. 27.85 s gammaloop-nextest-core> 5: <gammalooprs::cff::generation::tests_cff::thermal_eight::{closure#0} as core::ops::function::FnOnce<()>>::call_once
  137. 27.85 s gammaloop-nextest-core> note: Some details are omitted, run with `RUST_BACKTRACE=full` for a verbose backtrace.
  138. 27.85 s gammaloop-nextest-core>
  139. 27.90 s gammaloop-nextest-core> FAIL [ 0.074s] ( 72/483) gammalooprs cff::generation::tests_cff::thermal_ring
  140. 27.90 s gammaloop-nextest-core> stdout ---
  141. 27.90 s gammaloop-nextest-core>
  142. 27.90 s gammaloop-nextest-core> running 1 test
  143. 27.90 s gammaloop-nextest-core> test cff::generation::tests_cff::thermal_ring ... FAILED
  144. 27.90 s gammaloop-nextest-core>
  145. 27.90 s gammaloop-nextest-core> failures:
  146. 27.90 s gammaloop-nextest-core>
  147. 27.90 s gammaloop-nextest-core> failures:
  148. 27.90 s gammaloop-nextest-core> cff::generation::tests_cff::thermal_ring
  149. 27.90 s gammaloop-nextest-core>
  150. 27.90 s gammaloop-nextest-core> test result: FAILED. 0 passed; 1 failed; 0 ignored; 0 measured; 535 filtered out; finished in 0.05s
  151. 27.90 s gammaloop-nextest-core>
  152. 27.90 s gammaloop-nextest-core> stderr ---
  153. 27.90 s gammaloop-nextest-core>
  154. 27.90 s gammaloop-nextest-core> thread 'cff::generation::tests_cff::thermal_ring' (1300) panicked at /nix/store/1sigmg52bb61pfngmk9k8wq5fz9r7bf1-vendor-cargo-deps/5929dab090e556a579e9f3b708cd2e67c60b3d84a12b5a276f2a36cb00473133/symbolica-2.2.0/src/evaluate/evaluator.rs:295:21:
  155. 27.90 s gammaloop-nextest-core> External function 'symbolica_coth' does not have an implementation for gammalooprs::utils::F<f64>
  156. 27.90 s gammaloop-nextest-core> stack backtrace:
  157. 27.90 s gammaloop-nextest-core> 0: __rustc::rust_begin_unwind
  158. 27.90 s gammaloop-nextest-core> 1: core::panicking::panic_fmt
  159. 27.90 s gammaloop-nextest-core> 2: <symbolica::evaluate::evaluator::ExpressionEvaluator<gammalooprs::utils::F<f64>>>::evaluate_impl_no_ops
  160. 27.90 s gammaloop-nextest-core> 3: <symbolica::evaluate::evaluator::ExpressionEvaluator<gammalooprs::utils::F<f64>>>::evaluate_single
  161. 27.90 s gammaloop-nextest-core> 4: gammalooprs::cff::generation::tests_cff::thermal_ring
  162. 27.90 s gammaloop-nextest-core> 5: <gammalooprs::cff::generation::tests_cff::thermal_ring::{closure#0} as core::ops::function::FnOnce<()>>::call_once
  163. 27.90 s gammaloop-nextest-core> note: Some details are omitted, run with `RUST_BACKTRACE=full` for a verbose backtrace.
  164. 27.90 s gammaloop-nextest-core>
  165. 28.29 s gammaloop-nextest-core> FAIL [ 0.461s] ( 87/483) gammalooprs cff::generation::tests_cff::thermal_mercedes
  166. 28.29 s gammaloop-nextest-core> stdout ---
  167. 28.29 s gammaloop-nextest-core>
  168. 28.29 s gammaloop-nextest-core> running 1 test
  169. 28.29 s gammaloop-nextest-core> test cff::generation::tests_cff::thermal_mercedes ... FAILED
  170. 28.29 s gammaloop-nextest-core>
  171. 28.29 s gammaloop-nextest-core> failures:
  172. 28.29 s gammaloop-nextest-core>
  173. 28.29 s gammaloop-nextest-core> failures:
  174. 28.29 s gammaloop-nextest-core> cff::generation::tests_cff::thermal_mercedes
  175. 28.29 s gammaloop-nextest-core>
  176. 28.29 s gammaloop-nextest-core> test result: FAILED. 0 passed; 1 failed; 0 ignored; 0 measured; 535 filtered out; finished in 0.43s
  177. 28.29 s gammaloop-nextest-core>
  178. 28.29 s gammaloop-nextest-core> stderr ---
  179. 28.29 s gammaloop-nextest-core>
  180. 28.29 s gammaloop-nextest-core> thread 'cff::generation::tests_cff::thermal_mercedes' (1296) panicked at /nix/store/1sigmg52bb61pfngmk9k8wq5fz9r7bf1-vendor-cargo-deps/5929dab090e556a579e9f3b708cd2e67c60b3d84a12b5a276f2a36cb00473133/symbolica-2.2.0/src/evaluate/evaluator.rs:295:21:
  181. 28.29 s gammaloop-nextest-core> External function 'symbolica_coth' does not have an implementation for gammalooprs::utils::F<f64>
  182. 28.29 s gammaloop-nextest-core> stack backtrace:
  183. 28.29 s gammaloop-nextest-core> 0: __rustc::rust_begin_unwind
  184. 28.29 s gammaloop-nextest-core> 1: core::panicking::panic_fmt
  185. 28.29 s gammaloop-nextest-core> 2: <symbolica::evaluate::evaluator::ExpressionEvaluator<gammalooprs::utils::F<f64>>>::evaluate_impl_no_ops
  186. 28.29 s gammaloop-nextest-core> 3: <symbolica::evaluate::evaluator::ExpressionEvaluator<gammalooprs::utils::F<f64>>>::evaluate_single
  187. 28.29 s gammaloop-nextest-core> 4: gammalooprs::cff::generation::tests_cff::thermal_mercedes
  188. 28.29 s gammaloop-nextest-core> 5: <gammalooprs::cff::generation::tests_cff::thermal_mercedes::{closure#0} as core::ops::function::FnOnce<()>>::call_once
  189. 28.29 s gammaloop-nextest-core> note: Some details are omitted, run with `RUST_BACKTRACE=full` for a verbose backtrace.
  190. 28.29 s gammaloop-nextest-core>
  191. 29.56 s gammaloop-nextest-core> FAIL [ 1.677s] (267/483) gammalooprs graph::feynman_graph::tests::native_thermal_distributions
  192. 29.56 s gammaloop-nextest-core> stdout ---
  193. 29.56 s gammaloop-nextest-core>
  194. 29.56 s gammaloop-nextest-core> running 1 test
  195. 29.56 s gammaloop-nextest-core> test graph::feynman_graph::tests::native_thermal_distributions ... FAILED
  196. 29.56 s gammaloop-nextest-core>
  197. 29.56 s gammaloop-nextest-core> failures:
  198. 29.56 s gammaloop-nextest-core>
  199. 29.56 s gammaloop-nextest-core> failures:
  200. 29.56 s gammaloop-nextest-core> graph::feynman_graph::tests::native_thermal_distributions
  201. 29.56 s gammaloop-nextest-core>
  202. 29.56 s gammaloop-nextest-core> test result: FAILED. 0 passed; 1 failed; 0 ignored; 0 measured; 535 filtered out; finished in 1.65s
  203. 29.56 s gammaloop-nextest-core>
  204. 29.56 s gammaloop-nextest-core> stderr ---
  205. 29.56 s gammaloop-nextest-core> The application panicked (crashed).
  206. 29.56 s gammaloop-nextest-core> Message: called `Result::unwrap()` on an `Err` value: Custom { kind: Other, error: "Could not compile code: g++ -shared -O3 -fPIC -ffast-math -funsafe-math-optimizations -march=native -o /build/gammaloop-native-thermal-1338/thermal_0_0.so /build/gammaloop-native-thermal-1338/thermal_0_0.cpp\nwarning: Skipping impure flag -march=native because NIX_ENFORCE_NO_NATIVE is set\n/build/gammaloop-native-thermal-1338/thermal_0_0.cpp: In function 'void thermal_realf64(const double*, double*, double*)':\n/build/gammaloop-native-thermal-1338/thermal_0_0.cpp:27:16: error: 'symbolica_tanh' was not declared in this scope\n 27 | Z[6] = symbolica_tanh(Z[6]);\n | ^~~~~~~~~~~~~~\n" }
  207. 29.56 s gammaloop-nextest-core> Location: crates/gammalooprs/src/graph/feynman_graph.rs:937
  208. 29.56 s gammaloop-nextest-core>
  209. 29.56 s gammaloop-nextest-core> ━━━━━━━━━━━━━━━━━━━━━━━━━━━━━━━━━━ BACKTRACE ━━━━━━━━━━━━━━━━━━━━━━━━━━━━━━━━━━━
  210. 29.56 s gammaloop-nextest-core> 1: <color_eyre[b0c9e66060e883b2]::config::PanicHook>::panic_report<unknown>
  211. 29.56 s gammaloop-nextest-core> at <unknown source file>:<unknown line>
  212. 29.56 s gammaloop-nextest-core> 2: <color_eyre[b0c9e66060e883b2]::config::PanicHook>::into_panic_hook::{closure#0}<unknown>
  213. 29.56 s gammaloop-nextest-core> at <unknown source file>:<unknown line>
  214. 29.56 s gammaloop-nextest-core> 3: std[bcb96dfbba0ab899]::panicking::panic_with_hook<unknown>
  215. 29.56 s gammaloop-nextest-core> at <unknown source file>:<unknown line>
  216. 29.56 s gammaloop-nextest-core> 4: std[bcb96dfbba0ab899]::panicking::panic_handler::{closure#0}<unknown>
  217. 29.56 s gammaloop-nextest-core> at <unknown source file>:<unknown line>
  218. 29.56 s gammaloop-nextest-core> 5: std[bcb96dfbba0ab899]::sys::backtrace::__rust_end_short_backtrace::<std[bcb96dfbba0ab899]::panicking::panic_handler::{closure#0}, !><unknown>
  219. 29.56 s gammaloop-nextest-core> at <unknown source file>:<unknown line>
  220. 29.56 s gammaloop-nextest-core> 6: __rustc[6c289b9f9c454d21]::rust_begin_unwind<unknown>
  221. 29.56 s gammaloop-nextest-core> at <unknown source file>:<unknown line>
  222. 29.56 s gammaloop-nextest-core> 7: core[940e698046960fd5]::panicking::panic_fmt<unknown>
  223. 29.56 s gammaloop-nextest-core> at <unknown source file>:<unknown line>
  224. 29.56 s gammaloop-nextest-core> 8: core[940e698046960fd5]::result::unwrap_failed<unknown>
  225. 29.56 s gammaloop-nextest-core> at <unknown source file>:<unknown line>
  226. 29.56 s gammaloop-nextest-core> 9: gammalooprs[5490727360442cce]::graph::feynman_graph::tests::native_thermal_distributions<unknown>
  227. 29.56 s gammaloop-nextest-core> at <unknown source file>:<unknown line>
  228. 29.56 s gammaloop-nextest-core> 10: <gammalooprs[5490727360442cce]::graph::feynman_graph::tests::native_thermal_distributions::{closure#0} as core[940e698046960fd5]::ops::function::FnOnce<()>>::call_once<unknown>
  229. 29.56 s gammaloop-nextest-core> at <unknown source file>:<unknown line>
  230. 29.56 s gammaloop-nextest-core> 11: test[75d6903177b1d7e9]::__rust_begin_short_backtrace::<core[940e698046960fd5]::result::Result<(), alloc[2ea6bcb46fca0c42]::string::String>, fn() -> core[940e698046960fd5]::result::Result<(), alloc[2ea6bcb46fca0c42]::string::String>><unknown>
  231. 29.56 s gammaloop-nextest-core> at <unknown source file>:<unknown line>
  232. 29.56 s gammaloop-nextest-core> 12: test[75d6903177b1d7e9]::run_test::{closure#0}<unknown>
  233. 29.56 s gammaloop-nextest-core> at <unknown source file>:<unknown line>
  234. 29.56 s gammaloop-nextest-core> 13: std[bcb96dfbba0ab899]::sys::backtrace::__rust_begin_short_backtrace::<test[75d6903177b1d7e9]::run_test::{closure#1}, ()><unknown>
  235. 29.56 s gammaloop-nextest-core> at <unknown source file>:<unknown line>
  236. 29.56 s gammaloop-nextest-core> 14: <std[bcb96dfbba0ab899]::thread::lifecycle::spawn_unchecked<test[75d6903177b1d7e9]::run_test::{closure#1}, ()>::{closure#1} as core[940e698046960fd5]::ops::function::FnOnce<()>>::call_once::{shim:vtable#0}<unknown>
  237. 29.56 s gammaloop-nextest-core> at <unknown source file>:<unknown line>
  238. 29.56 s gammaloop-nextest-core> 15: <std[bcb96dfbba0ab899]::sys::thread::unix::Thread>::new::thread_start<unknown>
  239. 29.56 s gammaloop-nextest-core> at <unknown source file>:<unknown line>
  240. 29.56 s gammaloop-nextest-core> 16: start_thread<unknown>
  241. 29.56 s gammaloop-nextest-core> at <unknown source file>:<unknown line>
  242. 29.56 s gammaloop-nextest-core> 17: __clone3<unknown>
  243. 29.56 s gammaloop-nextest-core> at <unknown source file>:<unknown line>
  244. 29.56 s gammaloop-nextest-core>
  245. 29.56 s gammaloop-nextest-core> Run with COLORBT_SHOW_HIDDEN=1 environment variable to disable frame filtering.
  246. 29.56 s gammaloop-nextest-core> Run with RUST_BACKTRACE=full to include source snippets.
  247. 29.56 s gammaloop-nextest-core>
  248. 49.07 s gammaloop-nextest-core> FAIL [ 21.254s] (481/483) gammalooprs cff::generation::tests_cff::thermal_bugblatter
  249. 49.07 s gammaloop-nextest-core> stdout ---
  250. 49.07 s gammaloop-nextest-core>
  251. 49.07 s gammaloop-nextest-core> running 1 test
  252. 49.07 s gammaloop-nextest-core> test cff::generation::tests_cff::thermal_bugblatter ... FAILED
  253. 49.07 s gammaloop-nextest-core>
  254. 49.07 s gammaloop-nextest-core> failures:
  255. 49.07 s gammaloop-nextest-core>
  256. 49.07 s gammaloop-nextest-core> failures:
  257. 49.07 s gammaloop-nextest-core> cff::generation::tests_cff::thermal_bugblatter
  258. 49.07 s gammaloop-nextest-core>
  259. 49.07 s gammaloop-nextest-core> test result: FAILED. 0 passed; 1 failed; 0 ignored; 0 measured; 535 filtered out; finished in 21.15s
  260. 49.07 s gammaloop-nextest-core>
  261. 49.07 s gammaloop-nextest-core> stderr ---
  262. 49.07 s gammaloop-nextest-core>
  263. 49.07 s gammaloop-nextest-core> thread 'cff::generation::tests_cff::thermal_bugblatter' (1276) panicked at /nix/store/1sigmg52bb61pfngmk9k8wq5fz9r7bf1-vendor-cargo-deps/5929dab090e556a579e9f3b708cd2e67c60b3d84a12b5a276f2a36cb00473133/symbolica-2.2.0/src/evaluate/evaluator.rs:295:21:
  264. 49.07 s gammaloop-nextest-core> External function 'symbolica_coth' does not have an implementation for gammalooprs::utils::F<f64>
  265. 49.07 s gammaloop-nextest-core> stack backtrace:
  266. 49.07 s gammaloop-nextest-core> 0: __rustc::rust_begin_unwind
  267. 49.07 s gammaloop-nextest-core> 1: core::panicking::panic_fmt
  268. 49.07 s gammaloop-nextest-core> 2: <symbolica::evaluate::evaluator::ExpressionEvaluator<gammalooprs::utils::F<f64>>>::evaluate_impl_no_ops
  269. 49.07 s gammaloop-nextest-core> 3: <symbolica::evaluate::evaluator::ExpressionEvaluator<gammalooprs::utils::F<f64>>>::evaluate_single
  270. 49.07 s gammaloop-nextest-core> 4: gammalooprs::cff::generation::tests_cff::thermal_bugblatter
  271. 49.07 s gammaloop-nextest-core> 5: <gammalooprs::cff::generation::tests_cff::thermal_bugblatter::{closure#0} as core::ops::function::FnOnce<()>>::call_once
  272. 49.07 s gammaloop-nextest-core> note: Some details are omitted, run with `RUST_BACKTRACE=full` for a verbose backtrace.
  273. 49.07 s gammaloop-nextest-core>
  274. 51.57 s gammaloop-nextest-core> ------------
  275. 51.57 s gammaloop-nextest-core> Summary [ 23.811s] 483 tests run: 476 passed, 7 failed, 61 skipped
  276. 51.57 s gammaloop-nextest-core> FAIL [ 0.024s] ( 43/483) gammalooprs cff::generation::tests_cff::thermal_bubble_chain
  277. 51.57 s gammaloop-nextest-core> stdout ---
  278. 51.57 s gammaloop-nextest-core>
  279. 51.57 s gammaloop-nextest-core> running 1 test
  280. 51.57 s gammaloop-nextest-core> test cff::generation::tests_cff::thermal_bubble_chain ... FAILED
  281. 51.57 s gammaloop-nextest-core>
  282. 51.57 s gammaloop-nextest-core> failures:
  283. 51.57 s gammaloop-nextest-core>
  284. 51.57 s gammaloop-nextest-core> failures:
  285. 51.57 s gammaloop-nextest-core> cff::generation::tests_cff::thermal_bubble_chain
  286. 51.57 s gammaloop-nextest-core>
  287. 51.57 s gammaloop-nextest-core> test result: FAILED. 0 passed; 1 failed; 0 ignored; 0 measured; 535 filtered out; finished in 0.01s
  288. 51.57 s gammaloop-nextest-core>
  289. 51.57 s gammaloop-nextest-core> stderr ---
  290. 51.57 s gammaloop-nextest-core>
  291. 51.57 s gammaloop-nextest-core> thread 'cff::generation::tests_cff::thermal_bubble_chain' (1271) panicked at /nix/store/1sigmg52bb61pfngmk9k8wq5fz9r7bf1-vendor-cargo-deps/5929dab090e556a579e9f3b708cd2e67c60b3d84a12b5a276f2a36cb00473133/symbolica-2.2.0/src/evaluate/evaluator.rs:295:21:
  292. 51.57 s gammaloop-nextest-core> External function 'symbolica_coth' does not have an implementation for gammalooprs::utils::F<f64>
  293. 51.57 s gammaloop-nextest-core> stack backtrace:
  294. 51.57 s gammaloop-nextest-core> 0: __rustc::rust_begin_unwind
  295. 51.57 s gammaloop-nextest-core> 1: core::panicking::panic_fmt
  296. 51.57 s gammaloop-nextest-core> 2: <symbolica::evaluate::evaluator::ExpressionEvaluator<gammalooprs::utils::F<f64>>>::evaluate_impl_no_ops
  297. 51.57 s gammaloop-nextest-core> 3: <symbolica::evaluate::evaluator::ExpressionEvaluator<gammalooprs::utils::F<f64>>>::evaluate_single
  298. 51.57 s gammaloop-nextest-core> 4: gammalooprs::cff::generation::tests_cff::thermal_bubble_chain
  299. 51.57 s gammaloop-nextest-core> 5: <gammalooprs::cff::generation::tests_cff::thermal_bubble_chain::{closure#0} as core::ops::function::FnOnce<()>>::call_once
  300. 51.57 s gammaloop-nextest-core> note: Some details are omitted, run with `RUST_BACKTRACE=full` for a verbose backtrace.
  301. 51.57 s gammaloop-nextest-core>
  302. 51.57 s gammaloop-nextest-core> FAIL [ 0.028s] ( 46/483) gammalooprs cff::generation::tests_cff::thermal_bubble
  303. 51.57 s gammaloop-nextest-core> stdout ---
  304. 51.57 s gammaloop-nextest-core>
  305. 51.57 s gammaloop-nextest-core> running 1 test
  306. 51.57 s gammaloop-nextest-core> test cff::generation::tests_cff::thermal_bubble ... FAILED
  307. 51.57 s gammaloop-nextest-core>
  308. 51.57 s gammaloop-nextest-core> failures:
  309. 51.57 s gammaloop-nextest-core>
  310. 51.57 s gammaloop-nextest-core> failures:
  311. 51.57 s gammaloop-nextest-core> cff::generation::tests_cff::thermal_bubble
  312. 51.57 s gammaloop-nextest-core>
  313. 51.57 s gammaloop-nextest-core> test result: FAILED. 0 passed; 1 failed; 0 ignored; 0 measured; 535 filtered out; finished in 0.01s
  314. 51.57 s gammaloop-nextest-core>
  315. 51.57 s gammaloop-nextest-core> stderr ---
  316. 51.57 s gammaloop-nextest-core>
  317. 51.57 s gammaloop-nextest-core> thread 'cff::generation::tests_cff::thermal_bubble' (1282) panicked at /nix/store/1sigmg52bb61pfngmk9k8wq5fz9r7bf1-vendor-cargo-deps/5929dab090e556a579e9f3b708cd2e67c60b3d84a12b5a276f2a36cb00473133/symbolica-2.2.0/src/evaluate/evaluator.rs:295:21:
  318. 51.57 s gammaloop-nextest-core> External function 'symbolica_coth' does not have an implementation for gammalooprs::utils::F<f64>
  319. 51.57 s gammaloop-nextest-core> stack backtrace:
  320. 51.57 s gammaloop-nextest-core> 0: __rustc::rust_begin_unwind
  321. 51.57 s gammaloop-nextest-core> 1: core::panicking::panic_fmt
  322. 51.57 s gammaloop-nextest-core> 2: <symbolica::evaluate::evaluator::ExpressionEvaluator<gammalooprs::utils::F<f64>>>::evaluate_impl_no_ops
  323. 51.57 s gammaloop-nextest-core> 3: <symbolica::evaluate::evaluator::ExpressionEvaluator<gammalooprs::utils::F<f64>>>::evaluate_single
  324. 51.57 s gammaloop-nextest-core> 4: gammalooprs::cff::generation::tests_cff::thermal_bubble
  325. 51.57 s gammaloop-nextest-core> 5: <gammalooprs::cff::generation::tests_cff::thermal_bubble::{closure#0} as core::ops::function::FnOnce<()>>::call_once
  326. 51.57 s gammaloop-nextest-core> note: Some details are omitted, run with `RUST_BACKTRACE=full` for a verbose backtrace.
  327. 51.57 s gammaloop-nextest-core>
  328. 51.57 s gammaloop-nextest-core> FAIL [ 0.032s] ( 48/483) gammalooprs cff::generation::tests_cff::thermal_eight
  329. 51.57 s gammaloop-nextest-core> stdout ---
  330. 51.57 s gammaloop-nextest-core>
  331. 51.57 s gammaloop-nextest-core> running 1 test
  332. 51.57 s gammaloop-nextest-core> test cff::generation::tests_cff::thermal_eight ... FAILED
  333. 51.57 s gammaloop-nextest-core>
  334. 51.57 s gammaloop-nextest-core> failures:
  335. 51.57 s gammaloop-nextest-core>
  336. 51.57 s gammaloop-nextest-core> failures:
  337. 51.57 s gammaloop-nextest-core> cff::generation::tests_cff::thermal_eight
  338. 51.57 s gammaloop-nextest-core>
  339. 51.57 s gammaloop-nextest-core> test result: FAILED. 0 passed; 1 failed; 0 ignored; 0 measured; 535 filtered out; finished in 0.02s
  340. 51.57 s gammaloop-nextest-core>
  341. 51.57 s gammaloop-nextest-core> stderr ---
  342. 51.57 s gammaloop-nextest-core>
  343. 51.57 s gammaloop-nextest-core> thread 'cff::generation::tests_cff::thermal_eight' (1281) panicked at /nix/store/1sigmg52bb61pfngmk9k8wq5fz9r7bf1-vendor-cargo-deps/5929dab090e556a579e9f3b708cd2e67c60b3d84a12b5a276f2a36cb00473133/symbolica-2.2.0/src/evaluate/evaluator.rs:295:21:
  344. 51.57 s gammaloop-nextest-core> External function 'symbolica_coth' does not have an implementation for gammalooprs::utils::F<f64>
  345. 51.57 s gammaloop-nextest-core> stack backtrace:
  346. 51.57 s gammaloop-nextest-core> 0: __rustc::rust_begin_unwind
  347. 51.57 s gammaloop-nextest-core> 1: core::panicking::panic_fmt
  348. 51.57 s gammaloop-nextest-core> 2: <symbolica::evaluate::evaluator::ExpressionEvaluator<gammalooprs::utils::F<f64>>>::evaluate_impl_no_ops
  349. 51.57 s gammaloop-nextest-core> 3: <symbolica::evaluate::evaluator::ExpressionEvaluator<gammalooprs::utils::F<f64>>>::evaluate_single
  350. 51.57 s gammaloop-nextest-core> 4: gammalooprs::cff::generation::tests_cff::thermal_eight
  351. 51.57 s gammaloop-nextest-core> 5: <gammalooprs::cff::generation::tests_cff::thermal_eight::{closure#0} as core::ops::function::FnOnce<()>>::call_once
  352. 51.57 s gammaloop-nextest-core> note: Some details are omitted, run with `RUST_BACKTRACE=full` for a verbose backtrace.
  353. 51.57 s gammaloop-nextest-core>
  354. 51.57 s gammaloop-nextest-core> FAIL [ 0.074s] ( 72/483) gammalooprs cff::generation::tests_cff::thermal_ring
  355. 51.57 s gammaloop-nextest-core> stdout ---
  356. 51.57 s gammaloop-nextest-core>
  357. 51.57 s gammaloop-nextest-core> running 1 test
  358. 51.57 s gammaloop-nextest-core> test cff::generation::tests_cff::thermal_ring ... FAILED
  359. 51.57 s gammaloop-nextest-core>
  360. 51.57 s gammaloop-nextest-core> failures:
  361. 51.57 s gammaloop-nextest-core>
  362. 51.57 s gammaloop-nextest-core> failures:
  363. 51.57 s gammaloop-nextest-core> cff::generation::tests_cff::thermal_ring
  364. 51.57 s gammaloop-nextest-core>
  365. 51.57 s gammaloop-nextest-core> test result: FAILED. 0 passed; 1 failed; 0 ignored; 0 measured; 535 filtered out; finished in 0.05s
  366. 51.57 s gammaloop-nextest-core>
  367. 51.57 s gammaloop-nextest-core> stderr ---
  368. 51.57 s gammaloop-nextest-core>
  369. 51.57 s gammaloop-nextest-core> thread 'cff::generation::tests_cff::thermal_ring' (1300) panicked at /nix/store/1sigmg52bb61pfngmk9k8wq5fz9r7bf1-vendor-cargo-deps/5929dab090e556a579e9f3b708cd2e67c60b3d84a12b5a276f2a36cb00473133/symbolica-2.2.0/src/evaluate/evaluator.rs:295:21:
  370. 51.57 s gammaloop-nextest-core> External function 'symbolica_coth' does not have an implementation for gammalooprs::utils::F<f64>
  371. 51.57 s gammaloop-nextest-core> stack backtrace:
  372. 51.57 s gammaloop-nextest-core> 0: __rustc::rust_begin_unwind
  373. 51.57 s gammaloop-nextest-core> 1: core::panicking::panic_fmt
  374. 51.57 s gammaloop-nextest-core> 2: <symbolica::evaluate::evaluator::ExpressionEvaluator<gammalooprs::utils::F<f64>>>::evaluate_impl_no_ops
  375. 51.57 s gammaloop-nextest-core> 3: <symbolica::evaluate::evaluator::ExpressionEvaluator<gammalooprs::utils::F<f64>>>::evaluate_single
  376. 51.57 s gammaloop-nextest-core> 4: gammalooprs::cff::generation::tests_cff::thermal_ring
  377. 51.57 s gammaloop-nextest-core> 5: <gammalooprs::cff::generation::tests_cff::thermal_ring::{closure#0} as core::ops::function::FnOnce<()>>::call_once
  378. 51.57 s gammaloop-nextest-core> note: Some details are omitted, run with `RUST_BACKTRACE=full` for a verbose backtrace.
  379. 51.57 s gammaloop-nextest-core>
  380. 51.57 s gammaloop-nextest-core> FAIL [ 0.461s] ( 87/483) gammalooprs cff::generation::tests_cff::thermal_mercedes
  381. 51.57 s gammaloop-nextest-core> stdout ---
  382. 51.57 s gammaloop-nextest-core>
  383. 51.57 s gammaloop-nextest-core> running 1 test
  384. 51.57 s gammaloop-nextest-core> test cff::generation::tests_cff::thermal_mercedes ... FAILED
  385. 51.57 s gammaloop-nextest-core>
  386. 51.57 s gammaloop-nextest-core> failures:
  387. 51.57 s gammaloop-nextest-core>
  388. 51.57 s gammaloop-nextest-core> failures:
  389. 51.57 s gammaloop-nextest-core> cff::generation::tests_cff::thermal_mercedes
  390. 51.57 s gammaloop-nextest-core>
  391. 51.57 s gammaloop-nextest-core> test result: FAILED. 0 passed; 1 failed; 0 ignored; 0 measured; 535 filtered out; finished in 0.43s
  392. 51.57 s gammaloop-nextest-core>
  393. 51.57 s gammaloop-nextest-core> stderr ---
  394. 51.57 s gammaloop-nextest-core>
  395. 51.57 s gammaloop-nextest-core> thread 'cff::generation::tests_cff::thermal_mercedes' (1296) panicked at /nix/store/1sigmg52bb61pfngmk9k8wq5fz9r7bf1-vendor-cargo-deps/5929dab090e556a579e9f3b708cd2e67c60b3d84a12b5a276f2a36cb00473133/symbolica-2.2.0/src/evaluate/evaluator.rs:295:21:
  396. 51.57 s gammaloop-nextest-core> External function 'symbolica_coth' does not have an implementation for gammalooprs::utils::F<f64>
  397. 51.57 s gammaloop-nextest-core> stack backtrace:
  398. 51.57 s gammaloop-nextest-core> 0: __rustc::rust_begin_unwind
  399. 51.57 s gammaloop-nextest-core> 1: core::panicking::panic_fmt
  400. 51.57 s gammaloop-nextest-core> 2: <symbolica::evaluate::evaluator::ExpressionEvaluator<gammalooprs::utils::F<f64>>>::evaluate_impl_no_ops
  401. 51.57 s gammaloop-nextest-core> 3: <symbolica::evaluate::evaluator::ExpressionEvaluator<gammalooprs::utils::F<f64>>>::evaluate_single
  402. 51.57 s gammaloop-nextest-core> 4: gammalooprs::cff::generation::tests_cff::thermal_mercedes
  403. 51.57 s gammaloop-nextest-core> 5: <gammalooprs::cff::generation::tests_cff::thermal_mercedes::{closure#0} as core::ops::function::FnOnce<()>>::call_once
  404. 51.57 s gammaloop-nextest-core> note: Some details are omitted, run with `RUST_BACKTRACE=full` for a verbose backtrace.
  405. 51.57 s gammaloop-nextest-core>
  406. 51.57 s gammaloop-nextest-core> FAIL [ 1.677s] (267/483) gammalooprs graph::feynman_graph::tests::native_thermal_distributions
  407. 51.57 s gammaloop-nextest-core> stdout ---
  408. 51.57 s gammaloop-nextest-core>
  409. 51.57 s gammaloop-nextest-core> running 1 test
  410. 51.57 s gammaloop-nextest-core> test graph::feynman_graph::tests::native_thermal_distributions ... FAILED
  411. 51.57 s gammaloop-nextest-core>
  412. 51.57 s gammaloop-nextest-core> failures:
  413. 51.57 s gammaloop-nextest-core>
  414. 51.57 s gammaloop-nextest-core> failures:
  415. 51.57 s gammaloop-nextest-core> graph::feynman_graph::tests::native_thermal_distributions
  416. 51.57 s gammaloop-nextest-core>
  417. 51.57 s gammaloop-nextest-core> test result: FAILED. 0 passed; 1 failed; 0 ignored; 0 measured; 535 filtered out; finished in 1.65s
  418. 51.57 s gammaloop-nextest-core>
  419. 51.57 s gammaloop-nextest-core> stderr ---
  420. 51.57 s gammaloop-nextest-core> The application panicked (crashed).
  421. 51.57 s gammaloop-nextest-core> Message: called `Result::unwrap()` on an `Err` value: Custom { kind: Other, error: "Could not compile code: g++ -shared -O3 -fPIC -ffast-math -funsafe-math-optimizations -march=native -o /build/gammaloop-native-thermal-1338/thermal_0_0.so /build/gammaloop-native-thermal-1338/thermal_0_0.cpp\nwarning: Skipping impure flag -march=native because NIX_ENFORCE_NO_NATIVE is set\n/build/gammaloop-native-thermal-1338/thermal_0_0.cpp: In function 'void thermal_realf64(const double*, double*, double*)':\n/build/gammaloop-native-thermal-1338/thermal_0_0.cpp:27:16: error: 'symbolica_tanh' was not declared in this scope\n 27 | Z[6] = symbolica_tanh(Z[6]);\n | ^~~~~~~~~~~~~~\n" }
  422. 51.58 s gammaloop-nextest-core> Location: crates/gammalooprs/src/graph/feynman_graph.rs:937
  423. 51.58 s gammaloop-nextest-core>
  424. 51.58 s gammaloop-nextest-core> ━━━━━━━━━━━━━━━━━━━━━━━━━━━━━━━━━━ BACKTRACE ━━━━━━━━━━━━━━━━━━━━━━━━━━━━━━━━━━━
  425. 51.58 s gammaloop-nextest-core> 1: <color_eyre[b0c9e66060e883b2]::config::PanicHook>::panic_report<unknown>
  426. 51.58 s gammaloop-nextest-core> at <unknown source file>:<unknown line>
  427. 51.58 s gammaloop-nextest-core> 2: <color_eyre[b0c9e66060e883b2]::config::PanicHook>::into_panic_hook::{closure#0}<unknown>
  428. 51.58 s gammaloop-nextest-core> at <unknown source file>:<unknown line>
  429. 51.58 s gammaloop-nextest-core> 3: std[bcb96dfbba0ab899]::panicking::panic_with_hook<unknown>
  430. 51.58 s gammaloop-nextest-core> at <unknown source file>:<unknown line>
  431. 51.58 s gammaloop-nextest-core> 4: std[bcb96dfbba0ab899]::panicking::panic_handler::{closure#0}<unknown>
  432. 51.58 s gammaloop-nextest-core> at <unknown source file>:<unknown line>
  433. 51.58 s gammaloop-nextest-core> 5: std[bcb96dfbba0ab899]::sys::backtrace::__rust_end_short_backtrace::<std[bcb96dfbba0ab899]::panicking::panic_handler::{closure#0}, !><unknown>
  434. 51.58 s gammaloop-nextest-core> at <unknown source file>:<unknown line>
  435. 51.58 s gammaloop-nextest-core> 6: __rustc[6c289b9f9c454d21]::rust_begin_unwind<unknown>
  436. 51.58 s gammaloop-nextest-core> at <unknown source file>:<unknown line>
  437. 51.58 s gammaloop-nextest-core> 7: core[940e698046960fd5]::panicking::panic_fmt<unknown>
  438. 51.58 s gammaloop-nextest-core> at <unknown source file>:<unknown line>
  439. 51.58 s gammaloop-nextest-core> 8: core[940e698046960fd5]::result::unwrap_failed<unknown>
  440. 51.58 s gammaloop-nextest-core> at <unknown source file>:<unknown line>
  441. 51.58 s gammaloop-nextest-core> 9: gammalooprs[5490727360442cce]::graph::feynman_graph::tests::native_thermal_distributions<unknown>
  442. 51.58 s gammaloop-nextest-core> at <unknown source file>:<unknown line>
  443. 51.58 s gammaloop-nextest-core> 10: <gammalooprs[5490727360442cce]::graph::feynman_graph::tests::native_thermal_distributions::{closure#0} as core[940e698046960fd5]::ops::function::FnOnce<()>>::call_once<unknown>
  444. 51.58 s gammaloop-nextest-core> at <unknown source file>:<unknown line>
  445. 51.58 s gammaloop-nextest-core> 11: test[75d6903177b1d7e9]::__rust_begin_short_backtrace::<core[940e698046960fd5]::result::Result<(), alloc[2ea6bcb46fca0c42]::string::String>, fn() -> core[940e698046960fd5]::result::Result<(), alloc[2ea6bcb46fca0c42]::string::String>><unknown>
  446. 51.58 s gammaloop-nextest-core> at <unknown source file>:<unknown line>
  447. 51.58 s gammaloop-nextest-core> 12: test[75d6903177b1d7e9]::run_test::{closure#0}<unknown>
  448. 51.58 s gammaloop-nextest-core> at <unknown source file>:<unknown line>
  449. 51.58 s gammaloop-nextest-core> 13: std[bcb96dfbba0ab899]::sys::backtrace::__rust_begin_short_backtrace::<test[75d6903177b1d7e9]::run_test::{closure#1}, ()><unknown>
  450. 51.58 s gammaloop-nextest-core> at <unknown source file>:<unknown line>
  451. 51.58 s gammaloop-nextest-core> 14: <std[bcb96dfbba0ab899]::thread::lifecycle::spawn_unchecked<test[75d6903177b1d7e9]::run_test::{closure#1}, ()>::{closure#1} as core[940e698046960fd5]::ops::function::FnOnce<()>>::call_once::{shim:vtable#0}<unknown>
  452. 51.58 s gammaloop-nextest-core> at <unknown source file>:<unknown line>
  453. 51.58 s gammaloop-nextest-core> 15: <std[bcb96dfbba0ab899]::sys::thread::unix::Thread>::new::thread_start<unknown>
  454. 51.58 s gammaloop-nextest-core> at <unknown source file>:<unknown line>
  455. 51.58 s gammaloop-nextest-core> 16: start_thread<unknown>
  456. 51.58 s gammaloop-nextest-core> at <unknown source file>:<unknown line>
  457. 51.58 s gammaloop-nextest-core> 17: __clone3<unknown>
  458. 51.58 s gammaloop-nextest-core> at <unknown source file>:<unknown line>
  459. 51.58 s gammaloop-nextest-core>
  460. 51.58 s gammaloop-nextest-core> Run with COLORBT_SHOW_HIDDEN=1 environment variable to disable frame filtering.
  461. 51.58 s gammaloop-nextest-core> Run with RUST_BACKTRACE=full to include source snippets.
  462. 51.58 s gammaloop-nextest-core>
  463. 51.58 s gammaloop-nextest-core> FAIL [ 21.254s] (481/483) gammalooprs cff::generation::tests_cff::thermal_bugblatter
  464. 51.58 s gammaloop-nextest-core> stdout ---
  465. 51.58 s gammaloop-nextest-core>
  466. 51.58 s gammaloop-nextest-core> running 1 test
  467. 51.58 s gammaloop-nextest-core> test cff::generation::tests_cff::thermal_bugblatter ... FAILED
  468. 51.58 s gammaloop-nextest-core>
  469. 51.58 s gammaloop-nextest-core> failures:
  470. 51.58 s gammaloop-nextest-core>
  471. 51.58 s gammaloop-nextest-core> failures:
  472. 51.58 s gammaloop-nextest-core> cff::generation::tests_cff::thermal_bugblatter
  473. 51.58 s gammaloop-nextest-core>
  474. 51.58 s gammaloop-nextest-core> test result: FAILED. 0 passed; 1 failed; 0 ignored; 0 measured; 535 filtered out; finished in 21.15s
  475. 51.58 s gammaloop-nextest-core>
  476. 51.58 s gammaloop-nextest-core> stderr ---
  477. 51.58 s gammaloop-nextest-core>
  478. 51.58 s gammaloop-nextest-core> thread 'cff::generation::tests_cff::thermal_bugblatter' (1276) panicked at /nix/store/1sigmg52bb61pfngmk9k8wq5fz9r7bf1-vendor-cargo-deps/5929dab090e556a579e9f3b708cd2e67c60b3d84a12b5a276f2a36cb00473133/symbolica-2.2.0/src/evaluate/evaluator.rs:295:21:
  479. 51.58 s gammaloop-nextest-core> External function 'symbolica_coth' does not have an implementation for gammalooprs::utils::F<f64>
  480. 51.58 s gammaloop-nextest-core> stack backtrace:
  481. 51.58 s gammaloop-nextest-core> 0: __rustc::rust_begin_unwind
  482. 51.58 s gammaloop-nextest-core> 1: core::panicking::panic_fmt
  483. 51.58 s gammaloop-nextest-core> 2: <symbolica::evaluate::evaluator::ExpressionEvaluator<gammalooprs::utils::F<f64>>>::evaluate_impl_no_ops
  484. 51.58 s gammaloop-nextest-core> 3: <symbolica::evaluate::evaluator::ExpressionEvaluator<gammalooprs::utils::F<f64>>>::evaluate_single
  485. 51.58 s gammaloop-nextest-core> 4: gammalooprs::cff::generation::tests_cff::thermal_bugblatter
  486. 51.58 s gammaloop-nextest-core> 5: <gammalooprs::cff::generation::tests_cff::thermal_bugblatter::{closure#0} as core::ops::function::FnOnce<()>>::call_once
  487. 51.58 s gammaloop-nextest-core> note: Some details are omitted, run with `RUST_BACKTRACE=full` for a verbose backtrace.
  488. 51.58 s gammaloop-nextest-core>
  489. 51.68 s gammaloop-nextest-core> error: test run failed
  490. 51.74 s gammaloop-nextest-core>
  491. 51.74 s gammaloop-nextest-core> ========== nextest test summary ==========
  492. 51.74 s gammaloop-nextest-core> report: target/nextest/ci_gammaloop/junit.xml
  493. 51.74 s gammaloop-nextest-core> tests: 483, failures: 7, errors: 0
  494. 51.74 s gammaloop-nextest-core>
  495. 51.74 s gammaloop-nextest-core> 1. gammalooprs::cff::generation::tests_cff::thermal_bubble_chain
  496. 51.74 s gammaloop-nextest-core> failure: test failure with exit code 101
  497. 51.74 s gammaloop-nextest-core> thread 'cff::generation::tests_cff::thermal_bubble_chain' (1271) panicked at /nix/store/1sigmg52bb61pfngmk9k8wq5fz9r7bf1-vendor-cargo-deps/5929dab090e556a579e9f3b708cd2e67c60b3d84a12b5a276f2a36cb00473133/symbolica-2.2.0/src/evaluate/evaluator.rs:295:21:
  498. 51.74 s gammaloop-nextest-core> External function 'symbolica_coth' does not have an implementation for gammalooprs::utils::F<f64>
  499. 51.74 s gammaloop-nextest-core> stack backtrace:
  500. 51.74 s gammaloop-nextest-core> 0: __rustc::rust_begin_unwind
  501. 51.74 s gammaloop-nextest-core> 1: core::panicking::panic_fmt
  502. 51.74 s gammaloop-nextest-core> 2: <symbolica::evaluate::evaluator::ExpressionEvaluator<gammalooprs::utils::F<f64>>>::evaluate_impl_no_ops
  503. 51.74 s gammaloop-nextest-core> 3: <symbolica::evaluate::evaluator::ExpressionEvaluator<gammalooprs::utils::F<f64>>>::evaluate_single
  504. 51.74 s gammaloop-nextest-core> 4: gammalooprs::cff::generation::tests_cff::thermal_bubble_chain
  505. 51.74 s gammaloop-nextest-core> 5: <gammalooprs::cff::generation::tests_cff::thermal_bubble_chain::{closure#0} as core::ops::function::FnOnce<()>>::call_once
  506. 51.74 s gammaloop-nextest-core> note: Some details are omitted, run with `RUST_BACKTRACE=full` for a verbose backtrace.
  507. 51.74 s gammaloop-nextest-core> system-out
  508. 51.74 s gammaloop-nextest-core> running 1 test
  509. 51.74 s gammaloop-nextest-core> test cff::generation::tests_cff::thermal_bubble_chain ... FAILED
  510. 51.74 s gammaloop-nextest-core>
  511. 51.74 s gammaloop-nextest-core> failures:
  512. 51.74 s gammaloop-nextest-core>
  513. 51.74 s gammaloop-nextest-core> failures:
  514. 51.74 s gammaloop-nextest-core> cff::generation::tests_cff::thermal_bubble_chain
  515. 51.74 s gammaloop-nextest-core>
  516. 51.74 s gammaloop-nextest-core> test result: FAILED. 0 passed; 1 failed; 0 ignored; 0 measured; 535 filtered out; finished in 0.01s
  517. 51.74 s gammaloop-nextest-core> system-err
  518. 51.74 s gammaloop-nextest-core> thread 'cff::generation::tests_cff::thermal_bubble_chain' (1271) panicked at /nix/store/1sigmg52bb61pfngmk9k8wq5fz9r7bf1-vendor-cargo-deps/5929dab090e556a579e9f3b708cd2e67c60b3d84a12b5a276f2a36cb00473133/symbolica-2.2.0/src/evaluate/evaluator.rs:295:21:
  519. 51.74 s gammaloop-nextest-core> External function 'symbolica_coth' does not have an implementation for gammalooprs::utils::F<f64>
  520. 51.74 s gammaloop-nextest-core> stack backtrace:
  521. 51.74 s gammaloop-nextest-core> 0: __rustc::rust_begin_unwind
  522. 51.74 s gammaloop-nextest-core> 1: core::panicking::panic_fmt
  523. 51.74 s gammaloop-nextest-core> 2: <symbolica::evaluate::evaluator::ExpressionEvaluator<gammalooprs::utils::F<f64>>>::evaluate_impl_no_ops
  524. 51.74 s gammaloop-nextest-core> 3: <symbolica::evaluate::evaluator::ExpressionEvaluator<gammalooprs::utils::F<f64>>>::evaluate_single
  525. 51.74 s gammaloop-nextest-core> 4: gammalooprs::cff::generation::tests_cff::thermal_bubble_chain
  526. 51.74 s gammaloop-nextest-core> 5: <gammalooprs::cff::generation::tests_cff::thermal_bubble_chain::{closure#0} as core::ops::function::FnOnce<()>>::call_once
  527. 51.74 s gammaloop-nextest-core> note: Some details are omitted, run with `RUST_BACKTRACE=full` for a verbose backtrace.
  528. 51.74 s gammaloop-nextest-core>
  529. 51.74 s gammaloop-nextest-core> 2. gammalooprs::cff::generation::tests_cff::thermal_bubble
  530. 51.74 s gammaloop-nextest-core> failure: test failure with exit code 101
  531. 51.74 s gammaloop-nextest-core> thread 'cff::generation::tests_cff::thermal_bubble' (1282) panicked at /nix/store/1sigmg52bb61pfngmk9k8wq5fz9r7bf1-vendor-cargo-deps/5929dab090e556a579e9f3b708cd2e67c60b3d84a12b5a276f2a36cb00473133/symbolica-2.2.0/src/evaluate/evaluator.rs:295:21:
  532. 51.74 s gammaloop-nextest-core> External function 'symbolica_coth' does not have an implementation for gammalooprs::utils::F<f64>
  533. 51.74 s gammaloop-nextest-core> stack backtrace:
  534. 51.74 s gammaloop-nextest-core> 0: __rustc::rust_begin_unwind
  535. 51.74 s gammaloop-nextest-core> 1: core::panicking::panic_fmt
  536. 51.74 s gammaloop-nextest-core> 2: <symbolica::evaluate::evaluator::ExpressionEvaluator<gammalooprs::utils::F<f64>>>::evaluate_impl_no_ops
  537. 51.74 s gammaloop-nextest-core> 3: <symbolica::evaluate::evaluator::ExpressionEvaluator<gammalooprs::utils::F<f64>>>::evaluate_single
  538. 51.74 s gammaloop-nextest-core> 4: gammalooprs::cff::generation::tests_cff::thermal_bubble
  539. 51.74 s gammaloop-nextest-core> 5: <gammalooprs::cff::generation::tests_cff::thermal_bubble::{closure#0} as core::ops::function::FnOnce<()>>::call_once
  540. 51.74 s gammaloop-nextest-core> note: Some details are omitted, run with `RUST_BACKTRACE=full` for a verbose backtrace.
  541. 51.74 s gammaloop-nextest-core> system-out
  542. 51.74 s gammaloop-nextest-core> running 1 test
  543. 51.74 s gammaloop-nextest-core> test cff::generation::tests_cff::thermal_bubble ... FAILED
  544. 51.74 s gammaloop-nextest-core>
  545. 51.74 s gammaloop-nextest-core> failures:
  546. 51.74 s gammaloop-nextest-core>
  547. 51.74 s gammaloop-nextest-core> failures:
  548. 51.74 s gammaloop-nextest-core> cff::generation::tests_cff::thermal_bubble
  549. 51.74 s gammaloop-nextest-core>
  550. 51.74 s gammaloop-nextest-core> test result: FAILED. 0 passed; 1 failed; 0 ignored; 0 measured; 535 filtered out; finished in 0.01s
  551. 51.74 s gammaloop-nextest-core> system-err
  552. 51.74 s gammaloop-nextest-core> thread 'cff::generation::tests_cff::thermal_bubble' (1282) panicked at /nix/store/1sigmg52bb61pfngmk9k8wq5fz9r7bf1-vendor-cargo-deps/5929dab090e556a579e9f3b708cd2e67c60b3d84a12b5a276f2a36cb00473133/symbolica-2.2.0/src/evaluate/evaluator.rs:295:21:
  553. 51.74 s gammaloop-nextest-core> External function 'symbolica_coth' does not have an implementation for gammalooprs::utils::F<f64>
  554. 51.74 s gammaloop-nextest-core> stack backtrace:
  555. 51.74 s gammaloop-nextest-core> 0: __rustc::rust_begin_unwind
  556. 51.74 s gammaloop-nextest-core> 1: core::panicking::panic_fmt
  557. 51.74 s gammaloop-nextest-core> 2: <symbolica::evaluate::evaluator::ExpressionEvaluator<gammalooprs::utils::F<f64>>>::evaluate_impl_no_ops
  558. 51.74 s gammaloop-nextest-core> 3: <symbolica::evaluate::evaluator::ExpressionEvaluator<gammalooprs::utils::F<f64>>>::evaluate_single
  559. 51.74 s gammaloop-nextest-core> 4: gammalooprs::cff::generation::tests_cff::thermal_bubble
  560. 51.74 s gammaloop-nextest-core> 5: <gammalooprs::cff::generation::tests_cff::thermal_bubble::{closure#0} as core::ops::function::FnOnce<()>>::call_once
  561. 51.74 s gammaloop-nextest-core> note: Some details are omitted, run with `RUST_BACKTRACE=full` for a verbose backtrace.
  562. 51.74 s gammaloop-nextest-core>
  563. 51.74 s gammaloop-nextest-core> 3. gammalooprs::cff::generation::tests_cff::thermal_eight
  564. 51.74 s gammaloop-nextest-core> failure: test failure with exit code 101
  565. 51.74 s gammaloop-nextest-core> thread 'cff::generation::tests_cff::thermal_eight' (1281) panicked at /nix/store/1sigmg52bb61pfngmk9k8wq5fz9r7bf1-vendor-cargo-deps/5929dab090e556a579e9f3b708cd2e67c60b3d84a12b5a276f2a36cb00473133/symbolica-2.2.0/src/evaluate/evaluator.rs:295:21:
  566. 51.74 s gammaloop-nextest-core> External function 'symbolica_coth' does not have an implementation for gammalooprs::utils::F<f64>
  567. 51.74 s gammaloop-nextest-core> stack backtrace:
  568. 51.74 s gammaloop-nextest-core> 0: __rustc::rust_begin_unwind
  569. 51.74 s gammaloop-nextest-core> 1: core::panicking::panic_fmt
  570. 51.74 s gammaloop-nextest-core> 2: <symbolica::evaluate::evaluator::ExpressionEvaluator<gammalooprs::utils::F<f64>>>::evaluate_impl_no_ops
  571. 51.74 s gammaloop-nextest-core> 3: <symbolica::evaluate::evaluator::ExpressionEvaluator<gammalooprs::utils::F<f64>>>::evaluate_single
  572. 51.74 s gammaloop-nextest-core> 4: gammalooprs::cff::generation::tests_cff::thermal_eight
  573. 51.74 s gammaloop-nextest-core> 5: <gammalooprs::cff::generation::tests_cff::thermal_eight::{closure#0} as core::ops::function::FnOnce<()>>::call_once
  574. 51.74 s gammaloop-nextest-core> note: Some details are omitted, run with `RUST_BACKTRACE=full` for a verbose backtrace.
  575. 51.74 s gammaloop-nextest-core> system-out
  576. 51.74 s gammaloop-nextest-core> running 1 test
  577. 51.74 s gammaloop-nextest-core> test cff::generation::tests_cff::thermal_eight ... FAILED
  578. 51.74 s gammaloop-nextest-core>
  579. 51.74 s gammaloop-nextest-core> failures:
  580. 51.74 s gammaloop-nextest-core>
  581. 51.74 s gammaloop-nextest-core> failures:
  582. 51.74 s gammaloop-nextest-core> cff::generation::tests_cff::thermal_eight
  583. 51.74 s gammaloop-nextest-core>
  584. 51.74 s gammaloop-nextest-core> test result: FAILED. 0 passed; 1 failed; 0 ignored; 0 measured; 535 filtered out; finished in 0.02s
  585. 51.74 s gammaloop-nextest-core> system-err
  586. 51.74 s gammaloop-nextest-core> thread 'cff::generation::tests_cff::thermal_eight' (1281) panicked at /nix/store/1sigmg52bb61pfngmk9k8wq5fz9r7bf1-vendor-cargo-deps/5929dab090e556a579e9f3b708cd2e67c60b3d84a12b5a276f2a36cb00473133/symbolica-2.2.0/src/evaluate/evaluator.rs:295:21:
  587. 51.74 s gammaloop-nextest-core> External function 'symbolica_coth' does not have an implementation for gammalooprs::utils::F<f64>
  588. 51.74 s gammaloop-nextest-core> stack backtrace:
  589. 51.74 s gammaloop-nextest-core> 0: __rustc::rust_begin_unwind
  590. 51.74 s gammaloop-nextest-core> 1: core::panicking::panic_fmt
  591. 51.74 s gammaloop-nextest-core> 2: <symbolica::evaluate::evaluator::ExpressionEvaluator<gammalooprs::utils::F<f64>>>::evaluate_impl_no_ops
  592. 51.74 s gammaloop-nextest-core> 3: <symbolica::evaluate::evaluator::ExpressionEvaluator<gammalooprs::utils::F<f64>>>::evaluate_single
  593. 51.74 s gammaloop-nextest-core> 4: gammalooprs::cff::generation::tests_cff::thermal_eight
  594. 51.74 s gammaloop-nextest-core> 5: <gammalooprs::cff::generation::tests_cff::thermal_eight::{closure#0} as core::ops::function::FnOnce<()>>::call_once
  595. 51.74 s gammaloop-nextest-core> note: Some details are omitted, run with `RUST_BACKTRACE=full` for a verbose backtrace.
  596. 51.74 s gammaloop-nextest-core>
  597. 51.74 s gammaloop-nextest-core> 4. gammalooprs::cff::generation::tests_cff::thermal_ring
  598. 51.74 s gammaloop-nextest-core> failure: test failure with exit code 101
  599. 51.74 s gammaloop-nextest-core> thread 'cff::generation::tests_cff::thermal_ring' (1300) panicked at /nix/store/1sigmg52bb61pfngmk9k8wq5fz9r7bf1-vendor-cargo-deps/5929dab090e556a579e9f3b708cd2e67c60b3d84a12b5a276f2a36cb00473133/symbolica-2.2.0/src/evaluate/evaluator.rs:295:21:
  600. 51.74 s gammaloop-nextest-core> External function 'symbolica_coth' does not have an implementation for gammalooprs::utils::F<f64>
  601. 51.74 s gammaloop-nextest-core> stack backtrace:
  602. 51.74 s gammaloop-nextest-core> 0: __rustc::rust_begin_unwind
  603. 51.74 s gammaloop-nextest-core> 1: core::panicking::panic_fmt
  604. 51.74 s gammaloop-nextest-core> 2: <symbolica::evaluate::evaluator::ExpressionEvaluator<gammalooprs::utils::F<f64>>>::evaluate_impl_no_ops
  605. 51.74 s gammaloop-nextest-core> 3: <symbolica::evaluate::evaluator::ExpressionEvaluator<gammalooprs::utils::F<f64>>>::evaluate_single
  606. 51.74 s gammaloop-nextest-core> 4: gammalooprs::cff::generation::tests_cff::thermal_ring
  607. 51.74 s gammaloop-nextest-core> 5: <gammalooprs::cff::generation::tests_cff::thermal_ring::{closure#0} as core::ops::function::FnOnce<()>>::call_once
  608. 51.74 s gammaloop-nextest-core> note: Some details are omitted, run with `RUST_BACKTRACE=full` for a verbose backtrace.
  609. 51.74 s gammaloop-nextest-core> system-out
  610. 51.74 s gammaloop-nextest-core> running 1 test
  611. 51.74 s gammaloop-nextest-core> test cff::generation::tests_cff::thermal_ring ... FAILED
  612. 51.74 s gammaloop-nextest-core>
  613. 51.74 s gammaloop-nextest-core> failures:
  614. 51.74 s gammaloop-nextest-core>
  615. 51.74 s gammaloop-nextest-core> failures:
  616. 51.74 s gammaloop-nextest-core> cff::generation::tests_cff::thermal_ring
  617. 51.74 s gammaloop-nextest-core>
  618. 51.74 s gammaloop-nextest-core> test result: FAILED. 0 passed; 1 failed; 0 ignored; 0 measured; 535 filtered out; finished in 0.05s
  619. 51.74 s gammaloop-nextest-core> system-err
  620. 51.74 s gammaloop-nextest-core> thread 'cff::generation::tests_cff::thermal_ring' (1300) panicked at /nix/store/1sigmg52bb61pfngmk9k8wq5fz9r7bf1-vendor-cargo-deps/5929dab090e556a579e9f3b708cd2e67c60b3d84a12b5a276f2a36cb00473133/symbolica-2.2.0/src/evaluate/evaluator.rs:295:21:
  621. 51.74 s gammaloop-nextest-core> External function 'symbolica_coth' does not have an implementation for gammalooprs::utils::F<f64>
  622. 51.74 s gammaloop-nextest-core> stack backtrace:
  623. 51.74 s gammaloop-nextest-core> 0: __rustc::rust_begin_unwind
  624. 51.74 s gammaloop-nextest-core> 1: core::panicking::panic_fmt
  625. 51.74 s gammaloop-nextest-core> 2: <symbolica::evaluate::evaluator::ExpressionEvaluator<gammalooprs::utils::F<f64>>>::evaluate_impl_no_ops
  626. 51.74 s gammaloop-nextest-core> 3: <symbolica::evaluate::evaluator::ExpressionEvaluator<gammalooprs::utils::F<f64>>>::evaluate_single
  627. 51.74 s gammaloop-nextest-core> 4: gammalooprs::cff::generation::tests_cff::thermal_ring
  628. 51.74 s gammaloop-nextest-core> 5: <gammalooprs::cff::generation::tests_cff::thermal_ring::{closure#0} as core::ops::function::FnOnce<()>>::call_once
  629. 51.74 s gammaloop-nextest-core> note: Some details are omitted, run with `RUST_BACKTRACE=full` for a verbose backtrace.
  630. 51.74 s gammaloop-nextest-core>
  631. 51.74 s gammaloop-nextest-core> 5. gammalooprs::cff::generation::tests_cff::thermal_mercedes
  632. 51.74 s gammaloop-nextest-core> failure: test failure with exit code 101
  633. 51.74 s gammaloop-nextest-core> thread 'cff::generation::tests_cff::thermal_mercedes' (1296) panicked at /nix/store/1sigmg52bb61pfngmk9k8wq5fz9r7bf1-vendor-cargo-deps/5929dab090e556a579e9f3b708cd2e67c60b3d84a12b5a276f2a36cb00473133/symbolica-2.2.0/src/evaluate/evaluator.rs:295:21:
  634. 51.74 s gammaloop-nextest-core> External function 'symbolica_coth' does not have an implementation for gammalooprs::utils::F<f64>
  635. 51.74 s gammaloop-nextest-core> stack backtrace:
  636. 51.74 s gammaloop-nextest-core> 0: __rustc::rust_begin_unwind
  637. 51.74 s gammaloop-nextest-core> 1: core::panicking::panic_fmt
  638. 51.74 s gammaloop-nextest-core> 2: <symbolica::evaluate::evaluator::ExpressionEvaluator<gammalooprs::utils::F<f64>>>::evaluate_impl_no_ops
  639. 51.74 s gammaloop-nextest-core> 3: <symbolica::evaluate::evaluator::ExpressionEvaluator<gammalooprs::utils::F<f64>>>::evaluate_single
  640. 51.74 s gammaloop-nextest-core> 4: gammalooprs::cff::generation::tests_cff::thermal_mercedes
  641. 51.74 s gammaloop-nextest-core> 5: <gammalooprs::cff::generation::tests_cff::thermal_mercedes::{closure#0} as core::ops::function::FnOnce<()>>::call_once
  642. 51.74 s gammaloop-nextest-core> note: Some details are omitted, run with `RUST_BACKTRACE=full` for a verbose backtrace.
  643. 51.74 s gammaloop-nextest-core> system-out
  644. 51.74 s gammaloop-nextest-core> running 1 test
  645. 51.74 s gammaloop-nextest-core> test cff::generation::tests_cff::thermal_mercedes ... FAILED
  646. 51.74 s gammaloop-nextest-core>
  647. 51.74 s gammaloop-nextest-core> failures:
  648. 51.74 s gammaloop-nextest-core>
  649. 51.74 s gammaloop-nextest-core> failures:
  650. 51.74 s gammaloop-nextest-core> cff::generation::tests_cff::thermal_mercedes
  651. 51.74 s gammaloop-nextest-core>
  652. 51.74 s gammaloop-nextest-core> test result: FAILED. 0 passed; 1 failed; 0 ignored; 0 measured; 535 filtered out; finished in 0.43s
  653. 51.74 s gammaloop-nextest-core> system-err
  654. 51.74 s gammaloop-nextest-core> thread 'cff::generation::tests_cff::thermal_mercedes' (1296) panicked at /nix/store/1sigmg52bb61pfngmk9k8wq5fz9r7bf1-vendor-cargo-deps/5929dab090e556a579e9f3b708cd2e67c60b3d84a12b5a276f2a36cb00473133/symbolica-2.2.0/src/evaluate/evaluator.rs:295:21:
  655. 51.74 s gammaloop-nextest-core> External function 'symbolica_coth' does not have an implementation for gammalooprs::utils::F<f64>
  656. 51.74 s gammaloop-nextest-core> stack backtrace:
  657. 51.74 s gammaloop-nextest-core> 0: __rustc::rust_begin_unwind
  658. 51.74 s gammaloop-nextest-core> 1: core::panicking::panic_fmt
  659. 51.74 s gammaloop-nextest-core> 2: <symbolica::evaluate::evaluator::ExpressionEvaluator<gammalooprs::utils::F<f64>>>::evaluate_impl_no_ops
  660. 51.74 s gammaloop-nextest-core> 3: <symbolica::evaluate::evaluator::ExpressionEvaluator<gammalooprs::utils::F<f64>>>::evaluate_single
  661. 51.74 s gammaloop-nextest-core> 4: gammalooprs::cff::generation::tests_cff::thermal_mercedes
  662. 51.74 s gammaloop-nextest-core> 5: <gammalooprs::cff::generation::tests_cff::thermal_mercedes::{closure#0} as core::ops::function::FnOnce<()>>::call_once
  663. 51.74 s gammaloop-nextest-core> note: Some details are omitted, run with `RUST_BACKTRACE=full` for a verbose backtrace.
  664. 51.74 s gammaloop-nextest-core>
  665. 51.74 s gammaloop-nextest-core> 6. gammalooprs::graph::feynman_graph::tests::native_thermal_distributions
  666. 51.74 s gammaloop-nextest-core> failure: test failure with exit code 101
  667. 51.74 s gammaloop-nextest-core> system-out
  668. 51.74 s gammaloop-nextest-core> running 1 test
  669. 51.74 s gammaloop-nextest-core> test graph::feynman_graph::tests::native_thermal_distributions ... FAILED
  670. 51.74 s gammaloop-nextest-core>
  671. 51.74 s gammaloop-nextest-core> failures:
  672. 51.74 s gammaloop-nextest-core>
  673. 51.74 s gammaloop-nextest-core> failures:
  674. 51.74 s gammaloop-nextest-core> graph::feynman_graph::tests::native_thermal_distributions
  675. 51.74 s gammaloop-nextest-core>
  676. 51.74 s gammaloop-nextest-core> test result: FAILED. 0 passed; 1 failed; 0 ignored; 0 measured; 535 filtered out; finished in 1.65s
  677. 51.74 s gammaloop-nextest-core> system-err
  678. 51.74 s gammaloop-nextest-core> The application panicked (crashed).
  679. 51.74 s gammaloop-nextest-core> Message: called `Result::unwrap()` on an `Err` value: Custom { kind: Other, error: "Could not compile code: g++ -shared -O3 -fPIC -ffast-math -funsafe-math-optimizations -march=native -o /build/gammaloop-native-thermal-1338/thermal_0_0.so /build/gammaloop-native-thermal-1338/thermal_0_0.cpp\nwarning: Skipping impure flag -march=native because NIX_ENFORCE_NO_NATIVE is set\n/build/gammaloop-native-thermal-1338/thermal_0_0.cpp: In function 'void thermal_realf64(const double*, double*, double*)':\n/build/gammaloop-native-thermal-1338/thermal_0_0.cpp:27:16: error: 'symbolica_tanh' was not declared in this scope\n 27 | Z[6] = symbolica_tanh(Z[6]);\n | ^~~~~~~~~~~~~~\n" }
  680. 51.74 s gammaloop-nextest-core> Location: crates/gammalooprs/src/graph/feynman_graph.rs:937
  681. 51.74 s gammaloop-nextest-core>
  682. 51.74 s gammaloop-nextest-core> ━━━━━━━━━━━━━━━━━━━━━━━━━━━━━━━━━━ BACKTRACE ━━━━━━━━━━━━━━━━━━━━━━━━━━━━━━━━━━━
  683. 51.74 s gammaloop-nextest-core> 1: <color_eyre[b0c9e66060e883b2]::config::PanicHook>::panic_report<unknown>
  684. 51.74 s gammaloop-nextest-core> at <unknown source file>:<unknown line>
  685. 51.74 s gammaloop-nextest-core> 2: <color_eyre[b0c9e66060e883b2]::config::PanicHook>::into_panic_hook::{closure#0}<unknown>
  686. 51.74 s gammaloop-nextest-core> at <unknown source file>:<unknown line>
  687. 51.74 s gammaloop-nextest-core> 3: std[bcb96dfbba0ab899]::panicking::panic_with_hook<unknown>
  688. 51.74 s gammaloop-nextest-core> at <unknown source file>:<unknown line>
  689. 51.74 s gammaloop-nextest-core> 4: std[bcb96dfbba0ab899]::panicking::panic_handler::{closure#0}<unknown>
  690. 51.74 s gammaloop-nextest-core> at <unknown source file>:<unknown line>
  691. 51.74 s gammaloop-nextest-core> 5: std[bcb96dfbba0ab899]::sys::backtrace::__rust_end_short_backtrace::<std[bcb96dfbba0ab899]::panicking::panic_handler::{closure#0}, !><unknown>
  692. 51.74 s gammaloop-nextest-core> at <unknown source file>:<unknown line>
  693. 51.74 s gammaloop-nextest-core> 6: __rustc[6c289b9f9c454d21]::rust_begin_unwind<unknown>
  694. 51.74 s gammaloop-nextest-core> at <unknown source file>:<unknown line>
  695. 51.74 s gammaloop-nextest-core> 7: core[940e698046960fd5]::panicking::panic_fmt<unknown>
  696. 51.74 s gammaloop-nextest-core> at <unknown source file>:<unknown line>
  697. 51.74 s gammaloop-nextest-core> 8: core[940e698046960fd5]::result::unwrap_failed<unknown>
  698. 51.74 s gammaloop-nextest-core> at <unknown source file>:<unknown line>
  699. 51.74 s gammaloop-nextest-core> 9: gammalooprs[5490727360442cce]::graph::feynman_graph::tests::native_thermal_distributions<unknown>
  700. 51.74 s gammaloop-nextest-core> at <unknown source file>:<unknown line>
  701. 51.74 s gammaloop-nextest-core> 10: <gammalooprs[5490727360442cce]::graph::feynman_graph::tests::native_thermal_distributions::{closure#0} as core[940e698046960fd5]::ops::function::FnOnce<()>>::call_once<unknown>
  702. 51.74 s gammaloop-nextest-core> at <unknown source file>:<unknown line>
  703. 51.74 s gammaloop-nextest-core> 11: test[75d6903177b1d7e9]::__rust_begin_short_backtrace::<core[940e698046960fd5]::result::Result<(), alloc[2ea6bcb46fca0c42]::string::String>, fn() -> core[940e698046960fd5]::result::Result<(), alloc[2ea6bcb46fca0c42]::string::String>><unknown>
  704. 51.74 s gammaloop-nextest-core> at <unknown source file>:<unknown line>
  705. 51.74 s gammaloop-nextest-core> 12: test[75d6903177b1d7e9]::run_test::{closure#0}<unknown>
  706. 51.74 s gammaloop-nextest-core> at <unknown source file>:<unknown line>
  707. 51.74 s gammaloop-nextest-core> 13: std[bcb96dfbba0ab899]::sys::backtrace::__rust_begin_short_backtrace::<test[75d6903177b1d7e9]::run_test::{closure#1}, ()><unknown>
  708. 51.74 s gammaloop-nextest-core> at <unknown source file>:<unknown line>
  709. 51.74 s gammaloop-nextest-core> 14: <std[bcb96dfbba0ab899]::thread::lifecycle::spawn_unchecked<test[75d6903177b1d7e9]::run_test::{closure#1}, ()>::{closure#1} as core[940e698046960fd5]::ops::function::FnOnce<()>>::call_once::{shim:vtable#0}<unknown>
  710. 51.74 s gammaloop-nextest-core> at <unknown source file>:<unknown line>
  711. 51.74 s gammaloop-nextest-core> 15: <std[bcb96dfbba0ab899]::sys::thread::unix::Thread>::new::thread_start<unknown>
  712. 51.74 s gammaloop-nextest-core> at <unknown source file>:<unknown line>
  713. 51.74 s gammaloop-nextest-core> 16: start_thread<unknown>
  714. 51.74 s gammaloop-nextest-core> at <unknown source file>:<unknown line>
  715. 51.74 s gammaloop-nextest-core> 17: __clone3<unknown>
  716. 51.74 s gammaloop-nextest-core> at <unknown source file>:<unknown line>
  717. 51.74 s gammaloop-nextest-core>
  718. 51.74 s gammaloop-nextest-core> Run with COLORBT_SHOW_HIDDEN=1 environment variable to disable frame filtering.
  719. 51.74 s gammaloop-nextest-core> Run with RUST_BACKTRACE=full to include source snippets.
  720. 51.74 s gammaloop-nextest-core>
  721. 51.74 s gammaloop-nextest-core> 7. gammalooprs::cff::generation::tests_cff::thermal_bugblatter
  722. 51.74 s gammaloop-nextest-core> failure: test failure with exit code 101
  723. 51.74 s gammaloop-nextest-core> thread 'cff::generation::tests_cff::thermal_bugblatter' (1276) panicked at /nix/store/1sigmg52bb61pfngmk9k8wq5fz9r7bf1-vendor-cargo-deps/5929dab090e556a579e9f3b708cd2e67c60b3d84a12b5a276f2a36cb00473133/symbolica-2.2.0/src/evaluate/evaluator.rs:295:21:
  724. 51.74 s gammaloop-nextest-core> External function 'symbolica_coth' does not have an implementation for gammalooprs::utils::F<f64>
  725. 51.74 s gammaloop-nextest-core> stack backtrace:
  726. 51.74 s gammaloop-nextest-core> 0: __rustc::rust_begin_unwind
  727. 51.74 s gammaloop-nextest-core> 1: core::panicking::panic_fmt
  728. 51.74 s gammaloop-nextest-core> 2: <symbolica::evaluate::evaluator::ExpressionEvaluator<gammalooprs::utils::F<f64>>>::evaluate_impl_no_ops
  729. 51.74 s gammaloop-nextest-core> 3: <symbolica::evaluate::evaluator::ExpressionEvaluator<gammalooprs::utils::F<f64>>>::evaluate_single
  730. 51.74 s gammaloop-nextest-core> 4: gammalooprs::cff::generation::tests_cff::thermal_bugblatter
  731. 51.74 s gammaloop-nextest-core> 5: <gammalooprs::cff::generation::tests_cff::thermal_bugblatter::{closure#0} as core::ops::function::FnOnce<()>>::call_once
  732. 51.74 s gammaloop-nextest-core> note: Some details are omitted, run with `RUST_BACKTRACE=full` for a verbose backtrace.
  733. 51.74 s gammaloop-nextest-core> system-out
  734. 51.74 s gammaloop-nextest-core> running 1 test
  735. 51.74 s gammaloop-nextest-core> test cff::generation::tests_cff::thermal_bugblatter ... FAILED
  736. 51.74 s gammaloop-nextest-core>
  737. 51.74 s gammaloop-nextest-core> failures:
  738. 51.74 s gammaloop-nextest-core>
  739. 51.74 s gammaloop-nextest-core> failures:
  740. 51.74 s gammaloop-nextest-core> cff::generation::tests_cff::thermal_bugblatter
  741. 51.74 s gammaloop-nextest-core>
  742. 51.74 s gammaloop-nextest-core> test result: FAILED. 0 passed; 1 failed; 0 ignored; 0 measured; 535 filtered out; finished in 21.15s
  743. 51.74 s gammaloop-nextest-core> system-err
  744. 51.74 s gammaloop-nextest-core> thread 'cff::generation::tests_cff::thermal_bugblatter' (1276) panicked at /nix/store/1sigmg52bb61pfngmk9k8wq5fz9r7bf1-vendor-cargo-deps/5929dab090e556a579e9f3b708cd2e67c60b3d84a12b5a276f2a36cb00473133/symbolica-2.2.0/src/evaluate/evaluator.rs:295:21:
  745. 51.74 s gammaloop-nextest-core> External function 'symbolica_coth' does not have an implementation for gammalooprs::utils::F<f64>
  746. 51.74 s gammaloop-nextest-core> stack backtrace:
  747. 51.74 s gammaloop-nextest-core> 0: __rustc::rust_begin_unwind
  748. 51.74 s gammaloop-nextest-core> 1: core::panicking::panic_fmt
  749. 51.74 s gammaloop-nextest-core> 2: <symbolica::evaluate::evaluator::ExpressionEvaluator<gammalooprs::utils::F<f64>>>::evaluate_impl_no_ops
  750. 51.74 s gammaloop-nextest-core> 3: <symbolica::evaluate::evaluator::ExpressionEvaluator<gammalooprs::utils::F<f64>>>::evaluate_single
  751. 51.74 s gammaloop-nextest-core> 4: gammalooprs::cff::generation::tests_cff::thermal_bugblatter
  752. 51.74 s gammaloop-nextest-core> 5: <gammalooprs::cff::generation::tests_cff::thermal_bugblatter::{closure#0} as core::ops::function::FnOnce<()>>::call_once
  753. 51.74 s gammaloop-nextest-core> note: Some details are omitted, run with `RUST_BACKTRACE=full` for a verbose backtrace.
  754. 51.74 s gammaloop-nextest-core> =========================================
  755. 51.84 s [0 built (1 failed)]error: Cannot build '/nix/store/4m6xcddxcb2ycplv2r6vd1qc57nv11md-gammaloop-nextest-core.drv'.
  756. 51.84 s Reason: builder failed with exit code 100.
  757. 51.84 s Output paths:
  758. 51.84 s /nix/store/k6a030dwps85a4jw4c4nah6vga1kas45-gammaloop-nextest-core
  759. 51.84 s Last 738 log lines:
  760. 51.84 s > Extracting 3 binaries (including 1 non-test binary), 1 build script output directory, and 2 linked paths to /build/nextest-archive-WBj1XP
  761. 51.84 s > Extracted 18 files to /build/nextest-archive-WBj1XP in 0.70s
  762. 51.84 s > ------------
  763. 51.84 s > Nextest run ID 00105aa6-5128-4ed8-8bb3-95196a0172d4 with nextest profile: ci_gammaloop
  764. 51.84 s > Starting 339 tests across 2 binaries
  765. 51.84 s > ------------
  766. 51.84 s > Summary [ 0.886s] 339 tests run: 339 passed, 0 skipped
  767. 51.84 s >
  768. 51.84 s > ========== nextest test summary ==========
  769. 51.84 s > report: target/nextest/ci_gammaloop/junit.xml
  770. 51.84 s > tests: 339, failures: 0, errors: 0
  771. 51.84 s > No failing testcases found.
  772. 51.84 s > =========================================
  773. 51.84 s > Extracting 1 binary and 1 linked path to /build/nextest-archive-WcbpHJ
  774. 51.84 s > Extracted 7 files to /build/nextest-archive-WcbpHJ in 0.09s
  775. 51.84 s > ------------
  776. 51.84 s > Nextest run ID 0412c7bd-e978-4748-b6d3-5b74cae3cdc4 with nextest profile: ci_gammaloop
  777. 51.84 s > Starting 19 tests across 1 binary
  778. 51.84 s > ------------
  779. 51.84 s > Summary [ 0.057s] 19 tests run: 19 passed, 0 skipped
  780. 51.84 s >
  781. 51.84 s > ========== nextest test summary ==========
  782. 51.84 s > report: target/nextest/ci_gammaloop/junit.xml
  783. 51.84 s > tests: 19, failures: 0, errors: 0
  784. 51.84 s > No failing testcases found.
  785. 51.84 s > =========================================
  786. 51.84 s > Extracting 1 binary to /build/nextest-archive-qJcgg5
  787. 51.84 s > Extracted 4 files to /build/nextest-archive-qJcgg5 in 0.06s
  788. 51.84 s > ------------
  789. 51.84 s > Nextest run ID 97f49356-59c2-4a37-924c-a78917712a49 with nextest profile: ci_gammaloop
  790. 51.84 s > Starting 0 tests across 1 binary
  791. 51.84 s > ------------
  792. 51.84 s > Summary [ 0.005s] 0 tests run: 0 passed, 0 skipped
  793. 51.84 s >
  794. 51.84 s > ========== nextest test summary ==========
  795. 51.84 s > report: target/nextest/ci_gammaloop/junit.xml
  796. 51.84 s > tests: 0, failures: 0, errors: 0
  797. 51.84 s > No failing testcases found.
  798. 51.84 s > =========================================
  799. 51.84 s > Extracting 4 binaries, 1 build script output directory, and 2 linked paths to /build/nextest-archive-ODiQiD
  800. 51.84 s > Extracted 18 files to /build/nextest-archive-ODiQiD in 0.73s
  801. 51.84 s > ------------
  802. 51.84 s > Nextest run ID cd5ff5c2-9bca-4e36-9540-a1030804533b with nextest profile: ci_gammaloop
  803. 51.84 s > Starting 483 tests across 4 binaries (61 tests skipped, including 60 tests via profile.ci_gammaloop.default-filter)
  804. 51.84 s > FAIL [ 0.024s] ( 43/483) gammalooprs cff::generation::tests_cff::thermal_bubble_chain
  805. 51.84 s > stdout ---
  806. 51.84 s >
  807. 51.84 s > running 1 test
  808. 51.84 s > test cff::generation::tests_cff::thermal_bubble_chain ... FAILED
  809. 51.84 s >
  810. 51.84 s > failures:
  811. 51.84 s >
  812. 51.84 s > failures:
  813. 51.84 s > cff::generation::tests_cff::thermal_bubble_chain
  814. 51.84 s >
  815. 51.84 s > test result: FAILED. 0 passed; 1 failed; 0 ignored; 0 measured; 535 filtered out; finished in 0.01s
  816. 51.84 s >
  817. 51.84 s > stderr ---
  818. 51.84 s >
  819. 51.84 s > thread 'cff::generation::tests_cff::thermal_bubble_chain' (1271) panicked at /nix/store/1sigmg52bb61pfngmk9k8wq5fz9r7bf1-vendor-cargo-deps/5929dab090e556a579e9f3b708cd2e67c60b3d84a12b5a276f2a36cb00473133/symbolica-2.2.0/src/evaluate/evaluator.rs:295:21:
  820. 51.84 s > External function 'symbolica_coth' does not have an implementation for gammalooprs::utils::F<f64>
  821. 51.84 s > stack backtrace:
  822. 51.84 s > 0: __rustc::rust_begin_unwind
  823. 51.84 s > 1: core::panicking::panic_fmt
  824. 51.84 s > 2: <symbolica::evaluate::evaluator::ExpressionEvaluator<gammalooprs::utils::F<f64>>>::evaluate_impl_no_ops
  825. 51.84 s > 3: <symbolica::evaluate::evaluator::ExpressionEvaluator<gammalooprs::utils::F<f64>>>::evaluate_single
  826. 51.84 s > 4: gammalooprs::cff::generation::tests_cff::thermal_bubble_chain
  827. 51.84 s > 5: <gammalooprs::cff::generation::tests_cff::thermal_bubble_chain::{closure#0} as core::ops::function::FnOnce<()>>::call_once
  828. 51.84 s > note: Some details are omitted, run with `RUST_BACKTRACE=full` for a verbose backtrace.
  829. 51.84 s >
  830. 51.84 s > FAIL [ 0.028s] ( 46/483) gammalooprs cff::generation::tests_cff::thermal_bubble
  831. 51.84 s > stdout ---
  832. 51.84 s >
  833. 51.84 s > running 1 test
  834. 51.84 s > test cff::generation::tests_cff::thermal_bubble ... FAILED
  835. 51.84 s >
  836. 51.84 s > failures:
  837. 51.84 s >
  838. 51.84 s > failures:
  839. 51.84 s > cff::generation::tests_cff::thermal_bubble
  840. 51.84 s >
  841. 51.84 s > test result: FAILED. 0 passed; 1 failed; 0 ignored; 0 measured; 535 filtered out; finished in 0.01s
  842. 51.84 s >
  843. 51.84 s > stderr ---
  844. 51.84 s >
  845. 51.84 s > thread 'cff::generation::tests_cff::thermal_bubble' (1282) panicked at /nix/store/1sigmg52bb61pfngmk9k8wq5fz9r7bf1-vendor-cargo-deps/5929dab090e556a579e9f3b708cd2e67c60b3d84a12b5a276f2a36cb00473133/symbolica-2.2.0/src/evaluate/evaluator.rs:295:21:
  846. 51.84 s > External function 'symbolica_coth' does not have an implementation for gammalooprs::utils::F<f64>
  847. 51.84 s > stack backtrace:
  848. 51.84 s > 0: __rustc::rust_begin_unwind
  849. 51.84 s > 1: core::panicking::panic_fmt
  850. 51.84 s > 2: <symbolica::evaluate::evaluator::ExpressionEvaluator<gammalooprs::utils::F<f64>>>::evaluate_impl_no_ops
  851. 51.84 s > 3: <symbolica::evaluate::evaluator::ExpressionEvaluator<gammalooprs::utils::F<f64>>>::evaluate_single
  852. 51.84 s > 4: gammalooprs::cff::generation::tests_cff::thermal_bubble
  853. 51.84 s > 5: <gammalooprs::cff::generation::tests_cff::thermal_bubble::{closure#0} as core::ops::function::FnOnce<()>>::call_once
  854. 51.84 s > note: Some details are omitted, run with `RUST_BACKTRACE=full` for a verbose backtrace.
  855. 51.84 s >
  856. 51.84 s > FAIL [ 0.032s] ( 48/483) gammalooprs cff::generation::tests_cff::thermal_eight
  857. 51.84 s > stdout ---
  858. 51.84 s >
  859. 51.84 s > running 1 test
  860. 51.84 s > test cff::generation::tests_cff::thermal_eight ... FAILED
  861. 51.84 s >
  862. 51.84 s > failures:
  863. 51.84 s >
  864. 51.84 s > failures:
  865. 51.84 s > cff::generation::tests_cff::thermal_eight
  866. 51.84 s >
  867. 51.84 s > test result: FAILED. 0 passed; 1 failed; 0 ignored; 0 measured; 535 filtered out; finished in 0.02s
  868. 51.84 s >
  869. 51.84 s > stderr ---
  870. 51.84 s >
  871. 51.84 s > thread 'cff::generation::tests_cff::thermal_eight' (1281) panicked at /nix/store/1sigmg52bb61pfngmk9k8wq5fz9r7bf1-vendor-cargo-deps/5929dab090e556a579e9f3b708cd2e67c60b3d84a12b5a276f2a36cb00473133/symbolica-2.2.0/src/evaluate/evaluator.rs:295:21:
  872. 51.84 s > External function 'symbolica_coth' does not have an implementation for gammalooprs::utils::F<f64>
  873. 51.84 s > stack backtrace:
  874. 51.84 s > 0: __rustc::rust_begin_unwind
  875. 51.84 s > 1: core::panicking::panic_fmt
  876. 51.84 s > 2: <symbolica::evaluate::evaluator::ExpressionEvaluator<gammalooprs::utils::F<f64>>>::evaluate_impl_no_ops
  877. 51.84 s > 3: <symbolica::evaluate::evaluator::ExpressionEvaluator<gammalooprs::utils::F<f64>>>::evaluate_single
  878. 51.84 s > 4: gammalooprs::cff::generation::tests_cff::thermal_eight
  879. 51.84 s > 5: <gammalooprs::cff::generation::tests_cff::thermal_eight::{closure#0} as core::ops::function::FnOnce<()>>::call_once
  880. 51.84 s > note: Some details are omitted, run with `RUST_BACKTRACE=full` for a verbose backtrace.
  881. 51.84 s >
  882. 51.84 s > FAIL [ 0.074s] ( 72/483) gammalooprs cff::generation::tests_cff::thermal_ring
  883. 51.84 s > stdout ---
  884. 51.84 s >
  885. 51.84 s > running 1 test
  886. 51.84 s > test cff::generation::tests_cff::thermal_ring ... FAILED
  887. 51.84 s >
  888. 51.84 s > failures:
  889. 51.84 s >
  890. 51.84 s > failures:
  891. 51.84 s > cff::generation::tests_cff::thermal_ring
  892. 51.84 s >
  893. 51.84 s > test result: FAILED. 0 passed; 1 failed; 0 ignored; 0 measured; 535 filtered out; finished in 0.05s
  894. 51.84 s >
  895. 51.84 s > stderr ---
  896. 51.84 s >
  897. 51.84 s > thread 'cff::generation::tests_cff::thermal_ring' (1300) panicked at /nix/store/1sigmg52bb61pfngmk9k8wq5fz9r7bf1-vendor-cargo-deps/5929dab090e556a579e9f3b708cd2e67c60b3d84a12b5a276f2a36cb00473133/symbolica-2.2.0/src/evaluate/evaluator.rs:295:21:
  898. 51.84 s > External function 'symbolica_coth' does not have an implementation for gammalooprs::utils::F<f64>
  899. 51.84 s > stack backtrace:
  900. 51.84 s > 0: __rustc::rust_begin_unwind
  901. 51.84 s > 1: core::panicking::panic_fmt
  902. 51.84 s > 2: <symbolica::evaluate::evaluator::ExpressionEvaluator<gammalooprs::utils::F<f64>>>::evaluate_impl_no_ops
  903. 51.84 s > 3: <symbolica::evaluate::evaluator::ExpressionEvaluator<gammalooprs::utils::F<f64>>>::evaluate_single
  904. 51.84 s > 4: gammalooprs::cff::generation::tests_cff::thermal_ring
  905. 51.84 s > 5: <gammalooprs::cff::generation::tests_cff::thermal_ring::{closure#0} as core::ops::function::FnOnce<()>>::call_once
  906. 51.84 s > note: Some details are omitted, run with `RUST_BACKTRACE=full` for a verbose backtrace.
  907. 51.84 s >
  908. 51.84 s > FAIL [ 0.461s] ( 87/483) gammalooprs cff::generation::tests_cff::thermal_mercedes
  909. 51.84 s > stdout ---
  910. 51.84 s >
  911. 51.84 s > running 1 test
  912. 51.84 s > test cff::generation::tests_cff::thermal_mercedes ... FAILED
  913. 51.84 s >
  914. 51.84 s > failures:
  915. 51.84 s >
  916. 51.84 s > failures:
  917. 51.84 s > cff::generation::tests_cff::thermal_mercedes
  918. 51.84 s >
  919. 51.84 s > test result: FAILED. 0 passed; 1 failed; 0 ignored; 0 measured; 535 filtered out; finished in 0.43s
  920. 51.84 s >
  921. 51.84 s > stderr ---
  922. 51.84 s >
  923. 51.84 s > thread 'cff::generation::tests_cff::thermal_mercedes' (1296) panicked at /nix/store/1sigmg52bb61pfngmk9k8wq5fz9r7bf1-vendor-cargo-deps/5929dab090e556a579e9f3b708cd2e67c60b3d84a12b5a276f2a36cb00473133/symbolica-2.2.0/src/evaluate/evaluator.rs:295:21:
  924. 51.84 s > External function 'symbolica_coth' does not have an implementation for gammalooprs::utils::F<f64>
  925. 51.84 s > stack backtrace:
  926. 51.84 s > 0: __rustc::rust_begin_unwind
  927. 51.84 s > 1: core::panicking::panic_fmt
  928. 51.84 s > 2: <symbolica::evaluate::evaluator::ExpressionEvaluator<gammalooprs::utils::F<f64>>>::evaluate_impl_no_ops
  929. 51.84 s > 3: <symbolica::evaluate::evaluator::ExpressionEvaluator<gammalooprs::utils::F<f64>>>::evaluate_single
  930. 51.84 s > 4: gammalooprs::cff::generation::tests_cff::thermal_mercedes
  931. 51.84 s > 5: <gammalooprs::cff::generation::tests_cff::thermal_mercedes::{closure#0} as core::ops::function::FnOnce<()>>::call_once
  932. 51.84 s > note: Some details are omitted, run with `RUST_BACKTRACE=full` for a verbose backtrace.
  933. 51.84 s >
  934. 51.84 s > FAIL [ 1.677s] (267/483) gammalooprs graph::feynman_graph::tests::native_thermal_distributions
  935. 51.84 s > stdout ---
  936. 51.84 s >
  937. 51.84 s > running 1 test
  938. 51.84 s > test graph::feynman_graph::tests::native_thermal_distributions ... FAILED
  939. 51.84 s >
  940. 51.84 s > failures:
  941. 51.84 s >
  942. 51.84 s > failures:
  943. 51.84 s > graph::feynman_graph::tests::native_thermal_distributions
  944. 51.84 s >
  945. 51.84 s > test result: FAILED. 0 passed; 1 failed; 0 ignored; 0 measured; 535 filtered out; finished in 1.65s
  946. 51.84 s >
  947. 51.84 s > stderr ---
  948. 51.84 s > The application panicked (crashed).
  949. 51.84 s > Message: called `Result::unwrap()` on an `Err` value: Custom { kind: Other, error: "Could not compile code: g++ -shared -O3 -fPIC -ffast-math -funsafe-math-optimizations -march=native -o /build/gammaloop-native-thermal-1338/thermal_0_0.so /build/gammaloop-native-thermal-1338/thermal_0_0.cpp\nwarning: Skipping impure flag -march=native because NIX_ENFORCE_NO_NATIVE is set\n/build/gammaloop-native-thermal-1338/thermal_0_0.cpp: In function 'void thermal_realf64(const double*, double*, double*)':\n/build/gammaloop-native-thermal-1338/thermal_0_0.cpp:27:16: error: 'symbolica_tanh' was not declared in this scope\n 27 | Z[6] = symbolica_tanh(Z[6]);\n | ^~~~~~~~~~~~~~\n" }
  950. 51.84 s > Location: crates/gammalooprs/src/graph/feynman_graph.rs:937
  951. 51.84 s >
  952. 51.84 s > ━━━━━━━━━━━━━━━━━━━━━━━━━━━━━━━━━━ BACKTRACE ━━━━━━━━━━━━━━━━━━━━━━━━━━━━━━━━━━━
  953. 51.84 s > 1: <color_eyre[b0c9e66060e883b2]::config::PanicHook>::panic_report<unknown>
  954. 51.84 s > at <unknown source file>:<unknown line>
  955. 51.84 s > 2: <color_eyre[b0c9e66060e883b2]::config::PanicHook>::into_panic_hook::{closure#0}<unknown>
  956. 51.84 s > at <unknown source file>:<unknown line>
  957. 51.84 s > 3: std[bcb96dfbba0ab899]::panicking::panic_with_hook<unknown>
  958. 51.84 s > at <unknown source file>:<unknown line>
  959. 51.84 s > 4: std[bcb96dfbba0ab899]::panicking::panic_handler::{closure#0}<unknown>
  960. 51.84 s > at <unknown source file>:<unknown line>
  961. 51.84 s > 5: std[bcb96dfbba0ab899]::sys::backtrace::__rust_end_short_backtrace::<std[bcb96dfbba0ab899]::panicking::panic_handler::{closure#0}, !><unknown>
  962. 51.84 s > at <unknown source file>:<unknown line>
  963. 51.84 s > 6: __rustc[6c289b9f9c454d21]::rust_begin_unwind<unknown>
  964. 51.84 s > at <unknown source file>:<unknown line>
  965. 51.84 s > 7: core[940e698046960fd5]::panicking::panic_fmt<unknown>
  966. 51.84 s > at <unknown source file>:<unknown line>
  967. 51.84 s > 8: core[940e698046960fd5]::result::unwrap_failed<unknown>
  968. 51.84 s > at <unknown source file>:<unknown line>
  969. 51.84 s > 9: gammalooprs[5490727360442cce]::graph::feynman_graph::tests::native_thermal_distributions<unknown>
  970. 51.84 s > at <unknown source file>:<unknown line>
  971. 51.84 s > 10: <gammalooprs[5490727360442cce]::graph::feynman_graph::tests::native_thermal_distributions::{closure#0} as core[940e698046960fd5]::ops::function::FnOnce<()>>::call_once<unknown>
  972. 51.84 s > at <unknown source file>:<unknown line>
  973. 51.84 s > 11: test[75d6903177b1d7e9]::__rust_begin_short_backtrace::<core[940e698046960fd5]::result::Result<(), alloc[2ea6bcb46fca0c42]::string::String>, fn() -> core[940e698046960fd5]::result::Result<(), alloc[2ea6bcb46fca0c42]::string::String>><unknown>
  974. 51.84 s > at <unknown source file>:<unknown line>
  975. 51.84 s > 12: test[75d6903177b1d7e9]::run_test::{closure#0}<unknown>
  976. 51.84 s > at <unknown source file>:<unknown line>
  977. 51.84 s > 13: std[bcb96dfbba0ab899]::sys::backtrace::__rust_begin_short_backtrace::<test[75d6903177b1d7e9]::run_test::{closure#1}, ()><unknown>
  978. 51.84 s > at <unknown source file>:<unknown line>
  979. 51.84 s > 14: <std[bcb96dfbba0ab899]::thread::lifecycle::spawn_unchecked<test[75d6903177b1d7e9]::run_test::{closure#1}, ()>::{closure#1} as core[940e698046960fd5]::ops::function::FnOnce<()>>::call_once::{shim:vtable#0}<unknown>
  980. 51.84 s > at <unknown source file>:<unknown line>
  981. 51.84 s > 15: <std[bcb96dfbba0ab899]::sys::thread::unix::Thread>::new::thread_start<unknown>
  982. 51.84 s > at <unknown source file>:<unknown line>
  983. 51.84 s > 16: start_thread<unknown>
  984. 51.84 s > at <unknown source file>:<unknown line>
  985. 51.84 s > 17: __clone3<unknown>
  986. 51.84 s > at <unknown source file>:<unknown line>
  987. 51.84 s >
  988. 51.84 s > Run with COLORBT_SHOW_HIDDEN=1 environment variable to disable frame filtering.
  989. 51.84 s > Run with RUST_BACKTRACE=full to include source snippets.
  990. 51.84 s >
  991. 51.84 s > FAIL [ 21.254s] (481/483) gammalooprs cff::generation::tests_cff::thermal_bugblatter
  992. 51.84 s > stdout ---
  993. 51.84 s >
  994. 51.84 s > running 1 test
  995. 51.84 s > test cff::generation::tests_cff::thermal_bugblatter ... FAILED
  996. 51.84 s >
  997. 51.84 s > failures:
  998. 51.84 s >
  999. 51.84 s > failures:
  1000. 51.84 s > cff::generation::tests_cff::thermal_bugblatter
  1001. 51.84 s >
  1002. 51.84 s > test result: FAILED. 0 passed; 1 failed; 0 ignored; 0 measured; 535 filtered out; finished in 21.15s
  1003. 51.84 s >
  1004. 51.84 s > stderr ---
  1005. 51.84 s >
  1006. 51.84 s > thread 'cff::generation::tests_cff::thermal_bugblatter' (1276) panicked at /nix/store/1sigmg52bb61pfngmk9k8wq5fz9r7bf1-vendor-cargo-deps/5929dab090e556a579e9f3b708cd2e67c60b3d84a12b5a276f2a36cb00473133/symbolica-2.2.0/src/evaluate/evaluator.rs:295:21:
  1007. 51.84 s > External function 'symbolica_coth' does not have an implementation for gammalooprs::utils::F<f64>
  1008. 51.84 s > stack backtrace:
  1009. 51.84 s > 0: __rustc::rust_begin_unwind
  1010. 51.84 s > 1: core::panicking::panic_fmt
  1011. 51.84 s > 2: <symbolica::evaluate::evaluator::ExpressionEvaluator<gammalooprs::utils::F<f64>>>::evaluate_impl_no_ops
  1012. 51.84 s > 3: <symbolica::evaluate::evaluator::ExpressionEvaluator<gammalooprs::utils::F<f64>>>::evaluate_single
  1013. 51.84 s > 4: gammalooprs::cff::generation::tests_cff::thermal_bugblatter
  1014. 51.84 s > 5: <gammalooprs::cff::generation::tests_cff::thermal_bugblatter::{closure#0} as core::ops::function::FnOnce<()>>::call_once
  1015. 51.84 s > note: Some details are omitted, run with `RUST_BACKTRACE=full` for a verbose backtrace.
  1016. 51.84 s >
  1017. 51.84 s > ------------
  1018. 51.84 s > Summary [ 23.811s] 483 tests run: 476 passed, 7 failed, 61 skipped
  1019. 51.84 s > FAIL [ 0.024s] ( 43/483) gammalooprs cff::generation::tests_cff::thermal_bubble_chain
  1020. 51.84 s > stdout ---
  1021. 51.84 s >
  1022. 51.84 s > running 1 test
  1023. 51.84 s > test cff::generation::tests_cff::thermal_bubble_chain ... FAILED
  1024. 51.84 s >
  1025. 51.84 s > failures:
  1026. 51.84 s >
  1027. 51.84 s > failures:
  1028. 51.84 s > cff::generation::tests_cff::thermal_bubble_chain
  1029. 51.84 s >
  1030. 51.84 s > test result: FAILED. 0 passed; 1 failed; 0 ignored; 0 measured; 535 filtered out; finished in 0.01s
  1031. 51.84 s >
  1032. 51.84 s > stderr ---
  1033. 51.84 s >
  1034. 51.84 s > thread 'cff::generation::tests_cff::thermal_bubble_chain' (1271) panicked at /nix/store/1sigmg52bb61pfngmk9k8wq5fz9r7bf1-vendor-cargo-deps/5929dab090e556a579e9f3b708cd2e67c60b3d84a12b5a276f2a36cb00473133/symbolica-2.2.0/src/evaluate/evaluator.rs:295:21:
  1035. 51.84 s > External function 'symbolica_coth' does not have an implementation for gammalooprs::utils::F<f64>
  1036. 51.84 s > stack backtrace:
  1037. 51.84 s > 0: __rustc::rust_begin_unwind
  1038. 51.84 s > 1: core::panicking::panic_fmt
  1039. 51.84 s > 2: <symbolica::evaluate::evaluator::ExpressionEvaluator<gammalooprs::utils::F<f64>>>::evaluate_impl_no_ops
  1040. 51.84 s > 3: <symbolica::evaluate::evaluator::ExpressionEvaluator<gammalooprs::utils::F<f64>>>::evaluate_single
  1041. 51.84 s > 4: gammalooprs::cff::generation::tests_cff::thermal_bubble_chain
  1042. 51.84 s > 5: <gammalooprs::cff::generation::tests_cff::thermal_bubble_chain::{closure#0} as core::ops::function::FnOnce<()>>::call_once
  1043. 51.84 s > note: Some details are omitted, run with `RUST_BACKTRACE=full` for a verbose backtrace.
  1044. 51.84 s >
  1045. 51.84 s > FAIL [ 0.028s] ( 46/483) gammalooprs cff::generation::tests_cff::thermal_bubble
  1046. 51.84 s > stdout ---
  1047. 51.84 s >
  1048. 51.84 s > running 1 test
  1049. 51.84 s > test cff::generation::tests_cff::thermal_bubble ... FAILED
  1050. 51.84 s >
  1051. 51.84 s > failures:
  1052. 51.84 s >
  1053. 51.84 s > failures:
  1054. 51.84 s > cff::generation::tests_cff::thermal_bubble
  1055. 51.84 s >
  1056. 51.84 s > test result: FAILED. 0 passed; 1 failed; 0 ignored; 0 measured; 535 filtered out; finished in 0.01s
  1057. 51.84 s >
  1058. 51.84 s > stderr ---
  1059. 51.84 s >
  1060. 51.84 s > thread 'cff::generation::tests_cff::thermal_bubble' (1282) panicked at /nix/store/1sigmg52bb61pfngmk9k8wq5fz9r7bf1-vendor-cargo-deps/5929dab090e556a579e9f3b708cd2e67c60b3d84a12b5a276f2a36cb00473133/symbolica-2.2.0/src/evaluate/evaluator.rs:295:21:
  1061. 51.84 s > External function 'symbolica_coth' does not have an implementation for gammalooprs::utils::F<f64>
  1062. 51.84 s > stack backtrace:
  1063. 51.84 s > 0: __rustc::rust_begin_unwind
  1064. 51.84 s > 1: core::panicking::panic_fmt
  1065. 51.84 s > 2: <symbolica::evaluate::evaluator::ExpressionEvaluator<gammalooprs::utils::F<f64>>>::evaluate_impl_no_ops
  1066. 51.84 s > 3: <symbolica::evaluate::evaluator::ExpressionEvaluator<gammalooprs::utils::F<f64>>>::evaluate_single
  1067. 51.84 s > 4: gammalooprs::cff::generation::tests_cff::thermal_bubble
  1068. 51.84 s > 5: <gammalooprs::cff::generation::tests_cff::thermal_bubble::{closure#0} as core::ops::function::FnOnce<()>>::call_once
  1069. 51.84 s > note: Some details are omitted, run with `RUST_BACKTRACE=full` for a verbose backtrace.
  1070. 51.84 s >
  1071. 51.84 s > FAIL [ 0.032s] ( 48/483) gammalooprs cff::generation::tests_cff::thermal_eight
  1072. 51.84 s > stdout ---
  1073. 51.84 s >
  1074. 51.84 s > running 1 test
  1075. 51.84 s > test cff::generation::tests_cff::thermal_eight ... FAILED
  1076. 51.84 s >
  1077. 51.84 s > failures:
  1078. 51.84 s >
  1079. 51.84 s > failures:
  1080. 51.84 s > cff::generation::tests_cff::thermal_eight
  1081. 51.84 s >
  1082. 51.84 s > test result: FAILED. 0 passed; 1 failed; 0 ignored; 0 measured; 535 filtered out; finished in 0.02s
  1083. 51.84 s >
  1084. 51.84 s > stderr ---
  1085. 51.84 s >
  1086. 51.84 s > thread 'cff::generation::tests_cff::thermal_eight' (1281) panicked at /nix/store/1sigmg52bb61pfngmk9k8wq5fz9r7bf1-vendor-cargo-deps/5929dab090e556a579e9f3b708cd2e67c60b3d84a12b5a276f2a36cb00473133/symbolica-2.2.0/src/evaluate/evaluator.rs:295:21:
  1087. 51.84 s > External function 'symbolica_coth' does not have an implementation for gammalooprs::utils::F<f64>
  1088. 51.84 s > stack backtrace:
  1089. 51.84 s > 0: __rustc::rust_begin_unwind
  1090. 51.84 s > 1: core::panicking::panic_fmt
  1091. 51.84 s > 2: <symbolica::evaluate::evaluator::ExpressionEvaluator<gammalooprs::utils::F<f64>>>::evaluate_impl_no_ops
  1092. 51.84 s > 3: <symbolica::evaluate::evaluator::ExpressionEvaluator<gammalooprs::utils::F<f64>>>::evaluate_single
  1093. 51.84 s > 4: gammalooprs::cff::generation::tests_cff::thermal_eight
  1094. 51.84 s > 5: <gammalooprs::cff::generation::tests_cff::thermal_eight::{closure#0} as core::ops::function::FnOnce<()>>::call_once
  1095. 51.84 s > note: Some details are omitted, run with `RUST_BACKTRACE=full` for a verbose backtrace.
  1096. 51.84 s >
  1097. 51.84 s > FAIL [ 0.074s] ( 72/483) gammalooprs cff::generation::tests_cff::thermal_ring
  1098. 51.84 s > stdout ---
  1099. 51.84 s >
  1100. 51.84 s > running 1 test
  1101. 51.84 s > test cff::generation::tests_cff::thermal_ring ... FAILED
  1102. 51.84 s >
  1103. 51.84 s > failures:
  1104. 51.84 s >
  1105. 51.84 s > failures:
  1106. 51.84 s > cff::generation::tests_cff::thermal_ring
  1107. 51.84 s >
  1108. 51.84 s > test result: FAILED. 0 passed; 1 failed; 0 ignored; 0 measured; 535 filtered out; finished in 0.05s
  1109. 51.84 s >
  1110. 51.84 s > stderr ---
  1111. 51.84 s >
  1112. 51.84 s > thread 'cff::generation::tests_cff::thermal_ring' (1300) panicked at /nix/store/1sigmg52bb61pfngmk9k8wq5fz9r7bf1-vendor-cargo-deps/5929dab090e556a579e9f3b708cd2e67c60b3d84a12b5a276f2a36cb00473133/symbolica-2.2.0/src/evaluate/evaluator.rs:295:21:
  1113. 51.84 s > External function 'symbolica_coth' does not have an implementation for gammalooprs::utils::F<f64>
  1114. 51.84 s > stack backtrace:
  1115. 51.84 s > 0: __rustc::rust_begin_unwind
  1116. 51.84 s > 1: core::panicking::panic_fmt
  1117. 51.84 s > 2: <symbolica::evaluate::evaluator::ExpressionEvaluator<gammalooprs::utils::F<f64>>>::evaluate_impl_no_ops
  1118. 51.84 s > 3: <symbolica::evaluate::evaluator::ExpressionEvaluator<gammalooprs::utils::F<f64>>>::evaluate_single
  1119. 51.84 s > 4: gammalooprs::cff::generation::tests_cff::thermal_ring
  1120. 51.84 s > 5: <gammalooprs::cff::generation::tests_cff::thermal_ring::{closure#0} as core::ops::function::FnOnce<()>>::call_once
  1121. 51.84 s > note: Some details are omitted, run with `RUST_BACKTRACE=full` for a verbose backtrace.
  1122. 51.84 s >
  1123. 51.84 s > FAIL [ 0.461s] ( 87/483) gammalooprs cff::generation::tests_cff::thermal_mercedes
  1124. 51.84 s > stdout ---
  1125. 51.84 s >
  1126. 51.84 s > running 1 test
  1127. 51.84 s > test cff::generation::tests_cff::thermal_mercedes ... FAILED
  1128. 51.84 s >
  1129. 51.84 s > failures:
  1130. 51.84 s >
  1131. 51.84 s > failures:
  1132. 51.84 s > cff::generation::tests_cff::thermal_mercedes
  1133. 51.84 s >
  1134. 51.84 s > test result: FAILED. 0 passed; 1 failed; 0 ignored; 0 measured; 535 filtered out; finished in 0.43s
  1135. 51.84 s >
  1136. 51.84 s > stderr ---
  1137. 51.84 s >
  1138. 51.84 s > thread 'cff::generation::tests_cff::thermal_mercedes' (1296) panicked at /nix/store/1sigmg52bb61pfngmk9k8wq5fz9r7bf1-vendor-cargo-deps/5929dab090e556a579e9f3b708cd2e67c60b3d84a12b5a276f2a36cb00473133/symbolica-2.2.0/src/evaluate/evaluator.rs:295:21:
  1139. 51.84 s > External function 'symbolica_coth' does not have an implementation for gammalooprs::utils::F<f64>
  1140. 51.84 s > stack backtrace:
  1141. 51.84 s > 0: __rustc::rust_begin_unwind
  1142. 51.84 s > 1: core::panicking::panic_fmt
  1143. 51.84 s > 2: <symbolica::evaluate::evaluator::ExpressionEvaluator<gammalooprs::utils::F<f64>>>::evaluate_impl_no_ops
  1144. 51.84 s > 3: <symbolica::evaluate::evaluator::ExpressionEvaluator<gammalooprs::utils::F<f64>>>::evaluate_single
  1145. 51.84 s > 4: gammalooprs::cff::generation::tests_cff::thermal_mercedes
  1146. 51.84 s > 5: <gammalooprs::cff::generation::tests_cff::thermal_mercedes::{closure#0} as core::ops::function::FnOnce<()>>::call_once
  1147. 51.84 s > note: Some details are omitted, run with `RUST_BACKTRACE=full` for a verbose backtrace.
  1148. 51.84 s >
  1149. 51.84 s > FAIL [ 1.677s] (267/483) gammalooprs graph::feynman_graph::tests::native_thermal_distributions
  1150. 51.84 s > stdout ---
  1151. 51.84 s >
  1152. 51.84 s > running 1 test
  1153. 51.84 s > test graph::feynman_graph::tests::native_thermal_distributions ... FAILED
  1154. 51.84 s >
  1155. 51.84 s > failures:
  1156. 51.84 s >
  1157. 51.84 s > failures:
  1158. 51.84 s > graph::feynman_graph::tests::native_thermal_distributions
  1159. 51.84 s >
  1160. 51.84 s > test result: FAILED. 0 passed; 1 failed; 0 ignored; 0 measured; 535 filtered out; finished in 1.65s
  1161. 51.84 s >
  1162. 51.84 s > stderr ---
  1163. 51.84 s > The application panicked (crashed).
  1164. 51.84 s > Message: called `Result::unwrap()` on an `Err` value: Custom { kind: Other, error: "Could not compile code: g++ -shared -O3 -fPIC -ffast-math -funsafe-math-optimizations -march=native -o /build/gammaloop-native-thermal-1338/thermal_0_0.so /build/gammaloop-native-thermal-1338/thermal_0_0.cpp\nwarning: Skipping impure flag -march=native because NIX_ENFORCE_NO_NATIVE is set\n/build/gammaloop-native-thermal-1338/thermal_0_0.cpp: In function 'void thermal_realf64(const double*, double*, double*)':\n/build/gammaloop-native-thermal-1338/thermal_0_0.cpp:27:16: error: 'symbolica_tanh' was not declared in this scope\n 27 | Z[6] = symbolica_tanh(Z[6]);\n | ^~~~~~~~~~~~~~\n" }
  1165. 51.84 s > Location: crates/gammalooprs/src/graph/feynman_graph.rs:937
  1166. 51.84 s >
  1167. 51.84 s > ━━━━━━━━━━━━━━━━━━━━━━━━━━━━━━━━━━ BACKTRACE ━━━━━━━━━━━━━━━━━━━━━━━━━━━━━━━━━━━
  1168. 51.84 s > 1: <color_eyre[b0c9e66060e883b2]::config::PanicHook>::panic_report<unknown>
  1169. 51.84 s > at <unknown source file>:<unknown line>
  1170. 51.84 s > 2: <color_eyre[b0c9e66060e883b2]::config::PanicHook>::into_panic_hook::{closure#0}<unknown>
  1171. 51.84 s > at <unknown source file>:<unknown line>
  1172. 51.84 s > 3: std[bcb96dfbba0ab899]::panicking::panic_with_hook<unknown>
  1173. 51.84 s > at <unknown source file>:<unknown line>
  1174. 51.84 s > 4: std[bcb96dfbba0ab899]::panicking::panic_handler::{closure#0}<unknown>
  1175. 51.84 s > at <unknown source file>:<unknown line>
  1176. 51.84 s > 5: std[bcb96dfbba0ab899]::sys::backtrace::__rust_end_short_backtrace::<std[bcb96dfbba0ab899]::panicking::panic_handler::{closure#0}, !><unknown>
  1177. 51.84 s > at <unknown source file>:<unknown line>
  1178. 51.84 s > 6: __rustc[6c289b9f9c454d21]::rust_begin_unwind<unknown>
  1179. 51.84 s > at <unknown source file>:<unknown line>
  1180. 51.84 s > 7: core[940e698046960fd5]::panicking::panic_fmt<unknown>
  1181. 51.84 s > at <unknown source file>:<unknown line>
  1182. 51.84 s > 8: core[940e698046960fd5]::result::unwrap_failed<unknown>
  1183. 51.84 s > at <unknown source file>:<unknown line>
  1184. 51.84 s > 9: gammalooprs[5490727360442cce]::graph::feynman_graph::tests::native_thermal_distributions<unknown>
  1185. 51.84 s > at <unknown source file>:<unknown line>
  1186. 51.84 s > 10: <gammalooprs[5490727360442cce]::graph::feynman_graph::tests::native_thermal_distributions::{closure#0} as core[940e698046960fd5]::ops::function::FnOnce<()>>::call_once<unknown>
  1187. 51.84 s > at <unknown source file>:<unknown line>
  1188. 51.84 s > 11: test[75d6903177b1d7e9]::__rust_begin_short_backtrace::<core[940e698046960fd5]::result::Result<(), alloc[2ea6bcb46fca0c42]::string::String>, fn() -> core[940e698046960fd5]::result::Result<(), alloc[2ea6bcb46fca0c42]::string::String>><unknown>
  1189. 51.84 s > at <unknown source file>:<unknown line>
  1190. 51.84 s > 12: test[75d6903177b1d7e9]::run_test::{closure#0}<unknown>
  1191. 51.84 s > at <unknown source file>:<unknown line>
  1192. 51.84 s > 13: std[bcb96dfbba0ab899]::sys::backtrace::__rust_begin_short_backtrace::<test[75d6903177b1d7e9]::run_test::{closure#1}, ()><unknown>
  1193. 51.84 s > at <unknown source file>:<unknown line>
  1194. 51.84 s > 14: <std[bcb96dfbba0ab899]::thread::lifecycle::spawn_unchecked<test[75d6903177b1d7e9]::run_test::{closure#1}, ()>::{closure#1} as core[940e698046960fd5]::ops::function::FnOnce<()>>::call_once::{shim:vtable#0}<unknown>
  1195. 51.84 s > at <unknown source file>:<unknown line>
  1196. 51.84 s > 15: <std[bcb96dfbba0ab899]::sys::thread::unix::Thread>::new::thread_start<unknown>
  1197. 51.84 s > at <unknown source file>:<unknown line>
  1198. 51.84 s > 16: start_thread<unknown>
  1199. 51.84 s > at <unknown source file>:<unknown line>
  1200. 51.84 s > 17: __clone3<unknown>
  1201. 51.84 s > at <unknown source file>:<unknown line>
  1202. 51.84 s >
  1203. 51.84 s > Run with COLORBT_SHOW_HIDDEN=1 environment variable to disable frame filtering.
  1204. 51.84 s > Run with RUST_BACKTRACE=full to include source snippets.
  1205. 51.84 s >
  1206. 51.84 s > FAIL [ 21.254s] (481/483) gammalooprs cff::generation::tests_cff::thermal_bugblatter
  1207. 51.84 s > stdout ---
  1208. 51.84 s >
  1209. 51.84 s > running 1 test
  1210. 51.84 s > test cff::generation::tests_cff::thermal_bugblatter ... FAILED
  1211. 51.84 s >
  1212. 51.84 s > failures:
  1213. 51.84 s >
  1214. 51.84 s > failures:
  1215. 51.84 s > cff::generation::tests_cff::thermal_bugblatter
  1216. 51.84 s >
  1217. 51.84 s > test result: FAILED. 0 passed; 1 failed; 0 ignored; 0 measured; 535 filtered out; finished in 21.15s
  1218. 51.84 s >
  1219. 51.84 s > stderr ---
  1220. 51.84 s >
  1221. 51.84 s > thread 'cff::generation::tests_cff::thermal_bugblatter' (1276) panicked at /nix/store/1sigmg52bb61pfngmk9k8wq5fz9r7bf1-vendor-cargo-deps/5929dab090e556a579e9f3b708cd2e67c60b3d84a12b5a276f2a36cb00473133/symbolica-2.2.0/src/evaluate/evaluator.rs:295:21:
  1222. 51.84 s > External function 'symbolica_coth' does not have an implementation for gammalooprs::utils::F<f64>
  1223. 51.84 s > stack backtrace:
  1224. 51.84 s > 0: __rustc::rust_begin_unwind
  1225. 51.84 s > 1: core::panicking::panic_fmt
  1226. 51.84 s > 2: <symbolica::evaluate::evaluator::ExpressionEvaluator<gammalooprs::utils::F<f64>>>::evaluate_impl_no_ops
  1227. 51.84 s > 3: <symbolica::evaluate::evaluator::ExpressionEvaluator<gammalooprs::utils::F<f64>>>::evaluate_single
  1228. 51.84 s > 4: gammalooprs::cff::generation::tests_cff::thermal_bugblatter
  1229. 51.84 s > 5: <gammalooprs::cff::generation::tests_cff::thermal_bugblatter::{closure#0} as core::ops::function::FnOnce<()>>::call_once
  1230. 51.84 s > note: Some details are omitted, run with `RUST_BACKTRACE=full` for a verbose backtrace.
  1231. 51.84 s >
  1232. 51.84 s > error: test run failed
  1233. 51.84 s >
  1234. 51.84 s > ========== nextest test summary ==========
  1235. 51.84 s > report: target/nextest/ci_gammaloop/junit.xml
  1236. 51.84 s > tests: 483, failures: 7, errors: 0
  1237. 51.84 s >
  1238. 51.84 s > 1. gammalooprs::cff::generation::tests_cff::thermal_bubble_chain
  1239. 51.84 s > failure: test failure with exit code 101
  1240. 51.84 s > thread 'cff::generation::tests_cff::thermal_bubble_chain' (1271) panicked at /nix/store/1sigmg52bb61pfngmk9k8wq5fz9r7bf1-vendor-cargo-deps/5929dab090e556a579e9f3b708cd2e67c60b3d84a12b5a276f2a36cb00473133/symbolica-2.2.0/src/evaluate/evaluator.rs:295:21:
  1241. 51.84 s > External function 'symbolica_coth' does not have an implementation for gammalooprs::utils::F<f64>
  1242. 51.84 s > stack backtrace:
  1243. 51.84 s > 0: __rustc::rust_begin_unwind
  1244. 51.84 s > 1: core::panicking::panic_fmt
  1245. 51.84 s > 2: <symbolica::evaluate::evaluator::ExpressionEvaluator<gammalooprs::utils::F<f64>>>::evaluate_impl_no_ops
  1246. 51.84 s > 3: <symbolica::evaluate::evaluator::ExpressionEvaluator<gammalooprs::utils::F<f64>>>::evaluate_single
  1247. 51.84 s > 4: gammalooprs::cff::generation::tests_cff::thermal_bubble_chain
  1248. 51.84 s > 5: <gammalooprs::cff::generation::tests_cff::thermal_bubble_chain::{closure#0} as core::ops::function::FnOnce<()>>::call_once
  1249. 51.84 s > note: Some details are omitted, run with `RUST_BACKTRACE=full` for a verbose backtrace.
  1250. 51.84 s > system-out
  1251. 51.84 s > running 1 test
  1252. 51.84 s > test cff::generation::tests_cff::thermal_bubble_chain ... FAILED
  1253. 51.84 s >
  1254. 51.84 s > failures:
  1255. 51.84 s >
  1256. 51.84 s > failures:
  1257. 51.84 s > cff::generation::tests_cff::thermal_bubble_chain
  1258. 51.84 s >
  1259. 51.84 s > test result: FAILED. 0 passed; 1 failed; 0 ignored; 0 measured; 535 filtered out; finished in 0.01s
  1260. 51.84 s > system-err
  1261. 51.84 s > thread 'cff::generation::tests_cff::thermal_bubble_chain' (1271) panicked at /nix/store/1sigmg52bb61pfngmk9k8wq5fz9r7bf1-vendor-cargo-deps/5929dab090e556a579e9f3b708cd2e67c60b3d84a12b5a276f2a36cb00473133/symbolica-2.2.0/src/evaluate/evaluator.rs:295:21:
  1262. 51.84 s > External function 'symbolica_coth' does not have an implementation for gammalooprs::utils::F<f64>
  1263. 51.84 s > stack backtrace:
  1264. 51.84 s > 0: __rustc::rust_begin_unwind
  1265. 51.84 s > 1: core::panicking::panic_fmt
  1266. 51.84 s > 2: <symbolica::evaluate::evaluator::ExpressionEvaluator<gammalooprs::utils::F<f64>>>::evaluate_impl_no_ops
  1267. 51.84 s > 3: <symbolica::evaluate::evaluator::ExpressionEvaluator<gammalooprs::utils::F<f64>>>::evaluate_single
  1268. 51.84 s > 4: gammalooprs::cff::generation::tests_cff::thermal_bubble_chain
  1269. 51.84 s > 5: <gammalooprs::cff::generation::tests_cff::thermal_bubble_chain::{closure#0} as core::ops::function::FnOnce<()>>::call_once
  1270. 51.84 s > note: Some details are omitted, run with `RUST_BACKTRACE=full` for a verbose backtrace.
  1271. 51.84 s >
  1272. 51.84 s > 2. gammalooprs::cff::generation::tests_cff::thermal_bubble
  1273. 51.84 s > failure: test failure with exit code 101
  1274. 51.84 s > thread 'cff::generation::tests_cff::thermal_bubble' (1282) panicked at /nix/store/1sigmg52bb61pfngmk9k8wq5fz9r7bf1-vendor-cargo-deps/5929dab090e556a579e9f3b708cd2e67c60b3d84a12b5a276f2a36cb00473133/symbolica-2.2.0/src/evaluate/evaluator.rs:295:21:
  1275. 51.84 s > External function 'symbolica_coth' does not have an implementation for gammalooprs::utils::F<f64>
  1276. 51.84 s > stack backtrace:
  1277. 51.84 s > 0: __rustc::rust_begin_unwind
  1278. 51.84 s > 1: core::panicking::panic_fmt
  1279. 51.84 s > 2: <symbolica::evaluate::evaluator::ExpressionEvaluator<gammalooprs::utils::F<f64>>>::evaluate_impl_no_ops
  1280. 51.84 s > 3: <symbolica::evaluate::evaluator::ExpressionEvaluator<gammalooprs::utils::F<f64>>>::evaluate_single
  1281. 51.84 s > 4: gammalooprs::cff::generation::tests_cff::thermal_bubble
  1282. 51.84 s > 5: <gammalooprs::cff::generation::tests_cff::thermal_bubble::{closure#0} as core::ops::function::FnOnce<()>>::call_once
  1283. 51.84 s > note: Some details are omitted, run with `RUST_BACKTRACE=full` for a verbose backtrace.
  1284. 51.84 s > system-out
  1285. 51.84 s > running 1 test
  1286. 51.84 s > test cff::generation::tests_cff::thermal_bubble ... FAILED
  1287. 51.84 s >
  1288. 51.84 s > failures:
  1289. 51.84 s >
  1290. 51.84 s > failures:
  1291. 51.84 s > cff::generation::tests_cff::thermal_bubble
  1292. 51.84 s >
  1293. 51.84 s > test result: FAILED. 0 passed; 1 failed; 0 ignored; 0 measured; 535 filtered out; finished in 0.01s
  1294. 51.84 s > system-err
  1295. 51.84 s > thread 'cff::generation::tests_cff::thermal_bubble' (1282) panicked at /nix/store/1sigmg52bb61pfngmk9k8wq5fz9r7bf1-vendor-cargo-deps/5929dab090e556a579e9f3b708cd2e67c60b3d84a12b5a276f2a36cb00473133/symbolica-2.2.0/src/evaluate/evaluator.rs:295:21:
  1296. 51.84 s > External function 'symbolica_coth' does not have an implementation for gammalooprs::utils::F<f64>
  1297. 51.84 s > stack backtrace:
  1298. 51.84 s > 0: __rustc::rust_begin_unwind
  1299. 51.84 s > 1: core::panicking::panic_fmt
  1300. 51.84 s > 2: <symbolica::evaluate::evaluator::ExpressionEvaluator<gammalooprs::utils::F<f64>>>::evaluate_impl_no_ops
  1301. 51.84 s > 3: <symbolica::evaluate::evaluator::ExpressionEvaluator<gammalooprs::utils::F<f64>>>::evaluate_single
  1302. 51.84 s > 4: gammalooprs::cff::generation::tests_cff::thermal_bubble
  1303. 51.84 s > 5: <gammalooprs::cff::generation::tests_cff::thermal_bubble::{closure#0} as core::ops::function::FnOnce<()>>::call_once
  1304. 51.84 s > note: Some details are omitted, run with `RUST_BACKTRACE=full` for a verbose backtrace.
  1305. 51.84 s >
  1306. 51.84 s > 3. gammalooprs::cff::generation::tests_cff::thermal_eight
  1307. 51.84 s > failure: test failure with exit code 101
  1308. 51.84 s > thread 'cff::generation::tests_cff::thermal_eight' (1281) panicked at /nix/store/1sigmg52bb61pfngmk9k8wq5fz9r7bf1-vendor-cargo-deps/5929dab090e556a579e9f3b708cd2e67c60b3d84a12b5a276f2a36cb00473133/symbolica-2.2.0/src/evaluate/evaluator.rs:295:21:
  1309. 51.84 s > External function 'symbolica_coth' does not have an implementation for gammalooprs::utils::F<f64>
  1310. 51.84 s > stack backtrace:
  1311. 51.84 s > 0: __rustc::rust_begin_unwind
  1312. 51.84 s > 1: core::panicking::panic_fmt
  1313. 51.84 s > 2: <symbolica::evaluate::evaluator::ExpressionEvaluator<gammalooprs::utils::F<f64>>>::evaluate_impl_no_ops
  1314. 51.84 s > 3: <symbolica::evaluate::evaluator::ExpressionEvaluator<gammalooprs::utils::F<f64>>>::evaluate_single
  1315. 51.84 s > 4: gammalooprs::cff::generation::tests_cff::thermal_eight
  1316. 51.84 s > 5: <gammalooprs::cff::generation::tests_cff::thermal_eight::{closure#0} as core::ops::function::FnOnce<()>>::call_once
  1317. 51.84 s > note: Some details are omitted, run with `RUST_BACKTRACE=full` for a verbose backtrace.
  1318. 51.84 s > system-out
  1319. 51.84 s > running 1 test
  1320. 51.84 s > test cff::generation::tests_cff::thermal_eight ... FAILED
  1321. 51.84 s >
  1322. 51.84 s > failures:
  1323. 51.84 s >
  1324. 51.84 s > failures:
  1325. 51.84 s > cff::generation::tests_cff::thermal_eight
  1326. 51.84 s >
  1327. 51.84 s > test result: FAILED. 0 passed; 1 failed; 0 ignored; 0 measured; 535 filtered out; finished in 0.02s
  1328. 51.84 s > system-err
  1329. 51.84 s > thread 'cff::generation::tests_cff::thermal_eight' (1281) panicked at /nix/store/1sigmg52bb61pfngmk9k8wq5fz9r7bf1-vendor-cargo-deps/5929dab090e556a579e9f3b708cd2e67c60b3d84a12b5a276f2a36cb00473133/symbolica-2.2.0/src/evaluate/evaluator.rs:295:21:
  1330. 51.84 s > External function 'symbolica_coth' does not have an implementation for gammalooprs::utils::F<f64>
  1331. 51.84 s > stack backtrace:
  1332. 51.84 s > 0: __rustc::rust_begin_unwind
  1333. 51.84 s > 1: core::panicking::panic_fmt
  1334. 51.84 s > 2: <symbolica::evaluate::evaluator::ExpressionEvaluator<gammalooprs::utils::F<f64>>>::evaluate_impl_no_ops
  1335. 51.84 s > 3: <symbolica::evaluate::evaluator::ExpressionEvaluator<gammalooprs::utils::F<f64>>>::evaluate_single
  1336. 51.84 s > 4: gammalooprs::cff::generation::tests_cff::thermal_eight
  1337. 51.84 s > 5: <gammalooprs::cff::generation::tests_cff::thermal_eight::{closure#0} as core::ops::function::FnOnce<()>>::call_once
  1338. 51.84 s > note: Some details are omitted, run with `RUST_BACKTRACE=full` for a verbose backtrace.
  1339. 51.84 s >
  1340. 51.84 s > 4. gammalooprs::cff::generation::tests_cff::thermal_ring
  1341. 51.84 s > failure: test failure with exit code 101
  1342. 51.84 s > thread 'cff::generation::tests_cff::thermal_ring' (1300) panicked at /nix/store/1sigmg52bb61pfngmk9k8wq5fz9r7bf1-vendor-cargo-deps/5929dab090e556a579e9f3b708cd2e67c60b3d84a12b5a276f2a36cb00473133/symbolica-2.2.0/src/evaluate/evaluator.rs:295:21:
  1343. 51.84 s > External function 'symbolica_coth' does not have an implementation for gammalooprs::utils::F<f64>
  1344. 51.84 s > stack backtrace:
  1345. 51.84 s > 0: __rustc::rust_begin_unwind
  1346. 51.84 s > 1: core::panicking::panic_fmt
  1347. 51.84 s > 2: <symbolica::evaluate::evaluator::ExpressionEvaluator<gammalooprs::utils::F<f64>>>::evaluate_impl_no_ops
  1348. 51.84 s > 3: <symbolica::evaluate::evaluator::ExpressionEvaluator<gammalooprs::utils::F<f64>>>::evaluate_single
  1349. 51.84 s > 4: gammalooprs::cff::generation::tests_cff::thermal_ring
  1350. 51.84 s > 5: <gammalooprs::cff::generation::tests_cff::thermal_ring::{closure#0} as core::ops::function::FnOnce<()>>::call_once
  1351. 51.84 s > note: Some details are omitted, run with `RUST_BACKTRACE=full` for a verbose backtrace.
  1352. 51.84 s > system-out
  1353. 51.84 s > running 1 test
  1354. 51.84 s > test cff::generation::tests_cff::thermal_ring ... FAILED
  1355. 51.84 s >
  1356. 51.84 s > failures:
  1357. 51.84 s >
  1358. 51.84 s > failures:
  1359. 51.84 s > cff::generation::tests_cff::thermal_ring
  1360. 51.84 s >
  1361. 51.84 s > test result: FAILED. 0 passed; 1 failed; 0 ignored; 0 measured; 535 filtered out; finished in 0.05s
  1362. 51.84 s > system-err
  1363. 51.84 s > thread 'cff::generation::tests_cff::thermal_ring' (1300) panicked at /nix/store/1sigmg52bb61pfngmk9k8wq5fz9r7bf1-vendor-cargo-deps/5929dab090e556a579e9f3b708cd2e67c60b3d84a12b5a276f2a36cb00473133/symbolica-2.2.0/src/evaluate/evaluator.rs:295:21:
  1364. 51.84 s > External function 'symbolica_coth' does not have an implementation for gammalooprs::utils::F<f64>
  1365. 51.84 s > stack backtrace:
  1366. 51.84 s > 0: __rustc::rust_begin_unwind
  1367. 51.84 s > 1: core::panicking::panic_fmt
  1368. 51.84 s > 2: <symbolica::evaluate::evaluator::ExpressionEvaluator<gammalooprs::utils::F<f64>>>::evaluate_impl_no_ops
  1369. 51.84 s > 3: <symbolica::evaluate::evaluator::ExpressionEvaluator<gammalooprs::utils::F<f64>>>::evaluate_single
  1370. 51.84 s > 4: gammalooprs::cff::generation::tests_cff::thermal_ring
  1371. 51.84 s > 5: <gammalooprs::cff::generation::tests_cff::thermal_ring::{closure#0} as core::ops::function::FnOnce<()>>::call_once
  1372. 51.84 s > note: Some details are omitted, run with `RUST_BACKTRACE=full` for a verbose backtrace.
  1373. 51.84 s >
  1374. 51.84 s > 5. gammalooprs::cff::generation::tests_cff::thermal_mercedes
  1375. 51.84 s > failure: test failure with exit code 101
  1376. 51.84 s > thread 'cff::generation::tests_cff::thermal_mercedes' (1296) panicked at /nix/store/1sigmg52bb61pfngmk9k8wq5fz9r7bf1-vendor-cargo-deps/5929dab090e556a579e9f3b708cd2e67c60b3d84a12b5a276f2a36cb00473133/symbolica-2.2.0/src/evaluate/evaluator.rs:295:21:
  1377. 51.84 s > External function 'symbolica_coth' does not have an implementation for gammalooprs::utils::F<f64>
  1378. 51.84 s > stack backtrace:
  1379. 51.84 s > 0: __rustc::rust_begin_unwind
  1380. 51.84 s > 1: core::panicking::panic_fmt
  1381. 51.84 s > 2: <symbolica::evaluate::evaluator::ExpressionEvaluator<gammalooprs::utils::F<f64>>>::evaluate_impl_no_ops
  1382. 51.84 s > 3: <symbolica::evaluate::evaluator::ExpressionEvaluator<gammalooprs::utils::F<f64>>>::evaluate_single
  1383. 51.84 s > 4: gammalooprs::cff::generation::tests_cff::thermal_mercedes
  1384. 51.84 s > 5: <gammalooprs::cff::generation::tests_cff::thermal_mercedes::{closure#0} as core::ops::function::FnOnce<()>>::call_once
  1385. 51.84 s > note: Some details are omitted, run with `RUST_BACKTRACE=full` for a verbose backtrace.
  1386. 51.84 s > system-out
  1387. 51.84 s > running 1 test
  1388. 51.84 s > test cff::generation::tests_cff::thermal_mercedes ... FAILED
  1389. 51.84 s >
  1390. 51.84 s > failures:
  1391. 51.84 s >
  1392. 51.84 s > failures:
  1393. 51.84 s > cff::generation::tests_cff::thermal_mercedes
  1394. 51.84 s >
  1395. 51.84 s > test result: FAILED. 0 passed; 1 failed; 0 ignored; 0 measured; 535 filtered out; finished in 0.43s
  1396. 51.84 s > system-err
  1397. 51.84 s > thread 'cff::generation::tests_cff::thermal_mercedes' (1296) panicked at /nix/store/1sigmg52bb61pfngmk9k8wq5fz9r7bf1-vendor-cargo-deps/5929dab090e556a579e9f3b708cd2e67c60b3d84a12b5a276f2a36cb00473133/symbolica-2.2.0/src/evaluate/evaluator.rs:295:21:
  1398. 51.84 s > External function 'symbolica_coth' does not have an implementation for gammalooprs::utils::F<f64>
  1399. 51.84 s > stack backtrace:
  1400. 51.84 s > 0: __rustc::rust_begin_unwind
  1401. 51.84 s > 1: core::panicking::panic_fmt
  1402. 51.84 s > 2: <symbolica::evaluate::evaluator::ExpressionEvaluator<gammalooprs::utils::F<f64>>>::evaluate_impl_no_ops
  1403. 51.84 s > 3: <symbolica::evaluate::evaluator::ExpressionEvaluator<gammalooprs::utils::F<f64>>>::evaluate_single
  1404. 51.84 s > 4: gammalooprs::cff::generation::tests_cff::thermal_mercedes
  1405. 51.84 s > 5: <gammalooprs::cff::generation::tests_cff::thermal_mercedes::{closure#0} as core::ops::function::FnOnce<()>>::call_once
  1406. 51.84 s > note: Some details are omitted, run with `RUST_BACKTRACE=full` for a verbose backtrace.
  1407. 51.84 s >
  1408. 51.84 s > 6. gammalooprs::graph::feynman_graph::tests::native_thermal_distributions
  1409. 51.84 s > failure: test failure with exit code 101
  1410. 51.84 s > system-out
  1411. 51.84 s > running 1 test
  1412. 51.84 s > test graph::feynman_graph::tests::native_thermal_distributions ... FAILED
  1413. 51.84 s >
  1414. 51.84 s > failures:
  1415. 51.84 s >
  1416. 51.84 s > failures:
  1417. 51.84 s > graph::feynman_graph::tests::native_thermal_distributions
  1418. 51.84 s >
  1419. 51.84 s > test result: FAILED. 0 passed; 1 failed; 0 ignored; 0 measured; 535 filtered out; finished in 1.65s
  1420. 51.84 s > system-err
  1421. 51.84 s > The application panicked (crashed).
  1422. 51.84 s > Message: called `Result::unwrap()` on an `Err` value: Custom { kind: Other, error: "Could not compile code: g++ -shared -O3 -fPIC -ffast-math -funsafe-math-optimizations -march=native -o /build/gammaloop-native-thermal-1338/thermal_0_0.so /build/gammaloop-native-thermal-1338/thermal_0_0.cpp\nwarning: Skipping impure flag -march=native because NIX_ENFORCE_NO_NATIVE is set\n/build/gammaloop-native-thermal-1338/thermal_0_0.cpp: In function 'void thermal_realf64(const double*, double*, double*)':\n/build/gammaloop-native-thermal-1338/thermal_0_0.cpp:27:16: error: 'symbolica_tanh' was not declared in this scope\n 27 | Z[6] = symbolica_tanh(Z[6]);\n | ^~~~~~~~~~~~~~\n" }
  1423. 51.84 s > Location: crates/gammalooprs/src/graph/feynman_graph.rs:937
  1424. 51.84 s >
  1425. 51.84 s > ━━━━━━━━━━━━━━━━━━━━━━━━━━━━━━━━━━ BACKTRACE ━━━━━━━━━━━━━━━━━━━━━━━━━━━━━━━━━━━
  1426. 51.84 s > 1: <color_eyre[b0c9e66060e883b2]::config::PanicHook>::panic_report<unknown>
  1427. 51.84 s > at <unknown source file>:<unknown line>
  1428. 51.84 s > 2: <color_eyre[b0c9e66060e883b2]::config::PanicHook>::into_panic_hook::{closure#0}<unknown>
  1429. 51.84 s > at <unknown source file>:<unknown line>
  1430. 51.84 s > 3: std[bcb96dfbba0ab899]::panicking::panic_with_hook<unknown>
  1431. 51.84 s > at <unknown source file>:<unknown line>
  1432. 51.84 s > 4: std[bcb96dfbba0ab899]::panicking::panic_handler::{closure#0}<unknown>
  1433. 51.84 s > at <unknown source file>:<unknown line>
  1434. 51.84 s > 5: std[bcb96dfbba0ab899]::sys::backtrace::__rust_end_short_backtrace::<std[bcb96dfbba0ab899]::panicking::panic_handler::{closure#0}, !><unknown>
  1435. 51.84 s > at <unknown source file>:<unknown line>
  1436. 51.84 s > 6: __rustc[6c289b9f9c454d21]::rust_begin_unwind<unknown>
  1437. 51.84 s > at <unknown source file>:<unknown line>
  1438. 51.84 s > 7: core[940e698046960fd5]::panicking::panic_fmt<unknown>
  1439. 51.84 s > at <unknown source file>:<unknown line>
  1440. 51.84 s > 8: core[940e698046960fd5]::result::unwrap_failed<unknown>
  1441. 51.84 s > at <unknown source file>:<unknown line>
  1442. 51.84 s > 9: gammalooprs[5490727360442cce]::graph::feynman_graph::tests::native_thermal_distributions<unknown>
  1443. 51.84 s > at <unknown source file>:<unknown line>
  1444. 51.84 s > 10: <gammalooprs[5490727360442cce]::graph::feynman_graph::tests::native_thermal_distributions::{closure#0} as core[940e698046960fd5]::ops::function::FnOnce<()>>::call_once<unknown>
  1445. 51.84 s > at <unknown source file>:<unknown line>
  1446. 51.84 s > 11: test[75d6903177b1d7e9]::__rust_begin_short_backtrace::<core[940e698046960fd5]::result::Result<(), alloc[2ea6bcb46fca0c42]::string::String>, fn() -> core[940e698046960fd5]::result::Result<(), alloc[2ea6bcb46fca0c42]::string::String>><unknown>
  1447. 51.84 s > at <unknown source file>:<unknown line>
  1448. 51.84 s > 12: test[75d6903177b1d7e9]::run_test::{closure#0}<unknown>
  1449. 51.84 s > at <unknown source file>:<unknown line>
  1450. 51.84 s > 13: std[bcb96dfbba0ab899]::sys::backtrace::__rust_begin_short_backtrace::<test[75d6903177b1d7e9]::run_test::{closure#1}, ()><unknown>
  1451. 51.84 s > at <unknown source file>:<unknown line>
  1452. 51.84 s > 14: <std[bcb96dfbba0ab899]::thread::lifecycle::spawn_unchecked<test[75d6903177b1d7e9]::run_test::{closure#1}, ()>::{closure#1} as core[940e698046960fd5]::ops::function::FnOnce<()>>::call_once::{shim:vtable#0}<unknown>
  1453. 51.84 s > at <unknown source file>:<unknown line>
  1454. 51.84 s > 15: <std[bcb96dfbba0ab899]::sys::thread::unix::Thread>::new::thread_start<unknown>
  1455. 51.84 s > at <unknown source file>:<unknown line>
  1456. 51.84 s > 16: start_thread<unknown>
  1457. 51.84 s > at <unknown source file>:<unknown line>
  1458. 51.84 s > 17: __clone3<unknown>
  1459. 51.84 s > at <unknown source file>:<unknown line>
  1460. 51.84 s >
  1461. 51.84 s > Run with COLORBT_SHOW_HIDDEN=1 environment variable to disable frame filtering.
  1462. 51.84 s > Run with RUST_BACKTRACE=full to include source snippets.
  1463. 51.84 s >
  1464. 51.84 s > 7. gammalooprs::cff::generation::tests_cff::thermal_bugblatter
  1465. 51.84 s > failure: test failure with exit code 101
  1466. 51.84 s > thread 'cff::generation::tests_cff::thermal_bugblatter' (1276) panicked at /nix/store/1sigmg52bb61pfngmk9k8wq5fz9r7bf1-vendor-cargo-deps/5929dab090e556a579e9f3b708cd2e67c60b3d84a12b5a276f2a36cb00473133/symbolica-2.2.0/src/evaluate/evaluator.rs:295:21:
  1467. 51.84 s > External function 'symbolica_coth' does not have an implementation for gammalooprs::utils::F<f64>
  1468. 51.84 s > stack backtrace:
  1469. 51.84 s > 0: __rustc::rust_begin_unwind
  1470. 51.84 s > 1: core::panicking::panic_fmt
  1471. 51.84 s > 2: <symbolica::evaluate::evaluator::ExpressionEvaluator<gammalooprs::utils::F<f64>>>::evaluate_impl_no_ops
  1472. 51.84 s > 3: <symbolica::evaluate::evaluator::ExpressionEvaluator<gammalooprs::utils::F<f64>>>::evaluate_single
  1473. 51.84 s > 4: gammalooprs::cff::generation::tests_cff::thermal_bugblatter
  1474. 51.85 s > 5: <gammalooprs::cff::generation::tests_cff::thermal_bugblatter::{closure#0} as core::ops::function::FnOnce<()>>::call_once
  1475. 51.85 s > note: Some details are omitted, run with `RUST_BACKTRACE=full` for a verbose backtrace.
  1476. 51.85 s > system-out
  1477. 51.85 s > running 1 test
  1478. 51.85 s > test cff::generation::tests_cff::thermal_bugblatter ... FAILED
  1479. 51.85 s >
  1480. 51.85 s > failures:
  1481. 51.85 s >
  1482. 51.85 s > failures:
  1483. 51.85 s > cff::generation::tests_cff::thermal_bugblatter
  1484. 51.85 s >
  1485. 51.85 s > test result: FAILED. 0 passed; 1 failed; 0 ignored; 0 measured; 535 filtered out; finished in 21.15s
  1486. 51.85 s > system-err
  1487. 51.85 s > thread 'cff::generation::tests_cff::thermal_bugblatter' (1276) panicked at /nix/store/1sigmg52bb61pfngmk9k8wq5fz9r7bf1-vendor-cargo-deps/5929dab090e556a579e9f3b708cd2e67c60b3d84a12b5a276f2a36cb00473133/symbolica-2.2.0/src/evaluate/evaluator.rs:295:21:
  1488. 51.85 s > External function 'symbolica_coth' does not have an implementation for gammalooprs::utils::F<f64>
  1489. 51.85 s > stack backtrace:
  1490. 51.85 s > 0: __rustc::rust_begin_unwind
  1491. 51.85 s > 1: core::panicking::panic_fmt
  1492. 51.85 s > 2: <symbolica::evaluate::evaluator::ExpressionEvaluator<gammalooprs::utils::F<f64>>>::evaluate_impl_no_ops
  1493. 51.85 s > 3: <symbolica::evaluate::evaluator::ExpressionEvaluator<gammalooprs::utils::F<f64>>>::evaluate_single
  1494. 51.85 s > 4: gammalooprs::cff::generation::tests_cff::thermal_bugblatter
  1495. 51.85 s > 5: <gammalooprs::cff::generation::tests_cff::thermal_bugblatter::{closure#0} as core::ops::function::FnOnce<()>>::call_once
  1496. 51.85 s > note: Some details are omitted, run with `RUST_BACKTRACE=full` for a verbose backtrace.
  1497. 51.85 s > =========================================
  1498. 51.85 s For full logs, run:
  1499. 51.85 s nix log /nix/store/4m6xcddxcb2ycplv2r6vd1qc57nv11md-gammaloop-nextest-core.drv
  1500. 52.19 s Run failed.