0.01 s
$ /nix/store/9ypz3flqsrl5xl495mm8h645gadjsxi1-coreutils-9.11/bin/timeout --kill-after=15s 7200s /nix/store/23zk8sgzamrbmj1fday15szf7f2279s8-nix-2.34.7/bin/nix --extra-experimental-features nix-command --extra-experimental-features flakes flake clone git+https://github.com/alphal00p/gammaloop --dest /tmp/nix-ci-worker/stable-pwd/repo/
0.11 s
Cloning into '/tmp/nix-ci-worker/stable-pwd/repo'...
0.91 s
remote: Enumerating objects: 78511, done.
1.02 s
remote: Counting objects: 0% (1/8005)
remote: Counting objects: 1% (81/8005)
remote: Counting objects: 2% (161/8005)
remote: Counting objects: 3% (241/8005)
remote: Counting objects: 4% (321/8005)
remote: Counting objects: 5% (401/8005)
remote: Counting objects: 6% (481/8005)
remote: Counting objects: 7% (561/8005)
remote: Counting objects: 8% (641/8005)
remote: Counting objects: 9% (721/8005)
remote: Counting objects: 10% (801/8005)
remote: Counting objects: 11% (881/8005)
remote: Counting objects: 12% (961/8005)
remote: Counting objects: 13% (1041/8005)
remote: Counting objects: 14% (1121/8005)
remote: Counting objects: 15% (1201/8005)
remote: Counting objects: 16% (1281/8005)
remote: Counting objects: 17% (1361/8005)
remote: Counting objects: 18% (1441/8005)
remote: Counting objects: 19% (1521/8005)
remote: Counting objects: 20% (1601/8005)
remote: Counting objects: 21% (1682/8005)
remote: Counting objects: 22% (1762/8005)
remote: Counting objects: 23% (1842/8005)
remote: Counting objects: 24% (1922/8005)
remote: Counting objects: 25% (2002/8005)
remote: Counting objects: 26% (2082/8005)
remote: Counting objects: 27% (2162/8005)
remote: Counting objects: 28% (2242/8005)
remote: Counting objects: 29% (2322/8005)
remote: Counting objects: 30% (2402/8005)
remote: Counting objects: 31% (2482/8005)
remote: Counting objects: 32% (2562/8005)
remote: Counting objects: 33% (2642/8005)
remote: Counting objects: 34% (2722/8005)
remote: Counting objects: 35% (2802/8005)
remote: Counting objects: 36% (2882/8005)
remote: Counting objects: 37% (2962/8005)
remote: Counting objects: 38% (3042/8005)
remote: Counting objects: 39% (3122/8005)
remote: Counting objects: 40% (3202/8005)
remote: Counting objects: 41% (3283/8005)
remote: Counting objects: 42% (3363/8005)
remote: Counting objects: 43% (3443/8005)
remote: Counting objects: 44% (3523/8005)
remote: Counting objects: 45% (3603/8005)
remote: Counting objects: 46% (3683/8005)
remote: Counting objects: 47% (3763/8005)
remote: Counting objects: 48% (3843/8005)
remote: Counting objects: 49% (3923/8005)
remote: Counting objects: 50% (4003/8005)
remote: Counting objects: 51% (4083/8005)
remote: Counting objects: 52% (4163/8005)
remote: Counting objects: 53% (4243/8005)
remote: Counting objects: 54% (4323/8005)
remote: Counting objects: 55% (4403/8005)
remote: Counting objects: 56% (4483/8005)
remote: Counting objects: 57% (4563/8005)
remote: Counting objects: 58% (4643/8005)
remote: Counting objects: 59% (4723/8005)
remote: Counting objects: 60% (4803/8005)
remote: Counting objects: 61% (4884/8005)
remote: Counting objects: 62% (4964/8005)
remote: Counting objects: 63% (5044/8005)
remote: Counting objects: 64% (5124/8005)
remote: Counting objects: 65% (5204/8005)
remote: Counting objects: 66% (5284/8005)
remote: Counting objects: 67% (5364/8005)
remote: Counting objects: 68% (5444/8005)
remote: Counting objects: 69% (5524/8005)
remote: Counting objects: 70% (5604/8005)
remote: Counting objects: 71% (5684/8005)
remote: Counting objects: 72% (5764/8005)
remote: Counting objects: 73% (5844/8005)
remote: Counting objects: 74% (5924/8005)
remote: Counting objects: 75% (6004/8005)
remote: Counting objects: 76% (6084/8005)
remote: Counting objects: 77% (6164/8005)
remote: Counting objects: 78% (6244/8005)
remote: Counting objects: 79% (6324/8005)
remote: Counting objects: 80% (6404/8005)
remote: Counting objects: 81% (6485/8005)
remote: Counting objects: 82% (6565/8005)
remote: Counting objects: 83% (6645/8005)
remote: Counting objects: 84% (6725/8005)
remote: Counting objects: 85% (6805/8005)
remote: Counting objects: 86% (6885/8005)
remote: Counting objects: 87% (6965/8005)
remote: Counting objects: 88% (7045/8005)
remote: Counting objects: 89% (7125/8005)
remote: Counting objects: 90% (7205/8005)
remote: Counting objects: 91% (7285/8005)
remote: Counting objects: 92% (7365/8005)
remote: Counting objects: 93% (7445/8005)
remote: Counting objects: 94% (7525/8005)
remote: Counting objects: 95% (7605/8005)
remote: Counting objects: 96% (7685/8005)
remote: Counting objects: 97% (7765/8005)
remote: Counting objects: 98% (7845/8005)
remote: Counting objects: 99% (7925/8005)
remote: Counting objects: 100% (8005/8005)
remote: Counting objects: 100% (8005/8005), done.
2.67 s
remote: Compressing objects: 0% (1/1507)
remote: Compressing objects: 1% (16/1507)
remote: Compressing objects: 2% (31/1507)
remote: Compressing objects: 3% (46/1507)
remote: Compressing objects: 4% (61/1507)
remote: Compressing objects: 5% (76/1507)
remote: Compressing objects: 6% (91/1507)
remote: Compressing objects: 7% (106/1507)
remote: Compressing objects: 8% (121/1507)
remote: Compressing objects: 9% (136/1507)
remote: Compressing objects: 9% (140/1507)
remote: Compressing objects: 10% (151/1507)
remote: Compressing objects: 11% (166/1507)
remote: Compressing objects: 12% (181/1507)
remote: Compressing objects: 13% (196/1507)
remote: Compressing objects: 14% (211/1507)
remote: Compressing objects: 15% (227/1507)
remote: Compressing objects: 16% (242/1507)
remote: Compressing objects: 17% (257/1507)
remote: Compressing objects: 18% (272/1507)
remote: Compressing objects: 19% (287/1507)
remote: Compressing objects: 20% (302/1507)
remote: Compressing objects: 21% (317/1507)
remote: Compressing objects: 22% (332/1507)
remote: Compressing objects: 23% (347/1507)
remote: Compressing objects: 24% (362/1507)
remote: Compressing objects: 25% (377/1507)
remote: Compressing objects: 26% (392/1507)
remote: Compressing objects: 27% (407/1507)
remote: Compressing objects: 28% (422/1507)
remote: Compressing objects: 29% (438/1507)
remote: Compressing objects: 30% (453/1507)
remote: Compressing objects: 31% (468/1507)
remote: Compressing objects: 32% (483/1507)
remote: Compressing objects: 33% (498/1507)
remote: Compressing objects: 34% (513/1507)
remote: Compressing objects: 35% (528/1507)
remote: Compressing objects: 36% (543/1507)
remote: Compressing objects: 37% (558/1507)
remote: Compressing objects: 38% (573/1507)
remote: Compressing objects: 39% (588/1507)
remote: Compressing objects: 40% (603/1507)
remote: Compressing objects: 41% (618/1507)
remote: Compressing objects: 42% (633/1507)
remote: Compressing objects: 43% (649/1507)
remote: Compressing objects: 44% (664/1507)
remote: Compressing objects: 45% (679/1507)
remote: Compressing objects: 46% (694/1507)
remote: Compressing objects: 47% (709/1507)
remote: Compressing objects: 48% (724/1507)
remote: Compressing objects: 49% (739/1507)
remote: Compressing objects: 50% (754/1507)
remote: Compressing objects: 51% (769/1507)
remote: Compressing objects: 52% (784/1507)
remote: Compressing objects: 53% (799/1507)
remote: Compressing objects: 54% (814/1507)
remote: Compressing objects: 55% (829/1507)
remote: Compressing objects: 56% (844/1507)
remote: Compressing objects: 57% (859/1507)
remote: Compressing objects: 58% (875/1507)
remote: Compressing objects: 59% (890/1507)
remote: Compressing objects: 60% (905/1507)
remote: Compressing objects: 61% (920/1507)
remote: Compressing objects: 62% (935/1507)
remote: Compressing objects: 63% (950/1507)
remote: Compressing objects: 64% (965/1507)
remote: Compressing objects: 65% (980/1507)
remote: Compressing objects: 66% (995/1507)
remote: Compressing objects: 67% (1010/1507)
remote: Compressing objects: 68% (1025/1507)
remote: Compressing objects: 69% (1040/1507)
remote: Compressing objects: 70% (1055/1507)
remote: Compressing objects: 71% (1070/1507)
remote: Compressing objects: 72% (1086/1507)
remote: Compressing objects: 73% (1101/1507)
remote: Compressing objects: 74% (1116/1507)
remote: Compressing objects: 75% (1131/1507)
remote: Compressing objects: 76% (1146/1507)
remote: Compressing objects: 77% (1161/1507)
remote: Compressing objects: 78% (1176/1507)
remote: Compressing objects: 79% (1191/1507)
remote: Compressing objects: 80% (1206/1507)
remote: Compressing objects: 81% (1221/1507)
remote: Compressing objects: 82% (1236/1507)
remote: Compressing objects: 83% (1251/1507)
remote: Compressing objects: 84% (1266/1507)
remote: Compressing objects: 85% (1281/1507)
remote: Compressing objects: 86% (1297/1507)
remote: Compressing objects: 87% (1312/1507)
remote: Compressing objects: 88% (1327/1507)
remote: Compressing objects: 89% (1342/1507)
remote: Compressing objects: 90% (1357/1507)
remote: Compressing objects: 91% (1372/1507)
remote: Compressing objects: 92% (1387/1507)
remote: Compressing objects: 93% (1402/1507)
remote: Compressing objects: 94% (1417/1507)
remote: Compressing objects: 95% (1432/1507)
remote: Compressing objects: 96% (1447/1507)
remote: Compressing objects: 97% (1462/1507)
remote: Compressing objects: 98% (1477/1507)
remote: Compressing objects: 99% (1492/1507)
remote: Compressing objects: 100% (1507/1507)
remote: Compressing objects: 100% (1507/1507), done.
6.82 s
Receiving objects: 0% (1/78511)
Receiving objects: 1% (786/78511), 932.00 KiB | 1.80 MiB/s
Receiving objects: 2% (1571/78511), 932.00 KiB | 1.80 MiB/s
Receiving objects: 3% (2356/78511), 932.00 KiB | 1.80 MiB/s
Receiving objects: 4% (3141/78511), 932.00 KiB | 1.80 MiB/s
Receiving objects: 5% (3926/78511), 932.00 KiB | 1.80 MiB/s
Receiving objects: 6% (4711/78511), 932.00 KiB | 1.80 MiB/s
Receiving objects: 6% (4746/78511), 8.91 MiB | 8.89 MiB/s
Receiving objects: 7% (5496/78511), 8.91 MiB | 8.89 MiB/s
Receiving objects: 8% (6281/78511), 8.91 MiB | 8.89 MiB/s
Receiving objects: 9% (7066/78511), 8.91 MiB | 8.89 MiB/s
Receiving objects: 10% (7852/78511), 8.91 MiB | 8.89 MiB/s
Receiving objects: 11% (8637/78511), 8.91 MiB | 8.89 MiB/s
Receiving objects: 12% (9422/78511), 8.91 MiB | 8.89 MiB/s
Receiving objects: 13% (10207/78511), 8.91 MiB | 8.89 MiB/s
Receiving objects: 14% (10992/78511), 8.91 MiB | 8.89 MiB/s
Receiving objects: 15% (11777/78511), 8.91 MiB | 8.89 MiB/s
Receiving objects: 16% (12562/78511), 8.91 MiB | 8.89 MiB/s
Receiving objects: 17% (13347/78511), 8.91 MiB | 8.89 MiB/s
Receiving objects: 18% (14132/78511), 8.91 MiB | 8.89 MiB/s
Receiving objects: 19% (14918/78511), 8.91 MiB | 8.89 MiB/s
Receiving objects: 20% (15703/78511), 8.91 MiB | 8.89 MiB/s
Receiving objects: 21% (16488/78511), 8.91 MiB | 8.89 MiB/s
Receiving objects: 22% (17273/78511), 8.91 MiB | 8.89 MiB/s
Receiving objects: 23% (18058/78511), 8.91 MiB | 8.89 MiB/s
Receiving objects: 24% (18843/78511), 8.91 MiB | 8.89 MiB/s
Receiving objects: 25% (19628/78511), 8.91 MiB | 8.89 MiB/s
Receiving objects: 26% (20413/78511), 8.91 MiB | 8.89 MiB/s
Receiving objects: 27% (21198/78511), 8.91 MiB | 8.89 MiB/s
Receiving objects: 28% (21984/78511), 8.91 MiB | 8.89 MiB/s
Receiving objects: 29% (22769/78511), 23.51 MiB | 15.66 MiB/s
Receiving objects: 30% (23554/78511), 23.51 MiB | 15.66 MiB/s
Receiving objects: 31% (24339/78511), 23.51 MiB | 15.66 MiB/s
Receiving objects: 32% (25124/78511), 23.51 MiB | 15.66 MiB/s
Receiving objects: 33% (25909/78511), 23.51 MiB | 15.66 MiB/s
Receiving objects: 34% (26694/78511), 23.51 MiB | 15.66 MiB/s
Receiving objects: 35% (27479/78511), 23.51 MiB | 15.66 MiB/s
Receiving objects: 36% (28264/78511), 23.51 MiB | 15.66 MiB/s
Receiving objects: 37% (29050/78511), 23.51 MiB | 15.66 MiB/s
Receiving objects: 38% (29835/78511), 23.51 MiB | 15.66 MiB/s
Receiving objects: 39% (30620/78511), 23.51 MiB | 15.66 MiB/s
Receiving objects: 40% (31405/78511), 23.51 MiB | 15.66 MiB/s
Receiving objects: 41% (32190/78511), 23.51 MiB | 15.66 MiB/s
Receiving objects: 42% (32975/78511), 23.51 MiB | 15.66 MiB/s
Receiving objects: 43% (33760/78511), 23.51 MiB | 15.66 MiB/s
Receiving objects: 44% (34545/78511), 23.51 MiB | 15.66 MiB/s
Receiving objects: 45% (35330/78511), 23.51 MiB | 15.66 MiB/s
Receiving objects: 46% (36116/78511), 23.51 MiB | 15.66 MiB/s
Receiving objects: 47% (36901/78511), 23.51 MiB | 15.66 MiB/s
Receiving objects: 48% (37686/78511), 23.51 MiB | 15.66 MiB/s
Receiving objects: 49% (38471/78511), 23.51 MiB | 15.66 MiB/s
Receiving objects: 50% (39256/78511), 23.51 MiB | 15.66 MiB/s
Receiving objects: 50% (39453/78511), 45.39 MiB | 22.68 MiB/s
Receiving objects: 51% (40041/78511), 45.39 MiB | 22.68 MiB/s
Receiving objects: 52% (40826/78511), 45.39 MiB | 22.68 MiB/s
Receiving objects: 53% (41611/78511), 45.39 MiB | 22.68 MiB/s
Receiving objects: 54% (42396/78511), 45.39 MiB | 22.68 MiB/s
Receiving objects: 55% (43182/78511), 45.39 MiB | 22.68 MiB/s
Receiving objects: 56% (43967/78511), 45.39 MiB | 22.68 MiB/s
Receiving objects: 57% (44752/78511), 45.39 MiB | 22.68 MiB/s
Receiving objects: 58% (45537/78511), 45.39 MiB | 22.68 MiB/s
Receiving objects: 59% (46322/78511), 45.39 MiB | 22.68 MiB/s
Receiving objects: 60% (47107/78511), 45.39 MiB | 22.68 MiB/s
Receiving objects: 61% (47892/78511), 45.39 MiB | 22.68 MiB/s
Receiving objects: 62% (48677/78511), 45.39 MiB | 22.68 MiB/s
Receiving objects: 63% (49462/78511), 63.63 MiB | 25.44 MiB/s
Receiving objects: 64% (50248/78511), 63.63 MiB | 25.44 MiB/s
Receiving objects: 65% (51033/78511), 63.63 MiB | 25.44 MiB/s
Receiving objects: 66% (51818/78511), 63.63 MiB | 25.44 MiB/s
Receiving objects: 67% (52603/78511), 63.63 MiB | 25.44 MiB/s
Receiving objects: 68% (53388/78511), 63.63 MiB | 25.44 MiB/s
Receiving objects: 69% (54173/78511), 63.63 MiB | 25.44 MiB/s
Receiving objects: 70% (54958/78511), 63.63 MiB | 25.44 MiB/s
Receiving objects: 71% (55743/78511), 63.63 MiB | 25.44 MiB/s
Receiving objects: 72% (56528/78511), 63.63 MiB | 25.44 MiB/s
Receiving objects: 72% (56736/78511), 81.71 MiB | 27.19 MiB/s
Receiving objects: 73% (57314/78511), 81.71 MiB | 27.19 MiB/s
Receiving objects: 74% (58099/78511), 81.71 MiB | 27.19 MiB/s
Receiving objects: 75% (58884/78511), 81.71 MiB | 27.19 MiB/s
Receiving objects: 76% (59669/78511), 81.71 MiB | 27.19 MiB/s
Receiving objects: 77% (60454/78511), 81.71 MiB | 27.19 MiB/s
Receiving objects: 78% (61239/78511), 81.71 MiB | 27.19 MiB/s
Receiving objects: 79% (62024/78511), 81.71 MiB | 27.19 MiB/s
Receiving objects: 80% (62809/78511), 100.10 MiB | 28.54 MiB/s
Receiving objects: 81% (63594/78511), 100.10 MiB | 28.54 MiB/s
Receiving objects: 82% (64380/78511), 100.10 MiB | 28.54 MiB/s
Receiving objects: 83% (65165/78511), 100.10 MiB | 28.54 MiB/s
Receiving objects: 84% (65950/78511), 100.10 MiB | 28.54 MiB/s
Receiving objects: 85% (66735/78511), 100.10 MiB | 28.54 MiB/s
Receiving objects: 86% (67520/78511), 100.10 MiB | 28.54 MiB/s
Receiving objects: 87% (68305/78511), 100.10 MiB | 28.54 MiB/s
Receiving objects: 88% (69090/78511), 100.10 MiB | 28.54 MiB/s
Receiving objects: 89% (69875/78511), 100.10 MiB | 28.54 MiB/s
Receiving objects: 90% (70660/78511), 100.10 MiB | 28.54 MiB/s
Receiving objects: 91% (71446/78511), 100.10 MiB | 28.54 MiB/s
Receiving objects: 92% (72231/78511), 100.10 MiB | 28.54 MiB/s
Receiving objects: 93% (73016/78511), 100.10 MiB | 28.54 MiB/s
Receiving objects: 94% (73801/78511), 100.10 MiB | 28.54 MiB/s
Receiving objects: 95% (74586/78511), 100.10 MiB | 28.54 MiB/s
Receiving objects: 96% (75371/78511), 100.10 MiB | 28.54 MiB/s
Receiving objects: 96% (76128/78511), 100.10 MiB | 28.54 MiB/s
Receiving objects: 97% (76156/78511), 100.10 MiB | 28.54 MiB/s
Receiving objects: 98% (76941/78511), 100.10 MiB | 28.54 MiB/s
Receiving objects: 99% (77726/78511), 118.53 MiB | 29.57 MiB/s
remote: Total 78511 (delta 7045), reused 6500 (delta 6498), pack-reused 70506 (from 2)
6.83 s
Receiving objects: 100% (78511/78511), 118.53 MiB | 29.57 MiB/s
Receiving objects: 100% (78511/78511), 120.01 MiB | 29.65 MiB/s, done.
8.12 s
Resolving deltas: 0% (0/53617)
Resolving deltas: 1% (537/53617)
Resolving deltas: 2% (1073/53617)
Resolving deltas: 3% (1609/53617)
Resolving deltas: 4% (2145/53617)
Resolving deltas: 5% (2681/53617)
Resolving deltas: 6% (3219/53617)
Resolving deltas: 7% (3754/53617)
Resolving deltas: 8% (4290/53617)
Resolving deltas: 9% (4827/53617)
Resolving deltas: 10% (5362/53617)
Resolving deltas: 11% (5898/53617)
Resolving deltas: 12% (6435/53617)
Resolving deltas: 13% (6971/53617)
Resolving deltas: 14% (7507/53617)
Resolving deltas: 15% (8043/53617)
Resolving deltas: 16% (8580/53617)
Resolving deltas: 17% (9115/53617)
Resolving deltas: 18% (9652/53617)
Resolving deltas: 19% (10188/53617)
Resolving deltas: 20% (10725/53617)
Resolving deltas: 21% (11260/53617)
Resolving deltas: 22% (11801/53617)
Resolving deltas: 23% (12332/53617)
Resolving deltas: 24% (12869/53617)
Resolving deltas: 25% (13410/53617)
Resolving deltas: 26% (13941/53617)
Resolving deltas: 27% (14477/53617)
Resolving deltas: 28% (15013/53617)
Resolving deltas: 29% (15549/53617)
Resolving deltas: 30% (16086/53617)
Resolving deltas: 31% (16622/53617)
Resolving deltas: 32% (17158/53617)
Resolving deltas: 33% (17694/53617)
Resolving deltas: 34% (18230/53617)
Resolving deltas: 35% (18766/53617)
Resolving deltas: 36% (19303/53617)
Resolving deltas: 37% (19839/53617)
Resolving deltas: 38% (20375/53617)
Resolving deltas: 39% (20913/53617)
Resolving deltas: 40% (21449/53617)
Resolving deltas: 41% (21983/53617)
Resolving deltas: 42% (22521/53617)
Resolving deltas: 43% (23058/53617)
Resolving deltas: 44% (23593/53617)
Resolving deltas: 45% (24128/53617)
Resolving deltas: 46% (24667/53617)
Resolving deltas: 47% (25200/53617)
Resolving deltas: 48% (25738/53617)
Resolving deltas: 49% (26273/53617)
Resolving deltas: 50% (26809/53617)
Resolving deltas: 51% (27347/53617)
Resolving deltas: 52% (27881/53617)
Resolving deltas: 53% (28420/53617)
Resolving deltas: 54% (28954/53617)
Resolving deltas: 55% (29490/53617)
Resolving deltas: 56% (30026/53617)
Resolving deltas: 57% (30562/53617)
Resolving deltas: 58% (31098/53617)
Resolving deltas: 59% (31635/53617)
Resolving deltas: 60% (32171/53617)
Resolving deltas: 61% (32710/53617)
Resolving deltas: 62% (33243/53617)
Resolving deltas: 63% (33779/53617)
Resolving deltas: 64% (34315/53617)
Resolving deltas: 65% (34852/53617)
Resolving deltas: 66% (35388/53617)
Resolving deltas: 67% (35924/53617)
Resolving deltas: 68% (36460/53617)
Resolving deltas: 69% (36996/53617)
Resolving deltas: 70% (37532/53617)
Resolving deltas: 71% (38070/53617)
Resolving deltas: 72% (38605/53617)
Resolving deltas: 73% (39141/53617)
Resolving deltas: 74% (39677/53617)
Resolving deltas: 75% (40213/53617)
Resolving deltas: 76% (40749/53617)
Resolving deltas: 77% (41287/53617)
Resolving deltas: 78% (41824/53617)
Resolving deltas: 79% (42358/53617)
Resolving deltas: 79% (42555/53617)
Resolving deltas: 80% (42894/53617)
Resolving deltas: 81% (43430/53617)
Resolving deltas: 82% (43966/53617)
Resolving deltas: 83% (44503/53617)
Resolving deltas: 84% (45039/53617)
Resolving deltas: 85% (45575/53617)
Resolving deltas: 86% (46113/53617)
Resolving deltas: 87% (46647/53617)
Resolving deltas: 88% (47183/53617)
Resolving deltas: 89% (47720/53617)
Resolving deltas: 90% (48257/53617)
Resolving deltas: 91% (48792/53617)
Resolving deltas: 92% (49328/53617)
Resolving deltas: 93% (49864/53617)
Resolving deltas: 94% (50400/53617)
Resolving deltas: 95% (50939/53617)
Resolving deltas: 96% (51474/53617)
Resolving deltas: 97% (52009/53617)
Resolving deltas: 98% (52545/53617)
Resolving deltas: 99% (53081/53617)
Resolving deltas: 100% (53617/53617)
Resolving deltas: 100% (53617/53617), done.
8.69 s
Fetching commit d2939d705e8a50d3412afbd503f2e4868476dca1 for wip/native-symbolica-hyperbolics ...
8.69 s
$ /nix/store/bcnisk3ydfgv26v2gw3zlky24g00yww2-git-2.54.0/bin/git fetch origin d2939d705e8a50d3412afbd503f2e4868476dca1
9.18 s
From https://github.com/alphal00p/gammaloop
9.18 s
* branch d2939d705e8a50d3412afbd503f2e4868476dca1 -> FETCH_HEAD
9.21 s
$ /nix/store/9ypz3flqsrl5xl495mm8h645gadjsxi1-coreutils-9.11/bin/timeout --kill-after=15s 7200s /nix/store/bcnisk3ydfgv26v2gw3zlky24g00yww2-git-2.54.0/bin/git -c advice.detachedHead=false checkout d2939d705e8a50d3412afbd503f2e4868476dca1
9.45 s
HEAD is now at d2939d705 wip: native hyperbolic functions, blocked on symbolica evaluator support
9.46 s
$ /nix/store/9ypz3flqsrl5xl495mm8h645gadjsxi1-coreutils-9.11/bin/timeout --kill-after=15s 7200s /nix/store/23zk8sgzamrbmj1fday15szf7f2279s8-nix-2.34.7/bin/nix --extra-experimental-features nix-command --extra-experimental-features flakes --log-format internal-json run .#packages.x86_64-linux.nix-ci-check-gammaloop-nextest-core --print-build-logs
15.02 s
24.70 s
evaluating derivation 'g
copying '/nix/store/jxqs
evaluating derivation 'g
copying '/nix/store/jxqs
evaluating derivation 'g
copying '/nix/store/jxqs
evaluating derivation 'g
copying '/nix/store/jxqs
evaluating derivation 'g
copying '/nix/store/jxqs
evaluating derivation 'g
copying '/nix/store/jxqs
evaluating derivation 'g
copying '/nix/store/jxqs
evaluating derivation 'g
copying '/nix/store/jxqs
evaluating derivation 'g
copying '/nix/store/jxqs
evaluating derivation 'g
copying '/nix/store/jxqs
evaluating derivation 'g
copying '/nix/store/jxqs
evaluating derivation 'g
copying '/nix/store/jxqs
evaluating derivation 'g
copying '/nix/store/jxqs
evaluating derivation 'g
copying '/nix/store/jxqs
evaluating derivation 'g
[0 /1 built]
[1 /0 /1 built]
[1 /0 /1 built] building g gammaloop-nextest-core> Extracting 3 binaries (including 1 non-test binary), 1 build script output directory, and 2 linked paths to /build/nextest-archive-WBj1XP
25.40 s
gammaloop-nextest-core> Extracted 18 files to /build/nextest-archive-WBj1XP in 0.70s
25.44 s
gammaloop-nextest-core> ------------
25.44 s
gammaloop-nextest-core> Nextest run ID 00105aa6-5128-4ed8-8bb3-95196a0172d4 with nextest profile: ci_gammaloop
25.44 s
gammaloop-nextest-core> Starting 339 tests across 2 binaries
26.32 s
gammaloop-nextest-core> ------------
26.32 s
gammaloop-nextest-core> Summary [ 0.886s] 339 tests run: 339 passed , 0 skipped
26.45 s
gammaloop-nextest-core>
26.45 s
gammaloop-nextest-core> ========== nextest test summary ==========
26.45 s
gammaloop-nextest-core> report: target/nextest/ci_gammaloop/junit.xml
26.45 s
gammaloop-nextest-core> tests: 339, failures: 0, errors: 0
26.45 s
gammaloop-nextest-core> No failing testcases found.
26.45 s
gammaloop-nextest-core> =========================================
26.48 s
gammaloop-nextest-core> Extracting 1 binary and 1 linked path to /build/nextest-archive-WcbpHJ
26.57 s
gammaloop-nextest-core> Extracted 7 files to /build/nextest-archive-WcbpHJ in 0.09s
26.60 s
gammaloop-nextest-core> ------------
26.60 s
gammaloop-nextest-core> Nextest run ID 0412c7bd-e978-4748-b6d3-5b74cae3cdc4 with nextest profile: ci_gammaloop
26.60 s
gammaloop-nextest-core> Starting 19 tests across 1 binary
26.66 s
gammaloop-nextest-core> ------------
26.66 s
gammaloop-nextest-core> Summary [ 0.057s] 19 tests run: 19 passed , 0 skipped
26.73 s
gammaloop-nextest-core>
26.73 s
gammaloop-nextest-core> ========== nextest test summary ==========
26.73 s
gammaloop-nextest-core> report: target/nextest/ci_gammaloop/junit.xml
26.73 s
gammaloop-nextest-core> tests: 19, failures: 0, errors: 0
26.73 s
gammaloop-nextest-core> No failing testcases found.
26.73 s
gammaloop-nextest-core> =========================================
26.76 s
gammaloop-nextest-core> Extracting 1 binary to /build/nextest-archive-qJcgg5
26.82 s
gammaloop-nextest-core> Extracted 4 files to /build/nextest-archive-qJcgg5 in 0.06s
26.85 s
gammaloop-nextest-core> ------------
26.85 s
gammaloop-nextest-core> Nextest run ID 97f49356-59c2-4a37-924c-a78917712a49 with nextest profile: ci_gammaloop
26.85 s
gammaloop-nextest-core> Starting 0 tests across 1 binary
26.86 s
gammaloop-nextest-core> ------------
26.86 s
gammaloop-nextest-core> Summary [ 0.005s] 0 tests run: 0 passed , 0 skipped
26.94 s
gammaloop-nextest-core>
26.94 s
gammaloop-nextest-core> ========== nextest test summary ==========
26.94 s
gammaloop-nextest-core> report: target/nextest/ci_gammaloop/junit.xml
26.94 s
gammaloop-nextest-core> tests: 0, failures: 0, errors: 0
26.94 s
gammaloop-nextest-core> No failing testcases found.
26.94 s
gammaloop-nextest-core> =========================================
26.97 s
gammaloop-nextest-core> Extracting 4 binaries, 1 build script output directory, and 2 linked paths to /build/nextest-archive-ODiQiD
27.70 s
gammaloop-nextest-core> Extracted 18 files to /build/nextest-archive-ODiQiD in 0.73s
27.75 s
gammaloop-nextest-core> ------------
27.75 s
gammaloop-nextest-core> Nextest run ID cd5ff5c2-9bca-4e36-9540-a1030804533b with nextest profile: ci_gammaloop
27.75 s
gammaloop-nextest-core> Starting 483 tests across 4 binaries (61 tests skipped , including 60 tests via profile.ci_gammaloop.default-filter )
27.84 s
gammaloop-nextest-core> FAIL [ 0.024s] ( 43/483) gammalooprs cff::generation::tests_cff :: thermal_bubble_chain
27.84 s
gammaloop-nextest-core> stdout ---
27.84 s
gammaloop-nextest-core>
27.84 s
gammaloop-nextest-core> running 1 test
27.84 s
gammaloop-nextest-core> test cff::generation::tests_cff::thermal_bubble_chain ... FAILED
27.84 s
gammaloop-nextest-core>
27.84 s
gammaloop-nextest-core> failures:
27.84 s
gammaloop-nextest-core>
27.84 s
gammaloop-nextest-core> failures:
27.84 s
gammaloop-nextest-core> cff::generation::tests_cff::thermal_bubble_chain
27.84 s
gammaloop-nextest-core>
27.84 s
gammaloop-nextest-core> test result: FAILED. 0 passed; 1 failed; 0 ignored; 0 measured; 535 filtered out; finished in 0.01s
27.84 s
gammaloop-nextest-core>
27.84 s
gammaloop-nextest-core> stderr ---
27.84 s
gammaloop-nextest-core>
27.84 s
gammaloop-nextest-core> thread 'cff::generation::tests_cff::thermal_bubble_chain' (1271) panicked at /nix/store/1sigmg52bb61pfngmk9k8wq5fz9r7bf1-vendor-cargo-deps/5929dab090e556a579e9f3b708cd2e67c60b3d84a12b5a276f2a36cb00473133/symbolica-2.2.0/src/evaluate/evaluator.rs:295:21:
27.84 s
gammaloop-nextest-core> External function 'symbolica_coth' does not have an implementation for gammalooprs::utils::F<f64>
27.84 s
gammaloop-nextest-core> stack backtrace:
27.84 s
gammaloop-nextest-core> 0: __rustc::rust_begin_unwind
27.84 s
gammaloop-nextest-core> 1: core::panicking::panic_fmt
27.84 s
gammaloop-nextest-core> 2: <symbolica::evaluate::evaluator::ExpressionEvaluator<gammalooprs::utils::F<f64>>>::evaluate_impl_no_ops
27.84 s
gammaloop-nextest-core> 3: <symbolica::evaluate::evaluator::ExpressionEvaluator<gammalooprs::utils::F<f64>>>::evaluate_single
27.84 s
gammaloop-nextest-core> 4: gammalooprs::cff::generation::tests_cff::thermal_bubble_chain
27.84 s
gammaloop-nextest-core> 5: <gammalooprs::cff::generation::tests_cff::thermal_bubble_chain::{closure#0} as core::ops::function::FnOnce<()>>::call_once
27.84 s
gammaloop-nextest-core> note: Some details are omitted, run with `RUST_BACKTRACE=full` for a verbose backtrace.
27.84 s
gammaloop-nextest-core>
27.84 s
gammaloop-nextest-core> FAIL [ 0.028s] ( 46/483) gammalooprs cff::generation::tests_cff :: thermal_bubble
27.84 s
gammaloop-nextest-core> stdout ---
27.84 s
gammaloop-nextest-core>
27.84 s
gammaloop-nextest-core> running 1 test
27.84 s
gammaloop-nextest-core> test cff::generation::tests_cff::thermal_bubble ... FAILED
27.84 s
gammaloop-nextest-core>
27.84 s
gammaloop-nextest-core> failures:
27.84 s
gammaloop-nextest-core>
27.84 s
gammaloop-nextest-core> failures:
27.84 s
gammaloop-nextest-core> cff::generation::tests_cff::thermal_bubble
27.84 s
gammaloop-nextest-core>
27.84 s
gammaloop-nextest-core> test result: FAILED. 0 passed; 1 failed; 0 ignored; 0 measured; 535 filtered out; finished in 0.01s
27.84 s
gammaloop-nextest-core>
27.84 s
gammaloop-nextest-core> stderr ---
27.84 s
gammaloop-nextest-core>
27.84 s
gammaloop-nextest-core> thread 'cff::generation::tests_cff::thermal_bubble' (1282) panicked at /nix/store/1sigmg52bb61pfngmk9k8wq5fz9r7bf1-vendor-cargo-deps/5929dab090e556a579e9f3b708cd2e67c60b3d84a12b5a276f2a36cb00473133/symbolica-2.2.0/src/evaluate/evaluator.rs:295:21:
27.84 s
gammaloop-nextest-core> External function 'symbolica_coth' does not have an implementation for gammalooprs::utils::F<f64>
27.84 s
gammaloop-nextest-core> stack backtrace:
27.84 s
gammaloop-nextest-core> 0: __rustc::rust_begin_unwind
27.84 s
gammaloop-nextest-core> 1: core::panicking::panic_fmt
27.84 s
gammaloop-nextest-core> 2: <symbolica::evaluate::evaluator::ExpressionEvaluator<gammalooprs::utils::F<f64>>>::evaluate_impl_no_ops
27.84 s
gammaloop-nextest-core> 3: <symbolica::evaluate::evaluator::ExpressionEvaluator<gammalooprs::utils::F<f64>>>::evaluate_single
27.84 s
gammaloop-nextest-core> 4: gammalooprs::cff::generation::tests_cff::thermal_bubble
27.84 s
gammaloop-nextest-core> 5: <gammalooprs::cff::generation::tests_cff::thermal_bubble::{closure#0} as core::ops::function::FnOnce<()>>::call_once
27.84 s
gammaloop-nextest-core> note: Some details are omitted, run with `RUST_BACKTRACE=full` for a verbose backtrace.
27.84 s
gammaloop-nextest-core>
27.85 s
gammaloop-nextest-core> FAIL [ 0.032s] ( 48/483) gammalooprs cff::generation::tests_cff :: thermal_eight
27.85 s
gammaloop-nextest-core> stdout ---
27.85 s
gammaloop-nextest-core>
27.85 s
gammaloop-nextest-core> running 1 test
27.85 s
gammaloop-nextest-core> test cff::generation::tests_cff::thermal_eight ... FAILED
27.85 s
gammaloop-nextest-core>
27.85 s
gammaloop-nextest-core> failures:
27.85 s
gammaloop-nextest-core>
27.85 s
gammaloop-nextest-core> failures:
27.85 s
gammaloop-nextest-core> cff::generation::tests_cff::thermal_eight
27.85 s
gammaloop-nextest-core>
27.85 s
gammaloop-nextest-core> test result: FAILED. 0 passed; 1 failed; 0 ignored; 0 measured; 535 filtered out; finished in 0.02s
27.85 s
gammaloop-nextest-core>
27.85 s
gammaloop-nextest-core> stderr ---
27.85 s
gammaloop-nextest-core>
27.85 s
gammaloop-nextest-core> thread 'cff::generation::tests_cff::thermal_eight' (1281) panicked at /nix/store/1sigmg52bb61pfngmk9k8wq5fz9r7bf1-vendor-cargo-deps/5929dab090e556a579e9f3b708cd2e67c60b3d84a12b5a276f2a36cb00473133/symbolica-2.2.0/src/evaluate/evaluator.rs:295:21:
27.85 s
gammaloop-nextest-core> External function 'symbolica_coth' does not have an implementation for gammalooprs::utils::F<f64>
27.85 s
gammaloop-nextest-core> stack backtrace:
27.85 s
gammaloop-nextest-core> 0: __rustc::rust_begin_unwind
27.85 s
gammaloop-nextest-core> 1: core::panicking::panic_fmt
27.85 s
gammaloop-nextest-core> 2: <symbolica::evaluate::evaluator::ExpressionEvaluator<gammalooprs::utils::F<f64>>>::evaluate_impl_no_ops
27.85 s
gammaloop-nextest-core> 3: <symbolica::evaluate::evaluator::ExpressionEvaluator<gammalooprs::utils::F<f64>>>::evaluate_single
27.85 s
gammaloop-nextest-core> 4: gammalooprs::cff::generation::tests_cff::thermal_eight
27.85 s
gammaloop-nextest-core> 5: <gammalooprs::cff::generation::tests_cff::thermal_eight::{closure#0} as core::ops::function::FnOnce<()>>::call_once
27.85 s
gammaloop-nextest-core> note: Some details are omitted, run with `RUST_BACKTRACE=full` for a verbose backtrace.
27.85 s
gammaloop-nextest-core>
27.90 s
gammaloop-nextest-core> FAIL [ 0.074s] ( 72/483) gammalooprs cff::generation::tests_cff :: thermal_ring
27.90 s
gammaloop-nextest-core> stdout ---
27.90 s
gammaloop-nextest-core>
27.90 s
gammaloop-nextest-core> running 1 test
27.90 s
gammaloop-nextest-core> test cff::generation::tests_cff::thermal_ring ... FAILED
27.90 s
gammaloop-nextest-core>
27.90 s
gammaloop-nextest-core> failures:
27.90 s
gammaloop-nextest-core>
27.90 s
gammaloop-nextest-core> failures:
27.90 s
gammaloop-nextest-core> cff::generation::tests_cff::thermal_ring
27.90 s
gammaloop-nextest-core>
27.90 s
gammaloop-nextest-core> test result: FAILED. 0 passed; 1 failed; 0 ignored; 0 measured; 535 filtered out; finished in 0.05s
27.90 s
gammaloop-nextest-core>
27.90 s
gammaloop-nextest-core> stderr ---
27.90 s
gammaloop-nextest-core>
27.90 s
gammaloop-nextest-core> thread 'cff::generation::tests_cff::thermal_ring' (1300) panicked at /nix/store/1sigmg52bb61pfngmk9k8wq5fz9r7bf1-vendor-cargo-deps/5929dab090e556a579e9f3b708cd2e67c60b3d84a12b5a276f2a36cb00473133/symbolica-2.2.0/src/evaluate/evaluator.rs:295:21:
27.90 s
gammaloop-nextest-core> External function 'symbolica_coth' does not have an implementation for gammalooprs::utils::F<f64>
27.90 s
gammaloop-nextest-core> stack backtrace:
27.90 s
gammaloop-nextest-core> 0: __rustc::rust_begin_unwind
27.90 s
gammaloop-nextest-core> 1: core::panicking::panic_fmt
27.90 s
gammaloop-nextest-core> 2: <symbolica::evaluate::evaluator::ExpressionEvaluator<gammalooprs::utils::F<f64>>>::evaluate_impl_no_ops
27.90 s
gammaloop-nextest-core> 3: <symbolica::evaluate::evaluator::ExpressionEvaluator<gammalooprs::utils::F<f64>>>::evaluate_single
27.90 s
gammaloop-nextest-core> 4: gammalooprs::cff::generation::tests_cff::thermal_ring
27.90 s
gammaloop-nextest-core> 5: <gammalooprs::cff::generation::tests_cff::thermal_ring::{closure#0} as core::ops::function::FnOnce<()>>::call_once
27.90 s
gammaloop-nextest-core> note: Some details are omitted, run with `RUST_BACKTRACE=full` for a verbose backtrace.
27.90 s
gammaloop-nextest-core>
28.29 s
gammaloop-nextest-core> FAIL [ 0.461s] ( 87/483) gammalooprs cff::generation::tests_cff :: thermal_mercedes
28.29 s
gammaloop-nextest-core> stdout ---
28.29 s
gammaloop-nextest-core>
28.29 s
gammaloop-nextest-core> running 1 test
28.29 s
gammaloop-nextest-core> test cff::generation::tests_cff::thermal_mercedes ... FAILED
28.29 s
gammaloop-nextest-core>
28.29 s
gammaloop-nextest-core> failures:
28.29 s
gammaloop-nextest-core>
28.29 s
gammaloop-nextest-core> failures:
28.29 s
gammaloop-nextest-core> cff::generation::tests_cff::thermal_mercedes
28.29 s
gammaloop-nextest-core>
28.29 s
gammaloop-nextest-core> test result: FAILED. 0 passed; 1 failed; 0 ignored; 0 measured; 535 filtered out; finished in 0.43s
28.29 s
gammaloop-nextest-core>
28.29 s
gammaloop-nextest-core> stderr ---
28.29 s
gammaloop-nextest-core>
28.29 s
gammaloop-nextest-core> thread 'cff::generation::tests_cff::thermal_mercedes' (1296) panicked at /nix/store/1sigmg52bb61pfngmk9k8wq5fz9r7bf1-vendor-cargo-deps/5929dab090e556a579e9f3b708cd2e67c60b3d84a12b5a276f2a36cb00473133/symbolica-2.2.0/src/evaluate/evaluator.rs:295:21:
28.29 s
gammaloop-nextest-core> External function 'symbolica_coth' does not have an implementation for gammalooprs::utils::F<f64>
28.29 s
gammaloop-nextest-core> stack backtrace:
28.29 s
gammaloop-nextest-core> 0: __rustc::rust_begin_unwind
28.29 s
gammaloop-nextest-core> 1: core::panicking::panic_fmt
28.29 s
gammaloop-nextest-core> 2: <symbolica::evaluate::evaluator::ExpressionEvaluator<gammalooprs::utils::F<f64>>>::evaluate_impl_no_ops
28.29 s
gammaloop-nextest-core> 3: <symbolica::evaluate::evaluator::ExpressionEvaluator<gammalooprs::utils::F<f64>>>::evaluate_single
28.29 s
gammaloop-nextest-core> 4: gammalooprs::cff::generation::tests_cff::thermal_mercedes
28.29 s
gammaloop-nextest-core> 5: <gammalooprs::cff::generation::tests_cff::thermal_mercedes::{closure#0} as core::ops::function::FnOnce<()>>::call_once
28.29 s
gammaloop-nextest-core> note: Some details are omitted, run with `RUST_BACKTRACE=full` for a verbose backtrace.
28.29 s
gammaloop-nextest-core>
29.56 s
gammaloop-nextest-core> FAIL [ 1.677s] (267/483) gammalooprs graph::feynman_graph::tests :: native_thermal_distributions
29.56 s
gammaloop-nextest-core> stdout ---
29.56 s
gammaloop-nextest-core>
29.56 s
gammaloop-nextest-core> running 1 test
29.56 s
gammaloop-nextest-core> test graph::feynman_graph::tests::native_thermal_distributions ... FAILED
29.56 s
gammaloop-nextest-core>
29.56 s
gammaloop-nextest-core> failures:
29.56 s
gammaloop-nextest-core>
29.56 s
gammaloop-nextest-core> failures:
29.56 s
gammaloop-nextest-core> graph::feynman_graph::tests::native_thermal_distributions
29.56 s
gammaloop-nextest-core>
29.56 s
gammaloop-nextest-core> test result: FAILED. 0 passed; 1 failed; 0 ignored; 0 measured; 535 filtered out; finished in 1.65s
29.56 s
gammaloop-nextest-core>
29.56 s
gammaloop-nextest-core> stderr ---
29.56 s
gammaloop-nextest-core> The application panicked (crashed).
29.56 s
gammaloop-nextest-core> Message: called `Result::unwrap()` on an `Err` value: Custom { kind: Other, error: "Could not compile code: g++ -shared -O3 -fPIC -ffast-math -funsafe-math-optimizations -march=native -o /build/gammaloop-native-thermal-1338/thermal_0_0.so /build/gammaloop-native-thermal-1338/thermal_0_0.cpp\nwarning: Skipping impure flag -march=native because NIX_ENFORCE_NO_NATIVE is set\n/build/gammaloop-native-thermal-1338/thermal_0_0.cpp: In function 'void thermal_realf64(const double*, double*, double*)':\n/build/gammaloop-native-thermal-1338/thermal_0_0.cpp:27:16: error: 'symbolica_tanh' was not declared in this scope\n 27 | Z[6] = symbolica_tanh(Z[6]);\n | ^~~~~~~~~~~~~~\n" }
29.56 s
gammaloop-nextest-core> Location: crates/gammalooprs/src/graph/feynman_graph.rs :937
29.56 s
gammaloop-nextest-core>
29.56 s
gammaloop-nextest-core> ━━━━━━━━━━━━━━━━━━━━━━━━━━━━━━━━━━ BACKTRACE ━━━━━━━━━━━━━━━━━━━━━━━━━━━━━━━━━━━
29.56 s
gammaloop-nextest-core> 1: <color_eyre[b0c9e66060e883b2]::config::PanicHook>::panic_report <unknown>
29.56 s
gammaloop-nextest-core> at <unknown source file> :<unknown line>
29.56 s
gammaloop-nextest-core> 2: <color_eyre[b0c9e66060e883b2]::config::PanicHook>::into_panic_hook::{closure#0} <unknown>
29.56 s
gammaloop-nextest-core> at <unknown source file> :<unknown line>
29.56 s
gammaloop-nextest-core> 3: std[bcb96dfbba0ab899]::panicking::panic_with_hook <unknown>
29.56 s
gammaloop-nextest-core> at <unknown source file> :<unknown line>
29.56 s
gammaloop-nextest-core> 4: std[bcb96dfbba0ab899]::panicking::panic_handler::{closure#0} <unknown>
29.56 s
gammaloop-nextest-core> at <unknown source file> :<unknown line>
29.56 s
gammaloop-nextest-core> 5: std[bcb96dfbba0ab899]::sys::backtrace::__rust_end_short_backtrace::<std[bcb96dfbba0ab899]::panicking::panic_handler::{closure#0}, !> <unknown>
29.56 s
gammaloop-nextest-core> at <unknown source file> :<unknown line>
29.56 s
gammaloop-nextest-core> 6: __rustc[6c289b9f9c454d21]::rust_begin_unwind <unknown>
29.56 s
gammaloop-nextest-core> at <unknown source file> :<unknown line>
29.56 s
gammaloop-nextest-core> 7: core[940e698046960fd5]::panicking::panic_fmt <unknown>
29.56 s
gammaloop-nextest-core> at <unknown source file> :<unknown line>
29.56 s
gammaloop-nextest-core> 8: core[940e698046960fd5]::result::unwrap_failed <unknown>
29.56 s
gammaloop-nextest-core> at <unknown source file> :<unknown line>
29.56 s
gammaloop-nextest-core> 9: gammalooprs[5490727360442cce]::graph::feynman_graph::tests::native_thermal_distributions <unknown>
29.56 s
gammaloop-nextest-core> at <unknown source file> :<unknown line>
29.56 s
gammaloop-nextest-core> 10: <gammalooprs[5490727360442cce]::graph::feynman_graph::tests::native_thermal_distributions::{closure#0} as core[940e698046960fd5]::ops::function::FnOnce<()>>::call_once <unknown>
29.56 s
gammaloop-nextest-core> at <unknown source file> :<unknown line>
29.56 s
gammaloop-nextest-core> 11: test[75d6903177b1d7e9]::__rust_begin_short_backtrace::<core[940e698046960fd5]::result::Result<(), alloc[2ea6bcb46fca0c42]::string::String>, fn() -> core[940e698046960fd5]::result::Result<(), alloc[2ea6bcb46fca0c42]::string::String>> <unknown>
29.56 s
gammaloop-nextest-core> at <unknown source file> :<unknown line>
29.56 s
gammaloop-nextest-core> 12: test[75d6903177b1d7e9]::run_test::{closure#0} <unknown>
29.56 s
gammaloop-nextest-core> at <unknown source file> :<unknown line>
29.56 s
gammaloop-nextest-core> 13: std[bcb96dfbba0ab899]::sys::backtrace::__rust_begin_short_backtrace::<test[75d6903177b1d7e9]::run_test::{closure#1}, ()> <unknown>
29.56 s
gammaloop-nextest-core> at <unknown source file> :<unknown line>
29.56 s
gammaloop-nextest-core> 14: <std[bcb96dfbba0ab899]::thread::lifecycle::spawn_unchecked<test[75d6903177b1d7e9]::run_test::{closure#1}, ()>::{closure#1} as core[940e698046960fd5]::ops::function::FnOnce<()>>::call_once::{shim:vtable#0} <unknown>
29.56 s
gammaloop-nextest-core> at <unknown source file> :<unknown line>
29.56 s
gammaloop-nextest-core> 15: <std[bcb96dfbba0ab899]::sys::thread::unix::Thread>::new::thread_start <unknown>
29.56 s
gammaloop-nextest-core> at <unknown source file> :<unknown line>
29.56 s
gammaloop-nextest-core> 16: start_thread <unknown>
29.56 s
gammaloop-nextest-core> at <unknown source file> :<unknown line>
29.56 s
gammaloop-nextest-core> 17: __clone3 <unknown>
29.56 s
gammaloop-nextest-core> at <unknown source file> :<unknown line>
29.56 s
gammaloop-nextest-core>
29.56 s
gammaloop-nextest-core> Run with COLORBT_SHOW_HIDDEN=1 environment variable to disable frame filtering.
29.56 s
gammaloop-nextest-core> Run with RUST_BACKTRACE=full to include source snippets.
29.56 s
gammaloop-nextest-core>
49.07 s
gammaloop-nextest-core> FAIL [ 21.254s] (481/483) gammalooprs cff::generation::tests_cff :: thermal_bugblatter
49.07 s
gammaloop-nextest-core> stdout ---
49.07 s
gammaloop-nextest-core>
49.07 s
gammaloop-nextest-core> running 1 test
49.07 s
gammaloop-nextest-core> test cff::generation::tests_cff::thermal_bugblatter ... FAILED
49.07 s
gammaloop-nextest-core>
49.07 s
gammaloop-nextest-core> failures:
49.07 s
gammaloop-nextest-core>
49.07 s
gammaloop-nextest-core> failures:
49.07 s
gammaloop-nextest-core> cff::generation::tests_cff::thermal_bugblatter
49.07 s
gammaloop-nextest-core>
49.07 s
gammaloop-nextest-core> test result: FAILED. 0 passed; 1 failed; 0 ignored; 0 measured; 535 filtered out; finished in 21.15s
49.07 s
gammaloop-nextest-core>
49.07 s
gammaloop-nextest-core> stderr ---
49.07 s
gammaloop-nextest-core>
49.07 s
gammaloop-nextest-core> thread 'cff::generation::tests_cff::thermal_bugblatter' (1276) panicked at /nix/store/1sigmg52bb61pfngmk9k8wq5fz9r7bf1-vendor-cargo-deps/5929dab090e556a579e9f3b708cd2e67c60b3d84a12b5a276f2a36cb00473133/symbolica-2.2.0/src/evaluate/evaluator.rs:295:21:
49.07 s
gammaloop-nextest-core> External function 'symbolica_coth' does not have an implementation for gammalooprs::utils::F<f64>
49.07 s
gammaloop-nextest-core> stack backtrace:
49.07 s
gammaloop-nextest-core> 0: __rustc::rust_begin_unwind
49.07 s
gammaloop-nextest-core> 1: core::panicking::panic_fmt
49.07 s
gammaloop-nextest-core> 2: <symbolica::evaluate::evaluator::ExpressionEvaluator<gammalooprs::utils::F<f64>>>::evaluate_impl_no_ops
49.07 s
gammaloop-nextest-core> 3: <symbolica::evaluate::evaluator::ExpressionEvaluator<gammalooprs::utils::F<f64>>>::evaluate_single
49.07 s
gammaloop-nextest-core> 4: gammalooprs::cff::generation::tests_cff::thermal_bugblatter
49.07 s
gammaloop-nextest-core> 5: <gammalooprs::cff::generation::tests_cff::thermal_bugblatter::{closure#0} as core::ops::function::FnOnce<()>>::call_once
49.07 s
gammaloop-nextest-core> note: Some details are omitted, run with `RUST_BACKTRACE=full` for a verbose backtrace.
49.07 s
gammaloop-nextest-core>
51.57 s
gammaloop-nextest-core> ------------
51.57 s
gammaloop-nextest-core> Summary [ 23.811s] 483 tests run: 476 passed , 7 failed , 61 skipped
51.57 s
gammaloop-nextest-core> FAIL [ 0.024s] ( 43/483) gammalooprs cff::generation::tests_cff :: thermal_bubble_chain
51.57 s
gammaloop-nextest-core> stdout ---
51.57 s
gammaloop-nextest-core>
51.57 s
gammaloop-nextest-core> running 1 test
51.57 s
gammaloop-nextest-core> test cff::generation::tests_cff::thermal_bubble_chain ... FAILED
51.57 s
gammaloop-nextest-core>
51.57 s
gammaloop-nextest-core> failures:
51.57 s
gammaloop-nextest-core>
51.57 s
gammaloop-nextest-core> failures:
51.57 s
gammaloop-nextest-core> cff::generation::tests_cff::thermal_bubble_chain
51.57 s
gammaloop-nextest-core>
51.57 s
gammaloop-nextest-core> test result: FAILED. 0 passed; 1 failed; 0 ignored; 0 measured; 535 filtered out; finished in 0.01s
51.57 s
gammaloop-nextest-core>
51.57 s
gammaloop-nextest-core> stderr ---
51.57 s
gammaloop-nextest-core>
51.57 s
gammaloop-nextest-core> thread 'cff::generation::tests_cff::thermal_bubble_chain' (1271) panicked at /nix/store/1sigmg52bb61pfngmk9k8wq5fz9r7bf1-vendor-cargo-deps/5929dab090e556a579e9f3b708cd2e67c60b3d84a12b5a276f2a36cb00473133/symbolica-2.2.0/src/evaluate/evaluator.rs:295:21:
51.57 s
gammaloop-nextest-core> External function 'symbolica_coth' does not have an implementation for gammalooprs::utils::F<f64>
51.57 s
gammaloop-nextest-core> stack backtrace:
51.57 s
gammaloop-nextest-core> 0: __rustc::rust_begin_unwind
51.57 s
gammaloop-nextest-core> 1: core::panicking::panic_fmt
51.57 s
gammaloop-nextest-core> 2: <symbolica::evaluate::evaluator::ExpressionEvaluator<gammalooprs::utils::F<f64>>>::evaluate_impl_no_ops
51.57 s
gammaloop-nextest-core> 3: <symbolica::evaluate::evaluator::ExpressionEvaluator<gammalooprs::utils::F<f64>>>::evaluate_single
51.57 s
gammaloop-nextest-core> 4: gammalooprs::cff::generation::tests_cff::thermal_bubble_chain
51.57 s
gammaloop-nextest-core> 5: <gammalooprs::cff::generation::tests_cff::thermal_bubble_chain::{closure#0} as core::ops::function::FnOnce<()>>::call_once
51.57 s
gammaloop-nextest-core> note: Some details are omitted, run with `RUST_BACKTRACE=full` for a verbose backtrace.
51.57 s
gammaloop-nextest-core>
51.57 s
gammaloop-nextest-core> FAIL [ 0.028s] ( 46/483) gammalooprs cff::generation::tests_cff :: thermal_bubble
51.57 s
gammaloop-nextest-core> stdout ---
51.57 s
gammaloop-nextest-core>
51.57 s
gammaloop-nextest-core> running 1 test
51.57 s
gammaloop-nextest-core> test cff::generation::tests_cff::thermal_bubble ... FAILED
51.57 s
gammaloop-nextest-core>
51.57 s
gammaloop-nextest-core> failures:
51.57 s
gammaloop-nextest-core>
51.57 s
gammaloop-nextest-core> failures:
51.57 s
gammaloop-nextest-core> cff::generation::tests_cff::thermal_bubble
51.57 s
gammaloop-nextest-core>
51.57 s
gammaloop-nextest-core> test result: FAILED. 0 passed; 1 failed; 0 ignored; 0 measured; 535 filtered out; finished in 0.01s
51.57 s
gammaloop-nextest-core>
51.57 s
gammaloop-nextest-core> stderr ---
51.57 s
gammaloop-nextest-core>
51.57 s
gammaloop-nextest-core> thread 'cff::generation::tests_cff::thermal_bubble' (1282) panicked at /nix/store/1sigmg52bb61pfngmk9k8wq5fz9r7bf1-vendor-cargo-deps/5929dab090e556a579e9f3b708cd2e67c60b3d84a12b5a276f2a36cb00473133/symbolica-2.2.0/src/evaluate/evaluator.rs:295:21:
51.57 s
gammaloop-nextest-core> External function 'symbolica_coth' does not have an implementation for gammalooprs::utils::F<f64>
51.57 s
gammaloop-nextest-core> stack backtrace:
51.57 s
gammaloop-nextest-core> 0: __rustc::rust_begin_unwind
51.57 s
gammaloop-nextest-core> 1: core::panicking::panic_fmt
51.57 s
gammaloop-nextest-core> 2: <symbolica::evaluate::evaluator::ExpressionEvaluator<gammalooprs::utils::F<f64>>>::evaluate_impl_no_ops
51.57 s
gammaloop-nextest-core> 3: <symbolica::evaluate::evaluator::ExpressionEvaluator<gammalooprs::utils::F<f64>>>::evaluate_single
51.57 s
gammaloop-nextest-core> 4: gammalooprs::cff::generation::tests_cff::thermal_bubble
51.57 s
gammaloop-nextest-core> 5: <gammalooprs::cff::generation::tests_cff::thermal_bubble::{closure#0} as core::ops::function::FnOnce<()>>::call_once
51.57 s
gammaloop-nextest-core> note: Some details are omitted, run with `RUST_BACKTRACE=full` for a verbose backtrace.
51.57 s
gammaloop-nextest-core>
51.57 s
gammaloop-nextest-core> FAIL [ 0.032s] ( 48/483) gammalooprs cff::generation::tests_cff :: thermal_eight
51.57 s
gammaloop-nextest-core> stdout ---
51.57 s
gammaloop-nextest-core>
51.57 s
gammaloop-nextest-core> running 1 test
51.57 s
gammaloop-nextest-core> test cff::generation::tests_cff::thermal_eight ... FAILED
51.57 s
gammaloop-nextest-core>
51.57 s
gammaloop-nextest-core> failures:
51.57 s
gammaloop-nextest-core>
51.57 s
gammaloop-nextest-core> failures:
51.57 s
gammaloop-nextest-core> cff::generation::tests_cff::thermal_eight
51.57 s
gammaloop-nextest-core>
51.57 s
gammaloop-nextest-core> test result: FAILED. 0 passed; 1 failed; 0 ignored; 0 measured; 535 filtered out; finished in 0.02s
51.57 s
gammaloop-nextest-core>
51.57 s
gammaloop-nextest-core> stderr ---
51.57 s
gammaloop-nextest-core>
51.57 s
gammaloop-nextest-core> thread 'cff::generation::tests_cff::thermal_eight' (1281) panicked at /nix/store/1sigmg52bb61pfngmk9k8wq5fz9r7bf1-vendor-cargo-deps/5929dab090e556a579e9f3b708cd2e67c60b3d84a12b5a276f2a36cb00473133/symbolica-2.2.0/src/evaluate/evaluator.rs:295:21:
51.57 s
gammaloop-nextest-core> External function 'symbolica_coth' does not have an implementation for gammalooprs::utils::F<f64>
51.57 s
gammaloop-nextest-core> stack backtrace:
51.57 s
gammaloop-nextest-core> 0: __rustc::rust_begin_unwind
51.57 s
gammaloop-nextest-core> 1: core::panicking::panic_fmt
51.57 s
gammaloop-nextest-core> 2: <symbolica::evaluate::evaluator::ExpressionEvaluator<gammalooprs::utils::F<f64>>>::evaluate_impl_no_ops
51.57 s
gammaloop-nextest-core> 3: <symbolica::evaluate::evaluator::ExpressionEvaluator<gammalooprs::utils::F<f64>>>::evaluate_single
51.57 s
gammaloop-nextest-core> 4: gammalooprs::cff::generation::tests_cff::thermal_eight
51.57 s
gammaloop-nextest-core> 5: <gammalooprs::cff::generation::tests_cff::thermal_eight::{closure#0} as core::ops::function::FnOnce<()>>::call_once
51.57 s
gammaloop-nextest-core> note: Some details are omitted, run with `RUST_BACKTRACE=full` for a verbose backtrace.
51.57 s
gammaloop-nextest-core>
51.57 s
gammaloop-nextest-core> FAIL [ 0.074s] ( 72/483) gammalooprs cff::generation::tests_cff :: thermal_ring
51.57 s
gammaloop-nextest-core> stdout ---
51.57 s
gammaloop-nextest-core>
51.57 s
gammaloop-nextest-core> running 1 test
51.57 s
gammaloop-nextest-core> test cff::generation::tests_cff::thermal_ring ... FAILED
51.57 s
gammaloop-nextest-core>
51.57 s
gammaloop-nextest-core> failures:
51.57 s
gammaloop-nextest-core>
51.57 s
gammaloop-nextest-core> failures:
51.57 s
gammaloop-nextest-core> cff::generation::tests_cff::thermal_ring
51.57 s
gammaloop-nextest-core>
51.57 s
gammaloop-nextest-core> test result: FAILED. 0 passed; 1 failed; 0 ignored; 0 measured; 535 filtered out; finished in 0.05s
51.57 s
gammaloop-nextest-core>
51.57 s
gammaloop-nextest-core> stderr ---
51.57 s
gammaloop-nextest-core>
51.57 s
gammaloop-nextest-core> thread 'cff::generation::tests_cff::thermal_ring' (1300) panicked at /nix/store/1sigmg52bb61pfngmk9k8wq5fz9r7bf1-vendor-cargo-deps/5929dab090e556a579e9f3b708cd2e67c60b3d84a12b5a276f2a36cb00473133/symbolica-2.2.0/src/evaluate/evaluator.rs:295:21:
51.57 s
gammaloop-nextest-core> External function 'symbolica_coth' does not have an implementation for gammalooprs::utils::F<f64>
51.57 s
gammaloop-nextest-core> stack backtrace:
51.57 s
gammaloop-nextest-core> 0: __rustc::rust_begin_unwind
51.57 s
gammaloop-nextest-core> 1: core::panicking::panic_fmt
51.57 s
gammaloop-nextest-core> 2: <symbolica::evaluate::evaluator::ExpressionEvaluator<gammalooprs::utils::F<f64>>>::evaluate_impl_no_ops
51.57 s
gammaloop-nextest-core> 3: <symbolica::evaluate::evaluator::ExpressionEvaluator<gammalooprs::utils::F<f64>>>::evaluate_single
51.57 s
gammaloop-nextest-core> 4: gammalooprs::cff::generation::tests_cff::thermal_ring
51.57 s
gammaloop-nextest-core> 5: <gammalooprs::cff::generation::tests_cff::thermal_ring::{closure#0} as core::ops::function::FnOnce<()>>::call_once
51.57 s
gammaloop-nextest-core> note: Some details are omitted, run with `RUST_BACKTRACE=full` for a verbose backtrace.
51.57 s
gammaloop-nextest-core>
51.57 s
gammaloop-nextest-core> FAIL [ 0.461s] ( 87/483) gammalooprs cff::generation::tests_cff :: thermal_mercedes
51.57 s
gammaloop-nextest-core> stdout ---
51.57 s
gammaloop-nextest-core>
51.57 s
gammaloop-nextest-core> running 1 test
51.57 s
gammaloop-nextest-core> test cff::generation::tests_cff::thermal_mercedes ... FAILED
51.57 s
gammaloop-nextest-core>
51.57 s
gammaloop-nextest-core> failures:
51.57 s
gammaloop-nextest-core>
51.57 s
gammaloop-nextest-core> failures:
51.57 s
gammaloop-nextest-core> cff::generation::tests_cff::thermal_mercedes
51.57 s
gammaloop-nextest-core>
51.57 s
gammaloop-nextest-core> test result: FAILED. 0 passed; 1 failed; 0 ignored; 0 measured; 535 filtered out; finished in 0.43s
51.57 s
gammaloop-nextest-core>
51.57 s
gammaloop-nextest-core> stderr ---
51.57 s
gammaloop-nextest-core>
51.57 s
gammaloop-nextest-core> thread 'cff::generation::tests_cff::thermal_mercedes' (1296) panicked at /nix/store/1sigmg52bb61pfngmk9k8wq5fz9r7bf1-vendor-cargo-deps/5929dab090e556a579e9f3b708cd2e67c60b3d84a12b5a276f2a36cb00473133/symbolica-2.2.0/src/evaluate/evaluator.rs:295:21:
51.57 s
gammaloop-nextest-core> External function 'symbolica_coth' does not have an implementation for gammalooprs::utils::F<f64>
51.57 s
gammaloop-nextest-core> stack backtrace:
51.57 s
gammaloop-nextest-core> 0: __rustc::rust_begin_unwind
51.57 s
gammaloop-nextest-core> 1: core::panicking::panic_fmt
51.57 s
gammaloop-nextest-core> 2: <symbolica::evaluate::evaluator::ExpressionEvaluator<gammalooprs::utils::F<f64>>>::evaluate_impl_no_ops
51.57 s
gammaloop-nextest-core> 3: <symbolica::evaluate::evaluator::ExpressionEvaluator<gammalooprs::utils::F<f64>>>::evaluate_single
51.57 s
gammaloop-nextest-core> 4: gammalooprs::cff::generation::tests_cff::thermal_mercedes
51.57 s
gammaloop-nextest-core> 5: <gammalooprs::cff::generation::tests_cff::thermal_mercedes::{closure#0} as core::ops::function::FnOnce<()>>::call_once
51.57 s
gammaloop-nextest-core> note: Some details are omitted, run with `RUST_BACKTRACE=full` for a verbose backtrace.
51.57 s
gammaloop-nextest-core>
51.57 s
gammaloop-nextest-core> FAIL [ 1.677s] (267/483) gammalooprs graph::feynman_graph::tests :: native_thermal_distributions
51.57 s
gammaloop-nextest-core> stdout ---
51.57 s
gammaloop-nextest-core>
51.57 s
gammaloop-nextest-core> running 1 test
51.57 s
gammaloop-nextest-core> test graph::feynman_graph::tests::native_thermal_distributions ... FAILED
51.57 s
gammaloop-nextest-core>
51.57 s
gammaloop-nextest-core> failures:
51.57 s
gammaloop-nextest-core>
51.57 s
gammaloop-nextest-core> failures:
51.57 s
gammaloop-nextest-core> graph::feynman_graph::tests::native_thermal_distributions
51.57 s
gammaloop-nextest-core>
51.57 s
gammaloop-nextest-core> test result: FAILED. 0 passed; 1 failed; 0 ignored; 0 measured; 535 filtered out; finished in 1.65s
51.57 s
gammaloop-nextest-core>
51.57 s
gammaloop-nextest-core> stderr ---
51.57 s
gammaloop-nextest-core> The application panicked (crashed).
51.57 s
gammaloop-nextest-core> Message: called `Result::unwrap()` on an `Err` value: Custom { kind: Other, error: "Could not compile code: g++ -shared -O3 -fPIC -ffast-math -funsafe-math-optimizations -march=native -o /build/gammaloop-native-thermal-1338/thermal_0_0.so /build/gammaloop-native-thermal-1338/thermal_0_0.cpp\nwarning: Skipping impure flag -march=native because NIX_ENFORCE_NO_NATIVE is set\n/build/gammaloop-native-thermal-1338/thermal_0_0.cpp: In function 'void thermal_realf64(const double*, double*, double*)':\n/build/gammaloop-native-thermal-1338/thermal_0_0.cpp:27:16: error: 'symbolica_tanh' was not declared in this scope\n 27 | Z[6] = symbolica_tanh(Z[6]);\n | ^~~~~~~~~~~~~~\n" }
51.58 s
gammaloop-nextest-core> Location: crates/gammalooprs/src/graph/feynman_graph.rs :937
51.58 s
gammaloop-nextest-core>
51.58 s
gammaloop-nextest-core> ━━━━━━━━━━━━━━━━━━━━━━━━━━━━━━━━━━ BACKTRACE ━━━━━━━━━━━━━━━━━━━━━━━━━━━━━━━━━━━
51.58 s
gammaloop-nextest-core> 1: <color_eyre[b0c9e66060e883b2]::config::PanicHook>::panic_report <unknown>
51.58 s
gammaloop-nextest-core> at <unknown source file> :<unknown line>
51.58 s
gammaloop-nextest-core> 2: <color_eyre[b0c9e66060e883b2]::config::PanicHook>::into_panic_hook::{closure#0} <unknown>
51.58 s
gammaloop-nextest-core> at <unknown source file> :<unknown line>
51.58 s
gammaloop-nextest-core> 3: std[bcb96dfbba0ab899]::panicking::panic_with_hook <unknown>
51.58 s
gammaloop-nextest-core> at <unknown source file> :<unknown line>
51.58 s
gammaloop-nextest-core> 4: std[bcb96dfbba0ab899]::panicking::panic_handler::{closure#0} <unknown>
51.58 s
gammaloop-nextest-core> at <unknown source file> :<unknown line>
51.58 s
gammaloop-nextest-core> 5: std[bcb96dfbba0ab899]::sys::backtrace::__rust_end_short_backtrace::<std[bcb96dfbba0ab899]::panicking::panic_handler::{closure#0}, !> <unknown>
51.58 s
gammaloop-nextest-core> at <unknown source file> :<unknown line>
51.58 s
gammaloop-nextest-core> 6: __rustc[6c289b9f9c454d21]::rust_begin_unwind <unknown>
51.58 s
gammaloop-nextest-core> at <unknown source file> :<unknown line>
51.58 s
gammaloop-nextest-core> 7: core[940e698046960fd5]::panicking::panic_fmt <unknown>
51.58 s
gammaloop-nextest-core> at <unknown source file> :<unknown line>
51.58 s
gammaloop-nextest-core> 8: core[940e698046960fd5]::result::unwrap_failed <unknown>
51.58 s
gammaloop-nextest-core> at <unknown source file> :<unknown line>
51.58 s
gammaloop-nextest-core> 9: gammalooprs[5490727360442cce]::graph::feynman_graph::tests::native_thermal_distributions <unknown>
51.58 s
gammaloop-nextest-core> at <unknown source file> :<unknown line>
51.58 s
gammaloop-nextest-core> 10: <gammalooprs[5490727360442cce]::graph::feynman_graph::tests::native_thermal_distributions::{closure#0} as core[940e698046960fd5]::ops::function::FnOnce<()>>::call_once <unknown>
51.58 s
gammaloop-nextest-core> at <unknown source file> :<unknown line>
51.58 s
gammaloop-nextest-core> 11: test[75d6903177b1d7e9]::__rust_begin_short_backtrace::<core[940e698046960fd5]::result::Result<(), alloc[2ea6bcb46fca0c42]::string::String>, fn() -> core[940e698046960fd5]::result::Result<(), alloc[2ea6bcb46fca0c42]::string::String>> <unknown>
51.58 s
gammaloop-nextest-core> at <unknown source file> :<unknown line>
51.58 s
gammaloop-nextest-core> 12: test[75d6903177b1d7e9]::run_test::{closure#0} <unknown>
51.58 s
gammaloop-nextest-core> at <unknown source file> :<unknown line>
51.58 s
gammaloop-nextest-core> 13: std[bcb96dfbba0ab899]::sys::backtrace::__rust_begin_short_backtrace::<test[75d6903177b1d7e9]::run_test::{closure#1}, ()> <unknown>
51.58 s
gammaloop-nextest-core> at <unknown source file> :<unknown line>
51.58 s
gammaloop-nextest-core> 14: <std[bcb96dfbba0ab899]::thread::lifecycle::spawn_unchecked<test[75d6903177b1d7e9]::run_test::{closure#1}, ()>::{closure#1} as core[940e698046960fd5]::ops::function::FnOnce<()>>::call_once::{shim:vtable#0} <unknown>
51.58 s
gammaloop-nextest-core> at <unknown source file> :<unknown line>
51.58 s
gammaloop-nextest-core> 15: <std[bcb96dfbba0ab899]::sys::thread::unix::Thread>::new::thread_start <unknown>
51.58 s
gammaloop-nextest-core> at <unknown source file> :<unknown line>
51.58 s
gammaloop-nextest-core> 16: start_thread <unknown>
51.58 s
gammaloop-nextest-core> at <unknown source file> :<unknown line>
51.58 s
gammaloop-nextest-core> 17: __clone3 <unknown>
51.58 s
gammaloop-nextest-core> at <unknown source file> :<unknown line>
51.58 s
gammaloop-nextest-core>
51.58 s
gammaloop-nextest-core> Run with COLORBT_SHOW_HIDDEN=1 environment variable to disable frame filtering.
51.58 s
gammaloop-nextest-core> Run with RUST_BACKTRACE=full to include source snippets.
51.58 s
gammaloop-nextest-core>
51.58 s
gammaloop-nextest-core> FAIL [ 21.254s] (481/483) gammalooprs cff::generation::tests_cff :: thermal_bugblatter
51.58 s
gammaloop-nextest-core> stdout ---
51.58 s
gammaloop-nextest-core>
51.58 s
gammaloop-nextest-core> running 1 test
51.58 s
gammaloop-nextest-core> test cff::generation::tests_cff::thermal_bugblatter ... FAILED
51.58 s
gammaloop-nextest-core>
51.58 s
gammaloop-nextest-core> failures:
51.58 s
gammaloop-nextest-core>
51.58 s
gammaloop-nextest-core> failures:
51.58 s
gammaloop-nextest-core> cff::generation::tests_cff::thermal_bugblatter
51.58 s
gammaloop-nextest-core>
51.58 s
gammaloop-nextest-core> test result: FAILED. 0 passed; 1 failed; 0 ignored; 0 measured; 535 filtered out; finished in 21.15s
51.58 s
gammaloop-nextest-core>
51.58 s
gammaloop-nextest-core> stderr ---
51.58 s
gammaloop-nextest-core>
51.58 s
gammaloop-nextest-core> thread 'cff::generation::tests_cff::thermal_bugblatter' (1276) panicked at /nix/store/1sigmg52bb61pfngmk9k8wq5fz9r7bf1-vendor-cargo-deps/5929dab090e556a579e9f3b708cd2e67c60b3d84a12b5a276f2a36cb00473133/symbolica-2.2.0/src/evaluate/evaluator.rs:295:21:
51.58 s
gammaloop-nextest-core> External function 'symbolica_coth' does not have an implementation for gammalooprs::utils::F<f64>
51.58 s
gammaloop-nextest-core> stack backtrace:
51.58 s
gammaloop-nextest-core> 0: __rustc::rust_begin_unwind
51.58 s
gammaloop-nextest-core> 1: core::panicking::panic_fmt
51.58 s
gammaloop-nextest-core> 2: <symbolica::evaluate::evaluator::ExpressionEvaluator<gammalooprs::utils::F<f64>>>::evaluate_impl_no_ops
51.58 s
gammaloop-nextest-core> 3: <symbolica::evaluate::evaluator::ExpressionEvaluator<gammalooprs::utils::F<f64>>>::evaluate_single
51.58 s
gammaloop-nextest-core> 4: gammalooprs::cff::generation::tests_cff::thermal_bugblatter
51.58 s
gammaloop-nextest-core> 5: <gammalooprs::cff::generation::tests_cff::thermal_bugblatter::{closure#0} as core::ops::function::FnOnce<()>>::call_once
51.58 s
gammaloop-nextest-core> note: Some details are omitted, run with `RUST_BACKTRACE=full` for a verbose backtrace.
51.58 s
gammaloop-nextest-core>
51.68 s
gammaloop-nextest-core> error : test run failed
51.74 s
gammaloop-nextest-core>
51.74 s
gammaloop-nextest-core> ========== nextest test summary ==========
51.74 s
gammaloop-nextest-core> report: target/nextest/ci_gammaloop/junit.xml
51.74 s
gammaloop-nextest-core> tests: 483, failures: 7, errors: 0
51.74 s
gammaloop-nextest-core>
51.74 s
gammaloop-nextest-core> 1. gammalooprs::cff::generation::tests_cff::thermal_bubble_chain
51.74 s
gammaloop-nextest-core> failure: test failure with exit code 101
51.74 s
gammaloop-nextest-core> thread 'cff::generation::tests_cff::thermal_bubble_chain' (1271) panicked at /nix/store/1sigmg52bb61pfngmk9k8wq5fz9r7bf1-vendor-cargo-deps/5929dab090e556a579e9f3b708cd2e67c60b3d84a12b5a276f2a36cb00473133/symbolica-2.2.0/src/evaluate/evaluator.rs:295:21:
51.74 s
gammaloop-nextest-core> External function 'symbolica_coth' does not have an implementation for gammalooprs::utils::F<f64>
51.74 s
gammaloop-nextest-core> stack backtrace:
51.74 s
gammaloop-nextest-core> 0: __rustc::rust_begin_unwind
51.74 s
gammaloop-nextest-core> 1: core::panicking::panic_fmt
51.74 s
gammaloop-nextest-core> 2: <symbolica::evaluate::evaluator::ExpressionEvaluator<gammalooprs::utils::F<f64>>>::evaluate_impl_no_ops
51.74 s
gammaloop-nextest-core> 3: <symbolica::evaluate::evaluator::ExpressionEvaluator<gammalooprs::utils::F<f64>>>::evaluate_single
51.74 s
gammaloop-nextest-core> 4: gammalooprs::cff::generation::tests_cff::thermal_bubble_chain
51.74 s
gammaloop-nextest-core> 5: <gammalooprs::cff::generation::tests_cff::thermal_bubble_chain::{closure#0} as core::ops::function::FnOnce<()>>::call_once
51.74 s
gammaloop-nextest-core> note: Some details are omitted, run with `RUST_BACKTRACE=full` for a verbose backtrace.
51.74 s
gammaloop-nextest-core> system-out
51.74 s
gammaloop-nextest-core> running 1 test
51.74 s
gammaloop-nextest-core> test cff::generation::tests_cff::thermal_bubble_chain ... FAILED
51.74 s
gammaloop-nextest-core>
51.74 s
gammaloop-nextest-core> failures:
51.74 s
gammaloop-nextest-core>
51.74 s
gammaloop-nextest-core> failures:
51.74 s
gammaloop-nextest-core> cff::generation::tests_cff::thermal_bubble_chain
51.74 s
gammaloop-nextest-core>
51.74 s
gammaloop-nextest-core> test result: FAILED. 0 passed; 1 failed; 0 ignored; 0 measured; 535 filtered out; finished in 0.01s
51.74 s
gammaloop-nextest-core> system-err
51.74 s
gammaloop-nextest-core> thread 'cff::generation::tests_cff::thermal_bubble_chain' (1271) panicked at /nix/store/1sigmg52bb61pfngmk9k8wq5fz9r7bf1-vendor-cargo-deps/5929dab090e556a579e9f3b708cd2e67c60b3d84a12b5a276f2a36cb00473133/symbolica-2.2.0/src/evaluate/evaluator.rs:295:21:
51.74 s
gammaloop-nextest-core> External function 'symbolica_coth' does not have an implementation for gammalooprs::utils::F<f64>
51.74 s
gammaloop-nextest-core> stack backtrace:
51.74 s
gammaloop-nextest-core> 0: __rustc::rust_begin_unwind
51.74 s
gammaloop-nextest-core> 1: core::panicking::panic_fmt
51.74 s
gammaloop-nextest-core> 2: <symbolica::evaluate::evaluator::ExpressionEvaluator<gammalooprs::utils::F<f64>>>::evaluate_impl_no_ops
51.74 s
gammaloop-nextest-core> 3: <symbolica::evaluate::evaluator::ExpressionEvaluator<gammalooprs::utils::F<f64>>>::evaluate_single
51.74 s
gammaloop-nextest-core> 4: gammalooprs::cff::generation::tests_cff::thermal_bubble_chain
51.74 s
gammaloop-nextest-core> 5: <gammalooprs::cff::generation::tests_cff::thermal_bubble_chain::{closure#0} as core::ops::function::FnOnce<()>>::call_once
51.74 s
gammaloop-nextest-core> note: Some details are omitted, run with `RUST_BACKTRACE=full` for a verbose backtrace.
51.74 s
gammaloop-nextest-core>
51.74 s
gammaloop-nextest-core> 2. gammalooprs::cff::generation::tests_cff::thermal_bubble
51.74 s
gammaloop-nextest-core> failure: test failure with exit code 101
51.74 s
gammaloop-nextest-core> thread 'cff::generation::tests_cff::thermal_bubble' (1282) panicked at /nix/store/1sigmg52bb61pfngmk9k8wq5fz9r7bf1-vendor-cargo-deps/5929dab090e556a579e9f3b708cd2e67c60b3d84a12b5a276f2a36cb00473133/symbolica-2.2.0/src/evaluate/evaluator.rs:295:21:
51.74 s
gammaloop-nextest-core> External function 'symbolica_coth' does not have an implementation for gammalooprs::utils::F<f64>
51.74 s
gammaloop-nextest-core> stack backtrace:
51.74 s
gammaloop-nextest-core> 0: __rustc::rust_begin_unwind
51.74 s
gammaloop-nextest-core> 1: core::panicking::panic_fmt
51.74 s
gammaloop-nextest-core> 2: <symbolica::evaluate::evaluator::ExpressionEvaluator<gammalooprs::utils::F<f64>>>::evaluate_impl_no_ops
51.74 s
gammaloop-nextest-core> 3: <symbolica::evaluate::evaluator::ExpressionEvaluator<gammalooprs::utils::F<f64>>>::evaluate_single
51.74 s
gammaloop-nextest-core> 4: gammalooprs::cff::generation::tests_cff::thermal_bubble
51.74 s
gammaloop-nextest-core> 5: <gammalooprs::cff::generation::tests_cff::thermal_bubble::{closure#0} as core::ops::function::FnOnce<()>>::call_once
51.74 s
gammaloop-nextest-core> note: Some details are omitted, run with `RUST_BACKTRACE=full` for a verbose backtrace.
51.74 s
gammaloop-nextest-core> system-out
51.74 s
gammaloop-nextest-core> running 1 test
51.74 s
gammaloop-nextest-core> test cff::generation::tests_cff::thermal_bubble ... FAILED
51.74 s
gammaloop-nextest-core>
51.74 s
gammaloop-nextest-core> failures:
51.74 s
gammaloop-nextest-core>
51.74 s
gammaloop-nextest-core> failures:
51.74 s
gammaloop-nextest-core> cff::generation::tests_cff::thermal_bubble
51.74 s
gammaloop-nextest-core>
51.74 s
gammaloop-nextest-core> test result: FAILED. 0 passed; 1 failed; 0 ignored; 0 measured; 535 filtered out; finished in 0.01s
51.74 s
gammaloop-nextest-core> system-err
51.74 s
gammaloop-nextest-core> thread 'cff::generation::tests_cff::thermal_bubble' (1282) panicked at /nix/store/1sigmg52bb61pfngmk9k8wq5fz9r7bf1-vendor-cargo-deps/5929dab090e556a579e9f3b708cd2e67c60b3d84a12b5a276f2a36cb00473133/symbolica-2.2.0/src/evaluate/evaluator.rs:295:21:
51.74 s
gammaloop-nextest-core> External function 'symbolica_coth' does not have an implementation for gammalooprs::utils::F<f64>
51.74 s
gammaloop-nextest-core> stack backtrace:
51.74 s
gammaloop-nextest-core> 0: __rustc::rust_begin_unwind
51.74 s
gammaloop-nextest-core> 1: core::panicking::panic_fmt
51.74 s
gammaloop-nextest-core> 2: <symbolica::evaluate::evaluator::ExpressionEvaluator<gammalooprs::utils::F<f64>>>::evaluate_impl_no_ops
51.74 s
gammaloop-nextest-core> 3: <symbolica::evaluate::evaluator::ExpressionEvaluator<gammalooprs::utils::F<f64>>>::evaluate_single
51.74 s
gammaloop-nextest-core> 4: gammalooprs::cff::generation::tests_cff::thermal_bubble
51.74 s
gammaloop-nextest-core> 5: <gammalooprs::cff::generation::tests_cff::thermal_bubble::{closure#0} as core::ops::function::FnOnce<()>>::call_once
51.74 s
gammaloop-nextest-core> note: Some details are omitted, run with `RUST_BACKTRACE=full` for a verbose backtrace.
51.74 s
gammaloop-nextest-core>
51.74 s
gammaloop-nextest-core> 3. gammalooprs::cff::generation::tests_cff::thermal_eight
51.74 s
gammaloop-nextest-core> failure: test failure with exit code 101
51.74 s
gammaloop-nextest-core> thread 'cff::generation::tests_cff::thermal_eight' (1281) panicked at /nix/store/1sigmg52bb61pfngmk9k8wq5fz9r7bf1-vendor-cargo-deps/5929dab090e556a579e9f3b708cd2e67c60b3d84a12b5a276f2a36cb00473133/symbolica-2.2.0/src/evaluate/evaluator.rs:295:21:
51.74 s
gammaloop-nextest-core> External function 'symbolica_coth' does not have an implementation for gammalooprs::utils::F<f64>
51.74 s
gammaloop-nextest-core> stack backtrace:
51.74 s
gammaloop-nextest-core> 0: __rustc::rust_begin_unwind
51.74 s
gammaloop-nextest-core> 1: core::panicking::panic_fmt
51.74 s
gammaloop-nextest-core> 2: <symbolica::evaluate::evaluator::ExpressionEvaluator<gammalooprs::utils::F<f64>>>::evaluate_impl_no_ops
51.74 s
gammaloop-nextest-core> 3: <symbolica::evaluate::evaluator::ExpressionEvaluator<gammalooprs::utils::F<f64>>>::evaluate_single
51.74 s
gammaloop-nextest-core> 4: gammalooprs::cff::generation::tests_cff::thermal_eight
51.74 s
gammaloop-nextest-core> 5: <gammalooprs::cff::generation::tests_cff::thermal_eight::{closure#0} as core::ops::function::FnOnce<()>>::call_once
51.74 s
gammaloop-nextest-core> note: Some details are omitted, run with `RUST_BACKTRACE=full` for a verbose backtrace.
51.74 s
gammaloop-nextest-core> system-out
51.74 s
gammaloop-nextest-core> running 1 test
51.74 s
gammaloop-nextest-core> test cff::generation::tests_cff::thermal_eight ... FAILED
51.74 s
gammaloop-nextest-core>
51.74 s
gammaloop-nextest-core> failures:
51.74 s
gammaloop-nextest-core>
51.74 s
gammaloop-nextest-core> failures:
51.74 s
gammaloop-nextest-core> cff::generation::tests_cff::thermal_eight
51.74 s
gammaloop-nextest-core>
51.74 s
gammaloop-nextest-core> test result: FAILED. 0 passed; 1 failed; 0 ignored; 0 measured; 535 filtered out; finished in 0.02s
51.74 s
gammaloop-nextest-core> system-err
51.74 s
gammaloop-nextest-core> thread 'cff::generation::tests_cff::thermal_eight' (1281) panicked at /nix/store/1sigmg52bb61pfngmk9k8wq5fz9r7bf1-vendor-cargo-deps/5929dab090e556a579e9f3b708cd2e67c60b3d84a12b5a276f2a36cb00473133/symbolica-2.2.0/src/evaluate/evaluator.rs:295:21:
51.74 s
gammaloop-nextest-core> External function 'symbolica_coth' does not have an implementation for gammalooprs::utils::F<f64>
51.74 s
gammaloop-nextest-core> stack backtrace:
51.74 s
gammaloop-nextest-core> 0: __rustc::rust_begin_unwind
51.74 s
gammaloop-nextest-core> 1: core::panicking::panic_fmt
51.74 s
gammaloop-nextest-core> 2: <symbolica::evaluate::evaluator::ExpressionEvaluator<gammalooprs::utils::F<f64>>>::evaluate_impl_no_ops
51.74 s
gammaloop-nextest-core> 3: <symbolica::evaluate::evaluator::ExpressionEvaluator<gammalooprs::utils::F<f64>>>::evaluate_single
51.74 s
gammaloop-nextest-core> 4: gammalooprs::cff::generation::tests_cff::thermal_eight
51.74 s
gammaloop-nextest-core> 5: <gammalooprs::cff::generation::tests_cff::thermal_eight::{closure#0} as core::ops::function::FnOnce<()>>::call_once
51.74 s
gammaloop-nextest-core> note: Some details are omitted, run with `RUST_BACKTRACE=full` for a verbose backtrace.
51.74 s
gammaloop-nextest-core>
51.74 s
gammaloop-nextest-core> 4. gammalooprs::cff::generation::tests_cff::thermal_ring
51.74 s
gammaloop-nextest-core> failure: test failure with exit code 101
51.74 s
gammaloop-nextest-core> thread 'cff::generation::tests_cff::thermal_ring' (1300) panicked at /nix/store/1sigmg52bb61pfngmk9k8wq5fz9r7bf1-vendor-cargo-deps/5929dab090e556a579e9f3b708cd2e67c60b3d84a12b5a276f2a36cb00473133/symbolica-2.2.0/src/evaluate/evaluator.rs:295:21:
51.74 s
gammaloop-nextest-core> External function 'symbolica_coth' does not have an implementation for gammalooprs::utils::F<f64>
51.74 s
gammaloop-nextest-core> stack backtrace:
51.74 s
gammaloop-nextest-core> 0: __rustc::rust_begin_unwind
51.74 s
gammaloop-nextest-core> 1: core::panicking::panic_fmt
51.74 s
gammaloop-nextest-core> 2: <symbolica::evaluate::evaluator::ExpressionEvaluator<gammalooprs::utils::F<f64>>>::evaluate_impl_no_ops
51.74 s
gammaloop-nextest-core> 3: <symbolica::evaluate::evaluator::ExpressionEvaluator<gammalooprs::utils::F<f64>>>::evaluate_single
51.74 s
gammaloop-nextest-core> 4: gammalooprs::cff::generation::tests_cff::thermal_ring
51.74 s
gammaloop-nextest-core> 5: <gammalooprs::cff::generation::tests_cff::thermal_ring::{closure#0} as core::ops::function::FnOnce<()>>::call_once
51.74 s
gammaloop-nextest-core> note: Some details are omitted, run with `RUST_BACKTRACE=full` for a verbose backtrace.
51.74 s
gammaloop-nextest-core> system-out
51.74 s
gammaloop-nextest-core> running 1 test
51.74 s
gammaloop-nextest-core> test cff::generation::tests_cff::thermal_ring ... FAILED
51.74 s
gammaloop-nextest-core>
51.74 s
gammaloop-nextest-core> failures:
51.74 s
gammaloop-nextest-core>
51.74 s
gammaloop-nextest-core> failures:
51.74 s
gammaloop-nextest-core> cff::generation::tests_cff::thermal_ring
51.74 s
gammaloop-nextest-core>
51.74 s
gammaloop-nextest-core> test result: FAILED. 0 passed; 1 failed; 0 ignored; 0 measured; 535 filtered out; finished in 0.05s
51.74 s
gammaloop-nextest-core> system-err
51.74 s
gammaloop-nextest-core> thread 'cff::generation::tests_cff::thermal_ring' (1300) panicked at /nix/store/1sigmg52bb61pfngmk9k8wq5fz9r7bf1-vendor-cargo-deps/5929dab090e556a579e9f3b708cd2e67c60b3d84a12b5a276f2a36cb00473133/symbolica-2.2.0/src/evaluate/evaluator.rs:295:21:
51.74 s
gammaloop-nextest-core> External function 'symbolica_coth' does not have an implementation for gammalooprs::utils::F<f64>
51.74 s
gammaloop-nextest-core> stack backtrace:
51.74 s
gammaloop-nextest-core> 0: __rustc::rust_begin_unwind
51.74 s
gammaloop-nextest-core> 1: core::panicking::panic_fmt
51.74 s
gammaloop-nextest-core> 2: <symbolica::evaluate::evaluator::ExpressionEvaluator<gammalooprs::utils::F<f64>>>::evaluate_impl_no_ops
51.74 s
gammaloop-nextest-core> 3: <symbolica::evaluate::evaluator::ExpressionEvaluator<gammalooprs::utils::F<f64>>>::evaluate_single
51.74 s
gammaloop-nextest-core> 4: gammalooprs::cff::generation::tests_cff::thermal_ring
51.74 s
gammaloop-nextest-core> 5: <gammalooprs::cff::generation::tests_cff::thermal_ring::{closure#0} as core::ops::function::FnOnce<()>>::call_once
51.74 s
gammaloop-nextest-core> note: Some details are omitted, run with `RUST_BACKTRACE=full` for a verbose backtrace.
51.74 s
gammaloop-nextest-core>
51.74 s
gammaloop-nextest-core> 5. gammalooprs::cff::generation::tests_cff::thermal_mercedes
51.74 s
gammaloop-nextest-core> failure: test failure with exit code 101
51.74 s
gammaloop-nextest-core> thread 'cff::generation::tests_cff::thermal_mercedes' (1296) panicked at /nix/store/1sigmg52bb61pfngmk9k8wq5fz9r7bf1-vendor-cargo-deps/5929dab090e556a579e9f3b708cd2e67c60b3d84a12b5a276f2a36cb00473133/symbolica-2.2.0/src/evaluate/evaluator.rs:295:21:
51.74 s
gammaloop-nextest-core> External function 'symbolica_coth' does not have an implementation for gammalooprs::utils::F<f64>
51.74 s
gammaloop-nextest-core> stack backtrace:
51.74 s
gammaloop-nextest-core> 0: __rustc::rust_begin_unwind
51.74 s
gammaloop-nextest-core> 1: core::panicking::panic_fmt
51.74 s
gammaloop-nextest-core> 2: <symbolica::evaluate::evaluator::ExpressionEvaluator<gammalooprs::utils::F<f64>>>::evaluate_impl_no_ops
51.74 s
gammaloop-nextest-core> 3: <symbolica::evaluate::evaluator::ExpressionEvaluator<gammalooprs::utils::F<f64>>>::evaluate_single
51.74 s
gammaloop-nextest-core> 4: gammalooprs::cff::generation::tests_cff::thermal_mercedes
51.74 s
gammaloop-nextest-core> 5: <gammalooprs::cff::generation::tests_cff::thermal_mercedes::{closure#0} as core::ops::function::FnOnce<()>>::call_once
51.74 s
gammaloop-nextest-core> note: Some details are omitted, run with `RUST_BACKTRACE=full` for a verbose backtrace.
51.74 s
gammaloop-nextest-core> system-out
51.74 s
gammaloop-nextest-core> running 1 test
51.74 s
gammaloop-nextest-core> test cff::generation::tests_cff::thermal_mercedes ... FAILED
51.74 s
gammaloop-nextest-core>
51.74 s
gammaloop-nextest-core> failures:
51.74 s
gammaloop-nextest-core>
51.74 s
gammaloop-nextest-core> failures:
51.74 s
gammaloop-nextest-core> cff::generation::tests_cff::thermal_mercedes
51.74 s
gammaloop-nextest-core>
51.74 s
gammaloop-nextest-core> test result: FAILED. 0 passed; 1 failed; 0 ignored; 0 measured; 535 filtered out; finished in 0.43s
51.74 s
gammaloop-nextest-core> system-err
51.74 s
gammaloop-nextest-core> thread 'cff::generation::tests_cff::thermal_mercedes' (1296) panicked at /nix/store/1sigmg52bb61pfngmk9k8wq5fz9r7bf1-vendor-cargo-deps/5929dab090e556a579e9f3b708cd2e67c60b3d84a12b5a276f2a36cb00473133/symbolica-2.2.0/src/evaluate/evaluator.rs:295:21:
51.74 s
gammaloop-nextest-core> External function 'symbolica_coth' does not have an implementation for gammalooprs::utils::F<f64>
51.74 s
gammaloop-nextest-core> stack backtrace:
51.74 s
gammaloop-nextest-core> 0: __rustc::rust_begin_unwind
51.74 s
gammaloop-nextest-core> 1: core::panicking::panic_fmt
51.74 s
gammaloop-nextest-core> 2: <symbolica::evaluate::evaluator::ExpressionEvaluator<gammalooprs::utils::F<f64>>>::evaluate_impl_no_ops
51.74 s
gammaloop-nextest-core> 3: <symbolica::evaluate::evaluator::ExpressionEvaluator<gammalooprs::utils::F<f64>>>::evaluate_single
51.74 s
gammaloop-nextest-core> 4: gammalooprs::cff::generation::tests_cff::thermal_mercedes
51.74 s
gammaloop-nextest-core> 5: <gammalooprs::cff::generation::tests_cff::thermal_mercedes::{closure#0} as core::ops::function::FnOnce<()>>::call_once
51.74 s
gammaloop-nextest-core> note: Some details are omitted, run with `RUST_BACKTRACE=full` for a verbose backtrace.
51.74 s
gammaloop-nextest-core>
51.74 s
gammaloop-nextest-core> 6. gammalooprs::graph::feynman_graph::tests::native_thermal_distributions
51.74 s
gammaloop-nextest-core> failure: test failure with exit code 101
51.74 s
gammaloop-nextest-core> system-out
51.74 s
gammaloop-nextest-core> running 1 test
51.74 s
gammaloop-nextest-core> test graph::feynman_graph::tests::native_thermal_distributions ... FAILED
51.74 s
gammaloop-nextest-core>
51.74 s
gammaloop-nextest-core> failures:
51.74 s
gammaloop-nextest-core>
51.74 s
gammaloop-nextest-core> failures:
51.74 s
gammaloop-nextest-core> graph::feynman_graph::tests::native_thermal_distributions
51.74 s
gammaloop-nextest-core>
51.74 s
gammaloop-nextest-core> test result: FAILED. 0 passed; 1 failed; 0 ignored; 0 measured; 535 filtered out; finished in 1.65s
51.74 s
gammaloop-nextest-core> system-err
51.74 s
gammaloop-nextest-core> The application panicked (crashed).
51.74 s
gammaloop-nextest-core> Message: called `Result::unwrap()` on an `Err` value: Custom { kind: Other, error: "Could not compile code: g++ -shared -O3 -fPIC -ffast-math -funsafe-math-optimizations -march=native -o /build/gammaloop-native-thermal-1338/thermal_0_0.so /build/gammaloop-native-thermal-1338/thermal_0_0.cpp\nwarning: Skipping impure flag -march=native because NIX_ENFORCE_NO_NATIVE is set\n/build/gammaloop-native-thermal-1338/thermal_0_0.cpp: In function 'void thermal_realf64(const double*, double*, double*)':\n/build/gammaloop-native-thermal-1338/thermal_0_0.cpp:27:16: error: 'symbolica_tanh' was not declared in this scope\n 27 | Z[6] = symbolica_tanh(Z[6]);\n | ^~~~~~~~~~~~~~\n" }
51.74 s
gammaloop-nextest-core> Location: crates/gammalooprs/src/graph/feynman_graph.rs:937
51.74 s
gammaloop-nextest-core>
51.74 s
gammaloop-nextest-core> ━━━━━━━━━━━━━━━━━━━━━━━━━━━━━━━━━━ BACKTRACE ━━━━━━━━━━━━━━━━━━━━━━━━━━━━━━━━━━━
51.74 s
gammaloop-nextest-core> 1: <color_eyre[b0c9e66060e883b2]::config::PanicHook>::panic_report<unknown>
51.74 s
gammaloop-nextest-core> at <unknown source file>:<unknown line>
51.74 s
gammaloop-nextest-core> 2: <color_eyre[b0c9e66060e883b2]::config::PanicHook>::into_panic_hook::{closure#0}<unknown>
51.74 s
gammaloop-nextest-core> at <unknown source file>:<unknown line>
51.74 s
gammaloop-nextest-core> 3: std[bcb96dfbba0ab899]::panicking::panic_with_hook<unknown>
51.74 s
gammaloop-nextest-core> at <unknown source file>:<unknown line>
51.74 s
gammaloop-nextest-core> 4: std[bcb96dfbba0ab899]::panicking::panic_handler::{closure#0}<unknown>
51.74 s
gammaloop-nextest-core> at <unknown source file>:<unknown line>
51.74 s
gammaloop-nextest-core> 5: std[bcb96dfbba0ab899]::sys::backtrace::__rust_end_short_backtrace::<std[bcb96dfbba0ab899]::panicking::panic_handler::{closure#0}, !><unknown>
51.74 s
gammaloop-nextest-core> at <unknown source file>:<unknown line>
51.74 s
gammaloop-nextest-core> 6: __rustc[6c289b9f9c454d21]::rust_begin_unwind<unknown>
51.74 s
gammaloop-nextest-core> at <unknown source file>:<unknown line>
51.74 s
gammaloop-nextest-core> 7: core[940e698046960fd5]::panicking::panic_fmt<unknown>
51.74 s
gammaloop-nextest-core> at <unknown source file>:<unknown line>
51.74 s
gammaloop-nextest-core> 8: core[940e698046960fd5]::result::unwrap_failed<unknown>
51.74 s
gammaloop-nextest-core> at <unknown source file>:<unknown line>
51.74 s
gammaloop-nextest-core> 9: gammalooprs[5490727360442cce]::graph::feynman_graph::tests::native_thermal_distributions<unknown>
51.74 s
gammaloop-nextest-core> at <unknown source file>:<unknown line>
51.74 s
gammaloop-nextest-core> 10: <gammalooprs[5490727360442cce]::graph::feynman_graph::tests::native_thermal_distributions::{closure#0} as core[940e698046960fd5]::ops::function::FnOnce<()>>::call_once<unknown>
51.74 s
gammaloop-nextest-core> at <unknown source file>:<unknown line>
51.74 s
gammaloop-nextest-core> 11: test[75d6903177b1d7e9]::__rust_begin_short_backtrace::<core[940e698046960fd5]::result::Result<(), alloc[2ea6bcb46fca0c42]::string::String>, fn() -> core[940e698046960fd5]::result::Result<(), alloc[2ea6bcb46fca0c42]::string::String>><unknown>
51.74 s
gammaloop-nextest-core> at <unknown source file>:<unknown line>
51.74 s
gammaloop-nextest-core> 12: test[75d6903177b1d7e9]::run_test::{closure#0}<unknown>
51.74 s
gammaloop-nextest-core> at <unknown source file>:<unknown line>
51.74 s
gammaloop-nextest-core> 13: std[bcb96dfbba0ab899]::sys::backtrace::__rust_begin_short_backtrace::<test[75d6903177b1d7e9]::run_test::{closure#1}, ()><unknown>
51.74 s
gammaloop-nextest-core> at <unknown source file>:<unknown line>
51.74 s
gammaloop-nextest-core> 14: <std[bcb96dfbba0ab899]::thread::lifecycle::spawn_unchecked<test[75d6903177b1d7e9]::run_test::{closure#1}, ()>::{closure#1} as core[940e698046960fd5]::ops::function::FnOnce<()>>::call_once::{shim:vtable#0}<unknown>
51.74 s
gammaloop-nextest-core> at <unknown source file>:<unknown line>
51.74 s
gammaloop-nextest-core> 15: <std[bcb96dfbba0ab899]::sys::thread::unix::Thread>::new::thread_start<unknown>
51.74 s
gammaloop-nextest-core> at <unknown source file>:<unknown line>
51.74 s
gammaloop-nextest-core> 16: start_thread<unknown>
51.74 s
gammaloop-nextest-core> at <unknown source file>:<unknown line>
51.74 s
gammaloop-nextest-core> 17: __clone3<unknown>
51.74 s
gammaloop-nextest-core> at <unknown source file>:<unknown line>
51.74 s
gammaloop-nextest-core>
51.74 s
gammaloop-nextest-core> Run with COLORBT_SHOW_HIDDEN=1 environment variable to disable frame filtering.
51.74 s
gammaloop-nextest-core> Run with RUST_BACKTRACE=full to include source snippets.
51.74 s
gammaloop-nextest-core>
51.74 s
gammaloop-nextest-core> 7. gammalooprs::cff::generation::tests_cff::thermal_bugblatter
51.74 s
gammaloop-nextest-core> failure: test failure with exit code 101
51.74 s
gammaloop-nextest-core> thread 'cff::generation::tests_cff::thermal_bugblatter' (1276) panicked at /nix/store/1sigmg52bb61pfngmk9k8wq5fz9r7bf1-vendor-cargo-deps/5929dab090e556a579e9f3b708cd2e67c60b3d84a12b5a276f2a36cb00473133/symbolica-2.2.0/src/evaluate/evaluator.rs:295:21:
51.74 s
gammaloop-nextest-core> External function 'symbolica_coth' does not have an implementation for gammalooprs::utils::F<f64>
51.74 s
gammaloop-nextest-core> stack backtrace:
51.74 s
gammaloop-nextest-core> 0: __rustc::rust_begin_unwind
51.74 s
gammaloop-nextest-core> 1: core::panicking::panic_fmt
51.74 s
gammaloop-nextest-core> 2: <symbolica::evaluate::evaluator::ExpressionEvaluator<gammalooprs::utils::F<f64>>>::evaluate_impl_no_ops
51.74 s
gammaloop-nextest-core> 3: <symbolica::evaluate::evaluator::ExpressionEvaluator<gammalooprs::utils::F<f64>>>::evaluate_single
51.74 s
gammaloop-nextest-core> 4: gammalooprs::cff::generation::tests_cff::thermal_bugblatter
51.74 s
gammaloop-nextest-core> 5: <gammalooprs::cff::generation::tests_cff::thermal_bugblatter::{closure#0} as core::ops::function::FnOnce<()>>::call_once
51.74 s
gammaloop-nextest-core> note: Some details are omitted, run with `RUST_BACKTRACE=full` for a verbose backtrace.
51.74 s
gammaloop-nextest-core> system-out
51.74 s
gammaloop-nextest-core> running 1 test
51.74 s
gammaloop-nextest-core> test cff::generation::tests_cff::thermal_bugblatter ... FAILED
51.74 s
gammaloop-nextest-core>
51.74 s
gammaloop-nextest-core> failures:
51.74 s
gammaloop-nextest-core>
51.74 s
gammaloop-nextest-core> failures:
51.74 s
gammaloop-nextest-core> cff::generation::tests_cff::thermal_bugblatter
51.74 s
gammaloop-nextest-core>
51.74 s
gammaloop-nextest-core> test result: FAILED. 0 passed; 1 failed; 0 ignored; 0 measured; 535 filtered out; finished in 21.15s
51.74 s
gammaloop-nextest-core> system-err
51.74 s
gammaloop-nextest-core> thread 'cff::generation::tests_cff::thermal_bugblatter' (1276) panicked at /nix/store/1sigmg52bb61pfngmk9k8wq5fz9r7bf1-vendor-cargo-deps/5929dab090e556a579e9f3b708cd2e67c60b3d84a12b5a276f2a36cb00473133/symbolica-2.2.0/src/evaluate/evaluator.rs:295:21:
51.74 s
gammaloop-nextest-core> External function 'symbolica_coth' does not have an implementation for gammalooprs::utils::F<f64>
51.74 s
gammaloop-nextest-core> stack backtrace:
51.74 s
gammaloop-nextest-core> 0: __rustc::rust_begin_unwind
51.74 s
gammaloop-nextest-core> 1: core::panicking::panic_fmt
51.74 s
gammaloop-nextest-core> 2: <symbolica::evaluate::evaluator::ExpressionEvaluator<gammalooprs::utils::F<f64>>>::evaluate_impl_no_ops
51.74 s
gammaloop-nextest-core> 3: <symbolica::evaluate::evaluator::ExpressionEvaluator<gammalooprs::utils::F<f64>>>::evaluate_single
51.74 s
gammaloop-nextest-core> 4: gammalooprs::cff::generation::tests_cff::thermal_bugblatter
51.74 s
gammaloop-nextest-core> 5: <gammalooprs::cff::generation::tests_cff::thermal_bugblatter::{closure#0} as core::ops::function::FnOnce<()>>::call_once
51.74 s
gammaloop-nextest-core> note: Some details are omitted, run with `RUST_BACKTRACE=full` for a verbose backtrace.
51.74 s
gammaloop-nextest-core> =========================================
51.84 s
[0 built (1 failed )]error: Cannot build '/nix/store/4m6xcddxcb2ycplv2r6vd1qc57nv11md-gammaloop-nextest-core.drv '.
51.84 s
Reason: builder failed with exit code 100 .
51.84 s
Output paths:
51.84 s
/nix/store/k6a030dwps85a4jw4c4nah6vga1kas45-gammaloop-nextest-core
51.84 s
Last 738 log lines:
51.84 s
> Extracting 3 binaries (including 1 non-test binary), 1 build script output directory, and 2 linked paths to /build/nextest-archive-WBj1XP
51.84 s
> Extracted 18 files to /build/nextest-archive-WBj1XP in 0.70s
51.84 s
> ------------
51.84 s
> Nextest run ID 00105aa6-5128-4ed8-8bb3-95196a0172d4 with nextest profile: ci_gammaloop
51.84 s
> Starting 339 tests across 2 binaries
51.84 s
> ------------
51.84 s
> Summary [ 0.886s] 339 tests run: 339 passed , 0 skipped
51.84 s
>
51.84 s
> ========== nextest test summary ==========
51.84 s
> report: target/nextest/ci_gammaloop/junit.xml
51.84 s
> tests: 339, failures: 0, errors: 0
51.84 s
> No failing testcases found.
51.84 s
> =========================================
51.84 s
> Extracting 1 binary and 1 linked path to /build/nextest-archive-WcbpHJ
51.84 s
> Extracted 7 files to /build/nextest-archive-WcbpHJ in 0.09s
51.84 s
> ------------
51.84 s
> Nextest run ID 0412c7bd-e978-4748-b6d3-5b74cae3cdc4 with nextest profile: ci_gammaloop
51.84 s
> Starting 19 tests across 1 binary
51.84 s
> ------------
51.84 s
> Summary [ 0.057s] 19 tests run: 19 passed , 0 skipped
51.84 s
>
51.84 s
> ========== nextest test summary ==========
51.84 s
> report: target/nextest/ci_gammaloop/junit.xml
51.84 s
> tests: 19, failures: 0, errors: 0
51.84 s
> No failing testcases found.
51.84 s
> =========================================
51.84 s
> Extracting 1 binary to /build/nextest-archive-qJcgg5
51.84 s
> Extracted 4 files to /build/nextest-archive-qJcgg5 in 0.06s
51.84 s
> ------------
51.84 s
> Nextest run ID 97f49356-59c2-4a37-924c-a78917712a49 with nextest profile: ci_gammaloop
51.84 s
> Starting 0 tests across 1 binary
51.84 s
> ------------
51.84 s
> Summary [ 0.005s] 0 tests run: 0 passed , 0 skipped
51.84 s
>
51.84 s
> ========== nextest test summary ==========
51.84 s
> report: target/nextest/ci_gammaloop/junit.xml
51.84 s
> tests: 0, failures: 0, errors: 0
51.84 s
> No failing testcases found.
51.84 s
> =========================================
51.84 s
> Extracting 4 binaries, 1 build script output directory, and 2 linked paths to /build/nextest-archive-ODiQiD
51.84 s
> Extracted 18 files to /build/nextest-archive-ODiQiD in 0.73s
51.84 s
> ------------
51.84 s
> Nextest run ID cd5ff5c2-9bca-4e36-9540-a1030804533b with nextest profile: ci_gammaloop
51.84 s
> Starting 483 tests across 4 binaries (61 tests skipped , including 60 tests via profile.ci_gammaloop.default-filter )
51.84 s
> FAIL [ 0.024s] ( 43/483) gammalooprs cff::generation::tests_cff :: thermal_bubble_chain
51.84 s
> stdout ---
51.84 s
>
51.84 s
> running 1 test
51.84 s
> test cff::generation::tests_cff::thermal_bubble_chain ... FAILED
51.84 s
>
51.84 s
> failures:
51.84 s
>
51.84 s
> failures:
51.84 s
> cff::generation::tests_cff::thermal_bubble_chain
51.84 s
>
51.84 s
> test result: FAILED. 0 passed; 1 failed; 0 ignored; 0 measured; 535 filtered out; finished in 0.01s
51.84 s
>
51.84 s
> stderr ---
51.84 s
>
51.84 s
> thread 'cff::generation::tests_cff::thermal_bubble_chain' (1271) panicked at /nix/store/1sigmg52bb61pfngmk9k8wq5fz9r7bf1-vendor-cargo-deps/5929dab090e556a579e9f3b708cd2e67c60b3d84a12b5a276f2a36cb00473133/symbolica-2.2.0/src/evaluate/evaluator.rs:295:21:
51.84 s
> External function 'symbolica_coth' does not have an implementation for gammalooprs::utils::F<f64>
51.84 s
> stack backtrace:
51.84 s
> 0: __rustc::rust_begin_unwind
51.84 s
> 1: core::panicking::panic_fmt
51.84 s
> 2: <symbolica::evaluate::evaluator::ExpressionEvaluator<gammalooprs::utils::F<f64>>>::evaluate_impl_no_ops
51.84 s
> 3: <symbolica::evaluate::evaluator::ExpressionEvaluator<gammalooprs::utils::F<f64>>>::evaluate_single
51.84 s
> 4: gammalooprs::cff::generation::tests_cff::thermal_bubble_chain
51.84 s
> 5: <gammalooprs::cff::generation::tests_cff::thermal_bubble_chain::{closure#0} as core::ops::function::FnOnce<()>>::call_once
51.84 s
> note: Some details are omitted, run with `RUST_BACKTRACE=full` for a verbose backtrace.
51.84 s
>
51.84 s
> FAIL [ 0.028s] ( 46/483) gammalooprs cff::generation::tests_cff :: thermal_bubble
51.84 s
> stdout ---
51.84 s
>
51.84 s
> running 1 test
51.84 s
> test cff::generation::tests_cff::thermal_bubble ... FAILED
51.84 s
>
51.84 s
> failures:
51.84 s
>
51.84 s
> failures:
51.84 s
> cff::generation::tests_cff::thermal_bubble
51.84 s
>
51.84 s
> test result: FAILED. 0 passed; 1 failed; 0 ignored; 0 measured; 535 filtered out; finished in 0.01s
51.84 s
>
51.84 s
> stderr ---
51.84 s
>
51.84 s
> thread 'cff::generation::tests_cff::thermal_bubble' (1282) panicked at /nix/store/1sigmg52bb61pfngmk9k8wq5fz9r7bf1-vendor-cargo-deps/5929dab090e556a579e9f3b708cd2e67c60b3d84a12b5a276f2a36cb00473133/symbolica-2.2.0/src/evaluate/evaluator.rs:295:21:
51.84 s
> External function 'symbolica_coth' does not have an implementation for gammalooprs::utils::F<f64>
51.84 s
> stack backtrace:
51.84 s
> 0: __rustc::rust_begin_unwind
51.84 s
> 1: core::panicking::panic_fmt
51.84 s
> 2: <symbolica::evaluate::evaluator::ExpressionEvaluator<gammalooprs::utils::F<f64>>>::evaluate_impl_no_ops
51.84 s
> 3: <symbolica::evaluate::evaluator::ExpressionEvaluator<gammalooprs::utils::F<f64>>>::evaluate_single
51.84 s
> 4: gammalooprs::cff::generation::tests_cff::thermal_bubble
51.84 s
> 5: <gammalooprs::cff::generation::tests_cff::thermal_bubble::{closure#0} as core::ops::function::FnOnce<()>>::call_once
51.84 s
> note: Some details are omitted, run with `RUST_BACKTRACE=full` for a verbose backtrace.
51.84 s
>
51.84 s
> FAIL [ 0.032s] ( 48/483) gammalooprs cff::generation::tests_cff :: thermal_eight
51.84 s
> stdout ---
51.84 s
>
51.84 s
> running 1 test
51.84 s
> test cff::generation::tests_cff::thermal_eight ... FAILED
51.84 s
>
51.84 s
> failures:
51.84 s
>
51.84 s
> failures:
51.84 s
> cff::generation::tests_cff::thermal_eight
51.84 s
>
51.84 s
> test result: FAILED. 0 passed; 1 failed; 0 ignored; 0 measured; 535 filtered out; finished in 0.02s
51.84 s
>
51.84 s
> stderr ---
51.84 s
>
51.84 s
> thread 'cff::generation::tests_cff::thermal_eight' (1281) panicked at /nix/store/1sigmg52bb61pfngmk9k8wq5fz9r7bf1-vendor-cargo-deps/5929dab090e556a579e9f3b708cd2e67c60b3d84a12b5a276f2a36cb00473133/symbolica-2.2.0/src/evaluate/evaluator.rs:295:21:
51.84 s
> External function 'symbolica_coth' does not have an implementation for gammalooprs::utils::F<f64>
51.84 s
> stack backtrace:
51.84 s
> 0: __rustc::rust_begin_unwind
51.84 s
> 1: core::panicking::panic_fmt
51.84 s
> 2: <symbolica::evaluate::evaluator::ExpressionEvaluator<gammalooprs::utils::F<f64>>>::evaluate_impl_no_ops
51.84 s
> 3: <symbolica::evaluate::evaluator::ExpressionEvaluator<gammalooprs::utils::F<f64>>>::evaluate_single
51.84 s
> 4: gammalooprs::cff::generation::tests_cff::thermal_eight
51.84 s
> 5: <gammalooprs::cff::generation::tests_cff::thermal_eight::{closure#0} as core::ops::function::FnOnce<()>>::call_once
51.84 s
> note: Some details are omitted, run with `RUST_BACKTRACE=full` for a verbose backtrace.
51.84 s
>
51.84 s
> FAIL [ 0.074s] ( 72/483) gammalooprs cff::generation::tests_cff :: thermal_ring
51.84 s
> stdout ---
51.84 s
>
51.84 s
> running 1 test
51.84 s
> test cff::generation::tests_cff::thermal_ring ... FAILED
51.84 s
>
51.84 s
> failures:
51.84 s
>
51.84 s
> failures:
51.84 s
> cff::generation::tests_cff::thermal_ring
51.84 s
>
51.84 s
> test result: FAILED. 0 passed; 1 failed; 0 ignored; 0 measured; 535 filtered out; finished in 0.05s
51.84 s
>
51.84 s
> stderr ---
51.84 s
>
51.84 s
> thread 'cff::generation::tests_cff::thermal_ring' (1300) panicked at /nix/store/1sigmg52bb61pfngmk9k8wq5fz9r7bf1-vendor-cargo-deps/5929dab090e556a579e9f3b708cd2e67c60b3d84a12b5a276f2a36cb00473133/symbolica-2.2.0/src/evaluate/evaluator.rs:295:21:
51.84 s
> External function 'symbolica_coth' does not have an implementation for gammalooprs::utils::F<f64>
51.84 s
> stack backtrace:
51.84 s
> 0: __rustc::rust_begin_unwind
51.84 s
> 1: core::panicking::panic_fmt
51.84 s
> 2: <symbolica::evaluate::evaluator::ExpressionEvaluator<gammalooprs::utils::F<f64>>>::evaluate_impl_no_ops
51.84 s
> 3: <symbolica::evaluate::evaluator::ExpressionEvaluator<gammalooprs::utils::F<f64>>>::evaluate_single
51.84 s
> 4: gammalooprs::cff::generation::tests_cff::thermal_ring
51.84 s
> 5: <gammalooprs::cff::generation::tests_cff::thermal_ring::{closure#0} as core::ops::function::FnOnce<()>>::call_once
51.84 s
> note: Some details are omitted, run with `RUST_BACKTRACE=full` for a verbose backtrace.
51.84 s
>
51.84 s
> FAIL [ 0.461s] ( 87/483) gammalooprs cff::generation::tests_cff :: thermal_mercedes
51.84 s
> stdout ---
51.84 s
>
51.84 s
> running 1 test
51.84 s
> test cff::generation::tests_cff::thermal_mercedes ... FAILED
51.84 s
>
51.84 s
> failures:
51.84 s
>
51.84 s
> failures:
51.84 s
> cff::generation::tests_cff::thermal_mercedes
51.84 s
>
51.84 s
> test result: FAILED. 0 passed; 1 failed; 0 ignored; 0 measured; 535 filtered out; finished in 0.43s
51.84 s
>
51.84 s
> stderr ---
51.84 s
>
51.84 s
> thread 'cff::generation::tests_cff::thermal_mercedes' (1296) panicked at /nix/store/1sigmg52bb61pfngmk9k8wq5fz9r7bf1-vendor-cargo-deps/5929dab090e556a579e9f3b708cd2e67c60b3d84a12b5a276f2a36cb00473133/symbolica-2.2.0/src/evaluate/evaluator.rs:295:21:
51.84 s
> External function 'symbolica_coth' does not have an implementation for gammalooprs::utils::F<f64>
51.84 s
> stack backtrace:
51.84 s
> 0: __rustc::rust_begin_unwind
51.84 s
> 1: core::panicking::panic_fmt
51.84 s
> 2: <symbolica::evaluate::evaluator::ExpressionEvaluator<gammalooprs::utils::F<f64>>>::evaluate_impl_no_ops
51.84 s
> 3: <symbolica::evaluate::evaluator::ExpressionEvaluator<gammalooprs::utils::F<f64>>>::evaluate_single
51.84 s
> 4: gammalooprs::cff::generation::tests_cff::thermal_mercedes
51.84 s
> 5: <gammalooprs::cff::generation::tests_cff::thermal_mercedes::{closure#0} as core::ops::function::FnOnce<()>>::call_once
51.84 s
> note: Some details are omitted, run with `RUST_BACKTRACE=full` for a verbose backtrace.
51.84 s
>
51.84 s
> FAIL [ 1.677s] (267/483) gammalooprs graph::feynman_graph::tests :: native_thermal_distributions
51.84 s
> stdout ---
51.84 s
>
51.84 s
> running 1 test
51.84 s
> test graph::feynman_graph::tests::native_thermal_distributions ... FAILED
51.84 s
>
51.84 s
> failures:
51.84 s
>
51.84 s
> failures:
51.84 s
> graph::feynman_graph::tests::native_thermal_distributions
51.84 s
>
51.84 s
> test result: FAILED. 0 passed; 1 failed; 0 ignored; 0 measured; 535 filtered out; finished in 1.65s
51.84 s
>
51.84 s
> stderr ---
51.84 s
> The application panicked (crashed).
51.84 s
> Message: called `Result::unwrap()` on an `Err` value: Custom { kind: Other, error: "Could not compile code: g++ -shared -O3 -fPIC -ffast-math -funsafe-math-optimizations -march=native -o /build/gammaloop-native-thermal-1338/thermal_0_0.so /build/gammaloop-native-thermal-1338/thermal_0_0.cpp\nwarning: Skipping impure flag -march=native because NIX_ENFORCE_NO_NATIVE is set\n/build/gammaloop-native-thermal-1338/thermal_0_0.cpp: In function 'void thermal_realf64(const double*, double*, double*)':\n/build/gammaloop-native-thermal-1338/thermal_0_0.cpp:27:16: error: 'symbolica_tanh' was not declared in this scope\n 27 | Z[6] = symbolica_tanh(Z[6]);\n | ^~~~~~~~~~~~~~\n" }
51.84 s
> Location: crates/gammalooprs/src/graph/feynman_graph.rs :937
51.84 s
>
51.84 s
> ━━━━━━━━━━━━━━━━━━━━━━━━━━━━━━━━━━ BACKTRACE ━━━━━━━━━━━━━━━━━━━━━━━━━━━━━━━━━━━
51.84 s
> 1: <color_eyre[b0c9e66060e883b2]::config::PanicHook>::panic_report <unknown>
51.84 s
> at <unknown source file> :<unknown line>
51.84 s
> 2: <color_eyre[b0c9e66060e883b2]::config::PanicHook>::into_panic_hook::{closure#0} <unknown>
51.84 s
> at <unknown source file> :<unknown line>
51.84 s
> 3: std[bcb96dfbba0ab899]::panicking::panic_with_hook <unknown>
51.84 s
> at <unknown source file> :<unknown line>
51.84 s
> 4: std[bcb96dfbba0ab899]::panicking::panic_handler::{closure#0} <unknown>
51.84 s
> at <unknown source file> :<unknown line>
51.84 s
> 5: std[bcb96dfbba0ab899]::sys::backtrace::__rust_end_short_backtrace::<std[bcb96dfbba0ab899]::panicking::panic_handler::{closure#0}, !> <unknown>
51.84 s
> at <unknown source file> :<unknown line>
51.84 s
> 6: __rustc[6c289b9f9c454d21]::rust_begin_unwind <unknown>
51.84 s
> at <unknown source file> :<unknown line>
51.84 s
> 7: core[940e698046960fd5]::panicking::panic_fmt <unknown>
51.84 s
> at <unknown source file> :<unknown line>
51.84 s
> 8: core[940e698046960fd5]::result::unwrap_failed <unknown>
51.84 s
> at <unknown source file> :<unknown line>
51.84 s
> 9: gammalooprs[5490727360442cce]::graph::feynman_graph::tests::native_thermal_distributions <unknown>
51.84 s
> at <unknown source file> :<unknown line>
51.84 s
> 10: <gammalooprs[5490727360442cce]::graph::feynman_graph::tests::native_thermal_distributions::{closure#0} as core[940e698046960fd5]::ops::function::FnOnce<()>>::call_once <unknown>
51.84 s
> at <unknown source file> :<unknown line>
51.84 s
> 11: test[75d6903177b1d7e9]::__rust_begin_short_backtrace::<core[940e698046960fd5]::result::Result<(), alloc[2ea6bcb46fca0c42]::string::String>, fn() -> core[940e698046960fd5]::result::Result<(), alloc[2ea6bcb46fca0c42]::string::String>> <unknown>
51.84 s
> at <unknown source file> :<unknown line>
51.84 s
> 12: test[75d6903177b1d7e9]::run_test::{closure#0} <unknown>
51.84 s
> at <unknown source file> :<unknown line>
51.84 s
> 13: std[bcb96dfbba0ab899]::sys::backtrace::__rust_begin_short_backtrace::<test[75d6903177b1d7e9]::run_test::{closure#1}, ()> <unknown>
51.84 s
> at <unknown source file> :<unknown line>
51.84 s
> 14: <std[bcb96dfbba0ab899]::thread::lifecycle::spawn_unchecked<test[75d6903177b1d7e9]::run_test::{closure#1}, ()>::{closure#1} as core[940e698046960fd5]::ops::function::FnOnce<()>>::call_once::{shim:vtable#0} <unknown>
51.84 s
> at <unknown source file> :<unknown line>
51.84 s
> 15: <std[bcb96dfbba0ab899]::sys::thread::unix::Thread>::new::thread_start <unknown>
51.84 s
> at <unknown source file> :<unknown line>
51.84 s
> 16: start_thread <unknown>
51.84 s
> at <unknown source file> :<unknown line>
51.84 s
> 17: __clone3 <unknown>
51.84 s
> at <unknown source file> :<unknown line>
51.84 s
>
51.84 s
> Run with COLORBT_SHOW_HIDDEN=1 environment variable to disable frame filtering.
51.84 s
> Run with RUST_BACKTRACE=full to include source snippets.
51.84 s
>
51.84 s
> FAIL [ 21.254s] (481/483) gammalooprs cff::generation::tests_cff :: thermal_bugblatter
51.84 s
> stdout ---
51.84 s
>
51.84 s
> running 1 test
51.84 s
> test cff::generation::tests_cff::thermal_bugblatter ... FAILED
51.84 s
>
51.84 s
> failures:
51.84 s
>
51.84 s
> failures:
51.84 s
> cff::generation::tests_cff::thermal_bugblatter
51.84 s
>
51.84 s
> test result: FAILED. 0 passed; 1 failed; 0 ignored; 0 measured; 535 filtered out; finished in 21.15s
51.84 s
>
51.84 s
> stderr ---
51.84 s
>
51.84 s
> thread 'cff::generation::tests_cff::thermal_bugblatter' (1276) panicked at /nix/store/1sigmg52bb61pfngmk9k8wq5fz9r7bf1-vendor-cargo-deps/5929dab090e556a579e9f3b708cd2e67c60b3d84a12b5a276f2a36cb00473133/symbolica-2.2.0/src/evaluate/evaluator.rs:295:21:
51.84 s
> External function 'symbolica_coth' does not have an implementation for gammalooprs::utils::F<f64>
51.84 s
> stack backtrace:
51.84 s
> 0: __rustc::rust_begin_unwind
51.84 s
> 1: core::panicking::panic_fmt
51.84 s
> 2: <symbolica::evaluate::evaluator::ExpressionEvaluator<gammalooprs::utils::F<f64>>>::evaluate_impl_no_ops
51.84 s
> 3: <symbolica::evaluate::evaluator::ExpressionEvaluator<gammalooprs::utils::F<f64>>>::evaluate_single
51.84 s
> 4: gammalooprs::cff::generation::tests_cff::thermal_bugblatter
51.84 s
> 5: <gammalooprs::cff::generation::tests_cff::thermal_bugblatter::{closure#0} as core::ops::function::FnOnce<()>>::call_once
51.84 s
> note: Some details are omitted, run with `RUST_BACKTRACE=full` for a verbose backtrace.
51.84 s
>
51.84 s
> ------------
51.84 s
> Summary [ 23.811s] 483 tests run: 476 passed , 7 failed , 61 skipped
51.84 s
> FAIL [ 0.024s] ( 43/483) gammalooprs cff::generation::tests_cff :: thermal_bubble_chain
51.84 s
> stdout ---
51.84 s
>
51.84 s
> running 1 test
51.84 s
> test cff::generation::tests_cff::thermal_bubble_chain ... FAILED
51.84 s
>
51.84 s
> failures:
51.84 s
>
51.84 s
> failures:
51.84 s
> cff::generation::tests_cff::thermal_bubble_chain
51.84 s
>
51.84 s
> test result: FAILED. 0 passed; 1 failed; 0 ignored; 0 measured; 535 filtered out; finished in 0.01s
51.84 s
>
51.84 s
> stderr ---
51.84 s
>
51.84 s
> thread 'cff::generation::tests_cff::thermal_bubble_chain' (1271) panicked at /nix/store/1sigmg52bb61pfngmk9k8wq5fz9r7bf1-vendor-cargo-deps/5929dab090e556a579e9f3b708cd2e67c60b3d84a12b5a276f2a36cb00473133/symbolica-2.2.0/src/evaluate/evaluator.rs:295:21:
51.84 s
> External function 'symbolica_coth' does not have an implementation for gammalooprs::utils::F<f64>
51.84 s
> stack backtrace:
51.84 s
> 0: __rustc::rust_begin_unwind
51.84 s
> 1: core::panicking::panic_fmt
51.84 s
> 2: <symbolica::evaluate::evaluator::ExpressionEvaluator<gammalooprs::utils::F<f64>>>::evaluate_impl_no_ops
51.84 s
> 3: <symbolica::evaluate::evaluator::ExpressionEvaluator<gammalooprs::utils::F<f64>>>::evaluate_single
51.84 s
> 4: gammalooprs::cff::generation::tests_cff::thermal_bubble_chain
51.84 s
> 5: <gammalooprs::cff::generation::tests_cff::thermal_bubble_chain::{closure#0} as core::ops::function::FnOnce<()>>::call_once
51.84 s
> note: Some details are omitted, run with `RUST_BACKTRACE=full` for a verbose backtrace.
51.84 s
>
51.84 s
> FAIL [ 0.028s] ( 46/483) gammalooprs cff::generation::tests_cff :: thermal_bubble
51.84 s
> stdout ---
51.84 s
>
51.84 s
> running 1 test
51.84 s
> test cff::generation::tests_cff::thermal_bubble ... FAILED
51.84 s
>
51.84 s
> failures:
51.84 s
>
51.84 s
> failures:
51.84 s
> cff::generation::tests_cff::thermal_bubble
51.84 s
>
51.84 s
> test result: FAILED. 0 passed; 1 failed; 0 ignored; 0 measured; 535 filtered out; finished in 0.01s
51.84 s
>
51.84 s
> stderr ---
51.84 s
>
51.84 s
> thread 'cff::generation::tests_cff::thermal_bubble' (1282) panicked at /nix/store/1sigmg52bb61pfngmk9k8wq5fz9r7bf1-vendor-cargo-deps/5929dab090e556a579e9f3b708cd2e67c60b3d84a12b5a276f2a36cb00473133/symbolica-2.2.0/src/evaluate/evaluator.rs:295:21:
51.84 s
> External function 'symbolica_coth' does not have an implementation for gammalooprs::utils::F<f64>
51.84 s
> stack backtrace:
51.84 s
> 0: __rustc::rust_begin_unwind
51.84 s
> 1: core::panicking::panic_fmt
51.84 s
> 2: <symbolica::evaluate::evaluator::ExpressionEvaluator<gammalooprs::utils::F<f64>>>::evaluate_impl_no_ops
51.84 s
> 3: <symbolica::evaluate::evaluator::ExpressionEvaluator<gammalooprs::utils::F<f64>>>::evaluate_single
51.84 s
> 4: gammalooprs::cff::generation::tests_cff::thermal_bubble
51.84 s
> 5: <gammalooprs::cff::generation::tests_cff::thermal_bubble::{closure#0} as core::ops::function::FnOnce<()>>::call_once
51.84 s
> note: Some details are omitted, run with `RUST_BACKTRACE=full` for a verbose backtrace.
51.84 s
>
51.84 s
> FAIL [ 0.032s] ( 48/483) gammalooprs cff::generation::tests_cff :: thermal_eight
51.84 s
> stdout ---
51.84 s
>
51.84 s
> running 1 test
51.84 s
> test cff::generation::tests_cff::thermal_eight ... FAILED
51.84 s
>
51.84 s
> failures:
51.84 s
>
51.84 s
> failures:
51.84 s
> cff::generation::tests_cff::thermal_eight
51.84 s
>
51.84 s
> test result: FAILED. 0 passed; 1 failed; 0 ignored; 0 measured; 535 filtered out; finished in 0.02s
51.84 s
>
51.84 s
> stderr ---
51.84 s
>
51.84 s
> thread 'cff::generation::tests_cff::thermal_eight' (1281) panicked at /nix/store/1sigmg52bb61pfngmk9k8wq5fz9r7bf1-vendor-cargo-deps/5929dab090e556a579e9f3b708cd2e67c60b3d84a12b5a276f2a36cb00473133/symbolica-2.2.0/src/evaluate/evaluator.rs:295:21:
51.84 s
> External function 'symbolica_coth' does not have an implementation for gammalooprs::utils::F<f64>
51.84 s
> stack backtrace:
51.84 s
> 0: __rustc::rust_begin_unwind
51.84 s
> 1: core::panicking::panic_fmt
51.84 s
> 2: <symbolica::evaluate::evaluator::ExpressionEvaluator<gammalooprs::utils::F<f64>>>::evaluate_impl_no_ops
51.84 s
> 3: <symbolica::evaluate::evaluator::ExpressionEvaluator<gammalooprs::utils::F<f64>>>::evaluate_single
51.84 s
> 4: gammalooprs::cff::generation::tests_cff::thermal_eight
51.84 s
> 5: <gammalooprs::cff::generation::tests_cff::thermal_eight::{closure#0} as core::ops::function::FnOnce<()>>::call_once
51.84 s
> note: Some details are omitted, run with `RUST_BACKTRACE=full` for a verbose backtrace.
51.84 s
>
51.84 s
> FAIL [ 0.074s] ( 72/483) gammalooprs cff::generation::tests_cff :: thermal_ring
51.84 s
> stdout ---
51.84 s
>
51.84 s
> running 1 test
51.84 s
> test cff::generation::tests_cff::thermal_ring ... FAILED
51.84 s
>
51.84 s
> failures:
51.84 s
>
51.84 s
> failures:
51.84 s
> cff::generation::tests_cff::thermal_ring
51.84 s
>
51.84 s
> test result: FAILED. 0 passed; 1 failed; 0 ignored; 0 measured; 535 filtered out; finished in 0.05s
51.84 s
>
51.84 s
> stderr ---
51.84 s
>
51.84 s
> thread 'cff::generation::tests_cff::thermal_ring' (1300) panicked at /nix/store/1sigmg52bb61pfngmk9k8wq5fz9r7bf1-vendor-cargo-deps/5929dab090e556a579e9f3b708cd2e67c60b3d84a12b5a276f2a36cb00473133/symbolica-2.2.0/src/evaluate/evaluator.rs:295:21:
51.84 s
> External function 'symbolica_coth' does not have an implementation for gammalooprs::utils::F<f64>
51.84 s
> stack backtrace:
51.84 s
> 0: __rustc::rust_begin_unwind
51.84 s
> 1: core::panicking::panic_fmt
51.84 s
> 2: <symbolica::evaluate::evaluator::ExpressionEvaluator<gammalooprs::utils::F<f64>>>::evaluate_impl_no_ops
51.84 s
> 3: <symbolica::evaluate::evaluator::ExpressionEvaluator<gammalooprs::utils::F<f64>>>::evaluate_single
51.84 s
> 4: gammalooprs::cff::generation::tests_cff::thermal_ring
51.84 s
> 5: <gammalooprs::cff::generation::tests_cff::thermal_ring::{closure#0} as core::ops::function::FnOnce<()>>::call_once
51.84 s
> note: Some details are omitted, run with `RUST_BACKTRACE=full` for a verbose backtrace.
51.84 s
>
51.84 s
> FAIL [ 0.461s] ( 87/483) gammalooprs cff::generation::tests_cff :: thermal_mercedes
51.84 s
> stdout ---
51.84 s
>
51.84 s
> running 1 test
51.84 s
> test cff::generation::tests_cff::thermal_mercedes ... FAILED
51.84 s
>
51.84 s
> failures:
51.84 s
>
51.84 s
> failures:
51.84 s
> cff::generation::tests_cff::thermal_mercedes
51.84 s
>
51.84 s
> test result: FAILED. 0 passed; 1 failed; 0 ignored; 0 measured; 535 filtered out; finished in 0.43s
51.84 s
>
51.84 s
> stderr ---
51.84 s
>
51.84 s
> thread 'cff::generation::tests_cff::thermal_mercedes' (1296) panicked at /nix/store/1sigmg52bb61pfngmk9k8wq5fz9r7bf1-vendor-cargo-deps/5929dab090e556a579e9f3b708cd2e67c60b3d84a12b5a276f2a36cb00473133/symbolica-2.2.0/src/evaluate/evaluator.rs:295:21:
51.84 s
> External function 'symbolica_coth' does not have an implementation for gammalooprs::utils::F<f64>
51.84 s
> stack backtrace:
51.84 s
> 0: __rustc::rust_begin_unwind
51.84 s
> 1: core::panicking::panic_fmt
51.84 s
> 2: <symbolica::evaluate::evaluator::ExpressionEvaluator<gammalooprs::utils::F<f64>>>::evaluate_impl_no_ops
51.84 s
> 3: <symbolica::evaluate::evaluator::ExpressionEvaluator<gammalooprs::utils::F<f64>>>::evaluate_single
51.84 s
> 4: gammalooprs::cff::generation::tests_cff::thermal_mercedes
51.84 s
> 5: <gammalooprs::cff::generation::tests_cff::thermal_mercedes::{closure#0} as core::ops::function::FnOnce<()>>::call_once
51.84 s
> note: Some details are omitted, run with `RUST_BACKTRACE=full` for a verbose backtrace.
51.84 s
>
51.84 s
> FAIL [ 1.677s] (267/483) gammalooprs graph::feynman_graph::tests :: native_thermal_distributions
51.84 s
> stdout ---
51.84 s
>
51.84 s
> running 1 test
51.84 s
> test graph::feynman_graph::tests::native_thermal_distributions ... FAILED
51.84 s
>
51.84 s
> failures:
51.84 s
>
51.84 s
> failures:
51.84 s
> graph::feynman_graph::tests::native_thermal_distributions
51.84 s
>
51.84 s
> test result: FAILED. 0 passed; 1 failed; 0 ignored; 0 measured; 535 filtered out; finished in 1.65s
51.84 s
>
51.84 s
> stderr ---
51.84 s
> The application panicked (crashed).
51.84 s
> Message: called `Result::unwrap()` on an `Err` value: Custom { kind: Other, error: "Could not compile code: g++ -shared -O3 -fPIC -ffast-math -funsafe-math-optimizations -march=native -o /build/gammaloop-native-thermal-1338/thermal_0_0.so /build/gammaloop-native-thermal-1338/thermal_0_0.cpp\nwarning: Skipping impure flag -march=native because NIX_ENFORCE_NO_NATIVE is set\n/build/gammaloop-native-thermal-1338/thermal_0_0.cpp: In function 'void thermal_realf64(const double*, double*, double*)':\n/build/gammaloop-native-thermal-1338/thermal_0_0.cpp:27:16: error: 'symbolica_tanh' was not declared in this scope\n 27 | Z[6] = symbolica_tanh(Z[6]);\n | ^~~~~~~~~~~~~~\n" }
51.84 s
> Location: crates/gammalooprs/src/graph/feynman_graph.rs :937
51.84 s
>
51.84 s
> ━━━━━━━━━━━━━━━━━━━━━━━━━━━━━━━━━━ BACKTRACE ━━━━━━━━━━━━━━━━━━━━━━━━━━━━━━━━━━━
51.84 s
> 1: <color_eyre[b0c9e66060e883b2]::config::PanicHook>::panic_report <unknown>
51.84 s
> at <unknown source file> :<unknown line>
51.84 s
> 2: <color_eyre[b0c9e66060e883b2]::config::PanicHook>::into_panic_hook::{closure#0} <unknown>
51.84 s
> at <unknown source file> :<unknown line>
51.84 s
> 3: std[bcb96dfbba0ab899]::panicking::panic_with_hook <unknown>
51.84 s
> at <unknown source file> :<unknown line>
51.84 s
> 4: std[bcb96dfbba0ab899]::panicking::panic_handler::{closure#0} <unknown>
51.84 s
> at <unknown source file> :<unknown line>
51.84 s
> 5: std[bcb96dfbba0ab899]::sys::backtrace::__rust_end_short_backtrace::<std[bcb96dfbba0ab899]::panicking::panic_handler::{closure#0}, !> <unknown>
51.84 s
> at <unknown source file> :<unknown line>
51.84 s
> 6: __rustc[6c289b9f9c454d21]::rust_begin_unwind <unknown>
51.84 s
> at <unknown source file> :<unknown line>
51.84 s
> 7: core[940e698046960fd5]::panicking::panic_fmt <unknown>
51.84 s
> at <unknown source file> :<unknown line>
51.84 s
> 8: core[940e698046960fd5]::result::unwrap_failed <unknown>
51.84 s
> at <unknown source file> :<unknown line>
51.84 s
> 9: gammalooprs[5490727360442cce]::graph::feynman_graph::tests::native_thermal_distributions <unknown>
51.84 s
> at <unknown source file> :<unknown line>
51.84 s
> 10: <gammalooprs[5490727360442cce]::graph::feynman_graph::tests::native_thermal_distributions::{closure#0} as core[940e698046960fd5]::ops::function::FnOnce<()>>::call_once <unknown>
51.84 s
> at <unknown source file> :<unknown line>
51.84 s
> 11: test[75d6903177b1d7e9]::__rust_begin_short_backtrace::<core[940e698046960fd5]::result::Result<(), alloc[2ea6bcb46fca0c42]::string::String>, fn() -> core[940e698046960fd5]::result::Result<(), alloc[2ea6bcb46fca0c42]::string::String>> <unknown>
51.84 s
> at <unknown source file> :<unknown line>
51.84 s
> 12: test[75d6903177b1d7e9]::run_test::{closure#0} <unknown>
51.84 s
> at <unknown source file> :<unknown line>
51.84 s
> 13: std[bcb96dfbba0ab899]::sys::backtrace::__rust_begin_short_backtrace::<test[75d6903177b1d7e9]::run_test::{closure#1}, ()> <unknown>
51.84 s
> at <unknown source file> :<unknown line>
51.84 s
> 14: <std[bcb96dfbba0ab899]::thread::lifecycle::spawn_unchecked<test[75d6903177b1d7e9]::run_test::{closure#1}, ()>::{closure#1} as core[940e698046960fd5]::ops::function::FnOnce<()>>::call_once::{shim:vtable#0} <unknown>
51.84 s
> at <unknown source file> :<unknown line>
51.84 s
> 15: <std[bcb96dfbba0ab899]::sys::thread::unix::Thread>::new::thread_start <unknown>
51.84 s
> at <unknown source file> :<unknown line>
51.84 s
> 16: start_thread <unknown>
51.84 s
> at <unknown source file> :<unknown line>
51.84 s
> 17: __clone3 <unknown>
51.84 s
> at <unknown source file> :<unknown line>
51.84 s
>
51.84 s
> Run with COLORBT_SHOW_HIDDEN=1 environment variable to disable frame filtering.
51.84 s
> Run with RUST_BACKTRACE=full to include source snippets.
51.84 s
>
51.84 s
> FAIL [ 21.254s] (481/483) gammalooprs cff::generation::tests_cff :: thermal_bugblatter
51.84 s
> stdout ---
51.84 s
>
51.84 s
> running 1 test
51.84 s
> test cff::generation::tests_cff::thermal_bugblatter ... FAILED
51.84 s
>
51.84 s
> failures:
51.84 s
>
51.84 s
> failures:
51.84 s
> cff::generation::tests_cff::thermal_bugblatter
51.84 s
>
51.84 s
> test result: FAILED. 0 passed; 1 failed; 0 ignored; 0 measured; 535 filtered out; finished in 21.15s
51.84 s
>
51.84 s
> stderr ---
51.84 s
>
51.84 s
> thread 'cff::generation::tests_cff::thermal_bugblatter' (1276) panicked at /nix/store/1sigmg52bb61pfngmk9k8wq5fz9r7bf1-vendor-cargo-deps/5929dab090e556a579e9f3b708cd2e67c60b3d84a12b5a276f2a36cb00473133/symbolica-2.2.0/src/evaluate/evaluator.rs:295:21:
51.84 s
> External function 'symbolica_coth' does not have an implementation for gammalooprs::utils::F<f64>
51.84 s
> stack backtrace:
51.84 s
> 0: __rustc::rust_begin_unwind
51.84 s
> 1: core::panicking::panic_fmt
51.84 s
> 2: <symbolica::evaluate::evaluator::ExpressionEvaluator<gammalooprs::utils::F<f64>>>::evaluate_impl_no_ops
51.84 s
> 3: <symbolica::evaluate::evaluator::ExpressionEvaluator<gammalooprs::utils::F<f64>>>::evaluate_single
51.84 s
> 4: gammalooprs::cff::generation::tests_cff::thermal_bugblatter
51.84 s
> 5: <gammalooprs::cff::generation::tests_cff::thermal_bugblatter::{closure#0} as core::ops::function::FnOnce<()>>::call_once
51.84 s
> note: Some details are omitted, run with `RUST_BACKTRACE=full` for a verbose backtrace.
51.84 s
>
51.84 s
> error : test run failed
51.84 s
>
51.84 s
> ========== nextest test summary ==========
51.84 s
> report: target/nextest/ci_gammaloop/junit.xml
51.84 s
> tests: 483, failures: 7, errors: 0
51.84 s
>
51.84 s
> 1. gammalooprs::cff::generation::tests_cff::thermal_bubble_chain
51.84 s
> failure: test failure with exit code 101
51.84 s
> thread 'cff::generation::tests_cff::thermal_bubble_chain' (1271) panicked at /nix/store/1sigmg52bb61pfngmk9k8wq5fz9r7bf1-vendor-cargo-deps/5929dab090e556a579e9f3b708cd2e67c60b3d84a12b5a276f2a36cb00473133/symbolica-2.2.0/src/evaluate/evaluator.rs:295:21:
51.84 s
> External function 'symbolica_coth' does not have an implementation for gammalooprs::utils::F<f64>
51.84 s
> stack backtrace:
51.84 s
> 0: __rustc::rust_begin_unwind
51.84 s
> 1: core::panicking::panic_fmt
51.84 s
> 2: <symbolica::evaluate::evaluator::ExpressionEvaluator<gammalooprs::utils::F<f64>>>::evaluate_impl_no_ops
51.84 s
> 3: <symbolica::evaluate::evaluator::ExpressionEvaluator<gammalooprs::utils::F<f64>>>::evaluate_single
51.84 s
> 4: gammalooprs::cff::generation::tests_cff::thermal_bubble_chain
51.84 s
> 5: <gammalooprs::cff::generation::tests_cff::thermal_bubble_chain::{closure#0} as core::ops::function::FnOnce<()>>::call_once
51.84 s
> note: Some details are omitted, run with `RUST_BACKTRACE=full` for a verbose backtrace.
51.84 s
> system-out
51.84 s
> running 1 test
51.84 s
> test cff::generation::tests_cff::thermal_bubble_chain ... FAILED
51.84 s
>
51.84 s
> failures:
51.84 s
>
51.84 s
> failures:
51.84 s
> cff::generation::tests_cff::thermal_bubble_chain
51.84 s
>
51.84 s
> test result: FAILED. 0 passed; 1 failed; 0 ignored; 0 measured; 535 filtered out; finished in 0.01s
51.84 s
> system-err
51.84 s
> thread 'cff::generation::tests_cff::thermal_bubble_chain' (1271) panicked at /nix/store/1sigmg52bb61pfngmk9k8wq5fz9r7bf1-vendor-cargo-deps/5929dab090e556a579e9f3b708cd2e67c60b3d84a12b5a276f2a36cb00473133/symbolica-2.2.0/src/evaluate/evaluator.rs:295:21:
51.84 s
> External function 'symbolica_coth' does not have an implementation for gammalooprs::utils::F<f64>
51.84 s
> stack backtrace:
51.84 s
> 0: __rustc::rust_begin_unwind
51.84 s
> 1: core::panicking::panic_fmt
51.84 s
> 2: <symbolica::evaluate::evaluator::ExpressionEvaluator<gammalooprs::utils::F<f64>>>::evaluate_impl_no_ops
51.84 s
> 3: <symbolica::evaluate::evaluator::ExpressionEvaluator<gammalooprs::utils::F<f64>>>::evaluate_single
51.84 s
> 4: gammalooprs::cff::generation::tests_cff::thermal_bubble_chain
51.84 s
> 5: <gammalooprs::cff::generation::tests_cff::thermal_bubble_chain::{closure#0} as core::ops::function::FnOnce<()>>::call_once
51.84 s
> note: Some details are omitted, run with `RUST_BACKTRACE=full` for a verbose backtrace.
51.84 s
>
51.84 s
> 2. gammalooprs::cff::generation::tests_cff::thermal_bubble
51.84 s
> failure: test failure with exit code 101
51.84 s
> thread 'cff::generation::tests_cff::thermal_bubble' (1282) panicked at /nix/store/1sigmg52bb61pfngmk9k8wq5fz9r7bf1-vendor-cargo-deps/5929dab090e556a579e9f3b708cd2e67c60b3d84a12b5a276f2a36cb00473133/symbolica-2.2.0/src/evaluate/evaluator.rs:295:21:
51.84 s
> External function 'symbolica_coth' does not have an implementation for gammalooprs::utils::F<f64>
51.84 s
> stack backtrace:
51.84 s
> 0: __rustc::rust_begin_unwind
51.84 s
> 1: core::panicking::panic_fmt
51.84 s
> 2: <symbolica::evaluate::evaluator::ExpressionEvaluator<gammalooprs::utils::F<f64>>>::evaluate_impl_no_ops
51.84 s
> 3: <symbolica::evaluate::evaluator::ExpressionEvaluator<gammalooprs::utils::F<f64>>>::evaluate_single
51.84 s
> 4: gammalooprs::cff::generation::tests_cff::thermal_bubble
51.84 s
> 5: <gammalooprs::cff::generation::tests_cff::thermal_bubble::{closure#0} as core::ops::function::FnOnce<()>>::call_once
51.84 s
> note: Some details are omitted, run with `RUST_BACKTRACE=full` for a verbose backtrace.
51.84 s
> system-out
51.84 s
> running 1 test
51.84 s
> test cff::generation::tests_cff::thermal_bubble ... FAILED
51.84 s
>
51.84 s
> failures:
51.84 s
>
51.84 s
> failures:
51.84 s
> cff::generation::tests_cff::thermal_bubble
51.84 s
>
51.84 s
> test result: FAILED. 0 passed; 1 failed; 0 ignored; 0 measured; 535 filtered out; finished in 0.01s
51.84 s
> system-err
51.84 s
> thread 'cff::generation::tests_cff::thermal_bubble' (1282) panicked at /nix/store/1sigmg52bb61pfngmk9k8wq5fz9r7bf1-vendor-cargo-deps/5929dab090e556a579e9f3b708cd2e67c60b3d84a12b5a276f2a36cb00473133/symbolica-2.2.0/src/evaluate/evaluator.rs:295:21:
51.84 s
> External function 'symbolica_coth' does not have an implementation for gammalooprs::utils::F<f64>
51.84 s
> stack backtrace:
51.84 s
> 0: __rustc::rust_begin_unwind
51.84 s
> 1: core::panicking::panic_fmt
51.84 s
> 2: <symbolica::evaluate::evaluator::ExpressionEvaluator<gammalooprs::utils::F<f64>>>::evaluate_impl_no_ops
51.84 s
> 3: <symbolica::evaluate::evaluator::ExpressionEvaluator<gammalooprs::utils::F<f64>>>::evaluate_single
51.84 s
> 4: gammalooprs::cff::generation::tests_cff::thermal_bubble
51.84 s
> 5: <gammalooprs::cff::generation::tests_cff::thermal_bubble::{closure#0} as core::ops::function::FnOnce<()>>::call_once
51.84 s
> note: Some details are omitted, run with `RUST_BACKTRACE=full` for a verbose backtrace.
51.84 s
>
51.84 s
> 3. gammalooprs::cff::generation::tests_cff::thermal_eight
51.84 s
> failure: test failure with exit code 101
51.84 s
> thread 'cff::generation::tests_cff::thermal_eight' (1281) panicked at /nix/store/1sigmg52bb61pfngmk9k8wq5fz9r7bf1-vendor-cargo-deps/5929dab090e556a579e9f3b708cd2e67c60b3d84a12b5a276f2a36cb00473133/symbolica-2.2.0/src/evaluate/evaluator.rs:295:21:
51.84 s
> External function 'symbolica_coth' does not have an implementation for gammalooprs::utils::F<f64>
51.84 s
> stack backtrace:
51.84 s
> 0: __rustc::rust_begin_unwind
51.84 s
> 1: core::panicking::panic_fmt
51.84 s
> 2: <symbolica::evaluate::evaluator::ExpressionEvaluator<gammalooprs::utils::F<f64>>>::evaluate_impl_no_ops
51.84 s
> 3: <symbolica::evaluate::evaluator::ExpressionEvaluator<gammalooprs::utils::F<f64>>>::evaluate_single
51.84 s
> 4: gammalooprs::cff::generation::tests_cff::thermal_eight
51.84 s
> 5: <gammalooprs::cff::generation::tests_cff::thermal_eight::{closure#0} as core::ops::function::FnOnce<()>>::call_once
51.84 s
> note: Some details are omitted, run with `RUST_BACKTRACE=full` for a verbose backtrace.
51.84 s
> system-out
51.84 s
> running 1 test
51.84 s
> test cff::generation::tests_cff::thermal_eight ... FAILED
51.84 s
>
51.84 s
> failures:
51.84 s
>
51.84 s
> failures:
51.84 s
> cff::generation::tests_cff::thermal_eight
51.84 s
>
51.84 s
> test result: FAILED. 0 passed; 1 failed; 0 ignored; 0 measured; 535 filtered out; finished in 0.02s
51.84 s
> system-err
51.84 s
> thread 'cff::generation::tests_cff::thermal_eight' (1281) panicked at /nix/store/1sigmg52bb61pfngmk9k8wq5fz9r7bf1-vendor-cargo-deps/5929dab090e556a579e9f3b708cd2e67c60b3d84a12b5a276f2a36cb00473133/symbolica-2.2.0/src/evaluate/evaluator.rs:295:21:
51.84 s
> External function 'symbolica_coth' does not have an implementation for gammalooprs::utils::F<f64>
51.84 s
> stack backtrace:
51.84 s
> 0: __rustc::rust_begin_unwind
51.84 s
> 1: core::panicking::panic_fmt
51.84 s
> 2: <symbolica::evaluate::evaluator::ExpressionEvaluator<gammalooprs::utils::F<f64>>>::evaluate_impl_no_ops
51.84 s
> 3: <symbolica::evaluate::evaluator::ExpressionEvaluator<gammalooprs::utils::F<f64>>>::evaluate_single
51.84 s
> 4: gammalooprs::cff::generation::tests_cff::thermal_eight
51.84 s
> 5: <gammalooprs::cff::generation::tests_cff::thermal_eight::{closure#0} as core::ops::function::FnOnce<()>>::call_once
51.84 s
> note: Some details are omitted, run with `RUST_BACKTRACE=full` for a verbose backtrace.
51.84 s
>
51.84 s
> 4. gammalooprs::cff::generation::tests_cff::thermal_ring
51.84 s
> failure: test failure with exit code 101
51.84 s
> thread 'cff::generation::tests_cff::thermal_ring' (1300) panicked at /nix/store/1sigmg52bb61pfngmk9k8wq5fz9r7bf1-vendor-cargo-deps/5929dab090e556a579e9f3b708cd2e67c60b3d84a12b5a276f2a36cb00473133/symbolica-2.2.0/src/evaluate/evaluator.rs:295:21:
51.84 s
> External function 'symbolica_coth' does not have an implementation for gammalooprs::utils::F<f64>
51.84 s
> stack backtrace:
51.84 s
> 0: __rustc::rust_begin_unwind
51.84 s
> 1: core::panicking::panic_fmt
51.84 s
> 2: <symbolica::evaluate::evaluator::ExpressionEvaluator<gammalooprs::utils::F<f64>>>::evaluate_impl_no_ops
51.84 s
> 3: <symbolica::evaluate::evaluator::ExpressionEvaluator<gammalooprs::utils::F<f64>>>::evaluate_single
51.84 s
> 4: gammalooprs::cff::generation::tests_cff::thermal_ring
51.84 s
> 5: <gammalooprs::cff::generation::tests_cff::thermal_ring::{closure#0} as core::ops::function::FnOnce<()>>::call_once
51.84 s
> note: Some details are omitted, run with `RUST_BACKTRACE=full` for a verbose backtrace.
51.84 s
> system-out
51.84 s
> running 1 test
51.84 s
> test cff::generation::tests_cff::thermal_ring ... FAILED
51.84 s
>
51.84 s
> failures:
51.84 s
>
51.84 s
> failures:
51.84 s
> cff::generation::tests_cff::thermal_ring
51.84 s
>
51.84 s
> test result: FAILED. 0 passed; 1 failed; 0 ignored; 0 measured; 535 filtered out; finished in 0.05s
51.84 s
> system-err
51.84 s
> thread 'cff::generation::tests_cff::thermal_ring' (1300) panicked at /nix/store/1sigmg52bb61pfngmk9k8wq5fz9r7bf1-vendor-cargo-deps/5929dab090e556a579e9f3b708cd2e67c60b3d84a12b5a276f2a36cb00473133/symbolica-2.2.0/src/evaluate/evaluator.rs:295:21:
51.84 s
> External function 'symbolica_coth' does not have an implementation for gammalooprs::utils::F<f64>
51.84 s
> stack backtrace:
51.84 s
> 0: __rustc::rust_begin_unwind
51.84 s
> 1: core::panicking::panic_fmt
51.84 s
> 2: <symbolica::evaluate::evaluator::ExpressionEvaluator<gammalooprs::utils::F<f64>>>::evaluate_impl_no_ops
51.84 s
> 3: <symbolica::evaluate::evaluator::ExpressionEvaluator<gammalooprs::utils::F<f64>>>::evaluate_single
51.84 s
> 4: gammalooprs::cff::generation::tests_cff::thermal_ring
51.84 s
> 5: <gammalooprs::cff::generation::tests_cff::thermal_ring::{closure#0} as core::ops::function::FnOnce<()>>::call_once
51.84 s
> note: Some details are omitted, run with `RUST_BACKTRACE=full` for a verbose backtrace.
51.84 s
>
51.84 s
> 5. gammalooprs::cff::generation::tests_cff::thermal_mercedes
51.84 s
> failure: test failure with exit code 101
51.84 s
> thread 'cff::generation::tests_cff::thermal_mercedes' (1296) panicked at /nix/store/1sigmg52bb61pfngmk9k8wq5fz9r7bf1-vendor-cargo-deps/5929dab090e556a579e9f3b708cd2e67c60b3d84a12b5a276f2a36cb00473133/symbolica-2.2.0/src/evaluate/evaluator.rs:295:21:
51.84 s
> External function 'symbolica_coth' does not have an implementation for gammalooprs::utils::F<f64>
51.84 s
> stack backtrace:
51.84 s
> 0: __rustc::rust_begin_unwind
51.84 s
> 1: core::panicking::panic_fmt
51.84 s
> 2: <symbolica::evaluate::evaluator::ExpressionEvaluator<gammalooprs::utils::F<f64>>>::evaluate_impl_no_ops
51.84 s
> 3: <symbolica::evaluate::evaluator::ExpressionEvaluator<gammalooprs::utils::F<f64>>>::evaluate_single
51.84 s
> 4: gammalooprs::cff::generation::tests_cff::thermal_mercedes
51.84 s
> 5: <gammalooprs::cff::generation::tests_cff::thermal_mercedes::{closure#0} as core::ops::function::FnOnce<()>>::call_once
51.84 s
> note: Some details are omitted, run with `RUST_BACKTRACE=full` for a verbose backtrace.
51.84 s
> system-out
51.84 s
> running 1 test
51.84 s
> test cff::generation::tests_cff::thermal_mercedes ... FAILED
51.84 s
>
51.84 s
> failures:
51.84 s
>
51.84 s
> failures:
51.84 s
> cff::generation::tests_cff::thermal_mercedes
51.84 s
>
51.84 s
> test result: FAILED. 0 passed; 1 failed; 0 ignored; 0 measured; 535 filtered out; finished in 0.43s
51.84 s
> system-err
51.84 s
> thread 'cff::generation::tests_cff::thermal_mercedes' (1296) panicked at /nix/store/1sigmg52bb61pfngmk9k8wq5fz9r7bf1-vendor-cargo-deps/5929dab090e556a579e9f3b708cd2e67c60b3d84a12b5a276f2a36cb00473133/symbolica-2.2.0/src/evaluate/evaluator.rs:295:21:
51.84 s
> External function 'symbolica_coth' does not have an implementation for gammalooprs::utils::F<f64>
51.84 s
> stack backtrace:
51.84 s
> 0: __rustc::rust_begin_unwind
51.84 s
> 1: core::panicking::panic_fmt
51.84 s
> 2: <symbolica::evaluate::evaluator::ExpressionEvaluator<gammalooprs::utils::F<f64>>>::evaluate_impl_no_ops
51.84 s
> 3: <symbolica::evaluate::evaluator::ExpressionEvaluator<gammalooprs::utils::F<f64>>>::evaluate_single
51.84 s
> 4: gammalooprs::cff::generation::tests_cff::thermal_mercedes
51.84 s
> 5: <gammalooprs::cff::generation::tests_cff::thermal_mercedes::{closure#0} as core::ops::function::FnOnce<()>>::call_once
51.84 s
> note: Some details are omitted, run with `RUST_BACKTRACE=full` for a verbose backtrace.
51.84 s
>
51.84 s
> 6. gammalooprs::graph::feynman_graph::tests::native_thermal_distributions
51.84 s
> failure: test failure with exit code 101
51.84 s
> system-out
51.84 s
> running 1 test
51.84 s
> test graph::feynman_graph::tests::native_thermal_distributions ... FAILED
51.84 s
>
51.84 s
> failures:
51.84 s
>
51.84 s
> failures:
51.84 s
> graph::feynman_graph::tests::native_thermal_distributions
51.84 s
>
51.84 s
> test result: FAILED. 0 passed; 1 failed; 0 ignored; 0 measured; 535 filtered out; finished in 1.65s
51.84 s
> system-err
51.84 s
> The application panicked (crashed).
51.84 s
> Message: called `Result::unwrap()` on an `Err` value: Custom { kind: Other, error: "Could not compile code: g++ -shared -O3 -fPIC -ffast-math -funsafe-math-optimizations -march=native -o /build/gammaloop-native-thermal-1338/thermal_0_0.so /build/gammaloop-native-thermal-1338/thermal_0_0.cpp\nwarning: Skipping impure flag -march=native because NIX_ENFORCE_NO_NATIVE is set\n/build/gammaloop-native-thermal-1338/thermal_0_0.cpp: In function 'void thermal_realf64(const double*, double*, double*)':\n/build/gammaloop-native-thermal-1338/thermal_0_0.cpp:27:16: error: 'symbolica_tanh' was not declared in this scope\n 27 | Z[6] = symbolica_tanh(Z[6]);\n | ^~~~~~~~~~~~~~\n" }
51.84 s
> Location: crates/gammalooprs/src/graph/feynman_graph.rs:937
51.84 s
>
51.84 s
> ━━━━━━━━━━━━━━━━━━━━━━━━━━━━━━━━━━ BACKTRACE ━━━━━━━━━━━━━━━━━━━━━━━━━━━━━━━━━━━
51.84 s
> 1: <color_eyre[b0c9e66060e883b2]::config::PanicHook>::panic_report<unknown>
51.84 s
> at <unknown source file>:<unknown line>
51.84 s
> 2: <color_eyre[b0c9e66060e883b2]::config::PanicHook>::into_panic_hook::{closure#0}<unknown>
51.84 s
> at <unknown source file>:<unknown line>
51.84 s
> 3: std[bcb96dfbba0ab899]::panicking::panic_with_hook<unknown>
51.84 s
> at <unknown source file>:<unknown line>
51.84 s
> 4: std[bcb96dfbba0ab899]::panicking::panic_handler::{closure#0}<unknown>
51.84 s
> at <unknown source file>:<unknown line>
51.84 s
> 5: std[bcb96dfbba0ab899]::sys::backtrace::__rust_end_short_backtrace::<std[bcb96dfbba0ab899]::panicking::panic_handler::{closure#0}, !><unknown>
51.84 s
> at <unknown source file>:<unknown line>
51.84 s
> 6: __rustc[6c289b9f9c454d21]::rust_begin_unwind<unknown>
51.84 s
> at <unknown source file>:<unknown line>
51.84 s
> 7: core[940e698046960fd5]::panicking::panic_fmt<unknown>
51.84 s
> at <unknown source file>:<unknown line>
51.84 s
> 8: core[940e698046960fd5]::result::unwrap_failed<unknown>
51.84 s
> at <unknown source file>:<unknown line>
51.84 s
> 9: gammalooprs[5490727360442cce]::graph::feynman_graph::tests::native_thermal_distributions<unknown>
51.84 s
> at <unknown source file>:<unknown line>
51.84 s
> 10: <gammalooprs[5490727360442cce]::graph::feynman_graph::tests::native_thermal_distributions::{closure#0} as core[940e698046960fd5]::ops::function::FnOnce<()>>::call_once<unknown>
51.84 s
> at <unknown source file>:<unknown line>
51.84 s
> 11: test[75d6903177b1d7e9]::__rust_begin_short_backtrace::<core[940e698046960fd5]::result::Result<(), alloc[2ea6bcb46fca0c42]::string::String>, fn() -> core[940e698046960fd5]::result::Result<(), alloc[2ea6bcb46fca0c42]::string::String>><unknown>
51.84 s
> at <unknown source file>:<unknown line>
51.84 s
> 12: test[75d6903177b1d7e9]::run_test::{closure#0}<unknown>
51.84 s
> at <unknown source file>:<unknown line>
51.84 s
> 13: std[bcb96dfbba0ab899]::sys::backtrace::__rust_begin_short_backtrace::<test[75d6903177b1d7e9]::run_test::{closure#1}, ()><unknown>
51.84 s
> at <unknown source file>:<unknown line>
51.84 s
> 14: <std[bcb96dfbba0ab899]::thread::lifecycle::spawn_unchecked<test[75d6903177b1d7e9]::run_test::{closure#1}, ()>::{closure#1} as core[940e698046960fd5]::ops::function::FnOnce<()>>::call_once::{shim:vtable#0}<unknown>
51.84 s
> at <unknown source file>:<unknown line>
51.84 s
> 15: <std[bcb96dfbba0ab899]::sys::thread::unix::Thread>::new::thread_start<unknown>
51.84 s
> at <unknown source file>:<unknown line>
51.84 s
> 16: start_thread<unknown>
51.84 s
> at <unknown source file>:<unknown line>
51.84 s
> 17: __clone3<unknown>
51.84 s
> at <unknown source file>:<unknown line>
51.84 s
>
51.84 s
> Run with COLORBT_SHOW_HIDDEN=1 environment variable to disable frame filtering.
51.84 s
> Run with RUST_BACKTRACE=full to include source snippets.
51.84 s
>
51.84 s
> 7. gammalooprs::cff::generation::tests_cff::thermal_bugblatter
51.84 s
> failure: test failure with exit code 101
51.84 s
> thread 'cff::generation::tests_cff::thermal_bugblatter' (1276) panicked at /nix/store/1sigmg52bb61pfngmk9k8wq5fz9r7bf1-vendor-cargo-deps/5929dab090e556a579e9f3b708cd2e67c60b3d84a12b5a276f2a36cb00473133/symbolica-2.2.0/src/evaluate/evaluator.rs:295:21:
51.84 s
> External function 'symbolica_coth' does not have an implementation for gammalooprs::utils::F<f64>
51.84 s
> stack backtrace:
51.84 s
> 0: __rustc::rust_begin_unwind
51.84 s
> 1: core::panicking::panic_fmt
51.84 s
> 2: <symbolica::evaluate::evaluator::ExpressionEvaluator<gammalooprs::utils::F<f64>>>::evaluate_impl_no_ops
51.84 s
> 3: <symbolica::evaluate::evaluator::ExpressionEvaluator<gammalooprs::utils::F<f64>>>::evaluate_single
51.84 s
> 4: gammalooprs::cff::generation::tests_cff::thermal_bugblatter
51.85 s
> 5: <gammalooprs::cff::generation::tests_cff::thermal_bugblatter::{closure#0} as core::ops::function::FnOnce<()>>::call_once
51.85 s
> note: Some details are omitted, run with `RUST_BACKTRACE=full` for a verbose backtrace.
51.85 s
> system-out
51.85 s
> running 1 test
51.85 s
> test cff::generation::tests_cff::thermal_bugblatter ... FAILED
51.85 s
>
51.85 s
> failures:
51.85 s
>
51.85 s
> failures:
51.85 s
> cff::generation::tests_cff::thermal_bugblatter
51.85 s
>
51.85 s
> test result: FAILED. 0 passed; 1 failed; 0 ignored; 0 measured; 535 filtered out; finished in 21.15s
51.85 s
> system-err
51.85 s
> thread 'cff::generation::tests_cff::thermal_bugblatter' (1276) panicked at /nix/store/1sigmg52bb61pfngmk9k8wq5fz9r7bf1-vendor-cargo-deps/5929dab090e556a579e9f3b708cd2e67c60b3d84a12b5a276f2a36cb00473133/symbolica-2.2.0/src/evaluate/evaluator.rs:295:21:
51.85 s
> External function 'symbolica_coth' does not have an implementation for gammalooprs::utils::F<f64>
51.85 s
> stack backtrace:
51.85 s
> 0: __rustc::rust_begin_unwind
51.85 s
> 1: core::panicking::panic_fmt
51.85 s
> 2: <symbolica::evaluate::evaluator::ExpressionEvaluator<gammalooprs::utils::F<f64>>>::evaluate_impl_no_ops
51.85 s
> 3: <symbolica::evaluate::evaluator::ExpressionEvaluator<gammalooprs::utils::F<f64>>>::evaluate_single
51.85 s
> 4: gammalooprs::cff::generation::tests_cff::thermal_bugblatter
51.85 s
> 5: <gammalooprs::cff::generation::tests_cff::thermal_bugblatter::{closure#0} as core::ops::function::FnOnce<()>>::call_once
51.85 s
> note: Some details are omitted, run with `RUST_BACKTRACE=full` for a verbose backtrace.
51.85 s
> =========================================
51.85 s
For full logs, run:
51.85 s
nix log /nix/store/4m6xcddxcb2ycplv2r6vd1qc57nv11md-gammaloop-nextest-core.drv
52.19 s
Run failed.