1. 0.71 s $ /nix/store/9ypz3flqsrl5xl495mm8h645gadjsxi1-coreutils-9.11/bin/timeout --kill-after=15s 7200s /nix/store/23zk8sgzamrbmj1fday15szf7f2279s8-nix-2.34.7/bin/nix --extra-experimental-features nix-command --extra-experimental-features flakes --log-format internal-json build --no-link --print-out-paths git+https://github.com/sellout/pathway?ref=more-system&rev=1ea193cbc6593071794981ca0dcd055e8eb42609&shallow=1#packages.x86_64-linux.ghc967_all --print-build-logs
  2. 2.44 s warning: ignoring untrusted flake configuration setting 'allow-import-from-derivation'.
  3. 2.44 s Pass '--accept-flake-config' to trust it
  4. 2.44 s warning: ignoring untrusted flake configuration setting 'extra-experimental-features'.
  5. 2.44 s Pass '--accept-flake-config' to trust it
  6. 2.44 s warning: ignoring untrusted flake configuration setting 'extra-substituters'.
  7. 2.44 s Pass '--accept-flake-config' to trust it
  8. 2.44 s warning: ignoring untrusted flake configuration setting 'extra-trusted-public-keys'.
  9. 2.44 s Pass '--accept-flake-config' to trust it
  10. 2.44 s warning: ignoring untrusted flake configuration setting 'sandbox'.
  11. 2.44 s Pass '--accept-flake-config' to trust it
  12. 2.44 s warning: ignoring untrusted flake configuration setting 'use-registries'.
  13. 2.44 s Pass '--accept-flake-config' to trust it
  14. 2.44 s error (ignored): SQLite database '/var/cache/nix-ci-worker/eval-cache-v6/7e8cef9f9a584f12750e4112f9919eb203f4dd515b08e08f130fffcf31865d0a.sqlite' is busy
  15. 2.45 s
  16. 2.53 s Downloading cached pathway-internal-0.0.1.0-doc from https://cache.nix-ci.com
  17. 2.54 s Downloaded cached pathway-internal-0.0.1.0-doc (576 KiB) in 10ms
  18. 2.54 s Progress: 0 of 22 built, 1 of 8 downloaded from cache
  19. 2.54 s Downloading cached pathway-0.0.1.0-doc from https://cache.nix-ci.com
  20. 2.54 s Downloading cached pathway-internal from https://cache.nix-ci.com
  21. 2.54 s Downloading cached pathway-quickcheck-0.0.1.0-doc from https://cache.nix-ci.com
  22. 2.55 s Downloaded cached pathway-quickcheck-0.0.1.0-doc (216 KiB) in 13ms
  23. 2.55 s Progress: 0 of 21 built, 2 of 8 downloaded from cache (2 downloading)
  24. 2.55 s Downloaded cached pathway-0.0.1.0-doc (1.3 MiB) in 14ms
  25. 2.55 s Progress: 0 of 20 built, 3 of 8 downloaded from cache (1 downloading)
  26. 2.56 s Downloading cached pathway-path-0.0.1.0-doc from https://cache.nix-ci.com
  27. 2.57 s Downloaded cached pathway-internal (2.1 MiB) in 29ms
  28. 2.57 s Progress: 0 of 19 built, 4 of 8 downloaded from cache (1 downloading)
  29. 2.57 s Downloaded cached pathway-path-0.0.1.0-doc (263 KiB) in 11ms
  30. 2.57 s Downloading cached pathway from https://cache.nix-ci.com
  31. 2.57 s Downloading cached pathway-quickcheck from https://cache.nix-ci.com
  32. 2.57 s Progress: 0 of 18 built, 5 of 8 downloaded from cache (2 downloading)
  33. 2.58 s Downloaded cached pathway-quickcheck (179 KiB) in 9ms
  34. 2.58 s Progress: 0 of 17 built, 6 of 8 downloaded from cache (1 downloading)
  35. 2.59 s Downloaded cached pathway (2.7 MiB) in 21ms
  36. 2.59 s Progress: 0 of 16 built, 7 of 8 downloaded from cache
  37. 2.59 s Downloading cached pathway-path from https://cache.nix-ci.com
  38. 2.60 s Downloaded cached pathway-path (217 KiB) in 7ms
  39. 2.68 s Building /nix/store/r05xgdsqgil1m6ii36zf017yqy13dwfp-pathway-compat-base-0.0.1.0.drv
  40. 2.68 s Progress: 0 of 15 built (1 building), 8 of 8 downloaded from cache
  41. 2.89 s [pathway-compat-base] Phase: setupCompilerEnvironmentPhase
  42. 2.89 s [pathway-compat-base] Build with /nix/store/2djpcnj8a25viv1y24h3mziy1gsy3fc6-ghc-9.6.7.
  43. 3.22 s [pathway-compat-base] Phase: unpackPhase
  44. 3.23 s [pathway-compat-base] unpacking source archive /nix/store/ga56x34386fcqgj51vg6p532znb23d3g-base
  45. 3.23 s [pathway-compat-base] source root is base
  46. 3.25 s [pathway-compat-base] Phase: patchPhase
  47. 3.26 s [pathway-compat-base] Phase: compileBuildDriverPhase
  48. 3.26 s [pathway-compat-base] setupCompileFlags: -package-db=/build/tmp.SZy7sWMTAV/setup-package.conf.d -threaded
  49. 3.31 s [pathway-compat-base] [1 of 2] Compiling Main ( Setup.hs, /build/tmp.SZy7sWMTAV/Main.o )
  50. 3.37 s [pathway-compat-base] [2 of 2] Linking Setup
  51. 4.59 s [pathway-compat-base] Phase: updateAutotoolsGnuConfigScriptsPhase
  52. 4.61 s [pathway-compat-base] Phase: configurePhase
  53. 4.61 s [pathway-compat-base] configureFlags: --verbose --prefix=/nix/store/5yds5x988kvqbm18q0b330g0bkq0b0il-pathway-compat-base-0.0.1.0 --libdir=$prefix/lib/$compiler/lib --libsubdir=$abi/$libname --docdir=/nix/store/n7rcgdpdya0npf6g7jk9lwq4a2jmx36d-pathway-compat-base-0.0.1.0-doc/share/doc/pathway-compat-base-0.0.1.0 --with-gcc=gcc --package-db=/build/tmp.SZy7sWMTAV/package.conf.d --ghc-option=-j16 --ghc-option=+RTS --ghc-option=-A64M --ghc-option=-RTS --enable-library-profiling --profiling-detail=exported-functions --disable-profiling --enable-shared --disable-coverage --enable-static --disable-executable-dynamic --enable-tests --disable-benchmarks --enable-library-vanilla --disable-library-for-ghci --enable-split-sections --enable-library-stripping --enable-executable-stripping --ghc-option=-haddock --ghc-options=-Werror --extra-lib-dirs=/nix/store/pndhkk0l649lm1sj0mxk7cbwq26qd1ra-ncurses-6.6/lib --extra-lib-dirs=/nix/store/0djlg4g0b81w94k3vcaqsxsc2hh4kism-libffi-3.5.2/lib --extra-lib-dirs=/nix/store/md4paia7riiggyrj8p24c7a6vf8w7jz8-elfutils-0.194/lib --extra-lib-dirs=/nix/store/39vv2pf64gd8li48a4hpbhw2crzd8z5p-gmp-with-cxx-6.3.0/lib --extra-lib-dirs=/nix/store/7wwvald8lapkrsr72qanlw8blyn55ifx-numactl-2.0.18/lib --extra-lib-dirs=/nix/store/2djpcnj8a25viv1y24h3mziy1gsy3fc6-ghc-9.6.7/lib
  54. 4.62 s [pathway-compat-base] Using Parsec parser
  55. 4.62 s [pathway-compat-base] Configuring pathway-compat-base-0.0.1.0...
  56. 5.01 s [pathway-compat-base] Flags chosen: noisy-deprecations=True, verify-no-recursion=False
  57. 5.01 s [pathway-compat-base] Dependency base >=4.14.0 && <4.15 || >=4.15.0 && <4.16 || >=4.16.0 && <4.17 ||
  58. 5.01 s [pathway-compat-base] >=4.17.0 && <4.18 || >=4.18.0 && <4.19 || >=4.19.0 && <4.20 || >=4.20.0 &&
  59. 5.01 s [pathway-compat-base] <4.21 || >=4.21.0 && <4.22 || >=4.22.0 && <4.23: using base-4.18.3.0
  60. 5.01 s [pathway-compat-base] Dependency exceptions: using exceptions-0.10.7
  61. 5.01 s [pathway-compat-base] Dependency megaparsec >=9.0.1 && <9.1 || >=9.2.1 && <9.3 || >=9.5.0 && <9.6 ||
  62. 5.01 s [pathway-compat-base] >=9.7.0 && <9.8: using megaparsec-9.7.0
  63. 5.01 s [pathway-compat-base] Dependency pathway >=0.0.1 && <0.1: using pathway-0.0.1.0
  64. 5.01 s [pathway-compat-base] Dependency variant: using variant-1.0.2
  65. 5.01 s [pathway-compat-base] Dependency base >=4.14.0 && <4.15 || >=4.15.0 && <4.16 || >=4.16.0 && <4.17 ||
  66. 5.01 s [pathway-compat-base] >=4.17.0 && <4.18 || >=4.18.0 && <4.19 || >=4.19.0 && <4.20 || >=4.20.0 &&
  67. 5.01 s [pathway-compat-base] <4.21 || >=4.21.0 && <4.22 || >=4.22.0 && <4.23: using base-4.18.3.0
  68. 5.01 s [pathway-compat-base] Dependency doctest >=0.16.3 && <0.17 || >=0.18.1 && <0.19 || >=0.20.1 && <0.21
  69. 5.01 s [pathway-compat-base] || >=0.21.1 && <0.22 || >=0.22.2 && <0.23 || >=0.24.2 && <0.25: using
  70. 5.01 s [pathway-compat-base] doctest-0.24.3
  71. 5.01 s [pathway-compat-base] Dependency pathway-compat-base: using pathway-compat-base-0.0.1.0
  72. 5.44 s [pathway-compat-base] Source component graph:
  73. 5.44 s [pathway-compat-base] component lib
  74. 5.44 s [pathway-compat-base] component test:doctests dependency lib
  75. 5.44 s [pathway-compat-base] Configured component graph:
  76. 5.44 s [pathway-compat-base] component pathway-compat-base-0.0.1.0-E02izPYkwmmGdAPlQBKjbP
  77. 5.44 s [pathway-compat-base] include base-4.18.3.0
  78. 5.44 s [pathway-compat-base] include exceptions-0.10.7
  79. 5.44 s [pathway-compat-base] include megaparsec-9.7.0-EpAk7LLR2KBGAKafJPbXz1
  80. 5.44 s [pathway-compat-base] include pathway-0.0.1.0-5VJXWbvreBAfybP2NROr3
  81. 5.44 s [pathway-compat-base] include variant-1.0.2-5mfzNb7m7hb5BmRsuehY4I
  82. 5.44 s [pathway-compat-base] component pathway-compat-base-0.0.1.0-SkQnKen4bt6IgQL39Z6Bu-doctests
  83. 5.44 s [pathway-compat-base] include base-4.18.3.0
  84. 5.44 s [pathway-compat-base] include doctest-0.24.3-ACQNy8u8jPjC50l4I3tyiL
  85. 5.44 s [pathway-compat-base] include pathway-compat-base-0.0.1.0-E02izPYkwmmGdAPlQBKjbP
  86. 5.44 s [pathway-compat-base] Linked component graph:
  87. 5.44 s [pathway-compat-base] unit pathway-compat-base-0.0.1.0-E02izPYkwmmGdAPlQBKjbP
  88. 5.44 s [pathway-compat-base] include base-4.18.3.0
  89. 5.44 s [pathway-compat-base] include exceptions-0.10.7
  90. 5.44 s [pathway-compat-base] include megaparsec-9.7.0-EpAk7LLR2KBGAKafJPbXz1
  91. 5.44 s [pathway-compat-base] include pathway-0.0.1.0-5VJXWbvreBAfybP2NROr3
  92. 5.44 s [pathway-compat-base] include variant-1.0.2-5mfzNb7m7hb5BmRsuehY4I
  93. 5.44 s [pathway-compat-base] Common=pathway-compat-base-0.0.1.0-E02izPYkwmmGdAPlQBKjbP:Common,System.Environment.DropIn=pathway-compat-base-0.0.1.0-E02izPYkwmmGdAPlQBKjbP:System.Environment.DropIn,System.Environment.Overlay=pathway-compat-base-0.0.1.0-E02izPYkwmmGdAPlQBKjbP:System.Environment.Overlay,System.Environment.Pathway=pathway-compat-base-0.0.1.0-E02izPYkwmmGdAPlQBKjbP:System.Environment.Pathway,System.Environment.Thin=pathway-compat-base-0.0.1.0-E02izPYkwmmGdAPlQBKjbP:System.Environment.Thin,System.IO.Caught=pathway-compat-base-0.0.1.0-E02izPYkwmmGdAPlQBKjbP:System.IO.Caught,System.IO.DropIn=pathway-compat-base-0.0.1.0-E02izPYkwmmGdAPlQBKjbP:System.IO.DropIn,System.IO.Error.Caught=pathway-compat-base-0.0.1.0-E02izPYkwmmGdAPlQBKjbP:System.IO.Error.Caught,System.IO.Error.DropIn=pathway-compat-base-0.0.1.0-E02izPYkwmmGdAPlQBKjbP:System.IO.Error.DropIn,System.IO.Error.Overlay=pathway-compat-base-0.0.1.0-E02izPYkwmmGdAPlQBKjbP:System.IO.Error.Overlay,System.IO.Error.Pathway=pathway-compat-base-0.0.1.0-E02izPYkwmmGdAPlQBKjbP:System.IO.Error.Pathway,System.IO.Error.Thin=pathway-compat-base-0.0.1.0-E02izPYkwmmGdAPlQBKjbP:System.IO.Error.Thin,System.IO.Overlay=pathway-compat-base-0.0.1.0-E02izPYkwmmGdAPlQBKjbP:System.IO.Overlay,System.IO.Pathway=pathway-compat-base-0.0.1.0-E02izPYkwmmGdAPlQBKjbP:System.IO.Pathway,System.IO.Thin=pathway-compat-base-0.0.1.0-E02izPYkwmmGdAPlQBKjbP:System.IO.Thin
  94. 5.44 s [pathway-compat-base] unit pathway-compat-base-0.0.1.0-SkQnKen4bt6IgQL39Z6Bu-doctests
  95. 5.44 s [pathway-compat-base] include base-4.18.3.0
  96. 5.44 s [pathway-compat-base] include doctest-0.24.3-ACQNy8u8jPjC50l4I3tyiL
  97. 5.44 s [pathway-compat-base] include pathway-compat-base-0.0.1.0-E02izPYkwmmGdAPlQBKjbP
  98. 5.44 s [pathway-compat-base] Ready component graph:
  99. 5.44 s [pathway-compat-base] definite pathway-compat-base-0.0.1.0-E02izPYkwmmGdAPlQBKjbP
  100. 5.44 s [pathway-compat-base] depends base-4.18.3.0
  101. 5.44 s [pathway-compat-base] depends exceptions-0.10.7
  102. 5.44 s [pathway-compat-base] depends megaparsec-9.7.0-EpAk7LLR2KBGAKafJPbXz1
  103. 5.44 s [pathway-compat-base] depends pathway-0.0.1.0-5VJXWbvreBAfybP2NROr3
  104. 5.44 s [pathway-compat-base] depends variant-1.0.2-5mfzNb7m7hb5BmRsuehY4I
  105. 5.44 s [pathway-compat-base] definite pathway-compat-base-0.0.1.0-SkQnKen4bt6IgQL39Z6Bu-doctests
  106. 5.44 s [pathway-compat-base] depends base-4.18.3.0
  107. 5.44 s [pathway-compat-base] depends doctest-0.24.3-ACQNy8u8jPjC50l4I3tyiL
  108. 5.44 s [pathway-compat-base] depends pathway-compat-base-0.0.1.0-E02izPYkwmmGdAPlQBKjbP
  109. 5.44 s [pathway-compat-base] Using Cabal-3.10.3.0 compiled by ghc-9.6
  110. 5.44 s [pathway-compat-base] Using compiler: ghc-9.6.7
  111. 5.44 s [pathway-compat-base] Using install prefix:
  112. 5.44 s [pathway-compat-base] /nix/store/5yds5x988kvqbm18q0b330g0bkq0b0il-pathway-compat-base-0.0.1.0
  113. 5.44 s [pathway-compat-base] Executables installed in:
  114. 5.44 s [pathway-compat-base] /nix/store/5yds5x988kvqbm18q0b330g0bkq0b0il-pathway-compat-base-0.0.1.0/bin
  115. 5.44 s [pathway-compat-base] Libraries installed in:
  116. 5.44 s [pathway-compat-base] /nix/store/5yds5x988kvqbm18q0b330g0bkq0b0il-pathway-compat-base-0.0.1.0/lib/ghc-9.6.7/lib/x86_64-linux-ghc-9.6.7/pathway-compat-base-0.0.1.0-E02izPYkwmmGdAPlQBKjbP
  117. 5.44 s [pathway-compat-base] Dynamic Libraries installed in:
  118. 5.44 s [pathway-compat-base] /nix/store/5yds5x988kvqbm18q0b330g0bkq0b0il-pathway-compat-base-0.0.1.0/lib/ghc-9.6.7/lib/x86_64-linux-ghc-9.6.7
  119. 5.44 s [pathway-compat-base] Private executables installed in:
  120. 5.44 s [pathway-compat-base] /nix/store/5yds5x988kvqbm18q0b330g0bkq0b0il-pathway-compat-base-0.0.1.0/libexec/x86_64-linux-ghc-9.6.7/pathway-compat-base-0.0.1.0
  121. 5.44 s [pathway-compat-base] Data files installed in:
  122. 5.44 s [pathway-compat-base] /nix/store/5yds5x988kvqbm18q0b330g0bkq0b0il-pathway-compat-base-0.0.1.0/share/x86_64-linux-ghc-9.6.7/pathway-compat-base-0.0.1.0
  123. 5.44 s [pathway-compat-base] Documentation installed in:
  124. 5.44 s [pathway-compat-base] /nix/store/n7rcgdpdya0npf6g7jk9lwq4a2jmx36d-pathway-compat-base-0.0.1.0-doc/share/doc/pathway-compat-base-0.0.1.0
  125. 5.44 s [pathway-compat-base] Configuration files installed in:
  126. 5.44 s [pathway-compat-base] /nix/store/5yds5x988kvqbm18q0b330g0bkq0b0il-pathway-compat-base-0.0.1.0/etc
  127. 5.44 s [pathway-compat-base] No alex found
  128. 5.44 s [pathway-compat-base] Using ar found on system at:
  129. 5.44 s [pathway-compat-base] /nix/store/zjraf40s86y3iwhp626b934r5y6ldkbb-binutils-wrapper-2.46/bin/ar
  130. 5.44 s [pathway-compat-base] No c2hs found
  131. 5.44 s [pathway-compat-base] No cpphs found
  132. 5.44 s [pathway-compat-base] Using doctest version 0.24.3 found on system at:
  133. 5.44 s [pathway-compat-base] /nix/store/s48k56ayjjxwdbz9y7d8mnqwlcjfi1a8-doctest-0.24.3/bin/doctest
  134. 5.44 s [pathway-compat-base] Using gcc version 15.2.0 given by user at:
  135. 5.44 s [pathway-compat-base] /nix/store/29qjlshvklnyr67nhpprzgb9igmsfsjj-gcc-wrapper-15.2.0/bin/gcc
  136. 5.44 s [pathway-compat-base] Using ghc version 9.6.7 found on system at:
  137. 5.44 s [pathway-compat-base] /nix/store/2djpcnj8a25viv1y24h3mziy1gsy3fc6-ghc-9.6.7/bin/ghc
  138. 5.44 s [pathway-compat-base] Using ghc-pkg version 9.6.7 found on system at:
  139. 5.44 s [pathway-compat-base] /nix/store/2djpcnj8a25viv1y24h3mziy1gsy3fc6-ghc-9.6.7/bin/ghc-pkg-9.6.7
  140. 5.44 s [pathway-compat-base] No ghcjs found
  141. 5.44 s [pathway-compat-base] No ghcjs-pkg found
  142. 5.44 s [pathway-compat-base] No greencard found
  143. 5.44 s [pathway-compat-base] Using haddock version 2.29.2 found on system at:
  144. 5.44 s [pathway-compat-base] /nix/store/2djpcnj8a25viv1y24h3mziy1gsy3fc6-ghc-9.6.7/bin/haddock-ghc-9.6.7
  145. 5.44 s [pathway-compat-base] No happy found
  146. 5.44 s [pathway-compat-base] Using haskell-suite found on system at: haskell-suite-dummy-location
  147. 5.44 s [pathway-compat-base] Using haskell-suite-pkg found on system at: haskell-suite-pkg-dummy-location
  148. 5.44 s [pathway-compat-base] No hmake found
  149. 5.44 s [pathway-compat-base] Using hpc version 0.68 found on system at:
  150. 5.44 s [pathway-compat-base] /nix/store/2djpcnj8a25viv1y24h3mziy1gsy3fc6-ghc-9.6.7/bin/hpc-ghc-9.6.7
  151. 5.44 s [pathway-compat-base] Using hsc2hs version 0.68.9 found on system at:
  152. 5.44 s [pathway-compat-base] /nix/store/2djpcnj8a25viv1y24h3mziy1gsy3fc6-ghc-9.6.7/bin/hsc2hs-ghc-9.6.7
  153. 5.44 s [pathway-compat-base] Using hscolour version 1.25 found on system at:
  154. 5.44 s [pathway-compat-base] /nix/store/2x19jxh5g98bv0s06mdj71c1hmxi54yl-hscolour-1.25/bin/HsColour
  155. 5.44 s [pathway-compat-base] No jhc found
  156. 5.44 s [pathway-compat-base] Using ld found on system at:
  157. 5.44 s [pathway-compat-base] /nix/store/zjraf40s86y3iwhp626b934r5y6ldkbb-binutils-wrapper-2.46/bin/ld.gold
  158. 5.44 s [pathway-compat-base] No pkg-config found
  159. 5.44 s [pathway-compat-base] Using runghc version 9.6.7 found on system at:
  160. 5.44 s [pathway-compat-base] /nix/store/2djpcnj8a25viv1y24h3mziy1gsy3fc6-ghc-9.6.7/bin/runghc-9.6.7
  161. 5.44 s [pathway-compat-base] Using strip version 2.46 found on system at:
  162. 5.44 s [pathway-compat-base] /nix/store/29qjlshvklnyr67nhpprzgb9igmsfsjj-gcc-wrapper-15.2.0/bin/strip
  163. 5.44 s [pathway-compat-base] Using tar found on system at:
  164. 5.44 s [pathway-compat-base] /nix/store/z5mq2sam4484prf3kv6v6vjw1m0i7j24-gnutar-1.35/bin/tar
  165. 5.44 s [pathway-compat-base] No uhc found
  166. 5.91 s [pathway-compat-base] Phase: buildPhase
  167. 6.01 s [pathway-compat-base] Preprocessing library for pathway-compat-base-0.0.1.0..
  168. 7.61 s [pathway-compat-base] Building library for pathway-compat-base-0.0.1.0..
  169. 7.61 s [pathway-compat-base] [ 1 of 15] Compiling Common ( src/Common.hs, dist/build/Common.o, dist/build/Common.dyn_o )
  170. 7.61 s [pathway-compat-base] [ 2 of 15] Compiling System.Environment.Thin ( src/System/Environment/Thin.hs, dist/build/System/Environment/Thin.o, dist/build/System/Environment/Thin.dyn_o )
  171. 7.61 s [pathway-compat-base] [ 3 of 15] Compiling System.Environment.Pathway ( src/System/Environment/Pathway.hs, dist/build/System/Environment/Pathway.o, dist/build/System/Environment/Pathway.dyn_o )
  172. 7.61 s [pathway-compat-base] [ 4 of 15] Compiling System.Environment.Overlay ( src/System/Environment/Overlay.hs, dist/build/System/Environment/Overlay.o, dist/build/System/Environment/Overlay.dyn_o )
  173. 7.61 s [pathway-compat-base] [ 5 of 15] Compiling System.Environment.DropIn ( src/System/Environment/DropIn.hs, dist/build/System/Environment/DropIn.o, dist/build/System/Environment/DropIn.dyn_o )
  174. 7.61 s [pathway-compat-base] [ 6 of 15] Compiling System.IO.Error.Caught ( src/System/IO/Error/Caught.hs, dist/build/System/IO/Error/Caught.o, dist/build/System/IO/Error/Caught.dyn_o )
  175. 7.61 s [pathway-compat-base] [ 7 of 15] Compiling System.IO.Error.Thin ( src/System/IO/Error/Thin.hs, dist/build/System/IO/Error/Thin.o, dist/build/System/IO/Error/Thin.dyn_o )
  176. 7.61 s [pathway-compat-base] [ 8 of 15] Compiling System.IO.Error.Pathway ( src/System/IO/Error/Pathway.hs, dist/build/System/IO/Error/Pathway.o, dist/build/System/IO/Error/Pathway.dyn_o )
  177. 7.61 s [pathway-compat-base] [ 9 of 15] Compiling System.IO.Error.Overlay ( src/System/IO/Error/Overlay.hs, dist/build/System/IO/Error/Overlay.o, dist/build/System/IO/Error/Overlay.dyn_o )
  178. 7.61 s [pathway-compat-base] [10 of 15] Compiling System.IO.Error.DropIn ( src/System/IO/Error/DropIn.hs, dist/build/System/IO/Error/DropIn.o, dist/build/System/IO/Error/DropIn.dyn_o )
  179. 7.61 s [pathway-compat-base] [11 of 15] Compiling System.IO.Thin ( src/System/IO/Thin.hs, dist/build/System/IO/Thin.o, dist/build/System/IO/Thin.dyn_o )
  180. 7.61 s [pathway-compat-base] [12 of 15] Compiling System.IO.Overlay ( src/System/IO/Overlay.hs, dist/build/System/IO/Overlay.o, dist/build/System/IO/Overlay.dyn_o )
  181. 7.61 s [pathway-compat-base] [13 of 15] Compiling System.IO.DropIn ( src/System/IO/DropIn.hs, dist/build/System/IO/DropIn.o, dist/build/System/IO/DropIn.dyn_o )
  182. 7.61 s [pathway-compat-base] [14 of 15] Compiling System.IO.Caught ( src/System/IO/Caught.hs, dist/build/System/IO/Caught.o, dist/build/System/IO/Caught.dyn_o )
  183. 7.61 s [pathway-compat-base] [15 of 15] Compiling System.IO.Pathway ( src/System/IO/Pathway.hs, dist/build/System/IO/Pathway.o, dist/build/System/IO/Pathway.dyn_o )
  184. 7.62 s [pathway-compat-base] [ 1 of 15] Compiling Common ( src/Common.hs, dist/build/Common.p_o )
  185. 7.78 s [pathway-compat-base] [ 2 of 15] Compiling System.Environment.Thin ( src/System/Environment/Thin.hs, dist/build/System/Environment/Thin.p_o )
  186. 7.95 s [pathway-compat-base] [ 3 of 15] Compiling System.Environment.Pathway ( src/System/Environment/Pathway.hs, dist/build/System/Environment/Pathway.p_o )
  187. 8.10 s [pathway-compat-base] [ 4 of 15] Compiling System.Environment.Overlay ( src/System/Environment/Overlay.hs, dist/build/System/Environment/Overlay.p_o )
  188. 8.12 s [pathway-compat-base] [ 5 of 15] Compiling System.Environment.DropIn ( src/System/Environment/DropIn.hs, dist/build/System/Environment/DropIn.p_o )
  189. 8.27 s [pathway-compat-base] [ 6 of 15] Compiling System.IO.Error.Caught ( src/System/IO/Error/Caught.hs, dist/build/System/IO/Error/Caught.p_o )
  190. 8.27 s [pathway-compat-base] [ 7 of 15] Compiling System.IO.Error.Thin ( src/System/IO/Error/Thin.hs, dist/build/System/IO/Error/Thin.p_o )
  191. 8.27 s [pathway-compat-base] [ 8 of 15] Compiling System.IO.Error.Pathway ( src/System/IO/Error/Pathway.hs, dist/build/System/IO/Error/Pathway.p_o )
  192. 8.27 s [pathway-compat-base] [ 9 of 15] Compiling System.IO.Error.Overlay ( src/System/IO/Error/Overlay.hs, dist/build/System/IO/Error/Overlay.p_o )
  193. 8.27 s [pathway-compat-base] [10 of 15] Compiling System.IO.Error.DropIn ( src/System/IO/Error/DropIn.hs, dist/build/System/IO/Error/DropIn.p_o )
  194. 8.27 s [pathway-compat-base] [11 of 15] Compiling System.IO.Thin ( src/System/IO/Thin.hs, dist/build/System/IO/Thin.p_o )
  195. 8.27 s [pathway-compat-base] [12 of 15] Compiling System.IO.Overlay ( src/System/IO/Overlay.hs, dist/build/System/IO/Overlay.p_o )
  196. 8.27 s [pathway-compat-base] [13 of 15] Compiling System.IO.DropIn ( src/System/IO/DropIn.hs, dist/build/System/IO/DropIn.p_o )
  197. 8.36 s [pathway-compat-base] [14 of 15] Compiling System.IO.Caught ( src/System/IO/Caught.hs, dist/build/System/IO/Caught.p_o )
  198. 8.36 s [pathway-compat-base] [15 of 15] Compiling System.IO.Pathway ( src/System/IO/Pathway.hs, dist/build/System/IO/Pathway.p_o )
  199. 10.31 s [pathway-compat-base] Preprocessing test suite 'doctests' for pathway-compat-base-0.0.1.0..
  200. 10.31 s [pathway-compat-base] Building test suite 'doctests' for pathway-compat-base-0.0.1.0..
  201. 10.39 s [pathway-compat-base] [1 of 2] Compiling Build_doctests ( dist/build/doctests/autogen/Build_doctests.hs, dist/build/doctests/doctests-tmp/Build_doctests.o )
  202. 10.64 s [pathway-compat-base] [2 of 2] Compiling Main ( tests/doctests.hs, dist/build/doctests/doctests-tmp/Main.o )
  203. 10.91 s [pathway-compat-base] [3 of 3] Linking dist/build/doctests/doctests
  204. 14.32 s [pathway-compat-base] Phase: checkPhase
  205. 14.37 s [pathway-compat-base] Running 1 test suites...
  206. 14.37 s [pathway-compat-base] Test suite doctests: RUNNING...
  207. 14.75 s [pathway-compat-base]
  208. 14.75 s [pathway-compat-base] on the commandline: warning:
  209. 14.75 s [pathway-compat-base] -XTemplateHaskell is not allowed in Safe Haskell; ignoring -XTemplateHaskell
  210. 14.75 s [pathway-compat-base]
  211. 14.75 s [pathway-compat-base] on the commandline: warning:
  212. 14.75 s [pathway-compat-base] -XTemplateHaskell is not allowed in Safe Haskell; ignoring -XTemplateHaskell
  213. 14.75 s [pathway-compat-base]
  214. 14.75 s [pathway-compat-base] on the commandline: warning:
  215. 14.75 s [pathway-compat-base] -XTemplateHaskell is not allowed in Safe Haskell; ignoring -XTemplateHaskell
  216. 14.75 s [pathway-compat-base]
  217. 14.75 s [pathway-compat-base] on the commandline: warning:
  218. 14.75 s [pathway-compat-base] -XTemplateHaskell is not allowed in Safe Haskell; ignoring -XTemplateHaskell
  219. 14.78 s [pathway-compat-base]
  220. 14.78 s [pathway-compat-base] on the commandline: warning:
  221. 14.78 s [pathway-compat-base] -XTemplateHaskell is not allowed in Safe Haskell; ignoring -XTemplateHaskell
  222. 14.78 s [pathway-compat-base]
  223. 14.78 s [pathway-compat-base] on the commandline: warning:
  224. 14.78 s [pathway-compat-base] -XTemplateHaskell is not allowed in Safe Haskell; ignoring -XTemplateHaskell
  225. 14.78 s [pathway-compat-base]
  226. 14.78 s [pathway-compat-base] on the commandline: warning:
  227. 14.78 s [pathway-compat-base] -XTemplateHaskell is not allowed in Safe Haskell; ignoring -XTemplateHaskell
  228. 14.78 s [pathway-compat-base]
  229. 14.78 s [pathway-compat-base] on the commandline: warning:
  230. 14.78 s [pathway-compat-base] -XTemplateHaskell is not allowed in Safe Haskell; ignoring -XTemplateHaskell
  231. 14.78 s [pathway-compat-base]
  232. 14.78 s [pathway-compat-base] on the commandline: warning:
  233. 14.78 s [pathway-compat-base] -XTemplateHaskell is not allowed in Safe Haskell; ignoring -XTemplateHaskell
  234. 14.78 s [pathway-compat-base]
  235. 14.78 s [pathway-compat-base] on the commandline: warning:
  236. 14.78 s [pathway-compat-base] -XTemplateHaskell is not allowed in Safe Haskell; ignoring -XTemplateHaskell
  237. 14.78 s [pathway-compat-base]
  238. 14.78 s [pathway-compat-base] on the commandline: warning:
  239. 14.78 s [pathway-compat-base] -XTemplateHaskell is not allowed in Safe Haskell; ignoring -XTemplateHaskell
  240. 14.78 s [pathway-compat-base]
  241. 14.78 s [pathway-compat-base] on the commandline: warning:
  242. 14.78 s [pathway-compat-base] -XTemplateHaskell is not allowed in Safe Haskell; ignoring -XTemplateHaskell
  243. 14.78 s [pathway-compat-base]
  244. 14.78 s [pathway-compat-base] on the commandline: warning:
  245. 14.78 s [pathway-compat-base] -XTemplateHaskell is not allowed in Safe Haskell; ignoring -XTemplateHaskell
  246. 14.78 s [pathway-compat-base]
  247. 14.78 s [pathway-compat-base] on the commandline: warning:
  248. 14.78 s [pathway-compat-base] -XTemplateHaskell is not allowed in Safe Haskell; ignoring -XTemplateHaskell
  249. 14.81 s [pathway-compat-base]
  250. 14.81 s [pathway-compat-base] on the commandline: warning:
  251. 14.81 s [pathway-compat-base] -XTemplateHaskell is not allowed in Safe Haskell; ignoring -XTemplateHaskell
  252. 14.81 s [pathway-compat-base]
  253. 14.81 s [pathway-compat-base] on the commandline: warning:
  254. 14.81 s [pathway-compat-base] -XTemplateHaskell is not allowed in Safe Haskell; ignoring -XTemplateHaskell
  255. 14.81 s [pathway-compat-base]
  256. 14.81 s [pathway-compat-base] on the commandline: warning:
  257. 14.81 s [pathway-compat-base] -XTemplateHaskell is not allowed in Safe Haskell; ignoring -XTemplateHaskell
  258. 14.81 s [pathway-compat-base]
  259. 14.81 s [pathway-compat-base] on the commandline: warning:
  260. 14.81 s [pathway-compat-base] -XTemplateHaskell is not allowed in Safe Haskell; ignoring -XTemplateHaskell
  261. 14.81 s [pathway-compat-base]
  262. 14.81 s [pathway-compat-base] on the commandline: warning:
  263. 14.81 s [pathway-compat-base] -XTemplateHaskell is not allowed in Safe Haskell; ignoring -XTemplateHaskell
  264. 14.81 s [pathway-compat-base]
  265. 14.81 s [pathway-compat-base] on the commandline: warning:
  266. 14.81 s [pathway-compat-base] -XTemplateHaskell is not allowed in Safe Haskell; ignoring -XTemplateHaskell
  267. 14.81 s [pathway-compat-base]
  268. 14.81 s [pathway-compat-base] on the commandline: warning:
  269. 14.81 s [pathway-compat-base] -XTemplateHaskell is not allowed in Safe Haskell; ignoring -XTemplateHaskell
  270. 14.81 s [pathway-compat-base]
  271. 14.81 s [pathway-compat-base] on the commandline: warning:
  272. 14.81 s [pathway-compat-base] -XTemplateHaskell is not allowed in Safe Haskell; ignoring -XTemplateHaskell
  273. 14.81 s [pathway-compat-base]
  274. 14.81 s [pathway-compat-base] on the commandline: warning:
  275. 14.81 s [pathway-compat-base] -XTemplateHaskell is not allowed in Safe Haskell; ignoring -XTemplateHaskell
  276. 15.28 s [pathway-compat-base] Examples: 0 Tried: 0 Errors: 0 Failures: 0
  277. 15.34 s [pathway-compat-base] Test suite doctests: PASS
  278. 15.34 s [pathway-compat-base] Test suite logged to: dist/test/pathway-compat-base-0.0.1.0-doctests.log
  279. 15.34 s [pathway-compat-base] 1 of 1 test suites (1 of 1 test cases) passed.
  280. 15.36 s [pathway-compat-base] Phase: haddockPhase
  281. 15.51 s [pathway-compat-base] Preprocessing library for pathway-compat-base-0.0.1.0..
  282. 15.52 s [pathway-compat-base] Running Haddock on library for pathway-compat-base-0.0.1.0..
  283. 15.52 s [pathway-compat-base] Warning: The documentation for the following packages are not installed. No
  284. 15.52 s [pathway-compat-base] links will be generated to these packages: vector-0.13.2.0
  285. 15.58 s [pathway-compat-base] Warning: --source-* options are ignored when --hyperlinked-source is enabled.
  286. 15.86 s [pathway-compat-base] 90% ( 10 / 11) in 'System.IO.Error.Caught'
  287. 15.86 s [pathway-compat-base] Missing documentation for:
  288. 15.86 s [pathway-compat-base] AlreadyInUseError (src/System/IO/Error/Caught.hs:103)
  289. 16.04 s [pathway-compat-base] Warning: '</?>' is out of scope.
  290. 16.04 s [pathway-compat-base] If you qualify the identifier, haddock can try to link it anyway.
  291. 16.04 s [pathway-compat-base] Warning: '<$>' is out of scope.
  292. 16.04 s [pathway-compat-base] If you qualify the identifier, haddock can try to link it anyway.
  293. 16.04 s [pathway-compat-base] Warning: 'getCurrentDirectory' is out of scope.
  294. 16.04 s [pathway-compat-base] If you qualify the identifier, haddock can try to link it anyway.
  295. 16.04 s [pathway-compat-base] Warning: 'makeRelativeToCurrentDirectory' is out of scope.
  296. 16.04 s [pathway-compat-base] If you qualify the identifier, haddock can try to link it anyway.
  297. 16.04 s [pathway-compat-base] Warning: 'IOError' is out of scope.
  298. 16.04 s [pathway-compat-base] If you qualify the identifier, haddock can try to link it anyway.
  299. 16.04 s [pathway-compat-base] 14% ( 1 / 7) in 'Common'
  300. 16.04 s [pathway-compat-base] Missing documentation for:
  301. 16.04 s [pathway-compat-base] InternalFailure (src/Common.hs:69)
  302. 16.04 s [pathway-compat-base] toPathRep (src/Common.hs:84)
  303. 16.04 s [pathway-compat-base] fromPathRep (src/Common.hs:87)
  304. 16.04 s [pathway-compat-base] handleAnchoredPath (src/Common.hs:93)
  305. 16.04 s [pathway-compat-base] absFileFromPathRep (src/Common.hs:100)
  306. 16.04 s [pathway-compat-base] fileFromPathRep (src/Common.hs:114)
  307. 16.06 s [pathway-compat-base] 0% ( 0 / 5) in 'System.IO.Error.Thin'
  308. 16.06 s [pathway-compat-base] Missing documentation for:
  309. 16.06 s [pathway-compat-base] Module header
  310. 16.06 s [pathway-compat-base] mkIOError (src/System/IO/Error/Thin.hs:23)
  311. 16.06 s [pathway-compat-base] annotateIOError (src/System/IO/Error/Thin.hs:31)
  312. 16.06 s [pathway-compat-base] ioeGetFileName (src/System/IO/Error/Thin.hs:35)
  313. 16.06 s [pathway-compat-base] ioeSetFileName (src/System/IO/Error/Thin.hs:41)
  314. 16.06 s [pathway-compat-base] Warning: '</?>' is out of scope.
  315. 16.06 s [pathway-compat-base] If you qualify the identifier, haddock can try to link it anyway.
  316. 16.06 s [pathway-compat-base] Warning: 'getCurrentDirectory' is out of scope.
  317. 16.06 s [pathway-compat-base] If you qualify the identifier, haddock can try to link it anyway.
  318. 16.06 s [pathway-compat-base] Warning: 'makeRelativeToCurrentDirectory' is out of scope.
  319. 16.06 s [pathway-compat-base] If you qualify the identifier, haddock can try to link it anyway.
  320. 16.06 s [pathway-compat-base] Warning: 'IOError' is out of scope.
  321. 16.06 s [pathway-compat-base] If you qualify the identifier, haddock can try to link it anyway.
  322. 16.06 s [pathway-compat-base] Warning: 'Anchored' is out of scope.
  323. 16.06 s [pathway-compat-base] If you qualify the identifier, haddock can try to link it anyway.
  324. 16.06 s [pathway-compat-base] 33% ( 1 / 3) in 'System.Environment.Thin'
  325. 16.06 s [pathway-compat-base] Missing documentation for:
  326. 16.06 s [pathway-compat-base] executablePath (src/System/Environment/Thin.hs:52)
  327. 16.06 s [pathway-compat-base] getExecutablePath (src/System/Environment/Thin.hs:61)
  328. 16.07 s [pathway-compat-base] 0% ( 0 / 2) in 'System.IO.Error.Overlay'
  329. 16.07 s [pathway-compat-base] Missing documentation for:
  330. 16.07 s [pathway-compat-base] Module header
  331. 16.07 s [pathway-compat-base] ioeGetFileName (src/System/IO/Error/Overlay.hs:20)
  332. 16.07 s [pathway-compat-base] 100% ( 11 / 11) in 'System.Environment.Pathway'
  333. 16.07 s [pathway-compat-base] 76% ( 36 / 47) in 'System.IO.Error.DropIn'
  334. 16.07 s [pathway-compat-base] Missing documentation for:
  335. 16.07 s [pathway-compat-base] ioeGetErrorType
  336. 16.07 s [pathway-compat-base] ioeGetErrorString
  337. 16.07 s [pathway-compat-base] ioeGetLocation
  338. 16.07 s [pathway-compat-base] ioeGetHandle
  339. 16.07 s [pathway-compat-base] ioeSetErrorType
  340. 16.07 s [pathway-compat-base] ioeSetErrorString
  341. 16.07 s [pathway-compat-base] ioeSetLocation
  342. 16.08 s [pathway-compat-base] ioeSetHandle
  343. 16.08 s [pathway-compat-base] mkIOError (src/System/IO/Error/Thin.hs:23)
  344. 16.08 s [pathway-compat-base] ioeSetFileName (src/System/IO/Error/Thin.hs:41)
  345. 16.08 s [pathway-compat-base] annotateIOError (src/System/IO/Error/Thin.hs:31)
  346. 16.08 s [pathway-compat-base] 0% ( 0 / 13) in 'System.IO.Thin'
  347. 16.08 s [pathway-compat-base] Missing documentation for:
  348. 16.08 s [pathway-compat-base] Module header
  349. 16.08 s [pathway-compat-base] withFile (src/System/IO/Thin.hs:31)
  350. 16.08 s [pathway-compat-base] openFile (src/System/IO/Thin.hs:34)
  351. 16.08 s [pathway-compat-base] readFile (src/System/IO/Thin.hs:37)
  352. 16.08 s [pathway-compat-base] readFile' (src/System/IO/Thin.hs:40)
  353. 16.08 s [pathway-compat-base] writeFile (src/System/IO/Thin.hs:43)
  354. 16.08 s [pathway-compat-base] appendFile (src/System/IO/Thin.hs:46)
  355. 16.08 s [pathway-compat-base] withBinaryFile (src/System/IO/Thin.hs:49)
  356. 16.08 s [pathway-compat-base] openBinaryFile (src/System/IO/Thin.hs:52)
  357. 16.08 s [pathway-compat-base] openTempFile (src/System/IO/Thin.hs:55)
  358. 16.08 s [pathway-compat-base] openBinaryTempFile (src/System/IO/Thin.hs:69)
  359. 16.08 s [pathway-compat-base] openTempFileWithDefaultPermissions (src/System/IO/Thin.hs:84)
  360. 16.08 s [pathway-compat-base] openBinaryTempFileWithDefaultPermissions (src/System/IO/Thin.hs:93)
  361. 16.08 s [pathway-compat-base] Warning: '</?>' is out of scope.
  362. 16.08 s [pathway-compat-base] If you qualify the identifier, haddock can try to link it anyway.
  363. 16.08 s [pathway-compat-base] Warning: 'getCurrentDirectory' is out of scope.
  364. 16.08 s [pathway-compat-base] If you qualify the identifier, haddock can try to link it anyway.
  365. 16.08 s [pathway-compat-base] Warning: 'makeRelativeToCurrentDirectory' is out of scope.
  366. 16.08 s [pathway-compat-base] If you qualify the identifier, haddock can try to link it anyway.
  367. 16.08 s [pathway-compat-base] Warning: 'IOError' is out of scope.
  368. 16.08 s [pathway-compat-base] If you qualify the identifier, haddock can try to link it anyway.
  369. 16.08 s [pathway-compat-base] 33% ( 1 / 3) in 'System.Environment.Overlay'
  370. 16.08 s [pathway-compat-base] Missing documentation for:
  371. 16.08 s [pathway-compat-base] executablePath (src/System/Environment/Overlay.hs:50)
  372. 16.08 s [pathway-compat-base] getExecutablePath (src/System/Environment/Overlay.hs:54)
  373. 16.08 s [pathway-compat-base] 82% ( 37 / 45) in 'System.IO.Error.Pathway'
  374. 16.08 s [pathway-compat-base] Missing documentation for:
  375. 16.08 s [pathway-compat-base] ioeGetErrorType
  376. 16.08 s [pathway-compat-base] ioeGetErrorString
  377. 16.08 s [pathway-compat-base] ioeGetLocation
  378. 16.08 s [pathway-compat-base] ioeGetHandle
  379. 16.08 s [pathway-compat-base] ioeSetErrorType
  380. 16.08 s [pathway-compat-base] ioeSetErrorString
  381. 16.08 s [pathway-compat-base] ioeSetLocation
  382. 16.08 s [pathway-compat-base] ioeSetHandle
  383. 16.08 s [pathway-compat-base] 100% ( 11 / 11) in 'System.Environment.DropIn'
  384. 16.09 s [pathway-compat-base] 0% ( 0 / 5) in 'System.IO.Overlay'
  385. 16.09 s [pathway-compat-base] Missing documentation for:
  386. 16.09 s [pathway-compat-base] Module header
  387. 16.09 s [pathway-compat-base] openTempFile (src/System/IO/Overlay.hs:22)
  388. 16.09 s [pathway-compat-base] openBinaryTempFile (src/System/IO/Overlay.hs:26)
  389. 16.09 s [pathway-compat-base] openTempFileWithDefaultPermissions (src/System/IO/Overlay.hs:32)
  390. 16.09 s [pathway-compat-base] openBinaryTempFileWithDefaultPermissions (src/System/IO/Overlay.hs:37)
  391. 16.10 s [pathway-compat-base] 80% ( 73 / 91) in 'System.IO.DropIn'
  392. 16.10 s [pathway-compat-base] Missing documentation for:
  393. 16.10 s [pathway-compat-base] HandlePosn
  394. 16.10 s [pathway-compat-base] stdout
  395. 16.10 s [pathway-compat-base] stdin
  396. 16.10 s [pathway-compat-base] stderr
  397. 16.10 s [pathway-compat-base] hPutBufNonBlocking
  398. 16.10 s [pathway-compat-base] hIsOpen
  399. 16.10 s [pathway-compat-base] hIsClosed
  400. 16.10 s [pathway-compat-base] hIsReadable
  401. 16.10 s [pathway-compat-base] hIsWritable
  402. 16.10 s [pathway-compat-base] hIsSeekable
  403. 16.10 s [pathway-compat-base] openFile (src/System/IO/Thin.hs:34)
  404. 16.10 s [pathway-compat-base] readFile' (src/System/IO/Thin.hs:40)
  405. 16.10 s [pathway-compat-base] writeFile (src/System/IO/Thin.hs:43)
  406. 16.10 s [pathway-compat-base] withFile (src/System/IO/Thin.hs:31)
  407. 16.10 s [pathway-compat-base] openBinaryFile (src/System/IO/Thin.hs:52)
  408. 16.10 s [pathway-compat-base] withBinaryFile (src/System/IO/Thin.hs:49)
  409. 16.10 s [pathway-compat-base] readFile (src/System/IO/Thin.hs:37)
  410. 16.10 s [pathway-compat-base] appendFile (src/System/IO/Thin.hs:46)
  411. 16.11 s [pathway-compat-base] 20% ( 1 / 5) in 'System.IO.Caught'
  412. 16.11 s [pathway-compat-base] Missing documentation for:
  413. 16.11 s [pathway-compat-base] Module header
  414. 16.11 s [pathway-compat-base] OpenFileFailure (src/System/IO/Caught.hs:38)
  415. 16.11 s [pathway-compat-base] openFile (src/System/IO/Caught.hs:48)
  416. 16.11 s [pathway-compat-base] recoverOpenFileFailure (src/System/IO/Caught.hs:40)
  417. 16.11 s [pathway-compat-base] 77% ( 73 / 94) in 'System.IO.Pathway'
  418. 16.11 s [pathway-compat-base] Missing documentation for:
  419. 16.11 s [pathway-compat-base] HandlePosn
  420. 16.11 s [pathway-compat-base] stdout
  421. 16.11 s [pathway-compat-base] stdin
  422. 16.11 s [pathway-compat-base] stderr
  423. 16.11 s [pathway-compat-base] hPutBufNonBlocking
  424. 16.11 s [pathway-compat-base] hIsOpen
  425. 16.11 s [pathway-compat-base] hIsClosed
  426. 16.11 s [pathway-compat-base] hIsReadable
  427. 16.11 s [pathway-compat-base] hIsWritable
  428. 16.11 s [pathway-compat-base] hIsSeekable
  429. 16.11 s [pathway-compat-base] readFile' (src/System/IO/Thin.hs:40)
  430. 16.11 s [pathway-compat-base] writeFile (src/System/IO/Thin.hs:43)
  431. 16.11 s [pathway-compat-base] withFile (src/System/IO/Thin.hs:31)
  432. 16.11 s [pathway-compat-base] openBinaryFile (src/System/IO/Thin.hs:52)
  433. 16.11 s [pathway-compat-base] withBinaryFile (src/System/IO/Thin.hs:49)
  434. 16.11 s [pathway-compat-base] readFile (src/System/IO/Thin.hs:37)
  435. 16.11 s [pathway-compat-base] appendFile (src/System/IO/Thin.hs:46)
  436. 16.11 s [pathway-compat-base] openTempFile (src/System/IO/Thin.hs:55)
  437. 16.11 s [pathway-compat-base] openBinaryTempFile (src/System/IO/Thin.hs:69)
  438. 16.11 s [pathway-compat-base] openTempFileWithDefaultPermissions (src/System/IO/Thin.hs:84)
  439. 16.11 s [pathway-compat-base] openBinaryTempFileWithDefaultPermissions (src/System/IO/Thin.hs:93)
  440. 21.23 s [pathway-compat-base] Documentation created: dist/doc/html/pathway-compat-base/,
  441. 21.23 s [pathway-compat-base] dist/doc/html/pathway-compat-base/pathway-compat-base.txt
  442. 21.30 s [pathway-compat-base] Preprocessing test suite 'doctests' for pathway-compat-base-0.0.1.0..
  443. 21.31 s [pathway-compat-base] Phase: installPhase
  444. 21.40 s [pathway-compat-base] Installing library in /nix/store/5yds5x988kvqbm18q0b330g0bkq0b0il-pathway-compat-base-0.0.1.0/lib/ghc-9.6.7/lib/x86_64-linux-ghc-9.6.7/pathway-compat-base-0.0.1.0-E02izPYkwmmGdAPlQBKjbP
  445. 21.83 s [pathway-compat-base] Phase: fixupPhase
  446. 21.85 s [pathway-compat-base] shrinking RPATHs of ELF executables and libraries in /nix/store/5yds5x988kvqbm18q0b330g0bkq0b0il-pathway-compat-base-0.0.1.0
  447. 21.85 s [pathway-compat-base] shrinking /nix/store/5yds5x988kvqbm18q0b330g0bkq0b0il-pathway-compat-base-0.0.1.0/lib/ghc-9.6.7/lib/x86_64-linux-ghc-9.6.7/libHSpathway-compat-base-0.0.1.0-E02izPYkwmmGdAPlQBKjbP-ghc9.6.7.so
  448. 21.88 s [pathway-compat-base] checking for references to /build/ in /nix/store/5yds5x988kvqbm18q0b330g0bkq0b0il-pathway-compat-base-0.0.1.0...
  449. 21.91 s [pathway-compat-base] patching script interpreter paths in /nix/store/5yds5x988kvqbm18q0b330g0bkq0b0il-pathway-compat-base-0.0.1.0
  450. 21.92 s [pathway-compat-base] stripping (with command strip and flags -S -p) in /nix/store/5yds5x988kvqbm18q0b330g0bkq0b0il-pathway-compat-base-0.0.1.0/lib
  451. 22.01 s [pathway-compat-base] shrinking RPATHs of ELF executables and libraries in /nix/store/n7rcgdpdya0npf6g7jk9lwq4a2jmx36d-pathway-compat-base-0.0.1.0-doc
  452. 22.02 s [pathway-compat-base] checking for references to /build/ in /nix/store/n7rcgdpdya0npf6g7jk9lwq4a2jmx36d-pathway-compat-base-0.0.1.0-doc...
  453. 22.05 s [pathway-compat-base] patching script interpreter paths in /nix/store/n7rcgdpdya0npf6g7jk9lwq4a2jmx36d-pathway-compat-base-0.0.1.0-doc
  454. 22.15 s [pathway-compat-base:post-build] Uploading to cachix cache "sellout": /nix/store/5yds5x988kvqbm18q0b330g0bkq0b0il-pathway-compat-base-0.0.1.0 /nix/store/n7rcgdpdya0npf6g7jk9lwq4a2jmx36d-pathway-compat-base-0.0.1.0-doc
  455. 22.64 s [pathway-compat-base:post-build] Pushing 2 paths (186 are already present) using zstd to cache sellout ⏳
  456. 22.64 s [pathway-compat-base:post-build]
  457. 23.01 s [pathway-compat-base:post-build] Pushing /nix/store/n7rcgdpdya0npf6g7jk9lwq4a2jmx36d-pathway-compat-base-0.0.1.0-doc (1.85 MiB)
  458. 23.10 s [pathway-compat-base:post-build] Pushing /nix/store/5yds5x988kvqbm18q0b330g0bkq0b0il-pathway-compat-base-0.0.1.0 (2.00 MiB)
  459. 24.11 s [pathway-compat-base:post-build]
  460. 24.11 s [pathway-compat-base:post-build] All done.
  461. 24.13 s [pathway-compat-base:post-build] Uploading to the NixCI cache: /nix/store/5yds5x988kvqbm18q0b330g0bkq0b0il-pathway-compat-base-0.0.1.0 /nix/store/n7rcgdpdya0npf6g7jk9lwq4a2jmx36d-pathway-compat-base-0.0.1.0-doc
  462. 24.17 s [pathway-compat-base:post-build] warning: 'warn-short-path-literals' is deprecated, use 'lint-short-path-literals = ignore' instead
  463. 24.19 s [pathway-compat-base:post-build] copying 2 paths...
  464. 24.19 s [pathway-compat-base:post-build] copying path '/nix/store/n7rcgdpdya0npf6g7jk9lwq4a2jmx36d-pathway-compat-base-0.0.1.0-doc' to 'https://cache.nix-ci.com'...
  465. 24.52 s [pathway-compat-base:post-build] copying path '/nix/store/5yds5x988kvqbm18q0b330g0bkq0b0il-pathway-compat-base-0.0.1.0' to 'https://cache.nix-ci.com'...
  466. 25.05 s [pathway-compat-base:post-build] warning: 'warn-short-path-literals' is deprecated, use 'lint-short-path-literals = ignore' instead
  467. 25.25 s [pathway-compat-base:post-build] copying 1 paths...
  468. 25.25 s [pathway-compat-base:post-build] copying path '/nix/store/r05xgdsqgil1m6ii36zf017yqy13dwfp-pathway-compat-base-0.0.1.0.drv' to 'https://cache.nix-ci.com'...
  469. 25.40 s Uploaded pathway-compat-base in 3.2s
  470. 25.40 s Progress: 1 of 15 built, 8 of 8 downloaded from cache
  471. 25.40 s Built pathway-compat-base in 22.7s
  472. 25.43 s Building /nix/store/isq7l83m10yyykzr1f202hq4n23f43p1-pathway-compat-filepath-0.0.1.0.drv
  473. 25.64 s [pathway-compat-filepath] Phase: setupCompilerEnvironmentPhase
  474. 25.64 s [pathway-compat-filepath] Build with /nix/store/2djpcnj8a25viv1y24h3mziy1gsy3fc6-ghc-9.6.7.
  475. 25.99 s [pathway-compat-filepath] Phase: unpackPhase
  476. 26.00 s [pathway-compat-filepath] unpacking source archive /nix/store/5z4x7vzkb1m65ccyx19wn7vcxdl9gmbf-filepath
  477. 26.00 s [pathway-compat-filepath] source root is filepath
  478. 26.02 s [pathway-compat-filepath] Phase: patchPhase
  479. 26.03 s [pathway-compat-filepath] Phase: compileBuildDriverPhase
  480. 26.03 s [pathway-compat-filepath] setupCompileFlags: -package-db=/build/tmp.zKwaqPnUnM/setup-package.conf.d -threaded
  481. 26.08 s [pathway-compat-filepath] [1 of 2] Compiling Main ( Setup.hs, /build/tmp.zKwaqPnUnM/Main.o )
  482. 26.14 s [pathway-compat-filepath] [2 of 2] Linking Setup
  483. 27.41 s [pathway-compat-filepath] Phase: updateAutotoolsGnuConfigScriptsPhase
  484. 27.42 s [pathway-compat-filepath] Phase: configurePhase
  485. 27.44 s [pathway-compat-filepath] configureFlags: --verbose --prefix=/nix/store/q9fsagpd29spy55dp5m0zri4is79nfz5-pathway-compat-filepath-0.0.1.0 --libdir=$prefix/lib/$compiler/lib --libsubdir=$abi/$libname --docdir=/nix/store/gsxpk94inw22circr76qnnbmvc6ziwhz-pathway-compat-filepath-0.0.1.0-doc/share/doc/pathway-compat-filepath-0.0.1.0 --with-gcc=gcc --package-db=/build/tmp.zKwaqPnUnM/package.conf.d --ghc-option=-j16 --ghc-option=+RTS --ghc-option=-A64M --ghc-option=-RTS --enable-library-profiling --profiling-detail=exported-functions --disable-profiling --enable-shared --disable-coverage --enable-static --disable-executable-dynamic --enable-tests --disable-benchmarks --enable-library-vanilla --disable-library-for-ghci --enable-split-sections --enable-library-stripping --enable-executable-stripping --ghc-option=-haddock --ghc-options=-Werror --extra-lib-dirs=/nix/store/pndhkk0l649lm1sj0mxk7cbwq26qd1ra-ncurses-6.6/lib --extra-lib-dirs=/nix/store/0djlg4g0b81w94k3vcaqsxsc2hh4kism-libffi-3.5.2/lib --extra-lib-dirs=/nix/store/md4paia7riiggyrj8p24c7a6vf8w7jz8-elfutils-0.194/lib --extra-lib-dirs=/nix/store/39vv2pf64gd8li48a4hpbhw2crzd8z5p-gmp-with-cxx-6.3.0/lib --extra-lib-dirs=/nix/store/7wwvald8lapkrsr72qanlw8blyn55ifx-numactl-2.0.18/lib --extra-lib-dirs=/nix/store/2djpcnj8a25viv1y24h3mziy1gsy3fc6-ghc-9.6.7/lib
  486. 27.45 s [pathway-compat-filepath] Using Parsec parser
  487. 27.45 s [pathway-compat-filepath] Configuring pathway-compat-filepath-0.0.1.0...
  488. 27.83 s [pathway-compat-filepath] Flags chosen: noisy-deprecations=True, verify-no-recursion=False
  489. 27.83 s [pathway-compat-filepath] Dependency base >=4.14.0 && <4.15 || >=4.15.0 && <4.16 || >=4.16.0 && <4.17 ||
  490. 27.83 s [pathway-compat-filepath] >=4.17.0 && <4.18 || >=4.18.0 && <4.19 || >=4.19.0 && <4.20 || >=4.20.0 &&
  491. 27.83 s [pathway-compat-filepath] <4.21 || >=4.21.0 && <4.22 || >=4.22.0 && <4.23: using base-4.18.3.0
  492. 27.83 s [pathway-compat-filepath] Dependency extra: using extra-1.8.1
  493. 27.83 s [pathway-compat-filepath] Dependency filepath >=1.4.2 && <1.5 || >=1.5.0 && <1.6: using
  494. 27.83 s [pathway-compat-filepath] filepath-1.4.301.0
  495. 27.83 s [pathway-compat-filepath] Dependency megaparsec >=9.0.1 && <9.1 || >=9.2.1 && <9.3 || >=9.5.0 && <9.6 ||
  496. 27.83 s [pathway-compat-filepath] >=9.7.0 && <9.8: using megaparsec-9.7.0
  497. 27.83 s [pathway-compat-filepath] Dependency os-string: using os-string-2.0.10
  498. 27.83 s [pathway-compat-filepath] Dependency pathway >=0.0.1 && <0.1: using pathway-0.0.1.0
  499. 27.83 s [pathway-compat-filepath] Dependency pathway-compat-base >=0.0.1 && <0.1: using
  500. 27.83 s [pathway-compat-filepath] pathway-compat-base-0.0.1.0
  501. 27.83 s [pathway-compat-filepath] Dependency pathway-internal >=0.0.1 && <0.1: using pathway-internal-0.0.1.0
  502. 27.83 s [pathway-compat-filepath] Dependency base >=4.14.0 && <4.15 || >=4.15.0 && <4.16 || >=4.16.0 && <4.17 ||
  503. 27.83 s [pathway-compat-filepath] >=4.17.0 && <4.18 || >=4.18.0 && <4.19 || >=4.19.0 && <4.20 || >=4.20.0 &&
  504. 27.83 s [pathway-compat-filepath] <4.21 || >=4.21.0 && <4.22 || >=4.22.0 && <4.23: using base-4.18.3.0
  505. 27.83 s [pathway-compat-filepath] Dependency doctest >=0.16.3 && <0.17 || >=0.18.1 && <0.19 || >=0.20.1 && <0.21
  506. 27.84 s [pathway-compat-filepath] || >=0.21.1 && <0.22 || >=0.22.2 && <0.23 || >=0.24.2 && <0.25: using
  507. 27.84 s [pathway-compat-filepath] doctest-0.24.3
  508. 27.84 s [pathway-compat-filepath] Dependency pathway-compat-filepath: using pathway-compat-filepath-0.0.1.0
  509. 28.26 s [pathway-compat-filepath] Source component graph:
  510. 28.26 s [pathway-compat-filepath] component lib
  511. 28.26 s [pathway-compat-filepath] component test:doctests dependency lib
  512. 28.26 s [pathway-compat-filepath] Configured component graph:
  513. 28.26 s [pathway-compat-filepath] component pathway-compat-filepath-0.0.1.0-Ck51GFznMiC2cxIfBMz4NH
  514. 28.26 s [pathway-compat-filepath] include base-4.18.3.0
  515. 28.26 s [pathway-compat-filepath] include extra-1.8.1-FU1frm3XcM88A49dBkmtgI
  516. 28.26 s [pathway-compat-filepath] include filepath-1.4.301.0
  517. 28.26 s [pathway-compat-filepath] include megaparsec-9.7.0-EpAk7LLR2KBGAKafJPbXz1
  518. 28.26 s [pathway-compat-filepath] include os-string-2.0.10-19KGKnZaj8J2ODUMyNXxJr
  519. 28.26 s [pathway-compat-filepath] include pathway-0.0.1.0-5VJXWbvreBAfybP2NROr3
  520. 28.26 s [pathway-compat-filepath] include pathway-compat-base-0.0.1.0-E02izPYkwmmGdAPlQBKjbP
  521. 28.26 s [pathway-compat-filepath] include pathway-internal-0.0.1.0-1xeSc3z2VhRIotiMz9hdL1
  522. 28.26 s [pathway-compat-filepath] component pathway-compat-filepath-0.0.1.0-Bh4LT0cz7im2Vo1hGnl75g-doctests
  523. 28.26 s [pathway-compat-filepath] include base-4.18.3.0
  524. 28.26 s [pathway-compat-filepath] include doctest-0.24.3-ACQNy8u8jPjC50l4I3tyiL
  525. 28.26 s [pathway-compat-filepath] include pathway-compat-filepath-0.0.1.0-Ck51GFznMiC2cxIfBMz4NH
  526. 28.26 s [pathway-compat-filepath] Linked component graph:
  527. 28.26 s [pathway-compat-filepath] unit pathway-compat-filepath-0.0.1.0-Ck51GFznMiC2cxIfBMz4NH
  528. 28.26 s [pathway-compat-filepath] include base-4.18.3.0
  529. 28.26 s [pathway-compat-filepath] include extra-1.8.1-FU1frm3XcM88A49dBkmtgI
  530. 28.26 s [pathway-compat-filepath] include filepath-1.4.301.0
  531. 28.26 s [pathway-compat-filepath] include megaparsec-9.7.0-EpAk7LLR2KBGAKafJPbXz1
  532. 28.26 s [pathway-compat-filepath] include os-string-2.0.10-19KGKnZaj8J2ODUMyNXxJr
  533. 28.26 s [pathway-compat-filepath] include pathway-0.0.1.0-5VJXWbvreBAfybP2NROr3
  534. 28.26 s [pathway-compat-filepath] include pathway-compat-base-0.0.1.0-E02izPYkwmmGdAPlQBKjbP
  535. 28.26 s [pathway-compat-filepath] include pathway-internal-0.0.1.0-1xeSc3z2VhRIotiMz9hdL1
  536. 28.26 s [pathway-compat-filepath] Common.FilePath=pathway-compat-filepath-0.0.1.0-Ck51GFznMiC2cxIfBMz4NH:Common.FilePath,Common.OsPath=pathway-compat-filepath-0.0.1.0-Ck51GFznMiC2cxIfBMz4NH:Common.OsPath,System.FilePath=pathway-compat-filepath-0.0.1.0-Ck51GFznMiC2cxIfBMz4NH:System.FilePath,System.FilePath.Overlay=pathway-compat-filepath-0.0.1.0-Ck51GFznMiC2cxIfBMz4NH:System.FilePath.Overlay,System.FilePath.Pathway=pathway-compat-filepath-0.0.1.0-Ck51GFznMiC2cxIfBMz4NH:System.FilePath.Pathway,System.FilePath.Thin=pathway-compat-filepath-0.0.1.0-Ck51GFznMiC2cxIfBMz4NH:System.FilePath.Thin,System.OsPath=pathway-compat-filepath-0.0.1.0-Ck51GFznMiC2cxIfBMz4NH:System.OsPath,System.OsPath.Overlay=pathway-compat-filepath-0.0.1.0-Ck51GFznMiC2cxIfBMz4NH:System.OsPath.Overlay,System.OsPath.Pathway=pathway-compat-filepath-0.0.1.0-Ck51GFznMiC2cxIfBMz4NH:System.OsPath.Pathway,System.OsPath.Thin=pathway-compat-filepath-0.0.1.0-Ck51GFznMiC2cxIfBMz4NH:System.OsPath.Thin
  537. 28.26 s [pathway-compat-filepath] unit pathway-compat-filepath-0.0.1.0-Bh4LT0cz7im2Vo1hGnl75g-doctests
  538. 28.26 s [pathway-compat-filepath] include base-4.18.3.0
  539. 28.27 s [pathway-compat-filepath] include doctest-0.24.3-ACQNy8u8jPjC50l4I3tyiL
  540. 28.27 s [pathway-compat-filepath] include pathway-compat-filepath-0.0.1.0-Ck51GFznMiC2cxIfBMz4NH
  541. 28.27 s [pathway-compat-filepath] Ready component graph:
  542. 28.27 s [pathway-compat-filepath] definite pathway-compat-filepath-0.0.1.0-Ck51GFznMiC2cxIfBMz4NH
  543. 28.27 s [pathway-compat-filepath] depends base-4.18.3.0
  544. 28.27 s [pathway-compat-filepath] depends extra-1.8.1-FU1frm3XcM88A49dBkmtgI
  545. 28.27 s [pathway-compat-filepath] depends filepath-1.4.301.0
  546. 28.27 s [pathway-compat-filepath] depends megaparsec-9.7.0-EpAk7LLR2KBGAKafJPbXz1
  547. 28.27 s [pathway-compat-filepath] depends os-string-2.0.10-19KGKnZaj8J2ODUMyNXxJr
  548. 28.27 s [pathway-compat-filepath] depends pathway-0.0.1.0-5VJXWbvreBAfybP2NROr3
  549. 28.27 s [pathway-compat-filepath] depends pathway-compat-base-0.0.1.0-E02izPYkwmmGdAPlQBKjbP
  550. 28.27 s [pathway-compat-filepath] depends pathway-internal-0.0.1.0-1xeSc3z2VhRIotiMz9hdL1
  551. 28.27 s [pathway-compat-filepath] definite pathway-compat-filepath-0.0.1.0-Bh4LT0cz7im2Vo1hGnl75g-doctests
  552. 28.27 s [pathway-compat-filepath] depends base-4.18.3.0
  553. 28.27 s [pathway-compat-filepath] depends doctest-0.24.3-ACQNy8u8jPjC50l4I3tyiL
  554. 28.27 s [pathway-compat-filepath] depends pathway-compat-filepath-0.0.1.0-Ck51GFznMiC2cxIfBMz4NH
  555. 28.27 s [pathway-compat-filepath] Using Cabal-3.10.3.0 compiled by ghc-9.6
  556. 28.27 s [pathway-compat-filepath] Using compiler: ghc-9.6.7
  557. 28.27 s [pathway-compat-filepath] Using install prefix:
  558. 28.27 s [pathway-compat-filepath] /nix/store/q9fsagpd29spy55dp5m0zri4is79nfz5-pathway-compat-filepath-0.0.1.0
  559. 28.27 s [pathway-compat-filepath] Executables installed in:
  560. 28.27 s [pathway-compat-filepath] /nix/store/q9fsagpd29spy55dp5m0zri4is79nfz5-pathway-compat-filepath-0.0.1.0/bin
  561. 28.27 s [pathway-compat-filepath] Libraries installed in:
  562. 28.27 s [pathway-compat-filepath] /nix/store/q9fsagpd29spy55dp5m0zri4is79nfz5-pathway-compat-filepath-0.0.1.0/lib/ghc-9.6.7/lib/x86_64-linux-ghc-9.6.7/pathway-compat-filepath-0.0.1.0-Ck51GFznMiC2cxIfBMz4NH
  563. 28.27 s [pathway-compat-filepath] Dynamic Libraries installed in:
  564. 28.27 s [pathway-compat-filepath] /nix/store/q9fsagpd29spy55dp5m0zri4is79nfz5-pathway-compat-filepath-0.0.1.0/lib/ghc-9.6.7/lib/x86_64-linux-ghc-9.6.7
  565. 28.27 s [pathway-compat-filepath] Private executables installed in:
  566. 28.27 s [pathway-compat-filepath] /nix/store/q9fsagpd29spy55dp5m0zri4is79nfz5-pathway-compat-filepath-0.0.1.0/libexec/x86_64-linux-ghc-9.6.7/pathway-compat-filepath-0.0.1.0
  567. 28.27 s [pathway-compat-filepath] Data files installed in:
  568. 28.27 s [pathway-compat-filepath] /nix/store/q9fsagpd29spy55dp5m0zri4is79nfz5-pathway-compat-filepath-0.0.1.0/share/x86_64-linux-ghc-9.6.7/pathway-compat-filepath-0.0.1.0
  569. 28.27 s [pathway-compat-filepath] Documentation installed in:
  570. 28.27 s [pathway-compat-filepath] /nix/store/gsxpk94inw22circr76qnnbmvc6ziwhz-pathway-compat-filepath-0.0.1.0-doc/share/doc/pathway-compat-filepath-0.0.1.0
  571. 28.27 s [pathway-compat-filepath] Configuration files installed in:
  572. 28.27 s [pathway-compat-filepath] /nix/store/q9fsagpd29spy55dp5m0zri4is79nfz5-pathway-compat-filepath-0.0.1.0/etc
  573. 28.27 s [pathway-compat-filepath] No alex found
  574. 28.27 s [pathway-compat-filepath] Using ar found on system at:
  575. 28.27 s [pathway-compat-filepath] /nix/store/zjraf40s86y3iwhp626b934r5y6ldkbb-binutils-wrapper-2.46/bin/ar
  576. 28.27 s [pathway-compat-filepath] No c2hs found
  577. 28.27 s [pathway-compat-filepath] No cpphs found
  578. 28.27 s [pathway-compat-filepath] Using doctest version 0.24.3 found on system at:
  579. 28.27 s [pathway-compat-filepath] /nix/store/s48k56ayjjxwdbz9y7d8mnqwlcjfi1a8-doctest-0.24.3/bin/doctest
  580. 28.27 s [pathway-compat-filepath] Using gcc version 15.2.0 given by user at:
  581. 28.27 s [pathway-compat-filepath] /nix/store/29qjlshvklnyr67nhpprzgb9igmsfsjj-gcc-wrapper-15.2.0/bin/gcc
  582. 28.27 s [pathway-compat-filepath] Using ghc version 9.6.7 found on system at:
  583. 28.27 s [pathway-compat-filepath] /nix/store/2djpcnj8a25viv1y24h3mziy1gsy3fc6-ghc-9.6.7/bin/ghc
  584. 28.27 s [pathway-compat-filepath] Using ghc-pkg version 9.6.7 found on system at:
  585. 28.27 s [pathway-compat-filepath] /nix/store/2djpcnj8a25viv1y24h3mziy1gsy3fc6-ghc-9.6.7/bin/ghc-pkg-9.6.7
  586. 28.27 s [pathway-compat-filepath] No ghcjs found
  587. 28.27 s [pathway-compat-filepath] No ghcjs-pkg found
  588. 28.27 s [pathway-compat-filepath] No greencard found
  589. 28.27 s [pathway-compat-filepath] Using haddock version 2.29.2 found on system at:
  590. 28.27 s [pathway-compat-filepath] /nix/store/2djpcnj8a25viv1y24h3mziy1gsy3fc6-ghc-9.6.7/bin/haddock-ghc-9.6.7
  591. 28.27 s [pathway-compat-filepath] No happy found
  592. 28.27 s [pathway-compat-filepath] Using haskell-suite found on system at: haskell-suite-dummy-location
  593. 28.27 s [pathway-compat-filepath] Using haskell-suite-pkg found on system at: haskell-suite-pkg-dummy-location
  594. 28.27 s [pathway-compat-filepath] No hmake found
  595. 28.27 s [pathway-compat-filepath] Using hpc version 0.68 found on system at:
  596. 28.27 s [pathway-compat-filepath] /nix/store/2djpcnj8a25viv1y24h3mziy1gsy3fc6-ghc-9.6.7/bin/hpc-ghc-9.6.7
  597. 28.27 s [pathway-compat-filepath] Using hsc2hs version 0.68.9 found on system at:
  598. 28.27 s [pathway-compat-filepath] /nix/store/2djpcnj8a25viv1y24h3mziy1gsy3fc6-ghc-9.6.7/bin/hsc2hs-ghc-9.6.7
  599. 28.27 s [pathway-compat-filepath] Using hscolour version 1.25 found on system at:
  600. 28.27 s [pathway-compat-filepath] /nix/store/2x19jxh5g98bv0s06mdj71c1hmxi54yl-hscolour-1.25/bin/HsColour
  601. 28.27 s [pathway-compat-filepath] No jhc found
  602. 28.27 s [pathway-compat-filepath] Using ld found on system at:
  603. 28.27 s [pathway-compat-filepath] /nix/store/zjraf40s86y3iwhp626b934r5y6ldkbb-binutils-wrapper-2.46/bin/ld.gold
  604. 28.27 s [pathway-compat-filepath] No pkg-config found
  605. 28.27 s [pathway-compat-filepath] Using runghc version 9.6.7 found on system at:
  606. 28.27 s [pathway-compat-filepath] /nix/store/2djpcnj8a25viv1y24h3mziy1gsy3fc6-ghc-9.6.7/bin/runghc-9.6.7
  607. 28.27 s [pathway-compat-filepath] Using strip version 2.46 found on system at:
  608. 28.27 s [pathway-compat-filepath] /nix/store/29qjlshvklnyr67nhpprzgb9igmsfsjj-gcc-wrapper-15.2.0/bin/strip
  609. 28.27 s [pathway-compat-filepath] Using tar found on system at:
  610. 28.27 s [pathway-compat-filepath] /nix/store/z5mq2sam4484prf3kv6v6vjw1m0i7j24-gnutar-1.35/bin/tar
  611. 28.27 s [pathway-compat-filepath] No uhc found
  612. 28.71 s [pathway-compat-filepath] Phase: buildPhase
  613. 28.79 s [pathway-compat-filepath] Preprocessing library for pathway-compat-filepath-0.0.1.0..
  614. 28.79 s [pathway-compat-filepath] Building library for pathway-compat-filepath-0.0.1.0..
  615. 28.88 s [pathway-compat-filepath] [ 1 of 10] Compiling Common.FilePath ( src/Common/FilePath.hs, dist/build/Common/FilePath.o, dist/build/Common/FilePath.dyn_o )
  616. 29.20 s [pathway-compat-filepath] [ 2 of 10] Compiling Common.OsPath ( src/Common/OsPath.hs, dist/build/Common/OsPath.o, dist/build/Common/OsPath.dyn_o )
  617. 29.20 s [pathway-compat-filepath]
  618. 29.20 s [pathway-compat-filepath] src/Common/OsPath.hs:90:23: error: [GHC-83865]
  619. 29.20 s [pathway-compat-filepath] • Couldn't match type ‘OSS.OsString’ with ‘OsString’
  620. 29.20 s [pathway-compat-filepath] Expected: OsPath
  621. 29.20 s [pathway-compat-filepath] Actual: OSS.OsString
  622. 29.20 s [pathway-compat-filepath] NB: ‘OsString’
  623. 29.20 s [pathway-compat-filepath] is defined in ‘System.OsString.Internal.Types.Hidden’
  624. 29.20 s [pathway-compat-filepath] in package ‘filepath-1.4.301.0’
  625. 29.20 s [pathway-compat-filepath] ‘OSS.OsString’
  626. 29.20 s [pathway-compat-filepath] is defined in ‘System.OsString.Internal.Types’
  627. 29.20 s [pathway-compat-filepath] in package ‘os-string-2.0.10’
  628. 29.20 s [pathway-compat-filepath] • In the ‘parent’ field of a record
  629. 29.20 s [pathway-compat-filepath] In the expression:
  630. 29.20 s [pathway-compat-filepath] Format
  631. 29.20 s [pathway-compat-filepath] {Format.root = O.pack . pure $ O.pathSeparator,
  632. 29.20 s [pathway-compat-filepath] Format.current = mempty, Format.parent = OSS.unsafeEncodeUtf "..",
  633. 29.20 s [pathway-compat-filepath] Format.separator = O.pack . pure $ O.pathSeparator,
  634. 29.20 s [pathway-compat-filepath] Format.substitutions = mempty}
  635. 29.20 s [pathway-compat-filepath] In an equation for ‘localFormat’:
  636. 29.20 s [pathway-compat-filepath] localFormat
  637. 29.20 s [pathway-compat-filepath] = Format
  638. 29.20 s [pathway-compat-filepath] {Format.root = O.pack . pure $ O.pathSeparator,
  639. 29.20 s [pathway-compat-filepath] Format.current = mempty, Format.parent = OSS.unsafeEncodeUtf "..",
  640. 29.20 s [pathway-compat-filepath] Format.separator = O.pack . pure $ O.pathSeparator,
  641. 29.20 s [pathway-compat-filepath] Format.substitutions = mempty}
  642. 29.20 s [pathway-compat-filepath] |
  643. 29.20 s [pathway-compat-filepath] 90 | Format.parent = OSS.unsafeEncodeUtf "..",
  644. 29.20 s [pathway-compat-filepath] | ^^^^^^^^^^^^^^^^^^^^^^^^
  645. 29.20 s [pathway-compat-filepath] [ 3 of 10] Compiling System.FilePath.Thin ( src/System/FilePath/Thin.hs, dist/build/System/FilePath/Thin.o, dist/build/System/FilePath/Thin.dyn_o )
  646. 29.32 s [pathway-compat-filepath] [ 4 of 10] Compiling System.FilePath.Pathway ( src/System/FilePath/Pathway.hs, dist/build/System/FilePath/Pathway.o, dist/build/System/FilePath/Pathway.dyn_o )
  647. 29.35 s [pathway-compat-filepath] [ 5 of 10] Compiling System.FilePath.Overlay ( src/System/FilePath/Overlay.hs, dist/build/System/FilePath/Overlay.o, dist/build/System/FilePath/Overlay.dyn_o )
  648. 29.37 s [pathway-compat-filepath] [ 6 of 10] Compiling System.FilePath ( src/System/FilePath.hs, dist/build/System/FilePath.o, dist/build/System/FilePath.dyn_o )
  649. 29.50 s Progress: 1 of 13 built (1 failed), 8 of 8 downloaded from cache
  650. 29.50 s Failed to build pathway-compat-filepath after 4.0s
  651. 29.50 s error: Cannot build '/nix/store/isq7l83m10yyykzr1f202hq4n23f43p1-pathway-compat-filepath-0.0.1.0.drv'.
  652. 29.50 s Reason: builder failed with exit code 1.
  653. 29.50 s Output paths:
  654. 29.50 s /nix/store/gsxpk94inw22circr76qnnbmvc6ziwhz-pathway-compat-filepath-0.0.1.0-doc
  655. 29.50 s /nix/store/q9fsagpd29spy55dp5m0zri4is79nfz5-pathway-compat-filepath-0.0.1.0
  656. 29.50 s Last 176 log lines:
  657. 29.50 s > Running phase: setupCompilerEnvironmentPhase
  658. 29.50 s > Build with /nix/store/2djpcnj8a25viv1y24h3mziy1gsy3fc6-ghc-9.6.7.
  659. 29.50 s > Running phase: unpackPhase
  660. 29.50 s > unpacking source archive /nix/store/5z4x7vzkb1m65ccyx19wn7vcxdl9gmbf-filepath
  661. 29.50 s > source root is filepath
  662. 29.50 s > Running phase: patchPhase
  663. 29.50 s > Running phase: compileBuildDriverPhase
  664. 29.50 s > setupCompileFlags: -package-db=/build/tmp.zKwaqPnUnM/setup-package.conf.d -threaded
  665. 29.50 s > [1 of 2] Compiling Main ( Setup.hs, /build/tmp.zKwaqPnUnM/Main.o )
  666. 29.50 s > [2 of 2] Linking Setup
  667. 29.50 s > Running phase: updateAutotoolsGnuConfigScriptsPhase
  668. 29.50 s > Running phase: configurePhase
  669. 29.50 s > configureFlags: --verbose --prefix=/nix/store/q9fsagpd29spy55dp5m0zri4is79nfz5-pathway-compat-filepath-0.0.1.0 --libdir=$prefix/lib/$compiler/lib --libsubdir=$abi/$libname --docdir=/nix/store/gsxpk94inw22circr76qnnbmvc6ziwhz-pathway-compat-filepath-0.0.1.0-doc/share/doc/pathway-compat-filepath-0.0.1.0 --with-gcc=gcc --package-db=/build/tmp.zKwaqPnUnM/package.conf.d --ghc-option=-j16 --ghc-option=+RTS --ghc-option=-A64M --ghc-option=-RTS --enable-library-profiling --profiling-detail=exported-functions --disable-profiling --enable-shared --disable-coverage --enable-static --disable-executable-dynamic --enable-tests --disable-benchmarks --enable-library-vanilla --disable-library-for-ghci --enable-split-sections --enable-library-stripping --enable-executable-stripping --ghc-option=-haddock --ghc-options=-Werror --extra-lib-dirs=/nix/store/pndhkk0l649lm1sj0mxk7cbwq26qd1ra-ncurses-6.6/lib --extra-lib-dirs=/nix/store/0djlg4g0b81w94k3vcaqsxsc2hh4kism-libffi-3.5.2/lib --extra-lib-dirs=/nix/store/md4paia7riiggyrj8p24c7a6vf8w7jz8-elfutils-0.194/lib --extra-lib-dirs=/nix/store/39vv2pf64gd8li48a4hpbhw2crzd8z5p-gmp-with-cxx-6.3.0/lib --extra-lib-dirs=/nix/store/7wwvald8lapkrsr72qanlw8blyn55ifx-numactl-2.0.18/lib --extra-lib-dirs=/nix/store/2djpcnj8a25viv1y24h3mziy1gsy3fc6-ghc-9.6.7/lib
  670. 29.50 s > Using Parsec parser
  671. 29.50 s > Configuring pathway-compat-filepath-0.0.1.0...
  672. 29.50 s > Flags chosen: noisy-deprecations=True, verify-no-recursion=False
  673. 29.50 s > Dependency base >=4.14.0 && <4.15 || >=4.15.0 && <4.16 || >=4.16.0 && <4.17 ||
  674. 29.50 s > >=4.17.0 && <4.18 || >=4.18.0 && <4.19 || >=4.19.0 && <4.20 || >=4.20.0 &&
  675. 29.50 s > <4.21 || >=4.21.0 && <4.22 || >=4.22.0 && <4.23: using base-4.18.3.0
  676. 29.50 s > Dependency extra: using extra-1.8.1
  677. 29.50 s > Dependency filepath >=1.4.2 && <1.5 || >=1.5.0 && <1.6: using
  678. 29.50 s > filepath-1.4.301.0
  679. 29.50 s > Dependency megaparsec >=9.0.1 && <9.1 || >=9.2.1 && <9.3 || >=9.5.0 && <9.6 ||
  680. 29.50 s > >=9.7.0 && <9.8: using megaparsec-9.7.0
  681. 29.50 s > Dependency os-string: using os-string-2.0.10
  682. 29.50 s > Dependency pathway >=0.0.1 && <0.1: using pathway-0.0.1.0
  683. 29.50 s > Dependency pathway-compat-base >=0.0.1 && <0.1: using
  684. 29.50 s > pathway-compat-base-0.0.1.0
  685. 29.50 s > Dependency pathway-internal >=0.0.1 && <0.1: using pathway-internal-0.0.1.0
  686. 29.50 s > Dependency base >=4.14.0 && <4.15 || >=4.15.0 && <4.16 || >=4.16.0 && <4.17 ||
  687. 29.50 s > >=4.17.0 && <4.18 || >=4.18.0 && <4.19 || >=4.19.0 && <4.20 || >=4.20.0 &&
  688. 29.50 s > <4.21 || >=4.21.0 && <4.22 || >=4.22.0 && <4.23: using base-4.18.3.0
  689. 29.50 s > Dependency doctest >=0.16.3 && <0.17 || >=0.18.1 && <0.19 || >=0.20.1 && <0.21
  690. 29.50 s > || >=0.21.1 && <0.22 || >=0.22.2 && <0.23 || >=0.24.2 && <0.25: using
  691. 29.50 s > doctest-0.24.3
  692. 29.50 s > Dependency pathway-compat-filepath: using pathway-compat-filepath-0.0.1.0
  693. 29.50 s > Source component graph:
  694. 29.50 s > component lib
  695. 29.50 s > component test:doctests dependency lib
  696. 29.50 s > Configured component graph:
  697. 29.50 s > component pathway-compat-filepath-0.0.1.0-Ck51GFznMiC2cxIfBMz4NH
  698. 29.50 s > include base-4.18.3.0
  699. 29.50 s > include extra-1.8.1-FU1frm3XcM88A49dBkmtgI
  700. 29.50 s > include filepath-1.4.301.0
  701. 29.50 s > include megaparsec-9.7.0-EpAk7LLR2KBGAKafJPbXz1
  702. 29.50 s > include os-string-2.0.10-19KGKnZaj8J2ODUMyNXxJr
  703. 29.50 s > include pathway-0.0.1.0-5VJXWbvreBAfybP2NROr3
  704. 29.50 s > include pathway-compat-base-0.0.1.0-E02izPYkwmmGdAPlQBKjbP
  705. 29.50 s > include pathway-internal-0.0.1.0-1xeSc3z2VhRIotiMz9hdL1
  706. 29.50 s > component pathway-compat-filepath-0.0.1.0-Bh4LT0cz7im2Vo1hGnl75g-doctests
  707. 29.50 s > include base-4.18.3.0
  708. 29.50 s > include doctest-0.24.3-ACQNy8u8jPjC50l4I3tyiL
  709. 29.50 s > include pathway-compat-filepath-0.0.1.0-Ck51GFznMiC2cxIfBMz4NH
  710. 29.50 s > Linked component graph:
  711. 29.50 s > unit pathway-compat-filepath-0.0.1.0-Ck51GFznMiC2cxIfBMz4NH
  712. 29.50 s > include base-4.18.3.0
  713. 29.50 s > include extra-1.8.1-FU1frm3XcM88A49dBkmtgI
  714. 29.50 s > include filepath-1.4.301.0
  715. 29.50 s > include megaparsec-9.7.0-EpAk7LLR2KBGAKafJPbXz1
  716. 29.50 s > include os-string-2.0.10-19KGKnZaj8J2ODUMyNXxJr
  717. 29.50 s > include pathway-0.0.1.0-5VJXWbvreBAfybP2NROr3
  718. 29.50 s > include pathway-compat-base-0.0.1.0-E02izPYkwmmGdAPlQBKjbP
  719. 29.50 s > include pathway-internal-0.0.1.0-1xeSc3z2VhRIotiMz9hdL1
  720. 29.50 s > Common.FilePath=pathway-compat-filepath-0.0.1.0-Ck51GFznMiC2cxIfBMz4NH:Common.FilePath,Common.OsPath=pathway-compat-filepath-0.0.1.0-Ck51GFznMiC2cxIfBMz4NH:Common.OsPath,System.FilePath=pathway-compat-filepath-0.0.1.0-Ck51GFznMiC2cxIfBMz4NH:System.FilePath,System.FilePath.Overlay=pathway-compat-filepath-0.0.1.0-Ck51GFznMiC2cxIfBMz4NH:System.FilePath.Overlay,System.FilePath.Pathway=pathway-compat-filepath-0.0.1.0-Ck51GFznMiC2cxIfBMz4NH:System.FilePath.Pathway,System.FilePath.Thin=pathway-compat-filepath-0.0.1.0-Ck51GFznMiC2cxIfBMz4NH:System.FilePath.Thin,System.OsPath=pathway-compat-filepath-0.0.1.0-Ck51GFznMiC2cxIfBMz4NH:System.OsPath,System.OsPath.Overlay=pathway-compat-filepath-0.0.1.0-Ck51GFznMiC2cxIfBMz4NH:System.OsPath.Overlay,System.OsPath.Pathway=pathway-compat-filepath-0.0.1.0-Ck51GFznMiC2cxIfBMz4NH:System.OsPath.Pathway,System.OsPath.Thin=pathway-compat-filepath-0.0.1.0-Ck51GFznMiC2cxIfBMz4NH:System.OsPath.Thin
  721. 29.50 s > unit pathway-compat-filepath-0.0.1.0-Bh4LT0cz7im2Vo1hGnl75g-doctests
  722. 29.50 s > include base-4.18.3.0
  723. 29.50 s > include doctest-0.24.3-ACQNy8u8jPjC50l4I3tyiL
  724. 29.50 s > include pathway-compat-filepath-0.0.1.0-Ck51GFznMiC2cxIfBMz4NH
  725. 29.50 s > Ready component graph:
  726. 29.50 s > definite pathway-compat-filepath-0.0.1.0-Ck51GFznMiC2cxIfBMz4NH
  727. 29.50 s > depends base-4.18.3.0
  728. 29.50 s > depends extra-1.8.1-FU1frm3XcM88A49dBkmtgI
  729. 29.50 s > depends filepath-1.4.301.0
  730. 29.50 s > depends megaparsec-9.7.0-EpAk7LLR2KBGAKafJPbXz1
  731. 29.50 s > depends os-string-2.0.10-19KGKnZaj8J2ODUMyNXxJr
  732. 29.50 s > depends pathway-0.0.1.0-5VJXWbvreBAfybP2NROr3
  733. 29.50 s > depends pathway-compat-base-0.0.1.0-E02izPYkwmmGdAPlQBKjbP
  734. 29.50 s > depends pathway-internal-0.0.1.0-1xeSc3z2VhRIotiMz9hdL1
  735. 29.50 s > definite pathway-compat-filepath-0.0.1.0-Bh4LT0cz7im2Vo1hGnl75g-doctests
  736. 29.50 s > depends base-4.18.3.0
  737. 29.50 s > depends doctest-0.24.3-ACQNy8u8jPjC50l4I3tyiL
  738. 29.50 s > depends pathway-compat-filepath-0.0.1.0-Ck51GFznMiC2cxIfBMz4NH
  739. 29.50 s > Using Cabal-3.10.3.0 compiled by ghc-9.6
  740. 29.50 s > Using compiler: ghc-9.6.7
  741. 29.50 s > Using install prefix:
  742. 29.50 s > /nix/store/q9fsagpd29spy55dp5m0zri4is79nfz5-pathway-compat-filepath-0.0.1.0
  743. 29.50 s > Executables installed in:
  744. 29.50 s > /nix/store/q9fsagpd29spy55dp5m0zri4is79nfz5-pathway-compat-filepath-0.0.1.0/bin
  745. 29.50 s > Libraries installed in:
  746. 29.50 s > /nix/store/q9fsagpd29spy55dp5m0zri4is79nfz5-pathway-compat-filepath-0.0.1.0/lib/ghc-9.6.7/lib/x86_64-linux-ghc-9.6.7/pathway-compat-filepath-0.0.1.0-Ck51GFznMiC2cxIfBMz4NH
  747. 29.50 s > Dynamic Libraries installed in:
  748. 29.50 s > /nix/store/q9fsagpd29spy55dp5m0zri4is79nfz5-pathway-compat-filepath-0.0.1.0/lib/ghc-9.6.7/lib/x86_64-linux-ghc-9.6.7
  749. 29.50 s > Private executables installed in:
  750. 29.50 s > /nix/store/q9fsagpd29spy55dp5m0zri4is79nfz5-pathway-compat-filepath-0.0.1.0/libexec/x86_64-linux-ghc-9.6.7/pathway-compat-filepath-0.0.1.0
  751. 29.50 s > Data files installed in:
  752. 29.50 s > /nix/store/q9fsagpd29spy55dp5m0zri4is79nfz5-pathway-compat-filepath-0.0.1.0/share/x86_64-linux-ghc-9.6.7/pathway-compat-filepath-0.0.1.0
  753. 29.50 s > Documentation installed in:
  754. 29.50 s > /nix/store/gsxpk94inw22circr76qnnbmvc6ziwhz-pathway-compat-filepath-0.0.1.0-doc/share/doc/pathway-compat-filepath-0.0.1.0
  755. 29.50 s > Configuration files installed in:
  756. 29.50 s > /nix/store/q9fsagpd29spy55dp5m0zri4is79nfz5-pathway-compat-filepath-0.0.1.0/etc
  757. 29.50 s > No alex found
  758. 29.50 s > Using ar found on system at:
  759. 29.50 s > /nix/store/zjraf40s86y3iwhp626b934r5y6ldkbb-binutils-wrapper-2.46/bin/ar
  760. 29.50 s > No c2hs found
  761. 29.50 s > No cpphs found
  762. 29.50 s > Using doctest version 0.24.3 found on system at:
  763. 29.50 s > /nix/store/s48k56ayjjxwdbz9y7d8mnqwlcjfi1a8-doctest-0.24.3/bin/doctest
  764. 29.50 s > Using gcc version 15.2.0 given by user at:
  765. 29.50 s > /nix/store/29qjlshvklnyr67nhpprzgb9igmsfsjj-gcc-wrapper-15.2.0/bin/gcc
  766. 29.50 s > Using ghc version 9.6.7 found on system at:
  767. 29.50 s > /nix/store/2djpcnj8a25viv1y24h3mziy1gsy3fc6-ghc-9.6.7/bin/ghc
  768. 29.50 s > Using ghc-pkg version 9.6.7 found on system at:
  769. 29.50 s > /nix/store/2djpcnj8a25viv1y24h3mziy1gsy3fc6-ghc-9.6.7/bin/ghc-pkg-9.6.7
  770. 29.50 s > No ghcjs found
  771. 29.50 s > No ghcjs-pkg found
  772. 29.50 s > No greencard found
  773. 29.50 s > Using haddock version 2.29.2 found on system at:
  774. 29.50 s > /nix/store/2djpcnj8a25viv1y24h3mziy1gsy3fc6-ghc-9.6.7/bin/haddock-ghc-9.6.7
  775. 29.50 s > No happy found
  776. 29.50 s > Using haskell-suite found on system at: haskell-suite-dummy-location
  777. 29.50 s > Using haskell-suite-pkg found on system at: haskell-suite-pkg-dummy-location
  778. 29.50 s > No hmake found
  779. 29.50 s > Using hpc version 0.68 found on system at:
  780. 29.50 s > /nix/store/2djpcnj8a25viv1y24h3mziy1gsy3fc6-ghc-9.6.7/bin/hpc-ghc-9.6.7
  781. 29.50 s > Using hsc2hs version 0.68.9 found on system at:
  782. 29.50 s > /nix/store/2djpcnj8a25viv1y24h3mziy1gsy3fc6-ghc-9.6.7/bin/hsc2hs-ghc-9.6.7
  783. 29.50 s > Using hscolour version 1.25 found on system at:
  784. 29.50 s > /nix/store/2x19jxh5g98bv0s06mdj71c1hmxi54yl-hscolour-1.25/bin/HsColour
  785. 29.50 s > No jhc found
  786. 29.50 s > Using ld found on system at:
  787. 29.50 s > /nix/store/zjraf40s86y3iwhp626b934r5y6ldkbb-binutils-wrapper-2.46/bin/ld.gold
  788. 29.50 s > No pkg-config found
  789. 29.50 s > Using runghc version 9.6.7 found on system at:
  790. 29.50 s > /nix/store/2djpcnj8a25viv1y24h3mziy1gsy3fc6-ghc-9.6.7/bin/runghc-9.6.7
  791. 29.50 s > Using strip version 2.46 found on system at:
  792. 29.50 s > /nix/store/29qjlshvklnyr67nhpprzgb9igmsfsjj-gcc-wrapper-15.2.0/bin/strip
  793. 29.50 s > Using tar found on system at:
  794. 29.50 s > /nix/store/z5mq2sam4484prf3kv6v6vjw1m0i7j24-gnutar-1.35/bin/tar
  795. 29.50 s > No uhc found
  796. 29.50 s > Running phase: buildPhase
  797. 29.50 s > Preprocessing library for pathway-compat-filepath-0.0.1.0..
  798. 29.50 s > Building library for pathway-compat-filepath-0.0.1.0..
  799. 29.50 s > [ 1 of 10] Compiling Common.FilePath ( src/Common/FilePath.hs, dist/build/Common/FilePath.o, dist/build/Common/FilePath.dyn_o )
  800. 29.50 s > [ 2 of 10] Compiling Common.OsPath ( src/Common/OsPath.hs, dist/build/Common/OsPath.o, dist/build/Common/OsPath.dyn_o )
  801. 29.50 s >
  802. 29.50 s > src/Common/OsPath.hs:90:23: error: [GHC-83865]
  803. 29.50 s > • Couldn't match type ‘OSS.OsString’ with ‘OsString’
  804. 29.50 s > Expected: OsPath
  805. 29.50 s > Actual: OSS.OsString
  806. 29.50 s > NB: ‘OsString’
  807. 29.50 s > is defined in ‘System.OsString.Internal.Types.Hidden’
  808. 29.50 s > in package ‘filepath-1.4.301.0’
  809. 29.50 s > ‘OSS.OsString’
  810. 29.50 s > is defined in ‘System.OsString.Internal.Types’
  811. 29.50 s > in package ‘os-string-2.0.10’
  812. 29.50 s > • In the ‘parent’ field of a record
  813. 29.50 s > In the expression:
  814. 29.50 s > Format
  815. 29.50 s > {Format.root = O.pack . pure $ O.pathSeparator,
  816. 29.50 s > Format.current = mempty, Format.parent = OSS.unsafeEncodeUtf "..",
  817. 29.50 s > Format.separator = O.pack . pure $ O.pathSeparator,
  818. 29.50 s > Format.substitutions = mempty}
  819. 29.50 s > In an equation for ‘localFormat’:
  820. 29.50 s > localFormat
  821. 29.50 s > = Format
  822. 29.50 s > {Format.root = O.pack . pure $ O.pathSeparator,
  823. 29.50 s > Format.current = mempty, Format.parent = OSS.unsafeEncodeUtf "..",
  824. 29.50 s > Format.separator = O.pack . pure $ O.pathSeparator,
  825. 29.50 s > Format.substitutions = mempty}
  826. 29.50 s > |
  827. 29.50 s > 90 | Format.parent = OSS.unsafeEncodeUtf "..",
  828. 29.50 s > | ^^^^^^^^^^^^^^^^^^^^^^^^
  829. 29.50 s > [ 3 of 10] Compiling System.FilePath.Thin ( src/System/FilePath/Thin.hs, dist/build/System/FilePath/Thin.o, dist/build/System/FilePath/Thin.dyn_o )
  830. 29.50 s > [ 4 of 10] Compiling System.FilePath.Pathway ( src/System/FilePath/Pathway.hs, dist/build/System/FilePath/Pathway.o, dist/build/System/FilePath/Pathway.dyn_o )
  831. 29.50 s > [ 5 of 10] Compiling System.FilePath.Overlay ( src/System/FilePath/Overlay.hs, dist/build/System/FilePath/Overlay.o, dist/build/System/FilePath/Overlay.dyn_o )
  832. 29.50 s > [ 6 of 10] Compiling System.FilePath ( src/System/FilePath.hs, dist/build/System/FilePath.o, dist/build/System/FilePath.dyn_o )
  833. 29.50 s For full logs, run:
  834. 29.50 s nix log /nix/store/isq7l83m10yyykzr1f202hq4n23f43p1-pathway-compat-filepath-0.0.1.0.drv
  835. 29.51 s error: Cannot build '/nix/store/isq7l83m10yyykzr1f202hq4n23f43p1-pathway-compat-filepath-0.0.1.0.drv'.
  836. 29.51 s Reason: builder failed with exit code 1.
  837. 29.51 s Output paths:
  838. 29.51 s /nix/store/gsxpk94inw22circr76qnnbmvc6ziwhz-pathway-compat-filepath-0.0.1.0-doc
  839. 29.51 s /nix/store/q9fsagpd29spy55dp5m0zri4is79nfz5-pathway-compat-filepath-0.0.1.0
  840. 29.51 s Last 176 log lines:
  841. 29.51 s > Running phase: setupCompilerEnvironmentPhase
  842. 29.51 s > Build with /nix/store/2djpcnj8a25viv1y24h3mziy1gsy3fc6-ghc-9.6.7.
  843. 29.51 s > Running phase: unpackPhase
  844. 29.51 s > unpacking source archive /nix/store/5z4x7vzkb1m65ccyx19wn7vcxdl9gmbf-filepath
  845. 29.51 s > source root is filepath
  846. 29.51 s > Running phase: patchPhase
  847. 29.51 s > Running phase: compileBuildDriverPhase
  848. 29.51 s > setupCompileFlags: -package-db=/build/tmp.zKwaqPnUnM/setup-package.conf.d -threaded
  849. 29.51 s > [1 of 2] Compiling Main ( Setup.hs, /build/tmp.zKwaqPnUnM/Main.o )
  850. 29.51 s > [2 of 2] Linking Setup
  851. 29.51 s > Running phase: updateAutotoolsGnuConfigScriptsPhase
  852. 29.51 s > Running phase: configurePhase
  853. 29.51 s > configureFlags: --verbose --prefix=/nix/store/q9fsagpd29spy55dp5m0zri4is79nfz5-pathway-compat-filepath-0.0.1.0 --libdir=$prefix/lib/$compiler/lib --libsubdir=$abi/$libname --docdir=/nix/store/gsxpk94inw22circr76qnnbmvc6ziwhz-pathway-compat-filepath-0.0.1.0-doc/share/doc/pathway-compat-filepath-0.0.1.0 --with-gcc=gcc --package-db=/build/tmp.zKwaqPnUnM/package.conf.d --ghc-option=-j16 --ghc-option=+RTS --ghc-option=-A64M --ghc-option=-RTS --enable-library-profiling --profiling-detail=exported-functions --disable-profiling --enable-shared --disable-coverage --enable-static --disable-executable-dynamic --enable-tests --disable-benchmarks --enable-library-vanilla --disable-library-for-ghci --enable-split-sections --enable-library-stripping --enable-executable-stripping --ghc-option=-haddock --ghc-options=-Werror --extra-lib-dirs=/nix/store/pndhkk0l649lm1sj0mxk7cbwq26qd1ra-ncurses-6.6/lib --extra-lib-dirs=/nix/store/0djlg4g0b81w94k3vcaqsxsc2hh4kism-libffi-3.5.2/lib --extra-lib-dirs=/nix/store/md4paia7riiggyrj8p24c7a6vf8w7jz8-elfutils-0.194/lib --extra-lib-dirs=/nix/store/39vv2pf64gd8li48a4hpbhw2crzd8z5p-gmp-with-cxx-6.3.0/lib --extra-lib-dirs=/nix/store/7wwvald8lapkrsr72qanlw8blyn55ifx-numactl-2.0.18/lib --extra-lib-dirs=/nix/store/2djpcnj8a25viv1y24h3mziy1gsy3fc6-ghc-9.6.7/lib
  854. 29.51 s > Using Parsec parser
  855. 29.51 s > Configuring pathway-compat-filepath-0.0.1.0...
  856. 29.51 s > Flags chosen: noisy-deprecations=True, verify-no-recursion=False
  857. 29.51 s > Dependency base >=4.14.0 && <4.15 || >=4.15.0 && <4.16 || >=4.16.0 && <4.17 ||
  858. 29.51 s > >=4.17.0 && <4.18 || >=4.18.0 && <4.19 || >=4.19.0 && <4.20 || >=4.20.0 &&
  859. 29.51 s > <4.21 || >=4.21.0 && <4.22 || >=4.22.0 && <4.23: using base-4.18.3.0
  860. 29.51 s > Dependency extra: using extra-1.8.1
  861. 29.51 s > Dependency filepath >=1.4.2 && <1.5 || >=1.5.0 && <1.6: using
  862. 29.51 s > filepath-1.4.301.0
  863. 29.51 s > Dependency megaparsec >=9.0.1 && <9.1 || >=9.2.1 && <9.3 || >=9.5.0 && <9.6 ||
  864. 29.51 s > >=9.7.0 && <9.8: using megaparsec-9.7.0
  865. 29.51 s > Dependency os-string: using os-string-2.0.10
  866. 29.51 s > Dependency pathway >=0.0.1 && <0.1: using pathway-0.0.1.0
  867. 29.51 s > Dependency pathway-compat-base >=0.0.1 && <0.1: using
  868. 29.51 s > pathway-compat-base-0.0.1.0
  869. 29.51 s > Dependency pathway-internal >=0.0.1 && <0.1: using pathway-internal-0.0.1.0
  870. 29.51 s > Dependency base >=4.14.0 && <4.15 || >=4.15.0 && <4.16 || >=4.16.0 && <4.17 ||
  871. 29.51 s > >=4.17.0 && <4.18 || >=4.18.0 && <4.19 || >=4.19.0 && <4.20 || >=4.20.0 &&
  872. 29.51 s > <4.21 || >=4.21.0 && <4.22 || >=4.22.0 && <4.23: using base-4.18.3.0
  873. 29.51 s > Dependency doctest >=0.16.3 && <0.17 || >=0.18.1 && <0.19 || >=0.20.1 && <0.21
  874. 29.51 s > || >=0.21.1 && <0.22 || >=0.22.2 && <0.23 || >=0.24.2 && <0.25: using
  875. 29.51 s > doctest-0.24.3
  876. 29.51 s > Dependency pathway-compat-filepath: using pathway-compat-filepath-0.0.1.0
  877. 29.51 s > Source component graph:
  878. 29.51 s > component lib
  879. 29.51 s > component test:doctests dependency lib
  880. 29.51 s > Configured component graph:
  881. 29.51 s > component pathway-compat-filepath-0.0.1.0-Ck51GFznMiC2cxIfBMz4NH
  882. 29.51 s > include base-4.18.3.0
  883. 29.51 s > include extra-1.8.1-FU1frm3XcM88A49dBkmtgI
  884. 29.51 s > include filepath-1.4.301.0
  885. 29.51 s > include megaparsec-9.7.0-EpAk7LLR2KBGAKafJPbXz1
  886. 29.51 s > include os-string-2.0.10-19KGKnZaj8J2ODUMyNXxJr
  887. 29.51 s > include pathway-0.0.1.0-5VJXWbvreBAfybP2NROr3
  888. 29.51 s > include pathway-compat-base-0.0.1.0-E02izPYkwmmGdAPlQBKjbP
  889. 29.51 s > include pathway-internal-0.0.1.0-1xeSc3z2VhRIotiMz9hdL1
  890. 29.51 s > component pathway-compat-filepath-0.0.1.0-Bh4LT0cz7im2Vo1hGnl75g-doctests
  891. 29.51 s > include base-4.18.3.0
  892. 29.51 s > include doctest-0.24.3-ACQNy8u8jPjC50l4I3tyiL
  893. 29.51 s > include pathway-compat-filepath-0.0.1.0-Ck51GFznMiC2cxIfBMz4NH
  894. 29.51 s > Linked component graph:
  895. 29.51 s > unit pathway-compat-filepath-0.0.1.0-Ck51GFznMiC2cxIfBMz4NH
  896. 29.51 s > include base-4.18.3.0
  897. 29.51 s > include extra-1.8.1-FU1frm3XcM88A49dBkmtgI
  898. 29.51 s > include filepath-1.4.301.0
  899. 29.51 s > include megaparsec-9.7.0-EpAk7LLR2KBGAKafJPbXz1
  900. 29.51 s > include os-string-2.0.10-19KGKnZaj8J2ODUMyNXxJr
  901. 29.51 s > include pathway-0.0.1.0-5VJXWbvreBAfybP2NROr3
  902. 29.51 s > include pathway-compat-base-0.0.1.0-E02izPYkwmmGdAPlQBKjbP
  903. 29.51 s > include pathway-internal-0.0.1.0-1xeSc3z2VhRIotiMz9hdL1
  904. 29.51 s > Common.FilePath=pathway-compat-filepath-0.0.1.0-Ck51GFznMiC2cxIfBMz4NH:Common.FilePath,Common.OsPath=pathway-compat-filepath-0.0.1.0-Ck51GFznMiC2cxIfBMz4NH:Common.OsPath,System.FilePath=pathway-compat-filepath-0.0.1.0-Ck51GFznMiC2cxIfBMz4NH:System.FilePath,System.FilePath.Overlay=pathway-compat-filepath-0.0.1.0-Ck51GFznMiC2cxIfBMz4NH:System.FilePath.Overlay,System.FilePath.Pathway=pathway-compat-filepath-0.0.1.0-Ck51GFznMiC2cxIfBMz4NH:System.FilePath.Pathway,System.FilePath.Thin=pathway-compat-filepath-0.0.1.0-Ck51GFznMiC2cxIfBMz4NH:System.FilePath.Thin,System.OsPath=pathway-compat-filepath-0.0.1.0-Ck51GFznMiC2cxIfBMz4NH:System.OsPath,System.OsPath.Overlay=pathway-compat-filepath-0.0.1.0-Ck51GFznMiC2cxIfBMz4NH:System.OsPath.Overlay,System.OsPath.Pathway=pathway-compat-filepath-0.0.1.0-Ck51GFznMiC2cxIfBMz4NH:System.OsPath.Pathway,System.OsPath.Thin=pathway-compat-filepath-0.0.1.0-Ck51GFznMiC2cxIfBMz4NH:System.OsPath.Thin
  905. 29.51 s > unit pathway-compat-filepath-0.0.1.0-Bh4LT0cz7im2Vo1hGnl75g-doctests
  906. 29.51 s > include base-4.18.3.0
  907. 29.51 s > include doctest-0.24.3-ACQNy8u8jPjC50l4I3tyiL
  908. 29.51 s > include pathway-compat-filepath-0.0.1.0-Ck51GFznMiC2cxIfBMz4NH
  909. 29.51 s > Ready component graph:
  910. 29.51 s > definite pathway-compat-filepath-0.0.1.0-Ck51GFznMiC2cxIfBMz4NH
  911. 29.51 s > depends base-4.18.3.0
  912. 29.51 s > depends extra-1.8.1-FU1frm3XcM88A49dBkmtgI
  913. 29.51 s > depends filepath-1.4.301.0
  914. 29.51 s > depends megaparsec-9.7.0-EpAk7LLR2KBGAKafJPbXz1
  915. 29.51 s > depends os-string-2.0.10-19KGKnZaj8J2ODUMyNXxJr
  916. 29.51 s > depends pathway-0.0.1.0-5VJXWbvreBAfybP2NROr3
  917. 29.51 s > depends pathway-compat-base-0.0.1.0-E02izPYkwmmGdAPlQBKjbP
  918. 29.51 s > depends pathway-internal-0.0.1.0-1xeSc3z2VhRIotiMz9hdL1
  919. 29.51 s > definite pathway-compat-filepath-0.0.1.0-Bh4LT0cz7im2Vo1hGnl75g-doctests
  920. 29.51 s > depends base-4.18.3.0
  921. 29.51 s > depends doctest-0.24.3-ACQNy8u8jPjC50l4I3tyiL
  922. 29.51 s > depends pathway-compat-filepath-0.0.1.0-Ck51GFznMiC2cxIfBMz4NH
  923. 29.51 s > Using Cabal-3.10.3.0 compiled by ghc-9.6
  924. 29.51 s > Using compiler: ghc-9.6.7
  925. 29.51 s > Using install prefix:
  926. 29.51 s > /nix/store/q9fsagpd29spy55dp5m0zri4is79nfz5-pathway-compat-filepath-0.0.1.0
  927. 29.51 s > Executables installed in:
  928. 29.51 s > /nix/store/q9fsagpd29spy55dp5m0zri4is79nfz5-pathway-compat-filepath-0.0.1.0/bin
  929. 29.51 s > Libraries installed in:
  930. 29.51 s > /nix/store/q9fsagpd29spy55dp5m0zri4is79nfz5-pathway-compat-filepath-0.0.1.0/lib/ghc-9.6.7/lib/x86_64-linux-ghc-9.6.7/pathway-compat-filepath-0.0.1.0-Ck51GFznMiC2cxIfBMz4NH
  931. 29.51 s > Dynamic Libraries installed in:
  932. 29.51 s > /nix/store/q9fsagpd29spy55dp5m0zri4is79nfz5-pathway-compat-filepath-0.0.1.0/lib/ghc-9.6.7/lib/x86_64-linux-ghc-9.6.7
  933. 29.51 s > Private executables installed in:
  934. 29.51 s > /nix/store/q9fsagpd29spy55dp5m0zri4is79nfz5-pathway-compat-filepath-0.0.1.0/libexec/x86_64-linux-ghc-9.6.7/pathway-compat-filepath-0.0.1.0
  935. 29.51 s > Data files installed in:
  936. 29.51 s > /nix/store/q9fsagpd29spy55dp5m0zri4is79nfz5-pathway-compat-filepath-0.0.1.0/share/x86_64-linux-ghc-9.6.7/pathway-compat-filepath-0.0.1.0
  937. 29.51 s > Documentation installed in:
  938. 29.51 s > /nix/store/gsxpk94inw22circr76qnnbmvc6ziwhz-pathway-compat-filepath-0.0.1.0-doc/share/doc/pathway-compat-filepath-0.0.1.0
  939. 29.51 s > Configuration files installed in:
  940. 29.51 s > /nix/store/q9fsagpd29spy55dp5m0zri4is79nfz5-pathway-compat-filepath-0.0.1.0/etc
  941. 29.51 s > No alex found
  942. 29.51 s > Using ar found on system at:
  943. 29.51 s > /nix/store/zjraf40s86y3iwhp626b934r5y6ldkbb-binutils-wrapper-2.46/bin/ar
  944. 29.51 s > No c2hs found
  945. 29.51 s > No cpphs found
  946. 29.51 s > Using doctest version 0.24.3 found on system at:
  947. 29.51 s > /nix/store/s48k56ayjjxwdbz9y7d8mnqwlcjfi1a8-doctest-0.24.3/bin/doctest
  948. 29.51 s > Using gcc version 15.2.0 given by user at:
  949. 29.51 s > /nix/store/29qjlshvklnyr67nhpprzgb9igmsfsjj-gcc-wrapper-15.2.0/bin/gcc
  950. 29.51 s > Using ghc version 9.6.7 found on system at:
  951. 29.51 s > /nix/store/2djpcnj8a25viv1y24h3mziy1gsy3fc6-ghc-9.6.7/bin/ghc
  952. 29.51 s > Using ghc-pkg version 9.6.7 found on system at:
  953. 29.51 s > /nix/store/2djpcnj8a25viv1y24h3mziy1gsy3fc6-ghc-9.6.7/bin/ghc-pkg-9.6.7
  954. 29.51 s > No ghcjs found
  955. 29.51 s > No ghcjs-pkg found
  956. 29.51 s > No greencard found
  957. 29.51 s > Using haddock version 2.29.2 found on system at:
  958. 29.51 s > /nix/store/2djpcnj8a25viv1y24h3mziy1gsy3fc6-ghc-9.6.7/bin/haddock-ghc-9.6.7
  959. 29.51 s > No happy found
  960. 29.51 s > Using haskell-suite found on system at: haskell-suite-dummy-location
  961. 29.51 s > Using haskell-suite-pkg found on system at: haskell-suite-pkg-dummy-location
  962. 29.51 s > No hmake found
  963. 29.51 s > Using hpc version 0.68 found on system at:
  964. 29.51 s > /nix/store/2djpcnj8a25viv1y24h3mziy1gsy3fc6-ghc-9.6.7/bin/hpc-ghc-9.6.7
  965. 29.51 s > Using hsc2hs version 0.68.9 found on system at:
  966. 29.51 s > /nix/store/2djpcnj8a25viv1y24h3mziy1gsy3fc6-ghc-9.6.7/bin/hsc2hs-ghc-9.6.7
  967. 29.51 s > Using hscolour version 1.25 found on system at:
  968. 29.51 s > /nix/store/2x19jxh5g98bv0s06mdj71c1hmxi54yl-hscolour-1.25/bin/HsColour
  969. 29.51 s > No jhc found
  970. 29.51 s > Using ld found on system at:
  971. 29.51 s > /nix/store/zjraf40s86y3iwhp626b934r5y6ldkbb-binutils-wrapper-2.46/bin/ld.gold
  972. 29.51 s > No pkg-config found
  973. 29.51 s > Using runghc version 9.6.7 found on system at:
  974. 29.51 s > /nix/store/2djpcnj8a25viv1y24h3mziy1gsy3fc6-ghc-9.6.7/bin/runghc-9.6.7
  975. 29.51 s > Using strip version 2.46 found on system at:
  976. 29.51 s > /nix/store/29qjlshvklnyr67nhpprzgb9igmsfsjj-gcc-wrapper-15.2.0/bin/strip
  977. 29.51 s > Using tar found on system at:
  978. 29.51 s > /nix/store/z5mq2sam4484prf3kv6v6vjw1m0i7j24-gnutar-1.35/bin/tar
  979. 29.51 s > No uhc found
  980. 29.51 s > Running phase: buildPhase
  981. 29.51 s > Preprocessing library for pathway-compat-filepath-0.0.1.0..
  982. 29.51 s > Building library for pathway-compat-filepath-0.0.1.0..
  983. 29.51 s > [ 1 of 10] Compiling Common.FilePath ( src/Common/FilePath.hs, dist/build/Common/FilePath.o, dist/build/Common/FilePath.dyn_o )
  984. 29.51 s > [ 2 of 10] Compiling Common.OsPath ( src/Common/OsPath.hs, dist/build/Common/OsPath.o, dist/build/Common/OsPath.dyn_o )
  985. 29.51 s >
  986. 29.51 s > src/Common/OsPath.hs:90:23: error: [GHC-83865]
  987. 29.51 s > • Couldn't match type ‘OSS.OsString’ with ‘OsString’
  988. 29.51 s > Expected: OsPath
  989. 29.51 s > Actual: OSS.OsString
  990. 29.51 s > NB: ‘OsString’
  991. 29.51 s > is defined in ‘System.OsString.Internal.Types.Hidden’
  992. 29.51 s > in package ‘filepath-1.4.301.0’
  993. 29.51 s > ‘OSS.OsString’
  994. 29.51 s > is defined in ‘System.OsString.Internal.Types’
  995. 29.51 s > in package ‘os-string-2.0.10’
  996. 29.51 s > • In the ‘parent’ field of a record
  997. 29.51 s > In the expression:
  998. 29.51 s > Format
  999. 29.51 s > {Format.root = O.pack . pure $ O.pathSeparator,
  1000. 29.51 s > Format.current = mempty, Format.parent = OSS.unsafeEncodeUtf "..",
  1001. 29.51 s > Format.separator = O.pack . pure $ O.pathSeparator,
  1002. 29.51 s > Format.substitutions = mempty}
  1003. 29.51 s > In an equation for ‘localFormat’:
  1004. 29.51 s > localFormat
  1005. 29.51 s > = Format
  1006. 29.51 s > {Format.root = O.pack . pure $ O.pathSeparator,
  1007. 29.51 s > Format.current = mempty, Format.parent = OSS.unsafeEncodeUtf "..",
  1008. 29.51 s > Format.separator = O.pack . pure $ O.pathSeparator,
  1009. 29.51 s > Format.substitutions = mempty}
  1010. 29.51 s > |
  1011. 29.51 s > 90 | Format.parent = OSS.unsafeEncodeUtf "..",
  1012. 29.51 s > | ^^^^^^^^^^^^^^^^^^^^^^^^
  1013. 29.51 s > [ 3 of 10] Compiling System.FilePath.Thin ( src/System/FilePath/Thin.hs, dist/build/System/FilePath/Thin.o, dist/build/System/FilePath/Thin.dyn_o )
  1014. 29.51 s > [ 4 of 10] Compiling System.FilePath.Pathway ( src/System/FilePath/Pathway.hs, dist/build/System/FilePath/Pathway.o, dist/build/System/FilePath/Pathway.dyn_o )
  1015. 29.51 s > [ 5 of 10] Compiling System.FilePath.Overlay ( src/System/FilePath/Overlay.hs, dist/build/System/FilePath/Overlay.o, dist/build/System/FilePath/Overlay.dyn_o )
  1016. 29.51 s > [ 6 of 10] Compiling System.FilePath ( src/System/FilePath.hs, dist/build/System/FilePath.o, dist/build/System/FilePath.dyn_o )
  1017. 29.51 s For full logs, run:
  1018. 29.51 s nix log /nix/store/isq7l83m10yyykzr1f202hq4n23f43p1-pathway-compat-filepath-0.0.1.0.drv
  1019. 29.51 s error: Cannot build '/nix/store/bpr5w918izm9vxfkr6byadi3arwwsngk-ghc-9.6.7-with-packages.drv'.
  1020. 29.51 s Reason: 1 dependency failed.
  1021. 29.51 s Output paths:
  1022. 29.51 s /nix/store/w0xzk7grmg774djh9flicwfrp1k3bqw4-ghc-9.6.7-with-packages
  1023. 29.51 s error: Cannot build '/nix/store/6rvvbn4nsny64yndixwsr5kbnngamlpz-pathway-compat-directory-0.0.1.0.drv'.
  1024. 29.51 s Reason: 1 dependency failed.
  1025. 29.51 s Output paths:
  1026. 29.51 s /nix/store/fb8c9y8a3n35pz051dniy1chxnyamqsk-pathway-compat-directory-0.0.1.0-doc
  1027. 29.51 s /nix/store/m2hlbb7cw4m4wi41qg3wcapwhx8pidj3-pathway-compat-directory-0.0.1.0
  1028. 29.51 s error: Cannot build '/nix/store/gzfiby42jyphwpxkjd7q4akfcghrj0pq-pathway-compat-file-io-0.0.1.0.drv'.
  1029. 29.51 s Reason: 1 dependency failed.
  1030. 29.51 s Output paths:
  1031. 29.51 s /nix/store/4vxfzhpir4i8m0ns8m7zr6hma6fai8jc-pathway-compat-file-io-0.0.1.0-doc
  1032. 29.51 s /nix/store/iwrmym67qgm3xvlj71qlk0lf37fql3yh-pathway-compat-file-io-0.0.1.0
  1033. 29.51 s error: Cannot build '/nix/store/8ri2qmf4w6jfifamb1yb1fsb2nrjp773-pathway-compat-temporary-0.0.1.0.drv'.
  1034. 29.51 s Reason: 1 dependency failed.
  1035. 29.51 s Output paths:
  1036. 29.51 s /nix/store/1sa868r5wz084s1vx73w56xi3rh9af9d-pathway-compat-temporary-0.0.1.0
  1037. 29.51 s /nix/store/6fwn0wzs278issqpwgkkjaz9c13vw0hc-pathway-compat-temporary-0.0.1.0-doc
  1038. 29.51 s error: Cannot build '/nix/store/2w8dn50862rrwygm03k5j7l8warsd57k-pathway-system-0.0.1.0.drv'.
  1039. 29.51 s Reason: 1 dependency failed.
  1040. 29.51 s Output paths:
  1041. 29.51 s /nix/store/ps3kvxiwcm8qn4rmpnh09r10gbnn9hx1-pathway-system-0.0.1.0
  1042. 29.51 s /nix/store/q4lgkkr11sghd0k9zfay2syagb0mx8zr-pathway-system-0.0.1.0-doc
  1043. 29.51 s error: Build failed due to failed dependency
  1044. 29.51 s error: Cannot build '/nix/store/xpxxy1s8m69yjxsbmqgcpfwkzvc6c7cm-all-packages.drv'.
  1045. 29.51 s Reason: 1 dependency failed.
  1046. 29.51 s Output paths:
  1047. 29.51 s /nix/store/hdwsgcxhxv674mjsai1ydk6pm1lm4vpq-all-packages
  1048. 29.51 s Build failed due to failed dependency
  1049. 29.54 s Build failed.