build packages.x86_64-linux.ghc967_all
0.71 s
$ /nix/store/9ypz3flqsrl5xl495mm8h645gadjsxi1-coreutils-9.11/bin/timeout --kill-after=15s 7200s /nix/store/23zk8sgzamrbmj1fday15szf7f2279s8-nix-2.34.7/bin/nix --extra-experimental-features nix-command --extra-experimental-features flakes --log-format internal-json build --no-link --print-out-paths git+https://github.com/sellout/pathway?ref=more-system&rev=1ea193cbc6593071794981ca0dcd055e8eb42609&shallow=1#packages.x86_64-linux.ghc967_all --print-build-logs
2.44 s
warning: ignoring untrusted flake configuration setting 'allow-import-from-derivation'.
2.44 s
Pass '--accept-flake-config' to trust it
2.44 s
warning: ignoring untrusted flake configuration setting 'extra-experimental-features'.
2.44 s
Pass '--accept-flake-config' to trust it
2.44 s
warning: ignoring untrusted flake configuration setting 'extra-substituters'.
2.44 s
Pass '--accept-flake-config' to trust it
2.44 s
warning: ignoring untrusted flake configuration setting 'extra-trusted-public-keys'.
2.44 s
Pass '--accept-flake-config' to trust it
2.44 s
warning: ignoring untrusted flake configuration setting 'sandbox'.
2.44 s
Pass '--accept-flake-config' to trust it
2.44 s
warning: ignoring untrusted flake configuration setting 'use-registries'.
2.44 s
Pass '--accept-flake-config' to trust it
2.44 s
error (ignored): SQLite database '/var/cache/nix-ci-worker/eval-cache-v6/7e8cef9f9a584f12750e4112f9919eb203f4dd515b08e08f130fffcf31865d0a.sqlite ' is busy
2.45 s
2.53 s
Downloading cached pathway-internal-0.0.1.0-doc from https://cache.nix-ci.com
2.54 s
Downloaded cached pathway-internal-0.0.1.0-doc (576 KiB) in 10ms
2.54 s
Progress: 0 of 22 built, 1 of 8 downloaded from cache
2.54 s
Downloading cached pathway-0.0.1.0-doc from https://cache.nix-ci.com
2.54 s
Downloading cached pathway-internal from https://cache.nix-ci.com
2.54 s
Downloading cached pathway-quickcheck-0.0.1.0-doc from https://cache.nix-ci.com
2.55 s
Downloaded cached pathway-quickcheck-0.0.1.0-doc (216 KiB) in 13ms
2.55 s
Progress: 0 of 21 built, 2 of 8 downloaded from cache (2 downloading)
2.55 s
Downloaded cached pathway-0.0.1.0-doc (1.3 MiB) in 14ms
2.55 s
Progress: 0 of 20 built, 3 of 8 downloaded from cache (1 downloading)
2.56 s
Downloading cached pathway-path-0.0.1.0-doc from https://cache.nix-ci.com
2.57 s
Downloaded cached pathway-internal (2.1 MiB) in 29ms
2.57 s
Progress: 0 of 19 built, 4 of 8 downloaded from cache (1 downloading)
2.57 s
Downloaded cached pathway-path-0.0.1.0-doc (263 KiB) in 11ms
2.57 s
Downloading cached pathway from https://cache.nix-ci.com
2.57 s
Downloading cached pathway-quickcheck from https://cache.nix-ci.com
2.57 s
Progress: 0 of 18 built, 5 of 8 downloaded from cache (2 downloading)
2.58 s
Downloaded cached pathway-quickcheck (179 KiB) in 9ms
2.58 s
Progress: 0 of 17 built, 6 of 8 downloaded from cache (1 downloading)
2.59 s
Downloaded cached pathway (2.7 MiB) in 21ms
2.59 s
Progress: 0 of 16 built, 7 of 8 downloaded from cache
2.59 s
Downloading cached pathway-path from https://cache.nix-ci.com
2.60 s
Downloaded cached pathway-path (217 KiB) in 7ms
2.68 s
Building /nix/store/r05xgdsqgil1m6ii36zf017yqy13dwfp-pathway-compat-base-0.0.1.0.drv
2.68 s
Progress: 0 of 15 built (1 building), 8 of 8 downloaded from cache
2.89 s
[pathway-compat-base] Phase: setupCompilerEnvironmentPhase
2.89 s
[pathway-compat-base] Build with /nix/store/2djpcnj8a25viv1y24h3mziy1gsy3fc6-ghc-9.6.7.
3.22 s
[pathway-compat-base] Phase: unpackPhase
3.23 s
[pathway-compat-base] unpacking source archive /nix/store/ga56x34386fcqgj51vg6p532znb23d3g-base
3.23 s
[pathway-compat-base] source root is base
3.25 s
[pathway-compat-base] Phase: patchPhase
3.26 s
[pathway-compat-base] Phase: compileBuildDriverPhase
3.26 s
[pathway-compat-base] setupCompileFlags: -package-db=/build/tmp.SZy7sWMTAV/setup-package.conf.d -threaded
3.31 s
[pathway-compat-base] [1 of 2] Compiling Main ( Setup.hs, /build/tmp.SZy7sWMTAV/Main.o )
3.37 s
[pathway-compat-base] [2 of 2] Linking Setup
4.59 s
[pathway-compat-base] Phase: updateAutotoolsGnuConfigScriptsPhase
4.61 s
[pathway-compat-base] Phase: configurePhase
4.61 s
[pathway-compat-base] configureFlags: --verbose --prefix=/nix/store/5yds5x988kvqbm18q0b330g0bkq0b0il-pathway-compat-base-0.0.1.0 --libdir=$prefix/lib/$compiler/lib --libsubdir=$abi/$libname --docdir=/nix/store/n7rcgdpdya0npf6g7jk9lwq4a2jmx36d-pathway-compat-base-0.0.1.0-doc/share/doc/pathway-compat-base-0.0.1.0 --with-gcc=gcc --package-db=/build/tmp.SZy7sWMTAV/package.conf.d --ghc-option=-j16 --ghc-option=+RTS --ghc-option=-A64M --ghc-option=-RTS --enable-library-profiling --profiling-detail=exported-functions --disable-profiling --enable-shared --disable-coverage --enable-static --disable-executable-dynamic --enable-tests --disable-benchmarks --enable-library-vanilla --disable-library-for-ghci --enable-split-sections --enable-library-stripping --enable-executable-stripping --ghc-option=-haddock --ghc-options=-Werror --extra-lib-dirs=/nix/store/pndhkk0l649lm1sj0mxk7cbwq26qd1ra-ncurses-6.6/lib --extra-lib-dirs=/nix/store/0djlg4g0b81w94k3vcaqsxsc2hh4kism-libffi-3.5.2/lib --extra-lib-dirs=/nix/store/md4paia7riiggyrj8p24c7a6vf8w7jz8-elfutils-0.194/lib --extra-lib-dirs=/nix/store/39vv2pf64gd8li48a4hpbhw2crzd8z5p-gmp-with-cxx-6.3.0/lib --extra-lib-dirs=/nix/store/7wwvald8lapkrsr72qanlw8blyn55ifx-numactl-2.0.18/lib --extra-lib-dirs=/nix/store/2djpcnj8a25viv1y24h3mziy1gsy3fc6-ghc-9.6.7/lib
4.62 s
[pathway-compat-base] Using Parsec parser
4.62 s
[pathway-compat-base] Configuring pathway-compat-base-0.0.1.0...
5.01 s
[pathway-compat-base] Flags chosen: noisy-deprecations=True, verify-no-recursion=False
5.01 s
[pathway-compat-base] Dependency base >=4.14.0 && <4.15 || >=4.15.0 && <4.16 || >=4.16.0 && <4.17 ||
5.01 s
[pathway-compat-base] >=4.17.0 && <4.18 || >=4.18.0 && <4.19 || >=4.19.0 && <4.20 || >=4.20.0 &&
5.01 s
[pathway-compat-base] <4.21 || >=4.21.0 && <4.22 || >=4.22.0 && <4.23: using base-4.18.3.0
5.01 s
[pathway-compat-base] Dependency exceptions: using exceptions-0.10.7
5.01 s
[pathway-compat-base] Dependency megaparsec >=9.0.1 && <9.1 || >=9.2.1 && <9.3 || >=9.5.0 && <9.6 ||
5.01 s
[pathway-compat-base] >=9.7.0 && <9.8: using megaparsec-9.7.0
5.01 s
[pathway-compat-base] Dependency pathway >=0.0.1 && <0.1: using pathway-0.0.1.0
5.01 s
[pathway-compat-base] Dependency variant: using variant-1.0.2
5.01 s
[pathway-compat-base] Dependency base >=4.14.0 && <4.15 || >=4.15.0 && <4.16 || >=4.16.0 && <4.17 ||
5.01 s
[pathway-compat-base] >=4.17.0 && <4.18 || >=4.18.0 && <4.19 || >=4.19.0 && <4.20 || >=4.20.0 &&
5.01 s
[pathway-compat-base] <4.21 || >=4.21.0 && <4.22 || >=4.22.0 && <4.23: using base-4.18.3.0
5.01 s
[pathway-compat-base] Dependency doctest >=0.16.3 && <0.17 || >=0.18.1 && <0.19 || >=0.20.1 && <0.21
5.01 s
[pathway-compat-base] || >=0.21.1 && <0.22 || >=0.22.2 && <0.23 || >=0.24.2 && <0.25: using
5.01 s
[pathway-compat-base] doctest-0.24.3
5.01 s
[pathway-compat-base] Dependency pathway-compat-base: using pathway-compat-base-0.0.1.0
5.44 s
[pathway-compat-base] Source component graph:
5.44 s
[pathway-compat-base] component lib
5.44 s
[pathway-compat-base] component test:doctests dependency lib
5.44 s
[pathway-compat-base] Configured component graph:
5.44 s
[pathway-compat-base] component pathway-compat-base-0.0.1.0-E02izPYkwmmGdAPlQBKjbP
5.44 s
[pathway-compat-base] include base-4.18.3.0
5.44 s
[pathway-compat-base] include exceptions-0.10.7
5.44 s
[pathway-compat-base] include megaparsec-9.7.0-EpAk7LLR2KBGAKafJPbXz1
5.44 s
[pathway-compat-base] include pathway-0.0.1.0-5VJXWbvreBAfybP2NROr3
5.44 s
[pathway-compat-base] include variant-1.0.2-5mfzNb7m7hb5BmRsuehY4I
5.44 s
[pathway-compat-base] component pathway-compat-base-0.0.1.0-SkQnKen4bt6IgQL39Z6Bu-doctests
5.44 s
[pathway-compat-base] include base-4.18.3.0
5.44 s
[pathway-compat-base] include doctest-0.24.3-ACQNy8u8jPjC50l4I3tyiL
5.44 s
[pathway-compat-base] include pathway-compat-base-0.0.1.0-E02izPYkwmmGdAPlQBKjbP
5.44 s
[pathway-compat-base] Linked component graph:
5.44 s
[pathway-compat-base] unit pathway-compat-base-0.0.1.0-E02izPYkwmmGdAPlQBKjbP
5.44 s
[pathway-compat-base] include base-4.18.3.0
5.44 s
[pathway-compat-base] include exceptions-0.10.7
5.44 s
[pathway-compat-base] include megaparsec-9.7.0-EpAk7LLR2KBGAKafJPbXz1
5.44 s
[pathway-compat-base] include pathway-0.0.1.0-5VJXWbvreBAfybP2NROr3
5.44 s
[pathway-compat-base] include variant-1.0.2-5mfzNb7m7hb5BmRsuehY4I
5.44 s
[pathway-compat-base] Common=pathway-compat-base-0.0.1.0-E02izPYkwmmGdAPlQBKjbP:Common,System.Environment.DropIn=pathway-compat-base-0.0.1.0-E02izPYkwmmGdAPlQBKjbP:System.Environment.DropIn,System.Environment.Overlay=pathway-compat-base-0.0.1.0-E02izPYkwmmGdAPlQBKjbP:System.Environment.Overlay,System.Environment.Pathway=pathway-compat-base-0.0.1.0-E02izPYkwmmGdAPlQBKjbP:System.Environment.Pathway,System.Environment.Thin=pathway-compat-base-0.0.1.0-E02izPYkwmmGdAPlQBKjbP:System.Environment.Thin,System.IO.Caught=pathway-compat-base-0.0.1.0-E02izPYkwmmGdAPlQBKjbP:System.IO.Caught,System.IO.DropIn=pathway-compat-base-0.0.1.0-E02izPYkwmmGdAPlQBKjbP:System.IO.DropIn,System.IO.Error.Caught=pathway-compat-base-0.0.1.0-E02izPYkwmmGdAPlQBKjbP:System.IO.Error.Caught,System.IO.Error.DropIn=pathway-compat-base-0.0.1.0-E02izPYkwmmGdAPlQBKjbP:System.IO.Error.DropIn,System.IO.Error.Overlay=pathway-compat-base-0.0.1.0-E02izPYkwmmGdAPlQBKjbP:System.IO.Error.Overlay,System.IO.Error.Pathway=pathway-compat-base-0.0.1.0-E02izPYkwmmGdAPlQBKjbP:System.IO.Error.Pathway,System.IO.Error.Thin=pathway-compat-base-0.0.1.0-E02izPYkwmmGdAPlQBKjbP:System.IO.Error.Thin,System.IO.Overlay=pathway-compat-base-0.0.1.0-E02izPYkwmmGdAPlQBKjbP:System.IO.Overlay,System.IO.Pathway=pathway-compat-base-0.0.1.0-E02izPYkwmmGdAPlQBKjbP:System.IO.Pathway,System.IO.Thin=pathway-compat-base-0.0.1.0-E02izPYkwmmGdAPlQBKjbP:System.IO.Thin
5.44 s
[pathway-compat-base] unit pathway-compat-base-0.0.1.0-SkQnKen4bt6IgQL39Z6Bu-doctests
5.44 s
[pathway-compat-base] include base-4.18.3.0
5.44 s
[pathway-compat-base] include doctest-0.24.3-ACQNy8u8jPjC50l4I3tyiL
5.44 s
[pathway-compat-base] include pathway-compat-base-0.0.1.0-E02izPYkwmmGdAPlQBKjbP
5.44 s
[pathway-compat-base] Ready component graph:
5.44 s
[pathway-compat-base] definite pathway-compat-base-0.0.1.0-E02izPYkwmmGdAPlQBKjbP
5.44 s
[pathway-compat-base] depends base-4.18.3.0
5.44 s
[pathway-compat-base] depends exceptions-0.10.7
5.44 s
[pathway-compat-base] depends megaparsec-9.7.0-EpAk7LLR2KBGAKafJPbXz1
5.44 s
[pathway-compat-base] depends pathway-0.0.1.0-5VJXWbvreBAfybP2NROr3
5.44 s
[pathway-compat-base] depends variant-1.0.2-5mfzNb7m7hb5BmRsuehY4I
5.44 s
[pathway-compat-base] definite pathway-compat-base-0.0.1.0-SkQnKen4bt6IgQL39Z6Bu-doctests
5.44 s
[pathway-compat-base] depends base-4.18.3.0
5.44 s
[pathway-compat-base] depends doctest-0.24.3-ACQNy8u8jPjC50l4I3tyiL
5.44 s
[pathway-compat-base] depends pathway-compat-base-0.0.1.0-E02izPYkwmmGdAPlQBKjbP
5.44 s
[pathway-compat-base] Using Cabal-3.10.3.0 compiled by ghc-9.6
5.44 s
[pathway-compat-base] Using compiler: ghc-9.6.7
5.44 s
[pathway-compat-base] Using install prefix:
5.44 s
[pathway-compat-base] /nix/store/5yds5x988kvqbm18q0b330g0bkq0b0il-pathway-compat-base-0.0.1.0
5.44 s
[pathway-compat-base] Executables installed in:
5.44 s
[pathway-compat-base] /nix/store/5yds5x988kvqbm18q0b330g0bkq0b0il-pathway-compat-base-0.0.1.0/bin
5.44 s
[pathway-compat-base] Libraries installed in:
5.44 s
[pathway-compat-base] /nix/store/5yds5x988kvqbm18q0b330g0bkq0b0il-pathway-compat-base-0.0.1.0/lib/ghc-9.6.7/lib/x86_64-linux-ghc-9.6.7/pathway-compat-base-0.0.1.0-E02izPYkwmmGdAPlQBKjbP
5.44 s
[pathway-compat-base] Dynamic Libraries installed in:
5.44 s
[pathway-compat-base] /nix/store/5yds5x988kvqbm18q0b330g0bkq0b0il-pathway-compat-base-0.0.1.0/lib/ghc-9.6.7/lib/x86_64-linux-ghc-9.6.7
5.44 s
[pathway-compat-base] Private executables installed in:
5.44 s
[pathway-compat-base] /nix/store/5yds5x988kvqbm18q0b330g0bkq0b0il-pathway-compat-base-0.0.1.0/libexec/x86_64-linux-ghc-9.6.7/pathway-compat-base-0.0.1.0
5.44 s
[pathway-compat-base] Data files installed in:
5.44 s
[pathway-compat-base] /nix/store/5yds5x988kvqbm18q0b330g0bkq0b0il-pathway-compat-base-0.0.1.0/share/x86_64-linux-ghc-9.6.7/pathway-compat-base-0.0.1.0
5.44 s
[pathway-compat-base] Documentation installed in:
5.44 s
[pathway-compat-base] /nix/store/n7rcgdpdya0npf6g7jk9lwq4a2jmx36d-pathway-compat-base-0.0.1.0-doc/share/doc/pathway-compat-base-0.0.1.0
5.44 s
[pathway-compat-base] Configuration files installed in:
5.44 s
[pathway-compat-base] /nix/store/5yds5x988kvqbm18q0b330g0bkq0b0il-pathway-compat-base-0.0.1.0/etc
5.44 s
[pathway-compat-base] No alex found
5.44 s
[pathway-compat-base] Using ar found on system at:
5.44 s
[pathway-compat-base] /nix/store/zjraf40s86y3iwhp626b934r5y6ldkbb-binutils-wrapper-2.46/bin/ar
5.44 s
[pathway-compat-base] No c2hs found
5.44 s
[pathway-compat-base] No cpphs found
5.44 s
[pathway-compat-base] Using doctest version 0.24.3 found on system at:
5.44 s
[pathway-compat-base] /nix/store/s48k56ayjjxwdbz9y7d8mnqwlcjfi1a8-doctest-0.24.3/bin/doctest
5.44 s
[pathway-compat-base] Using gcc version 15.2.0 given by user at:
5.44 s
[pathway-compat-base] /nix/store/29qjlshvklnyr67nhpprzgb9igmsfsjj-gcc-wrapper-15.2.0/bin/gcc
5.44 s
[pathway-compat-base] Using ghc version 9.6.7 found on system at:
5.44 s
[pathway-compat-base] /nix/store/2djpcnj8a25viv1y24h3mziy1gsy3fc6-ghc-9.6.7/bin/ghc
5.44 s
[pathway-compat-base] Using ghc-pkg version 9.6.7 found on system at:
5.44 s
[pathway-compat-base] /nix/store/2djpcnj8a25viv1y24h3mziy1gsy3fc6-ghc-9.6.7/bin/ghc-pkg-9.6.7
5.44 s
[pathway-compat-base] No ghcjs found
5.44 s
[pathway-compat-base] No ghcjs-pkg found
5.44 s
[pathway-compat-base] No greencard found
5.44 s
[pathway-compat-base] Using haddock version 2.29.2 found on system at:
5.44 s
[pathway-compat-base] /nix/store/2djpcnj8a25viv1y24h3mziy1gsy3fc6-ghc-9.6.7/bin/haddock-ghc-9.6.7
5.44 s
[pathway-compat-base] No happy found
5.44 s
[pathway-compat-base] Using haskell-suite found on system at: haskell-suite-dummy-location
5.44 s
[pathway-compat-base] Using haskell-suite-pkg found on system at: haskell-suite-pkg-dummy-location
5.44 s
[pathway-compat-base] No hmake found
5.44 s
[pathway-compat-base] Using hpc version 0.68 found on system at:
5.44 s
[pathway-compat-base] /nix/store/2djpcnj8a25viv1y24h3mziy1gsy3fc6-ghc-9.6.7/bin/hpc-ghc-9.6.7
5.44 s
[pathway-compat-base] Using hsc2hs version 0.68.9 found on system at:
5.44 s
[pathway-compat-base] /nix/store/2djpcnj8a25viv1y24h3mziy1gsy3fc6-ghc-9.6.7/bin/hsc2hs-ghc-9.6.7
5.44 s
[pathway-compat-base] Using hscolour version 1.25 found on system at:
5.44 s
[pathway-compat-base] /nix/store/2x19jxh5g98bv0s06mdj71c1hmxi54yl-hscolour-1.25/bin/HsColour
5.44 s
[pathway-compat-base] No jhc found
5.44 s
[pathway-compat-base] Using ld found on system at:
5.44 s
[pathway-compat-base] /nix/store/zjraf40s86y3iwhp626b934r5y6ldkbb-binutils-wrapper-2.46/bin/ld.gold
5.44 s
[pathway-compat-base] No pkg-config found
5.44 s
[pathway-compat-base] Using runghc version 9.6.7 found on system at:
5.44 s
[pathway-compat-base] /nix/store/2djpcnj8a25viv1y24h3mziy1gsy3fc6-ghc-9.6.7/bin/runghc-9.6.7
5.44 s
[pathway-compat-base] Using strip version 2.46 found on system at:
5.44 s
[pathway-compat-base] /nix/store/29qjlshvklnyr67nhpprzgb9igmsfsjj-gcc-wrapper-15.2.0/bin/strip
5.44 s
[pathway-compat-base] Using tar found on system at:
5.44 s
[pathway-compat-base] /nix/store/z5mq2sam4484prf3kv6v6vjw1m0i7j24-gnutar-1.35/bin/tar
5.44 s
[pathway-compat-base] No uhc found
5.91 s
[pathway-compat-base] Phase: buildPhase
6.01 s
[pathway-compat-base] Preprocessing library for pathway-compat-base-0.0.1.0..
7.61 s
[pathway-compat-base] Building library for pathway-compat-base-0.0.1.0..
7.61 s
[pathway-compat-base] [ 1 of 15] Compiling Common ( src/Common.hs, dist/build/Common.o, dist/build/Common.dyn_o )
7.61 s
[pathway-compat-base] [ 2 of 15] Compiling System.Environment.Thin ( src/System/Environment/Thin.hs, dist/build/System/Environment/Thin.o, dist/build/System/Environment/Thin.dyn_o )
7.61 s
[pathway-compat-base] [ 3 of 15] Compiling System.Environment.Pathway ( src/System/Environment/Pathway.hs, dist/build/System/Environment/Pathway.o, dist/build/System/Environment/Pathway.dyn_o )
7.61 s
[pathway-compat-base] [ 4 of 15] Compiling System.Environment.Overlay ( src/System/Environment/Overlay.hs, dist/build/System/Environment/Overlay.o, dist/build/System/Environment/Overlay.dyn_o )
7.61 s
[pathway-compat-base] [ 5 of 15] Compiling System.Environment.DropIn ( src/System/Environment/DropIn.hs, dist/build/System/Environment/DropIn.o, dist/build/System/Environment/DropIn.dyn_o )
7.61 s
[pathway-compat-base] [ 6 of 15] Compiling System.IO.Error.Caught ( src/System/IO/Error/Caught.hs, dist/build/System/IO/Error/Caught.o, dist/build/System/IO/Error/Caught.dyn_o )
7.61 s
[pathway-compat-base] [ 7 of 15] Compiling System.IO.Error.Thin ( src/System/IO/Error/Thin.hs, dist/build/System/IO/Error/Thin.o, dist/build/System/IO/Error/Thin.dyn_o )
7.61 s
[pathway-compat-base] [ 8 of 15] Compiling System.IO.Error.Pathway ( src/System/IO/Error/Pathway.hs, dist/build/System/IO/Error/Pathway.o, dist/build/System/IO/Error/Pathway.dyn_o )
7.61 s
[pathway-compat-base] [ 9 of 15] Compiling System.IO.Error.Overlay ( src/System/IO/Error/Overlay.hs, dist/build/System/IO/Error/Overlay.o, dist/build/System/IO/Error/Overlay.dyn_o )
7.61 s
[pathway-compat-base] [10 of 15] Compiling System.IO.Error.DropIn ( src/System/IO/Error/DropIn.hs, dist/build/System/IO/Error/DropIn.o, dist/build/System/IO/Error/DropIn.dyn_o )
7.61 s
[pathway-compat-base] [11 of 15] Compiling System.IO.Thin ( src/System/IO/Thin.hs, dist/build/System/IO/Thin.o, dist/build/System/IO/Thin.dyn_o )
7.61 s
[pathway-compat-base] [12 of 15] Compiling System.IO.Overlay ( src/System/IO/Overlay.hs, dist/build/System/IO/Overlay.o, dist/build/System/IO/Overlay.dyn_o )
7.61 s
[pathway-compat-base] [13 of 15] Compiling System.IO.DropIn ( src/System/IO/DropIn.hs, dist/build/System/IO/DropIn.o, dist/build/System/IO/DropIn.dyn_o )
7.61 s
[pathway-compat-base] [14 of 15] Compiling System.IO.Caught ( src/System/IO/Caught.hs, dist/build/System/IO/Caught.o, dist/build/System/IO/Caught.dyn_o )
7.61 s
[pathway-compat-base] [15 of 15] Compiling System.IO.Pathway ( src/System/IO/Pathway.hs, dist/build/System/IO/Pathway.o, dist/build/System/IO/Pathway.dyn_o )
7.62 s
[pathway-compat-base] [ 1 of 15] Compiling Common ( src/Common.hs, dist/build/Common.p_o )
7.78 s
[pathway-compat-base] [ 2 of 15] Compiling System.Environment.Thin ( src/System/Environment/Thin.hs, dist/build/System/Environment/Thin.p_o )
7.95 s
[pathway-compat-base] [ 3 of 15] Compiling System.Environment.Pathway ( src/System/Environment/Pathway.hs, dist/build/System/Environment/Pathway.p_o )
8.10 s
[pathway-compat-base] [ 4 of 15] Compiling System.Environment.Overlay ( src/System/Environment/Overlay.hs, dist/build/System/Environment/Overlay.p_o )
8.12 s
[pathway-compat-base] [ 5 of 15] Compiling System.Environment.DropIn ( src/System/Environment/DropIn.hs, dist/build/System/Environment/DropIn.p_o )
8.27 s
[pathway-compat-base] [ 6 of 15] Compiling System.IO.Error.Caught ( src/System/IO/Error/Caught.hs, dist/build/System/IO/Error/Caught.p_o )
8.27 s
[pathway-compat-base] [ 7 of 15] Compiling System.IO.Error.Thin ( src/System/IO/Error/Thin.hs, dist/build/System/IO/Error/Thin.p_o )
8.27 s
[pathway-compat-base] [ 8 of 15] Compiling System.IO.Error.Pathway ( src/System/IO/Error/Pathway.hs, dist/build/System/IO/Error/Pathway.p_o )
8.27 s
[pathway-compat-base] [ 9 of 15] Compiling System.IO.Error.Overlay ( src/System/IO/Error/Overlay.hs, dist/build/System/IO/Error/Overlay.p_o )
8.27 s
[pathway-compat-base] [10 of 15] Compiling System.IO.Error.DropIn ( src/System/IO/Error/DropIn.hs, dist/build/System/IO/Error/DropIn.p_o )
8.27 s
[pathway-compat-base] [11 of 15] Compiling System.IO.Thin ( src/System/IO/Thin.hs, dist/build/System/IO/Thin.p_o )
8.27 s
[pathway-compat-base] [12 of 15] Compiling System.IO.Overlay ( src/System/IO/Overlay.hs, dist/build/System/IO/Overlay.p_o )
8.27 s
[pathway-compat-base] [13 of 15] Compiling System.IO.DropIn ( src/System/IO/DropIn.hs, dist/build/System/IO/DropIn.p_o )
8.36 s
[pathway-compat-base] [14 of 15] Compiling System.IO.Caught ( src/System/IO/Caught.hs, dist/build/System/IO/Caught.p_o )
8.36 s
[pathway-compat-base] [15 of 15] Compiling System.IO.Pathway ( src/System/IO/Pathway.hs, dist/build/System/IO/Pathway.p_o )
10.31 s
[pathway-compat-base] Preprocessing test suite 'doctests' for pathway-compat-base-0.0.1.0..
10.31 s
[pathway-compat-base] Building test suite 'doctests' for pathway-compat-base-0.0.1.0..
10.39 s
[pathway-compat-base] [1 of 2] Compiling Build_doctests ( dist/build/doctests/autogen/Build_doctests.hs, dist/build/doctests/doctests-tmp/Build_doctests.o )
10.64 s
[pathway-compat-base] [2 of 2] Compiling Main ( tests/doctests.hs, dist/build/doctests/doctests-tmp/Main.o )
10.91 s
[pathway-compat-base] [3 of 3] Linking dist/build/doctests/doctests
14.32 s
[pathway-compat-base] Phase: checkPhase
14.37 s
[pathway-compat-base] Running 1 test suites...
14.37 s
[pathway-compat-base] Test suite doctests: RUNNING...
14.75 s
[pathway-compat-base]
14.75 s
[pathway-compat-base] on the commandline: warning:
14.75 s
[pathway-compat-base] -XTemplateHaskell is not allowed in Safe Haskell; ignoring -XTemplateHaskell
14.75 s
[pathway-compat-base]
14.75 s
[pathway-compat-base] on the commandline: warning:
14.75 s
[pathway-compat-base] -XTemplateHaskell is not allowed in Safe Haskell; ignoring -XTemplateHaskell
14.75 s
[pathway-compat-base]
14.75 s
[pathway-compat-base] on the commandline: warning:
14.75 s
[pathway-compat-base] -XTemplateHaskell is not allowed in Safe Haskell; ignoring -XTemplateHaskell
14.75 s
[pathway-compat-base]
14.75 s
[pathway-compat-base] on the commandline: warning:
14.75 s
[pathway-compat-base] -XTemplateHaskell is not allowed in Safe Haskell; ignoring -XTemplateHaskell
14.78 s
[pathway-compat-base]
14.78 s
[pathway-compat-base] on the commandline: warning:
14.78 s
[pathway-compat-base] -XTemplateHaskell is not allowed in Safe Haskell; ignoring -XTemplateHaskell
14.78 s
[pathway-compat-base]
14.78 s
[pathway-compat-base] on the commandline: warning:
14.78 s
[pathway-compat-base] -XTemplateHaskell is not allowed in Safe Haskell; ignoring -XTemplateHaskell
14.78 s
[pathway-compat-base]
14.78 s
[pathway-compat-base] on the commandline: warning:
14.78 s
[pathway-compat-base] -XTemplateHaskell is not allowed in Safe Haskell; ignoring -XTemplateHaskell
14.78 s
[pathway-compat-base]
14.78 s
[pathway-compat-base] on the commandline: warning:
14.78 s
[pathway-compat-base] -XTemplateHaskell is not allowed in Safe Haskell; ignoring -XTemplateHaskell
14.78 s
[pathway-compat-base]
14.78 s
[pathway-compat-base] on the commandline: warning:
14.78 s
[pathway-compat-base] -XTemplateHaskell is not allowed in Safe Haskell; ignoring -XTemplateHaskell
14.78 s
[pathway-compat-base]
14.78 s
[pathway-compat-base] on the commandline: warning:
14.78 s
[pathway-compat-base] -XTemplateHaskell is not allowed in Safe Haskell; ignoring -XTemplateHaskell
14.78 s
[pathway-compat-base]
14.78 s
[pathway-compat-base] on the commandline: warning:
14.78 s
[pathway-compat-base] -XTemplateHaskell is not allowed in Safe Haskell; ignoring -XTemplateHaskell
14.78 s
[pathway-compat-base]
14.78 s
[pathway-compat-base] on the commandline: warning:
14.78 s
[pathway-compat-base] -XTemplateHaskell is not allowed in Safe Haskell; ignoring -XTemplateHaskell
14.78 s
[pathway-compat-base]
14.78 s
[pathway-compat-base] on the commandline: warning:
14.78 s
[pathway-compat-base] -XTemplateHaskell is not allowed in Safe Haskell; ignoring -XTemplateHaskell
14.78 s
[pathway-compat-base]
14.78 s
[pathway-compat-base] on the commandline: warning:
14.78 s
[pathway-compat-base] -XTemplateHaskell is not allowed in Safe Haskell; ignoring -XTemplateHaskell
14.81 s
[pathway-compat-base]
14.81 s
[pathway-compat-base] on the commandline: warning:
14.81 s
[pathway-compat-base] -XTemplateHaskell is not allowed in Safe Haskell; ignoring -XTemplateHaskell
14.81 s
[pathway-compat-base]
14.81 s
[pathway-compat-base] on the commandline: warning:
14.81 s
[pathway-compat-base] -XTemplateHaskell is not allowed in Safe Haskell; ignoring -XTemplateHaskell
14.81 s
[pathway-compat-base]
14.81 s
[pathway-compat-base] on the commandline: warning:
14.81 s
[pathway-compat-base] -XTemplateHaskell is not allowed in Safe Haskell; ignoring -XTemplateHaskell
14.81 s
[pathway-compat-base]
14.81 s
[pathway-compat-base] on the commandline: warning:
14.81 s
[pathway-compat-base] -XTemplateHaskell is not allowed in Safe Haskell; ignoring -XTemplateHaskell
14.81 s
[pathway-compat-base]
14.81 s
[pathway-compat-base] on the commandline: warning:
14.81 s
[pathway-compat-base] -XTemplateHaskell is not allowed in Safe Haskell; ignoring -XTemplateHaskell
14.81 s
[pathway-compat-base]
14.81 s
[pathway-compat-base] on the commandline: warning:
14.81 s
[pathway-compat-base] -XTemplateHaskell is not allowed in Safe Haskell; ignoring -XTemplateHaskell
14.81 s
[pathway-compat-base]
14.81 s
[pathway-compat-base] on the commandline: warning:
14.81 s
[pathway-compat-base] -XTemplateHaskell is not allowed in Safe Haskell; ignoring -XTemplateHaskell
14.81 s
[pathway-compat-base]
14.81 s
[pathway-compat-base] on the commandline: warning:
14.81 s
[pathway-compat-base] -XTemplateHaskell is not allowed in Safe Haskell; ignoring -XTemplateHaskell
14.81 s
[pathway-compat-base]
14.81 s
[pathway-compat-base] on the commandline: warning:
14.81 s
[pathway-compat-base] -XTemplateHaskell is not allowed in Safe Haskell; ignoring -XTemplateHaskell
15.28 s
[pathway-compat-base] Examples: 0 Tried: 0 Errors: 0 Failures: 0
15.34 s
[pathway-compat-base] Test suite doctests: PASS
15.34 s
[pathway-compat-base] Test suite logged to: dist/test/pathway-compat-base-0.0.1.0-doctests.log
15.34 s
[pathway-compat-base] 1 of 1 test suites (1 of 1 test cases) passed.
15.36 s
[pathway-compat-base] Phase: haddockPhase
15.51 s
[pathway-compat-base] Preprocessing library for pathway-compat-base-0.0.1.0..
15.52 s
[pathway-compat-base] Running Haddock on library for pathway-compat-base-0.0.1.0..
15.52 s
[pathway-compat-base] Warning: The documentation for the following packages are not installed. No
15.52 s
[pathway-compat-base] links will be generated to these packages: vector-0.13.2.0
15.58 s
[pathway-compat-base] Warning: --source-* options are ignored when --hyperlinked-source is enabled.
15.86 s
[pathway-compat-base] 90% ( 10 / 11) in 'System.IO.Error.Caught'
15.86 s
[pathway-compat-base] Missing documentation for:
15.86 s
[pathway-compat-base] AlreadyInUseError (src/System/IO/Error/Caught.hs:103)
16.04 s
[pathway-compat-base] Warning: '</?>' is out of scope.
16.04 s
[pathway-compat-base] If you qualify the identifier, haddock can try to link it anyway.
16.04 s
[pathway-compat-base] Warning: '<$>' is out of scope.
16.04 s
[pathway-compat-base] If you qualify the identifier, haddock can try to link it anyway.
16.04 s
[pathway-compat-base] Warning: 'getCurrentDirectory' is out of scope.
16.04 s
[pathway-compat-base] If you qualify the identifier, haddock can try to link it anyway.
16.04 s
[pathway-compat-base] Warning: 'makeRelativeToCurrentDirectory' is out of scope.
16.04 s
[pathway-compat-base] If you qualify the identifier, haddock can try to link it anyway.
16.04 s
[pathway-compat-base] Warning: 'IOError' is out of scope.
16.04 s
[pathway-compat-base] If you qualify the identifier, haddock can try to link it anyway.
16.04 s
[pathway-compat-base] 14% ( 1 / 7) in 'Common'
16.04 s
[pathway-compat-base] Missing documentation for:
16.04 s
[pathway-compat-base] InternalFailure (src/Common.hs:69)
16.04 s
[pathway-compat-base] toPathRep (src/Common.hs:84)
16.04 s
[pathway-compat-base] fromPathRep (src/Common.hs:87)
16.04 s
[pathway-compat-base] handleAnchoredPath (src/Common.hs:93)
16.04 s
[pathway-compat-base] absFileFromPathRep (src/Common.hs:100)
16.04 s
[pathway-compat-base] fileFromPathRep (src/Common.hs:114)
16.06 s
[pathway-compat-base] 0% ( 0 / 5) in 'System.IO.Error.Thin'
16.06 s
[pathway-compat-base] Missing documentation for:
16.06 s
[pathway-compat-base] Module header
16.06 s
[pathway-compat-base] mkIOError (src/System/IO/Error/Thin.hs:23)
16.06 s
[pathway-compat-base] annotateIOError (src/System/IO/Error/Thin.hs:31)
16.06 s
[pathway-compat-base] ioeGetFileName (src/System/IO/Error/Thin.hs:35)
16.06 s
[pathway-compat-base] ioeSetFileName (src/System/IO/Error/Thin.hs:41)
16.06 s
[pathway-compat-base] Warning: '</?>' is out of scope.
16.06 s
[pathway-compat-base] If you qualify the identifier, haddock can try to link it anyway.
16.06 s
[pathway-compat-base] Warning: 'getCurrentDirectory' is out of scope.
16.06 s
[pathway-compat-base] If you qualify the identifier, haddock can try to link it anyway.
16.06 s
[pathway-compat-base] Warning: 'makeRelativeToCurrentDirectory' is out of scope.
16.06 s
[pathway-compat-base] If you qualify the identifier, haddock can try to link it anyway.
16.06 s
[pathway-compat-base] Warning: 'IOError' is out of scope.
16.06 s
[pathway-compat-base] If you qualify the identifier, haddock can try to link it anyway.
16.06 s
[pathway-compat-base] Warning: 'Anchored' is out of scope.
16.06 s
[pathway-compat-base] If you qualify the identifier, haddock can try to link it anyway.
16.06 s
[pathway-compat-base] 33% ( 1 / 3) in 'System.Environment.Thin'
16.06 s
[pathway-compat-base] Missing documentation for:
16.06 s
[pathway-compat-base] executablePath (src/System/Environment/Thin.hs:52)
16.06 s
[pathway-compat-base] getExecutablePath (src/System/Environment/Thin.hs:61)
16.07 s
[pathway-compat-base] 0% ( 0 / 2) in 'System.IO.Error.Overlay'
16.07 s
[pathway-compat-base] Missing documentation for:
16.07 s
[pathway-compat-base] Module header
16.07 s
[pathway-compat-base] ioeGetFileName (src/System/IO/Error/Overlay.hs:20)
16.07 s
[pathway-compat-base] 100% ( 11 / 11) in 'System.Environment.Pathway'
16.07 s
[pathway-compat-base] 76% ( 36 / 47) in 'System.IO.Error.DropIn'
16.07 s
[pathway-compat-base] Missing documentation for:
16.07 s
[pathway-compat-base] ioeGetErrorType
16.07 s
[pathway-compat-base] ioeGetErrorString
16.07 s
[pathway-compat-base] ioeGetLocation
16.07 s
[pathway-compat-base] ioeGetHandle
16.07 s
[pathway-compat-base] ioeSetErrorType
16.07 s
[pathway-compat-base] ioeSetErrorString
16.07 s
[pathway-compat-base] ioeSetLocation
16.08 s
[pathway-compat-base] ioeSetHandle
16.08 s
[pathway-compat-base] mkIOError (src/System/IO/Error/Thin.hs:23)
16.08 s
[pathway-compat-base] ioeSetFileName (src/System/IO/Error/Thin.hs:41)
16.08 s
[pathway-compat-base] annotateIOError (src/System/IO/Error/Thin.hs:31)
16.08 s
[pathway-compat-base] 0% ( 0 / 13) in 'System.IO.Thin'
16.08 s
[pathway-compat-base] Missing documentation for:
16.08 s
[pathway-compat-base] Module header
16.08 s
[pathway-compat-base] withFile (src/System/IO/Thin.hs:31)
16.08 s
[pathway-compat-base] openFile (src/System/IO/Thin.hs:34)
16.08 s
[pathway-compat-base] readFile (src/System/IO/Thin.hs:37)
16.08 s
[pathway-compat-base] readFile' (src/System/IO/Thin.hs:40)
16.08 s
[pathway-compat-base] writeFile (src/System/IO/Thin.hs:43)
16.08 s
[pathway-compat-base] appendFile (src/System/IO/Thin.hs:46)
16.08 s
[pathway-compat-base] withBinaryFile (src/System/IO/Thin.hs:49)
16.08 s
[pathway-compat-base] openBinaryFile (src/System/IO/Thin.hs:52)
16.08 s
[pathway-compat-base] openTempFile (src/System/IO/Thin.hs:55)
16.08 s
[pathway-compat-base] openBinaryTempFile (src/System/IO/Thin.hs:69)
16.08 s
[pathway-compat-base] openTempFileWithDefaultPermissions (src/System/IO/Thin.hs:84)
16.08 s
[pathway-compat-base] openBinaryTempFileWithDefaultPermissions (src/System/IO/Thin.hs:93)
16.08 s
[pathway-compat-base] Warning: '</?>' is out of scope.
16.08 s
[pathway-compat-base] If you qualify the identifier, haddock can try to link it anyway.
16.08 s
[pathway-compat-base] Warning: 'getCurrentDirectory' is out of scope.
16.08 s
[pathway-compat-base] If you qualify the identifier, haddock can try to link it anyway.
16.08 s
[pathway-compat-base] Warning: 'makeRelativeToCurrentDirectory' is out of scope.
16.08 s
[pathway-compat-base] If you qualify the identifier, haddock can try to link it anyway.
16.08 s
[pathway-compat-base] Warning: 'IOError' is out of scope.
16.08 s
[pathway-compat-base] If you qualify the identifier, haddock can try to link it anyway.
16.08 s
[pathway-compat-base] 33% ( 1 / 3) in 'System.Environment.Overlay'
16.08 s
[pathway-compat-base] Missing documentation for:
16.08 s
[pathway-compat-base] executablePath (src/System/Environment/Overlay.hs:50)
16.08 s
[pathway-compat-base] getExecutablePath (src/System/Environment/Overlay.hs:54)
16.08 s
[pathway-compat-base] 82% ( 37 / 45) in 'System.IO.Error.Pathway'
16.08 s
[pathway-compat-base] Missing documentation for:
16.08 s
[pathway-compat-base] ioeGetErrorType
16.08 s
[pathway-compat-base] ioeGetErrorString
16.08 s
[pathway-compat-base] ioeGetLocation
16.08 s
[pathway-compat-base] ioeGetHandle
16.08 s
[pathway-compat-base] ioeSetErrorType
16.08 s
[pathway-compat-base] ioeSetErrorString
16.08 s
[pathway-compat-base] ioeSetLocation
16.08 s
[pathway-compat-base] ioeSetHandle
16.08 s
[pathway-compat-base] 100% ( 11 / 11) in 'System.Environment.DropIn'
16.09 s
[pathway-compat-base] 0% ( 0 / 5) in 'System.IO.Overlay'
16.09 s
[pathway-compat-base] Missing documentation for:
16.09 s
[pathway-compat-base] Module header
16.09 s
[pathway-compat-base] openTempFile (src/System/IO/Overlay.hs:22)
16.09 s
[pathway-compat-base] openBinaryTempFile (src/System/IO/Overlay.hs:26)
16.09 s
[pathway-compat-base] openTempFileWithDefaultPermissions (src/System/IO/Overlay.hs:32)
16.09 s
[pathway-compat-base] openBinaryTempFileWithDefaultPermissions (src/System/IO/Overlay.hs:37)
16.10 s
[pathway-compat-base] 80% ( 73 / 91) in 'System.IO.DropIn'
16.10 s
[pathway-compat-base] Missing documentation for:
16.10 s
[pathway-compat-base] HandlePosn
16.10 s
[pathway-compat-base] stdout
16.10 s
[pathway-compat-base] stdin
16.10 s
[pathway-compat-base] stderr
16.10 s
[pathway-compat-base] hPutBufNonBlocking
16.10 s
[pathway-compat-base] hIsOpen
16.10 s
[pathway-compat-base] hIsClosed
16.10 s
[pathway-compat-base] hIsReadable
16.10 s
[pathway-compat-base] hIsWritable
16.10 s
[pathway-compat-base] hIsSeekable
16.10 s
[pathway-compat-base] openFile (src/System/IO/Thin.hs:34)
16.10 s
[pathway-compat-base] readFile' (src/System/IO/Thin.hs:40)
16.10 s
[pathway-compat-base] writeFile (src/System/IO/Thin.hs:43)
16.10 s
[pathway-compat-base] withFile (src/System/IO/Thin.hs:31)
16.10 s
[pathway-compat-base] openBinaryFile (src/System/IO/Thin.hs:52)
16.10 s
[pathway-compat-base] withBinaryFile (src/System/IO/Thin.hs:49)
16.10 s
[pathway-compat-base] readFile (src/System/IO/Thin.hs:37)
16.10 s
[pathway-compat-base] appendFile (src/System/IO/Thin.hs:46)
16.11 s
[pathway-compat-base] 20% ( 1 / 5) in 'System.IO.Caught'
16.11 s
[pathway-compat-base] Missing documentation for:
16.11 s
[pathway-compat-base] Module header
16.11 s
[pathway-compat-base] OpenFileFailure (src/System/IO/Caught.hs:38)
16.11 s
[pathway-compat-base] openFile (src/System/IO/Caught.hs:48)
16.11 s
[pathway-compat-base] recoverOpenFileFailure (src/System/IO/Caught.hs:40)
16.11 s
[pathway-compat-base] 77% ( 73 / 94) in 'System.IO.Pathway'
16.11 s
[pathway-compat-base] Missing documentation for:
16.11 s
[pathway-compat-base] HandlePosn
16.11 s
[pathway-compat-base] stdout
16.11 s
[pathway-compat-base] stdin
16.11 s
[pathway-compat-base] stderr
16.11 s
[pathway-compat-base] hPutBufNonBlocking
16.11 s
[pathway-compat-base] hIsOpen
16.11 s
[pathway-compat-base] hIsClosed
16.11 s
[pathway-compat-base] hIsReadable
16.11 s
[pathway-compat-base] hIsWritable
16.11 s
[pathway-compat-base] hIsSeekable
16.11 s
[pathway-compat-base] readFile' (src/System/IO/Thin.hs:40)
16.11 s
[pathway-compat-base] writeFile (src/System/IO/Thin.hs:43)
16.11 s
[pathway-compat-base] withFile (src/System/IO/Thin.hs:31)
16.11 s
[pathway-compat-base] openBinaryFile (src/System/IO/Thin.hs:52)
16.11 s
[pathway-compat-base] withBinaryFile (src/System/IO/Thin.hs:49)
16.11 s
[pathway-compat-base] readFile (src/System/IO/Thin.hs:37)
16.11 s
[pathway-compat-base] appendFile (src/System/IO/Thin.hs:46)
16.11 s
[pathway-compat-base] openTempFile (src/System/IO/Thin.hs:55)
16.11 s
[pathway-compat-base] openBinaryTempFile (src/System/IO/Thin.hs:69)
16.11 s
[pathway-compat-base] openTempFileWithDefaultPermissions (src/System/IO/Thin.hs:84)
16.11 s
[pathway-compat-base] openBinaryTempFileWithDefaultPermissions (src/System/IO/Thin.hs:93)
21.23 s
[pathway-compat-base] Documentation created: dist/doc/html/pathway-compat-base/,
21.23 s
[pathway-compat-base] dist/doc/html/pathway-compat-base/pathway-compat-base.txt
21.30 s
[pathway-compat-base] Preprocessing test suite 'doctests' for pathway-compat-base-0.0.1.0..
21.31 s
[pathway-compat-base] Phase: installPhase
21.40 s
[pathway-compat-base] Installing library in /nix/store/5yds5x988kvqbm18q0b330g0bkq0b0il-pathway-compat-base-0.0.1.0/lib/ghc-9.6.7/lib/x86_64-linux-ghc-9.6.7/pathway-compat-base-0.0.1.0-E02izPYkwmmGdAPlQBKjbP
21.83 s
[pathway-compat-base] Phase: fixupPhase
21.85 s
[pathway-compat-base] shrinking RPATHs of ELF executables and libraries in /nix/store/5yds5x988kvqbm18q0b330g0bkq0b0il-pathway-compat-base-0.0.1.0
21.85 s
[pathway-compat-base] shrinking /nix/store/5yds5x988kvqbm18q0b330g0bkq0b0il-pathway-compat-base-0.0.1.0/lib/ghc-9.6.7/lib/x86_64-linux-ghc-9.6.7/libHSpathway-compat-base-0.0.1.0-E02izPYkwmmGdAPlQBKjbP-ghc9.6.7.so
21.88 s
[pathway-compat-base] checking for references to /build/ in /nix/store/5yds5x988kvqbm18q0b330g0bkq0b0il-pathway-compat-base-0.0.1.0...
21.91 s
[pathway-compat-base] patching script interpreter paths in /nix/store/5yds5x988kvqbm18q0b330g0bkq0b0il-pathway-compat-base-0.0.1.0
21.92 s
[pathway-compat-base] stripping (with command strip and flags -S -p) in /nix/store/5yds5x988kvqbm18q0b330g0bkq0b0il-pathway-compat-base-0.0.1.0/lib
22.01 s
[pathway-compat-base] shrinking RPATHs of ELF executables and libraries in /nix/store/n7rcgdpdya0npf6g7jk9lwq4a2jmx36d-pathway-compat-base-0.0.1.0-doc
22.02 s
[pathway-compat-base] checking for references to /build/ in /nix/store/n7rcgdpdya0npf6g7jk9lwq4a2jmx36d-pathway-compat-base-0.0.1.0-doc...
22.05 s
[pathway-compat-base] patching script interpreter paths in /nix/store/n7rcgdpdya0npf6g7jk9lwq4a2jmx36d-pathway-compat-base-0.0.1.0-doc
22.15 s
[pathway-compat-base:post-build] Uploading to cachix cache "sellout": /nix/store/5yds5x988kvqbm18q0b330g0bkq0b0il-pathway-compat-base-0.0.1.0 /nix/store/n7rcgdpdya0npf6g7jk9lwq4a2jmx36d-pathway-compat-base-0.0.1.0-doc
22.64 s
[pathway-compat-base:post-build] Pushing 2 paths (186 are already present) using zstd to cache sellout ⏳
22.64 s
[pathway-compat-base:post-build]
23.01 s
[pathway-compat-base:post-build] Pushing /nix/store/n7rcgdpdya0npf6g7jk9lwq4a2jmx36d-pathway-compat-base-0.0.1.0-doc (1.85 MiB)
23.10 s
[pathway-compat-base:post-build] Pushing /nix/store/5yds5x988kvqbm18q0b330g0bkq0b0il-pathway-compat-base-0.0.1.0 (2.00 MiB)
24.11 s
[pathway-compat-base:post-build]
24.11 s
[pathway-compat-base:post-build] All done.
24.13 s
[pathway-compat-base:post-build] Uploading to the NixCI cache: /nix/store/5yds5x988kvqbm18q0b330g0bkq0b0il-pathway-compat-base-0.0.1.0 /nix/store/n7rcgdpdya0npf6g7jk9lwq4a2jmx36d-pathway-compat-base-0.0.1.0-doc
24.17 s
[pathway-compat-base:post-build] warning: 'warn-short-path-literals' is deprecated, use 'lint-short-path-literals = ignore' instead
24.19 s
[pathway-compat-base:post-build] copying 2 paths...
24.19 s
[pathway-compat-base:post-build] copying path '/nix/store/n7rcgdpdya0npf6g7jk9lwq4a2jmx36d-pathway-compat-base-0.0.1.0-doc' to 'https://cache.nix-ci.com'...
24.52 s
[pathway-compat-base:post-build] copying path '/nix/store/5yds5x988kvqbm18q0b330g0bkq0b0il-pathway-compat-base-0.0.1.0' to 'https://cache.nix-ci.com'...
25.05 s
[pathway-compat-base:post-build] warning: 'warn-short-path-literals' is deprecated, use 'lint-short-path-literals = ignore' instead
25.25 s
[pathway-compat-base:post-build] copying 1 paths...
25.25 s
[pathway-compat-base:post-build] copying path '/nix/store/r05xgdsqgil1m6ii36zf017yqy13dwfp-pathway-compat-base-0.0.1.0.drv' to 'https://cache.nix-ci.com'...
25.40 s
Uploaded pathway-compat-base in 3.2s
25.40 s
Progress: 1 of 15 built, 8 of 8 downloaded from cache
25.40 s
Built pathway-compat-base in 22.7s
25.43 s
Building /nix/store/isq7l83m10yyykzr1f202hq4n23f43p1-pathway-compat-filepath-0.0.1.0.drv
25.64 s
[pathway-compat-filepath] Phase: setupCompilerEnvironmentPhase
25.64 s
[pathway-compat-filepath] Build with /nix/store/2djpcnj8a25viv1y24h3mziy1gsy3fc6-ghc-9.6.7.
25.99 s
[pathway-compat-filepath] Phase: unpackPhase
26.00 s
[pathway-compat-filepath] unpacking source archive /nix/store/5z4x7vzkb1m65ccyx19wn7vcxdl9gmbf-filepath
26.00 s
[pathway-compat-filepath] source root is filepath
26.02 s
[pathway-compat-filepath] Phase: patchPhase
26.03 s
[pathway-compat-filepath] Phase: compileBuildDriverPhase
26.03 s
[pathway-compat-filepath] setupCompileFlags: -package-db=/build/tmp.zKwaqPnUnM/setup-package.conf.d -threaded
26.08 s
[pathway-compat-filepath] [1 of 2] Compiling Main ( Setup.hs, /build/tmp.zKwaqPnUnM/Main.o )
26.14 s
[pathway-compat-filepath] [2 of 2] Linking Setup
27.41 s
[pathway-compat-filepath] Phase: updateAutotoolsGnuConfigScriptsPhase
27.42 s
[pathway-compat-filepath] Phase: configurePhase
27.44 s
[pathway-compat-filepath] configureFlags: --verbose --prefix=/nix/store/q9fsagpd29spy55dp5m0zri4is79nfz5-pathway-compat-filepath-0.0.1.0 --libdir=$prefix/lib/$compiler/lib --libsubdir=$abi/$libname --docdir=/nix/store/gsxpk94inw22circr76qnnbmvc6ziwhz-pathway-compat-filepath-0.0.1.0-doc/share/doc/pathway-compat-filepath-0.0.1.0 --with-gcc=gcc --package-db=/build/tmp.zKwaqPnUnM/package.conf.d --ghc-option=-j16 --ghc-option=+RTS --ghc-option=-A64M --ghc-option=-RTS --enable-library-profiling --profiling-detail=exported-functions --disable-profiling --enable-shared --disable-coverage --enable-static --disable-executable-dynamic --enable-tests --disable-benchmarks --enable-library-vanilla --disable-library-for-ghci --enable-split-sections --enable-library-stripping --enable-executable-stripping --ghc-option=-haddock --ghc-options=-Werror --extra-lib-dirs=/nix/store/pndhkk0l649lm1sj0mxk7cbwq26qd1ra-ncurses-6.6/lib --extra-lib-dirs=/nix/store/0djlg4g0b81w94k3vcaqsxsc2hh4kism-libffi-3.5.2/lib --extra-lib-dirs=/nix/store/md4paia7riiggyrj8p24c7a6vf8w7jz8-elfutils-0.194/lib --extra-lib-dirs=/nix/store/39vv2pf64gd8li48a4hpbhw2crzd8z5p-gmp-with-cxx-6.3.0/lib --extra-lib-dirs=/nix/store/7wwvald8lapkrsr72qanlw8blyn55ifx-numactl-2.0.18/lib --extra-lib-dirs=/nix/store/2djpcnj8a25viv1y24h3mziy1gsy3fc6-ghc-9.6.7/lib
27.45 s
[pathway-compat-filepath] Using Parsec parser
27.45 s
[pathway-compat-filepath] Configuring pathway-compat-filepath-0.0.1.0...
27.83 s
[pathway-compat-filepath] Flags chosen: noisy-deprecations=True, verify-no-recursion=False
27.83 s
[pathway-compat-filepath] Dependency base >=4.14.0 && <4.15 || >=4.15.0 && <4.16 || >=4.16.0 && <4.17 ||
27.83 s
[pathway-compat-filepath] >=4.17.0 && <4.18 || >=4.18.0 && <4.19 || >=4.19.0 && <4.20 || >=4.20.0 &&
27.83 s
[pathway-compat-filepath] <4.21 || >=4.21.0 && <4.22 || >=4.22.0 && <4.23: using base-4.18.3.0
27.83 s
[pathway-compat-filepath] Dependency extra: using extra-1.8.1
27.83 s
[pathway-compat-filepath] Dependency filepath >=1.4.2 && <1.5 || >=1.5.0 && <1.6: using
27.83 s
[pathway-compat-filepath] filepath-1.4.301.0
27.83 s
[pathway-compat-filepath] Dependency megaparsec >=9.0.1 && <9.1 || >=9.2.1 && <9.3 || >=9.5.0 && <9.6 ||
27.83 s
[pathway-compat-filepath] >=9.7.0 && <9.8: using megaparsec-9.7.0
27.83 s
[pathway-compat-filepath] Dependency os-string: using os-string-2.0.10
27.83 s
[pathway-compat-filepath] Dependency pathway >=0.0.1 && <0.1: using pathway-0.0.1.0
27.83 s
[pathway-compat-filepath] Dependency pathway-compat-base >=0.0.1 && <0.1: using
27.83 s
[pathway-compat-filepath] pathway-compat-base-0.0.1.0
27.83 s
[pathway-compat-filepath] Dependency pathway-internal >=0.0.1 && <0.1: using pathway-internal-0.0.1.0
27.83 s
[pathway-compat-filepath] Dependency base >=4.14.0 && <4.15 || >=4.15.0 && <4.16 || >=4.16.0 && <4.17 ||
27.83 s
[pathway-compat-filepath] >=4.17.0 && <4.18 || >=4.18.0 && <4.19 || >=4.19.0 && <4.20 || >=4.20.0 &&
27.83 s
[pathway-compat-filepath] <4.21 || >=4.21.0 && <4.22 || >=4.22.0 && <4.23: using base-4.18.3.0
27.83 s
[pathway-compat-filepath] Dependency doctest >=0.16.3 && <0.17 || >=0.18.1 && <0.19 || >=0.20.1 && <0.21
27.84 s
[pathway-compat-filepath] || >=0.21.1 && <0.22 || >=0.22.2 && <0.23 || >=0.24.2 && <0.25: using
27.84 s
[pathway-compat-filepath] doctest-0.24.3
27.84 s
[pathway-compat-filepath] Dependency pathway-compat-filepath: using pathway-compat-filepath-0.0.1.0
28.26 s
[pathway-compat-filepath] Source component graph:
28.26 s
[pathway-compat-filepath] component lib
28.26 s
[pathway-compat-filepath] component test:doctests dependency lib
28.26 s
[pathway-compat-filepath] Configured component graph:
28.26 s
[pathway-compat-filepath] component pathway-compat-filepath-0.0.1.0-Ck51GFznMiC2cxIfBMz4NH
28.26 s
[pathway-compat-filepath] include base-4.18.3.0
28.26 s
[pathway-compat-filepath] include extra-1.8.1-FU1frm3XcM88A49dBkmtgI
28.26 s
[pathway-compat-filepath] include filepath-1.4.301.0
28.26 s
[pathway-compat-filepath] include megaparsec-9.7.0-EpAk7LLR2KBGAKafJPbXz1
28.26 s
[pathway-compat-filepath] include os-string-2.0.10-19KGKnZaj8J2ODUMyNXxJr
28.26 s
[pathway-compat-filepath] include pathway-0.0.1.0-5VJXWbvreBAfybP2NROr3
28.26 s
[pathway-compat-filepath] include pathway-compat-base-0.0.1.0-E02izPYkwmmGdAPlQBKjbP
28.26 s
[pathway-compat-filepath] include pathway-internal-0.0.1.0-1xeSc3z2VhRIotiMz9hdL1
28.26 s
[pathway-compat-filepath] component pathway-compat-filepath-0.0.1.0-Bh4LT0cz7im2Vo1hGnl75g-doctests
28.26 s
[pathway-compat-filepath] include base-4.18.3.0
28.26 s
[pathway-compat-filepath] include doctest-0.24.3-ACQNy8u8jPjC50l4I3tyiL
28.26 s
[pathway-compat-filepath] include pathway-compat-filepath-0.0.1.0-Ck51GFznMiC2cxIfBMz4NH
28.26 s
[pathway-compat-filepath] Linked component graph:
28.26 s
[pathway-compat-filepath] unit pathway-compat-filepath-0.0.1.0-Ck51GFznMiC2cxIfBMz4NH
28.26 s
[pathway-compat-filepath] include base-4.18.3.0
28.26 s
[pathway-compat-filepath] include extra-1.8.1-FU1frm3XcM88A49dBkmtgI
28.26 s
[pathway-compat-filepath] include filepath-1.4.301.0
28.26 s
[pathway-compat-filepath] include megaparsec-9.7.0-EpAk7LLR2KBGAKafJPbXz1
28.26 s
[pathway-compat-filepath] include os-string-2.0.10-19KGKnZaj8J2ODUMyNXxJr
28.26 s
[pathway-compat-filepath] include pathway-0.0.1.0-5VJXWbvreBAfybP2NROr3
28.26 s
[pathway-compat-filepath] include pathway-compat-base-0.0.1.0-E02izPYkwmmGdAPlQBKjbP
28.26 s
[pathway-compat-filepath] include pathway-internal-0.0.1.0-1xeSc3z2VhRIotiMz9hdL1
28.26 s
[pathway-compat-filepath] Common.FilePath=pathway-compat-filepath-0.0.1.0-Ck51GFznMiC2cxIfBMz4NH:Common.FilePath,Common.OsPath=pathway-compat-filepath-0.0.1.0-Ck51GFznMiC2cxIfBMz4NH:Common.OsPath,System.FilePath=pathway-compat-filepath-0.0.1.0-Ck51GFznMiC2cxIfBMz4NH:System.FilePath,System.FilePath.Overlay=pathway-compat-filepath-0.0.1.0-Ck51GFznMiC2cxIfBMz4NH:System.FilePath.Overlay,System.FilePath.Pathway=pathway-compat-filepath-0.0.1.0-Ck51GFznMiC2cxIfBMz4NH:System.FilePath.Pathway,System.FilePath.Thin=pathway-compat-filepath-0.0.1.0-Ck51GFznMiC2cxIfBMz4NH:System.FilePath.Thin,System.OsPath=pathway-compat-filepath-0.0.1.0-Ck51GFznMiC2cxIfBMz4NH:System.OsPath,System.OsPath.Overlay=pathway-compat-filepath-0.0.1.0-Ck51GFznMiC2cxIfBMz4NH:System.OsPath.Overlay,System.OsPath.Pathway=pathway-compat-filepath-0.0.1.0-Ck51GFznMiC2cxIfBMz4NH:System.OsPath.Pathway,System.OsPath.Thin=pathway-compat-filepath-0.0.1.0-Ck51GFznMiC2cxIfBMz4NH:System.OsPath.Thin
28.26 s
[pathway-compat-filepath] unit pathway-compat-filepath-0.0.1.0-Bh4LT0cz7im2Vo1hGnl75g-doctests
28.26 s
[pathway-compat-filepath] include base-4.18.3.0
28.27 s
[pathway-compat-filepath] include doctest-0.24.3-ACQNy8u8jPjC50l4I3tyiL
28.27 s
[pathway-compat-filepath] include pathway-compat-filepath-0.0.1.0-Ck51GFznMiC2cxIfBMz4NH
28.27 s
[pathway-compat-filepath] Ready component graph:
28.27 s
[pathway-compat-filepath] definite pathway-compat-filepath-0.0.1.0-Ck51GFznMiC2cxIfBMz4NH
28.27 s
[pathway-compat-filepath] depends base-4.18.3.0
28.27 s
[pathway-compat-filepath] depends extra-1.8.1-FU1frm3XcM88A49dBkmtgI
28.27 s
[pathway-compat-filepath] depends filepath-1.4.301.0
28.27 s
[pathway-compat-filepath] depends megaparsec-9.7.0-EpAk7LLR2KBGAKafJPbXz1
28.27 s
[pathway-compat-filepath] depends os-string-2.0.10-19KGKnZaj8J2ODUMyNXxJr
28.27 s
[pathway-compat-filepath] depends pathway-0.0.1.0-5VJXWbvreBAfybP2NROr3
28.27 s
[pathway-compat-filepath] depends pathway-compat-base-0.0.1.0-E02izPYkwmmGdAPlQBKjbP
28.27 s
[pathway-compat-filepath] depends pathway-internal-0.0.1.0-1xeSc3z2VhRIotiMz9hdL1
28.27 s
[pathway-compat-filepath] definite pathway-compat-filepath-0.0.1.0-Bh4LT0cz7im2Vo1hGnl75g-doctests
28.27 s
[pathway-compat-filepath] depends base-4.18.3.0
28.27 s
[pathway-compat-filepath] depends doctest-0.24.3-ACQNy8u8jPjC50l4I3tyiL
28.27 s
[pathway-compat-filepath] depends pathway-compat-filepath-0.0.1.0-Ck51GFznMiC2cxIfBMz4NH
28.27 s
[pathway-compat-filepath] Using Cabal-3.10.3.0 compiled by ghc-9.6
28.27 s
[pathway-compat-filepath] Using compiler: ghc-9.6.7
28.27 s
[pathway-compat-filepath] Using install prefix:
28.27 s
[pathway-compat-filepath] /nix/store/q9fsagpd29spy55dp5m0zri4is79nfz5-pathway-compat-filepath-0.0.1.0
28.27 s
[pathway-compat-filepath] Executables installed in:
28.27 s
[pathway-compat-filepath] /nix/store/q9fsagpd29spy55dp5m0zri4is79nfz5-pathway-compat-filepath-0.0.1.0/bin
28.27 s
[pathway-compat-filepath] Libraries installed in:
28.27 s
[pathway-compat-filepath] /nix/store/q9fsagpd29spy55dp5m0zri4is79nfz5-pathway-compat-filepath-0.0.1.0/lib/ghc-9.6.7/lib/x86_64-linux-ghc-9.6.7/pathway-compat-filepath-0.0.1.0-Ck51GFznMiC2cxIfBMz4NH
28.27 s
[pathway-compat-filepath] Dynamic Libraries installed in:
28.27 s
[pathway-compat-filepath] /nix/store/q9fsagpd29spy55dp5m0zri4is79nfz5-pathway-compat-filepath-0.0.1.0/lib/ghc-9.6.7/lib/x86_64-linux-ghc-9.6.7
28.27 s
[pathway-compat-filepath] Private executables installed in:
28.27 s
[pathway-compat-filepath] /nix/store/q9fsagpd29spy55dp5m0zri4is79nfz5-pathway-compat-filepath-0.0.1.0/libexec/x86_64-linux-ghc-9.6.7/pathway-compat-filepath-0.0.1.0
28.27 s
[pathway-compat-filepath] Data files installed in:
28.27 s
[pathway-compat-filepath] /nix/store/q9fsagpd29spy55dp5m0zri4is79nfz5-pathway-compat-filepath-0.0.1.0/share/x86_64-linux-ghc-9.6.7/pathway-compat-filepath-0.0.1.0
28.27 s
[pathway-compat-filepath] Documentation installed in:
28.27 s
[pathway-compat-filepath] /nix/store/gsxpk94inw22circr76qnnbmvc6ziwhz-pathway-compat-filepath-0.0.1.0-doc/share/doc/pathway-compat-filepath-0.0.1.0
28.27 s
[pathway-compat-filepath] Configuration files installed in:
28.27 s
[pathway-compat-filepath] /nix/store/q9fsagpd29spy55dp5m0zri4is79nfz5-pathway-compat-filepath-0.0.1.0/etc
28.27 s
[pathway-compat-filepath] No alex found
28.27 s
[pathway-compat-filepath] Using ar found on system at:
28.27 s
[pathway-compat-filepath] /nix/store/zjraf40s86y3iwhp626b934r5y6ldkbb-binutils-wrapper-2.46/bin/ar
28.27 s
[pathway-compat-filepath] No c2hs found
28.27 s
[pathway-compat-filepath] No cpphs found
28.27 s
[pathway-compat-filepath] Using doctest version 0.24.3 found on system at:
28.27 s
[pathway-compat-filepath] /nix/store/s48k56ayjjxwdbz9y7d8mnqwlcjfi1a8-doctest-0.24.3/bin/doctest
28.27 s
[pathway-compat-filepath] Using gcc version 15.2.0 given by user at:
28.27 s
[pathway-compat-filepath] /nix/store/29qjlshvklnyr67nhpprzgb9igmsfsjj-gcc-wrapper-15.2.0/bin/gcc
28.27 s
[pathway-compat-filepath] Using ghc version 9.6.7 found on system at:
28.27 s
[pathway-compat-filepath] /nix/store/2djpcnj8a25viv1y24h3mziy1gsy3fc6-ghc-9.6.7/bin/ghc
28.27 s
[pathway-compat-filepath] Using ghc-pkg version 9.6.7 found on system at:
28.27 s
[pathway-compat-filepath] /nix/store/2djpcnj8a25viv1y24h3mziy1gsy3fc6-ghc-9.6.7/bin/ghc-pkg-9.6.7
28.27 s
[pathway-compat-filepath] No ghcjs found
28.27 s
[pathway-compat-filepath] No ghcjs-pkg found
28.27 s
[pathway-compat-filepath] No greencard found
28.27 s
[pathway-compat-filepath] Using haddock version 2.29.2 found on system at:
28.27 s
[pathway-compat-filepath] /nix/store/2djpcnj8a25viv1y24h3mziy1gsy3fc6-ghc-9.6.7/bin/haddock-ghc-9.6.7
28.27 s
[pathway-compat-filepath] No happy found
28.27 s
[pathway-compat-filepath] Using haskell-suite found on system at: haskell-suite-dummy-location
28.27 s
[pathway-compat-filepath] Using haskell-suite-pkg found on system at: haskell-suite-pkg-dummy-location
28.27 s
[pathway-compat-filepath] No hmake found
28.27 s
[pathway-compat-filepath] Using hpc version 0.68 found on system at:
28.27 s
[pathway-compat-filepath] /nix/store/2djpcnj8a25viv1y24h3mziy1gsy3fc6-ghc-9.6.7/bin/hpc-ghc-9.6.7
28.27 s
[pathway-compat-filepath] Using hsc2hs version 0.68.9 found on system at:
28.27 s
[pathway-compat-filepath] /nix/store/2djpcnj8a25viv1y24h3mziy1gsy3fc6-ghc-9.6.7/bin/hsc2hs-ghc-9.6.7
28.27 s
[pathway-compat-filepath] Using hscolour version 1.25 found on system at:
28.27 s
[pathway-compat-filepath] /nix/store/2x19jxh5g98bv0s06mdj71c1hmxi54yl-hscolour-1.25/bin/HsColour
28.27 s
[pathway-compat-filepath] No jhc found
28.27 s
[pathway-compat-filepath] Using ld found on system at:
28.27 s
[pathway-compat-filepath] /nix/store/zjraf40s86y3iwhp626b934r5y6ldkbb-binutils-wrapper-2.46/bin/ld.gold
28.27 s
[pathway-compat-filepath] No pkg-config found
28.27 s
[pathway-compat-filepath] Using runghc version 9.6.7 found on system at:
28.27 s
[pathway-compat-filepath] /nix/store/2djpcnj8a25viv1y24h3mziy1gsy3fc6-ghc-9.6.7/bin/runghc-9.6.7
28.27 s
[pathway-compat-filepath] Using strip version 2.46 found on system at:
28.27 s
[pathway-compat-filepath] /nix/store/29qjlshvklnyr67nhpprzgb9igmsfsjj-gcc-wrapper-15.2.0/bin/strip
28.27 s
[pathway-compat-filepath] Using tar found on system at:
28.27 s
[pathway-compat-filepath] /nix/store/z5mq2sam4484prf3kv6v6vjw1m0i7j24-gnutar-1.35/bin/tar
28.27 s
[pathway-compat-filepath] No uhc found
28.71 s
[pathway-compat-filepath] Phase: buildPhase
28.79 s
[pathway-compat-filepath] Preprocessing library for pathway-compat-filepath-0.0.1.0..
28.79 s
[pathway-compat-filepath] Building library for pathway-compat-filepath-0.0.1.0..
28.88 s
[pathway-compat-filepath] [ 1 of 10] Compiling Common.FilePath ( src/Common/FilePath.hs, dist/build/Common/FilePath.o, dist/build/Common/FilePath.dyn_o )
29.20 s
[pathway-compat-filepath] [ 2 of 10] Compiling Common.OsPath ( src/Common/OsPath.hs, dist/build/Common/OsPath.o, dist/build/Common/OsPath.dyn_o )
29.20 s
[pathway-compat-filepath]
29.20 s
[pathway-compat-filepath] src/Common/OsPath.hs:90:23: error : [ GHC-83865 ]
29.20 s
[pathway-compat-filepath] • Couldn't match type ‘OSS.OsString’ with ‘OsString’
29.20 s
[pathway-compat-filepath] Expected: OsPath
29.20 s
[pathway-compat-filepath] Actual: OSS.OsString
29.20 s
[pathway-compat-filepath] NB: ‘OsString’
29.20 s
[pathway-compat-filepath] is defined in ‘System.OsString.Internal.Types.Hidden’
29.20 s
[pathway-compat-filepath] in package ‘filepath-1.4.301.0’
29.20 s
[pathway-compat-filepath] ‘OSS.OsString’
29.20 s
[pathway-compat-filepath] is defined in ‘System.OsString.Internal.Types’
29.20 s
[pathway-compat-filepath] in package ‘os-string-2.0.10’
29.20 s
[pathway-compat-filepath] • In the ‘parent’ field of a record
29.20 s
[pathway-compat-filepath] In the expression:
29.20 s
[pathway-compat-filepath] Format
29.20 s
[pathway-compat-filepath] {Format.root = O.pack . pure $ O.pathSeparator,
29.20 s
[pathway-compat-filepath] Format.current = mempty, Format.parent = OSS.unsafeEncodeUtf "..",
29.20 s
[pathway-compat-filepath] Format.separator = O.pack . pure $ O.pathSeparator,
29.20 s
[pathway-compat-filepath] Format.substitutions = mempty}
29.20 s
[pathway-compat-filepath] In an equation for ‘localFormat’:
29.20 s
[pathway-compat-filepath] localFormat
29.20 s
[pathway-compat-filepath] = Format
29.20 s
[pathway-compat-filepath] {Format.root = O.pack . pure $ O.pathSeparator,
29.20 s
[pathway-compat-filepath] Format.current = mempty, Format.parent = OSS.unsafeEncodeUtf "..",
29.20 s
[pathway-compat-filepath] Format.separator = O.pack . pure $ O.pathSeparator,
29.20 s
[pathway-compat-filepath] Format.substitutions = mempty}
29.20 s
[pathway-compat-filepath] |
29.20 s
[pathway-compat-filepath] 90 | Format.parent = OSS.unsafeEncodeUtf ".." ,
29.20 s
[pathway-compat-filepath] | ^^^^^^^^^^^^^^^^^^^^^^^^
29.20 s
[pathway-compat-filepath] [ 3 of 10] Compiling System.FilePath.Thin ( src/System/FilePath/Thin.hs, dist/build/System/FilePath/Thin.o, dist/build/System/FilePath/Thin.dyn_o )
29.32 s
[pathway-compat-filepath] [ 4 of 10] Compiling System.FilePath.Pathway ( src/System/FilePath/Pathway.hs, dist/build/System/FilePath/Pathway.o, dist/build/System/FilePath/Pathway.dyn_o )
29.35 s
[pathway-compat-filepath] [ 5 of 10] Compiling System.FilePath.Overlay ( src/System/FilePath/Overlay.hs, dist/build/System/FilePath/Overlay.o, dist/build/System/FilePath/Overlay.dyn_o )
29.37 s
[pathway-compat-filepath] [ 6 of 10] Compiling System.FilePath ( src/System/FilePath.hs, dist/build/System/FilePath.o, dist/build/System/FilePath.dyn_o )
29.50 s
Progress: 1 of 13 built (1 failed), 8 of 8 downloaded from cache
29.50 s
Failed to build pathway-compat-filepath after 4.0s
29.50 s
error: Cannot build '/nix/store/isq7l83m10yyykzr1f202hq4n23f43p1-pathway-compat-filepath-0.0.1.0.drv '.
29.50 s
Reason: builder failed with exit code 1 .
29.50 s
Output paths:
29.50 s
/nix/store/gsxpk94inw22circr76qnnbmvc6ziwhz-pathway-compat-filepath-0.0.1.0-doc
29.50 s
/nix/store/q9fsagpd29spy55dp5m0zri4is79nfz5-pathway-compat-filepath-0.0.1.0
29.50 s
Last 176 log lines:
29.50 s
> Running phase: setupCompilerEnvironmentPhase
29.50 s
> Build with /nix/store/2djpcnj8a25viv1y24h3mziy1gsy3fc6-ghc-9.6.7.
29.50 s
> Running phase: unpackPhase
29.50 s
> unpacking source archive /nix/store/5z4x7vzkb1m65ccyx19wn7vcxdl9gmbf-filepath
29.50 s
> source root is filepath
29.50 s
> Running phase: patchPhase
29.50 s
> Running phase: compileBuildDriverPhase
29.50 s
> setupCompileFlags: -package-db=/build/tmp.zKwaqPnUnM/setup-package.conf.d -threaded
29.50 s
> [1 of 2] Compiling Main ( Setup.hs, /build/tmp.zKwaqPnUnM/Main.o )
29.50 s
> [2 of 2] Linking Setup
29.50 s
> Running phase: updateAutotoolsGnuConfigScriptsPhase
29.50 s
> Running phase: configurePhase
29.50 s
> configureFlags: --verbose --prefix=/nix/store/q9fsagpd29spy55dp5m0zri4is79nfz5-pathway-compat-filepath-0.0.1.0 --libdir=$prefix/lib/$compiler/lib --libsubdir=$abi/$libname --docdir=/nix/store/gsxpk94inw22circr76qnnbmvc6ziwhz-pathway-compat-filepath-0.0.1.0-doc/share/doc/pathway-compat-filepath-0.0.1.0 --with-gcc=gcc --package-db=/build/tmp.zKwaqPnUnM/package.conf.d --ghc-option=-j16 --ghc-option=+RTS --ghc-option=-A64M --ghc-option=-RTS --enable-library-profiling --profiling-detail=exported-functions --disable-profiling --enable-shared --disable-coverage --enable-static --disable-executable-dynamic --enable-tests --disable-benchmarks --enable-library-vanilla --disable-library-for-ghci --enable-split-sections --enable-library-stripping --enable-executable-stripping --ghc-option=-haddock --ghc-options=-Werror --extra-lib-dirs=/nix/store/pndhkk0l649lm1sj0mxk7cbwq26qd1ra-ncurses-6.6/lib --extra-lib-dirs=/nix/store/0djlg4g0b81w94k3vcaqsxsc2hh4kism-libffi-3.5.2/lib --extra-lib-dirs=/nix/store/md4paia7riiggyrj8p24c7a6vf8w7jz8-elfutils-0.194/lib --extra-lib-dirs=/nix/store/39vv2pf64gd8li48a4hpbhw2crzd8z5p-gmp-with-cxx-6.3.0/lib --extra-lib-dirs=/nix/store/7wwvald8lapkrsr72qanlw8blyn55ifx-numactl-2.0.18/lib --extra-lib-dirs=/nix/store/2djpcnj8a25viv1y24h3mziy1gsy3fc6-ghc-9.6.7/lib
29.50 s
> Using Parsec parser
29.50 s
> Configuring pathway-compat-filepath-0.0.1.0...
29.50 s
> Flags chosen: noisy-deprecations=True, verify-no-recursion=False
29.50 s
> Dependency base >=4.14.0 && <4.15 || >=4.15.0 && <4.16 || >=4.16.0 && <4.17 ||
29.50 s
> >=4.17.0 && <4.18 || >=4.18.0 && <4.19 || >=4.19.0 && <4.20 || >=4.20.0 &&
29.50 s
> <4.21 || >=4.21.0 && <4.22 || >=4.22.0 && <4.23: using base-4.18.3.0
29.50 s
> Dependency extra: using extra-1.8.1
29.50 s
> Dependency filepath >=1.4.2 && <1.5 || >=1.5.0 && <1.6: using
29.50 s
> filepath-1.4.301.0
29.50 s
> Dependency megaparsec >=9.0.1 && <9.1 || >=9.2.1 && <9.3 || >=9.5.0 && <9.6 ||
29.50 s
> >=9.7.0 && <9.8: using megaparsec-9.7.0
29.50 s
> Dependency os-string: using os-string-2.0.10
29.50 s
> Dependency pathway >=0.0.1 && <0.1: using pathway-0.0.1.0
29.50 s
> Dependency pathway-compat-base >=0.0.1 && <0.1: using
29.50 s
> pathway-compat-base-0.0.1.0
29.50 s
> Dependency pathway-internal >=0.0.1 && <0.1: using pathway-internal-0.0.1.0
29.50 s
> Dependency base >=4.14.0 && <4.15 || >=4.15.0 && <4.16 || >=4.16.0 && <4.17 ||
29.50 s
> >=4.17.0 && <4.18 || >=4.18.0 && <4.19 || >=4.19.0 && <4.20 || >=4.20.0 &&
29.50 s
> <4.21 || >=4.21.0 && <4.22 || >=4.22.0 && <4.23: using base-4.18.3.0
29.50 s
> Dependency doctest >=0.16.3 && <0.17 || >=0.18.1 && <0.19 || >=0.20.1 && <0.21
29.50 s
> || >=0.21.1 && <0.22 || >=0.22.2 && <0.23 || >=0.24.2 && <0.25: using
29.50 s
> doctest-0.24.3
29.50 s
> Dependency pathway-compat-filepath: using pathway-compat-filepath-0.0.1.0
29.50 s
> Source component graph:
29.50 s
> component lib
29.50 s
> component test:doctests dependency lib
29.50 s
> Configured component graph:
29.50 s
> component pathway-compat-filepath-0.0.1.0-Ck51GFznMiC2cxIfBMz4NH
29.50 s
> include base-4.18.3.0
29.50 s
> include extra-1.8.1-FU1frm3XcM88A49dBkmtgI
29.50 s
> include filepath-1.4.301.0
29.50 s
> include megaparsec-9.7.0-EpAk7LLR2KBGAKafJPbXz1
29.50 s
> include os-string-2.0.10-19KGKnZaj8J2ODUMyNXxJr
29.50 s
> include pathway-0.0.1.0-5VJXWbvreBAfybP2NROr3
29.50 s
> include pathway-compat-base-0.0.1.0-E02izPYkwmmGdAPlQBKjbP
29.50 s
> include pathway-internal-0.0.1.0-1xeSc3z2VhRIotiMz9hdL1
29.50 s
> component pathway-compat-filepath-0.0.1.0-Bh4LT0cz7im2Vo1hGnl75g-doctests
29.50 s
> include base-4.18.3.0
29.50 s
> include doctest-0.24.3-ACQNy8u8jPjC50l4I3tyiL
29.50 s
> include pathway-compat-filepath-0.0.1.0-Ck51GFznMiC2cxIfBMz4NH
29.50 s
> Linked component graph:
29.50 s
> unit pathway-compat-filepath-0.0.1.0-Ck51GFznMiC2cxIfBMz4NH
29.50 s
> include base-4.18.3.0
29.50 s
> include extra-1.8.1-FU1frm3XcM88A49dBkmtgI
29.50 s
> include filepath-1.4.301.0
29.50 s
> include megaparsec-9.7.0-EpAk7LLR2KBGAKafJPbXz1
29.50 s
> include os-string-2.0.10-19KGKnZaj8J2ODUMyNXxJr
29.50 s
> include pathway-0.0.1.0-5VJXWbvreBAfybP2NROr3
29.50 s
> include pathway-compat-base-0.0.1.0-E02izPYkwmmGdAPlQBKjbP
29.50 s
> include pathway-internal-0.0.1.0-1xeSc3z2VhRIotiMz9hdL1
29.50 s
> Common.FilePath=pathway-compat-filepath-0.0.1.0-Ck51GFznMiC2cxIfBMz4NH:Common.FilePath,Common.OsPath=pathway-compat-filepath-0.0.1.0-Ck51GFznMiC2cxIfBMz4NH:Common.OsPath,System.FilePath=pathway-compat-filepath-0.0.1.0-Ck51GFznMiC2cxIfBMz4NH:System.FilePath,System.FilePath.Overlay=pathway-compat-filepath-0.0.1.0-Ck51GFznMiC2cxIfBMz4NH:System.FilePath.Overlay,System.FilePath.Pathway=pathway-compat-filepath-0.0.1.0-Ck51GFznMiC2cxIfBMz4NH:System.FilePath.Pathway,System.FilePath.Thin=pathway-compat-filepath-0.0.1.0-Ck51GFznMiC2cxIfBMz4NH:System.FilePath.Thin,System.OsPath=pathway-compat-filepath-0.0.1.0-Ck51GFznMiC2cxIfBMz4NH:System.OsPath,System.OsPath.Overlay=pathway-compat-filepath-0.0.1.0-Ck51GFznMiC2cxIfBMz4NH:System.OsPath.Overlay,System.OsPath.Pathway=pathway-compat-filepath-0.0.1.0-Ck51GFznMiC2cxIfBMz4NH:System.OsPath.Pathway,System.OsPath.Thin=pathway-compat-filepath-0.0.1.0-Ck51GFznMiC2cxIfBMz4NH:System.OsPath.Thin
29.50 s
> unit pathway-compat-filepath-0.0.1.0-Bh4LT0cz7im2Vo1hGnl75g-doctests
29.50 s
> include base-4.18.3.0
29.50 s
> include doctest-0.24.3-ACQNy8u8jPjC50l4I3tyiL
29.50 s
> include pathway-compat-filepath-0.0.1.0-Ck51GFznMiC2cxIfBMz4NH
29.50 s
> Ready component graph:
29.50 s
> definite pathway-compat-filepath-0.0.1.0-Ck51GFznMiC2cxIfBMz4NH
29.50 s
> depends base-4.18.3.0
29.50 s
> depends extra-1.8.1-FU1frm3XcM88A49dBkmtgI
29.50 s
> depends filepath-1.4.301.0
29.50 s
> depends megaparsec-9.7.0-EpAk7LLR2KBGAKafJPbXz1
29.50 s
> depends os-string-2.0.10-19KGKnZaj8J2ODUMyNXxJr
29.50 s
> depends pathway-0.0.1.0-5VJXWbvreBAfybP2NROr3
29.50 s
> depends pathway-compat-base-0.0.1.0-E02izPYkwmmGdAPlQBKjbP
29.50 s
> depends pathway-internal-0.0.1.0-1xeSc3z2VhRIotiMz9hdL1
29.50 s
> definite pathway-compat-filepath-0.0.1.0-Bh4LT0cz7im2Vo1hGnl75g-doctests
29.50 s
> depends base-4.18.3.0
29.50 s
> depends doctest-0.24.3-ACQNy8u8jPjC50l4I3tyiL
29.50 s
> depends pathway-compat-filepath-0.0.1.0-Ck51GFznMiC2cxIfBMz4NH
29.50 s
> Using Cabal-3.10.3.0 compiled by ghc-9.6
29.50 s
> Using compiler: ghc-9.6.7
29.50 s
> Using install prefix:
29.50 s
> /nix/store/q9fsagpd29spy55dp5m0zri4is79nfz5-pathway-compat-filepath-0.0.1.0
29.50 s
> Executables installed in:
29.50 s
> /nix/store/q9fsagpd29spy55dp5m0zri4is79nfz5-pathway-compat-filepath-0.0.1.0/bin
29.50 s
> Libraries installed in:
29.50 s
> /nix/store/q9fsagpd29spy55dp5m0zri4is79nfz5-pathway-compat-filepath-0.0.1.0/lib/ghc-9.6.7/lib/x86_64-linux-ghc-9.6.7/pathway-compat-filepath-0.0.1.0-Ck51GFznMiC2cxIfBMz4NH
29.50 s
> Dynamic Libraries installed in:
29.50 s
> /nix/store/q9fsagpd29spy55dp5m0zri4is79nfz5-pathway-compat-filepath-0.0.1.0/lib/ghc-9.6.7/lib/x86_64-linux-ghc-9.6.7
29.50 s
> Private executables installed in:
29.50 s
> /nix/store/q9fsagpd29spy55dp5m0zri4is79nfz5-pathway-compat-filepath-0.0.1.0/libexec/x86_64-linux-ghc-9.6.7/pathway-compat-filepath-0.0.1.0
29.50 s
> Data files installed in:
29.50 s
> /nix/store/q9fsagpd29spy55dp5m0zri4is79nfz5-pathway-compat-filepath-0.0.1.0/share/x86_64-linux-ghc-9.6.7/pathway-compat-filepath-0.0.1.0
29.50 s
> Documentation installed in:
29.50 s
> /nix/store/gsxpk94inw22circr76qnnbmvc6ziwhz-pathway-compat-filepath-0.0.1.0-doc/share/doc/pathway-compat-filepath-0.0.1.0
29.50 s
> Configuration files installed in:
29.50 s
> /nix/store/q9fsagpd29spy55dp5m0zri4is79nfz5-pathway-compat-filepath-0.0.1.0/etc
29.50 s
> No alex found
29.50 s
> Using ar found on system at:
29.50 s
> /nix/store/zjraf40s86y3iwhp626b934r5y6ldkbb-binutils-wrapper-2.46/bin/ar
29.50 s
> No c2hs found
29.50 s
> No cpphs found
29.50 s
> Using doctest version 0.24.3 found on system at:
29.50 s
> /nix/store/s48k56ayjjxwdbz9y7d8mnqwlcjfi1a8-doctest-0.24.3/bin/doctest
29.50 s
> Using gcc version 15.2.0 given by user at:
29.50 s
> /nix/store/29qjlshvklnyr67nhpprzgb9igmsfsjj-gcc-wrapper-15.2.0/bin/gcc
29.50 s
> Using ghc version 9.6.7 found on system at:
29.50 s
> /nix/store/2djpcnj8a25viv1y24h3mziy1gsy3fc6-ghc-9.6.7/bin/ghc
29.50 s
> Using ghc-pkg version 9.6.7 found on system at:
29.50 s
> /nix/store/2djpcnj8a25viv1y24h3mziy1gsy3fc6-ghc-9.6.7/bin/ghc-pkg-9.6.7
29.50 s
> No ghcjs found
29.50 s
> No ghcjs-pkg found
29.50 s
> No greencard found
29.50 s
> Using haddock version 2.29.2 found on system at:
29.50 s
> /nix/store/2djpcnj8a25viv1y24h3mziy1gsy3fc6-ghc-9.6.7/bin/haddock-ghc-9.6.7
29.50 s
> No happy found
29.50 s
> Using haskell-suite found on system at: haskell-suite-dummy-location
29.50 s
> Using haskell-suite-pkg found on system at: haskell-suite-pkg-dummy-location
29.50 s
> No hmake found
29.50 s
> Using hpc version 0.68 found on system at:
29.50 s
> /nix/store/2djpcnj8a25viv1y24h3mziy1gsy3fc6-ghc-9.6.7/bin/hpc-ghc-9.6.7
29.50 s
> Using hsc2hs version 0.68.9 found on system at:
29.50 s
> /nix/store/2djpcnj8a25viv1y24h3mziy1gsy3fc6-ghc-9.6.7/bin/hsc2hs-ghc-9.6.7
29.50 s
> Using hscolour version 1.25 found on system at:
29.50 s
> /nix/store/2x19jxh5g98bv0s06mdj71c1hmxi54yl-hscolour-1.25/bin/HsColour
29.50 s
> No jhc found
29.50 s
> Using ld found on system at:
29.50 s
> /nix/store/zjraf40s86y3iwhp626b934r5y6ldkbb-binutils-wrapper-2.46/bin/ld.gold
29.50 s
> No pkg-config found
29.50 s
> Using runghc version 9.6.7 found on system at:
29.50 s
> /nix/store/2djpcnj8a25viv1y24h3mziy1gsy3fc6-ghc-9.6.7/bin/runghc-9.6.7
29.50 s
> Using strip version 2.46 found on system at:
29.50 s
> /nix/store/29qjlshvklnyr67nhpprzgb9igmsfsjj-gcc-wrapper-15.2.0/bin/strip
29.50 s
> Using tar found on system at:
29.50 s
> /nix/store/z5mq2sam4484prf3kv6v6vjw1m0i7j24-gnutar-1.35/bin/tar
29.50 s
> No uhc found
29.50 s
> Running phase: buildPhase
29.50 s
> Preprocessing library for pathway-compat-filepath-0.0.1.0..
29.50 s
> Building library for pathway-compat-filepath-0.0.1.0..
29.50 s
> [ 1 of 10] Compiling Common.FilePath ( src/Common/FilePath.hs, dist/build/Common/FilePath.o, dist/build/Common/FilePath.dyn_o )
29.50 s
> [ 2 of 10] Compiling Common.OsPath ( src/Common/OsPath.hs, dist/build/Common/OsPath.o, dist/build/Common/OsPath.dyn_o )
29.50 s
>
29.50 s
> src/Common/OsPath.hs:90:23: error : [ GHC-83865 ]
29.50 s
> • Couldn't match type ‘OSS.OsString’ with ‘OsString’
29.50 s
> Expected: OsPath
29.50 s
> Actual: OSS.OsString
29.50 s
> NB: ‘OsString’
29.50 s
> is defined in ‘System.OsString.Internal.Types.Hidden’
29.50 s
> in package ‘filepath-1.4.301.0’
29.50 s
> ‘OSS.OsString’
29.50 s
> is defined in ‘System.OsString.Internal.Types’
29.50 s
> in package ‘os-string-2.0.10’
29.50 s
> • In the ‘parent’ field of a record
29.50 s
> In the expression:
29.50 s
> Format
29.50 s
> {Format.root = O.pack . pure $ O.pathSeparator,
29.50 s
> Format.current = mempty, Format.parent = OSS.unsafeEncodeUtf "..",
29.50 s
> Format.separator = O.pack . pure $ O.pathSeparator,
29.50 s
> Format.substitutions = mempty}
29.50 s
> In an equation for ‘localFormat’:
29.50 s
> localFormat
29.50 s
> = Format
29.50 s
> {Format.root = O.pack . pure $ O.pathSeparator,
29.50 s
> Format.current = mempty, Format.parent = OSS.unsafeEncodeUtf "..",
29.50 s
> Format.separator = O.pack . pure $ O.pathSeparator,
29.50 s
> Format.substitutions = mempty}
29.50 s
> |
29.50 s
> 90 | Format.parent = OSS.unsafeEncodeUtf ".." ,
29.50 s
> | ^^^^^^^^^^^^^^^^^^^^^^^^
29.50 s
> [ 3 of 10] Compiling System.FilePath.Thin ( src/System/FilePath/Thin.hs, dist/build/System/FilePath/Thin.o, dist/build/System/FilePath/Thin.dyn_o )
29.50 s
> [ 4 of 10] Compiling System.FilePath.Pathway ( src/System/FilePath/Pathway.hs, dist/build/System/FilePath/Pathway.o, dist/build/System/FilePath/Pathway.dyn_o )
29.50 s
> [ 5 of 10] Compiling System.FilePath.Overlay ( src/System/FilePath/Overlay.hs, dist/build/System/FilePath/Overlay.o, dist/build/System/FilePath/Overlay.dyn_o )
29.50 s
> [ 6 of 10] Compiling System.FilePath ( src/System/FilePath.hs, dist/build/System/FilePath.o, dist/build/System/FilePath.dyn_o )
29.50 s
For full logs, run:
29.50 s
nix log /nix/store/isq7l83m10yyykzr1f202hq4n23f43p1-pathway-compat-filepath-0.0.1.0.drv
29.51 s
error: Cannot build '/nix/store/isq7l83m10yyykzr1f202hq4n23f43p1-pathway-compat-filepath-0.0.1.0.drv '.
29.51 s
Reason: builder failed with exit code 1 .
29.51 s
Output paths:
29.51 s
/nix/store/gsxpk94inw22circr76qnnbmvc6ziwhz-pathway-compat-filepath-0.0.1.0-doc
29.51 s
/nix/store/q9fsagpd29spy55dp5m0zri4is79nfz5-pathway-compat-filepath-0.0.1.0
29.51 s
Last 176 log lines:
29.51 s
> Running phase: setupCompilerEnvironmentPhase
29.51 s
> Build with /nix/store/2djpcnj8a25viv1y24h3mziy1gsy3fc6-ghc-9.6.7.
29.51 s
> Running phase: unpackPhase
29.51 s
> unpacking source archive /nix/store/5z4x7vzkb1m65ccyx19wn7vcxdl9gmbf-filepath
29.51 s
> source root is filepath
29.51 s
> Running phase: patchPhase
29.51 s
> Running phase: compileBuildDriverPhase
29.51 s
> setupCompileFlags: -package-db=/build/tmp.zKwaqPnUnM/setup-package.conf.d -threaded
29.51 s
> [1 of 2] Compiling Main ( Setup.hs, /build/tmp.zKwaqPnUnM/Main.o )
29.51 s
> [2 of 2] Linking Setup
29.51 s
> Running phase: updateAutotoolsGnuConfigScriptsPhase
29.51 s
> Running phase: configurePhase
29.51 s
> configureFlags: --verbose --prefix=/nix/store/q9fsagpd29spy55dp5m0zri4is79nfz5-pathway-compat-filepath-0.0.1.0 --libdir=$prefix/lib/$compiler/lib --libsubdir=$abi/$libname --docdir=/nix/store/gsxpk94inw22circr76qnnbmvc6ziwhz-pathway-compat-filepath-0.0.1.0-doc/share/doc/pathway-compat-filepath-0.0.1.0 --with-gcc=gcc --package-db=/build/tmp.zKwaqPnUnM/package.conf.d --ghc-option=-j16 --ghc-option=+RTS --ghc-option=-A64M --ghc-option=-RTS --enable-library-profiling --profiling-detail=exported-functions --disable-profiling --enable-shared --disable-coverage --enable-static --disable-executable-dynamic --enable-tests --disable-benchmarks --enable-library-vanilla --disable-library-for-ghci --enable-split-sections --enable-library-stripping --enable-executable-stripping --ghc-option=-haddock --ghc-options=-Werror --extra-lib-dirs=/nix/store/pndhkk0l649lm1sj0mxk7cbwq26qd1ra-ncurses-6.6/lib --extra-lib-dirs=/nix/store/0djlg4g0b81w94k3vcaqsxsc2hh4kism-libffi-3.5.2/lib --extra-lib-dirs=/nix/store/md4paia7riiggyrj8p24c7a6vf8w7jz8-elfutils-0.194/lib --extra-lib-dirs=/nix/store/39vv2pf64gd8li48a4hpbhw2crzd8z5p-gmp-with-cxx-6.3.0/lib --extra-lib-dirs=/nix/store/7wwvald8lapkrsr72qanlw8blyn55ifx-numactl-2.0.18/lib --extra-lib-dirs=/nix/store/2djpcnj8a25viv1y24h3mziy1gsy3fc6-ghc-9.6.7/lib
29.51 s
> Using Parsec parser
29.51 s
> Configuring pathway-compat-filepath-0.0.1.0...
29.51 s
> Flags chosen: noisy-deprecations=True, verify-no-recursion=False
29.51 s
> Dependency base >=4.14.0 && <4.15 || >=4.15.0 && <4.16 || >=4.16.0 && <4.17 ||
29.51 s
> >=4.17.0 && <4.18 || >=4.18.0 && <4.19 || >=4.19.0 && <4.20 || >=4.20.0 &&
29.51 s
> <4.21 || >=4.21.0 && <4.22 || >=4.22.0 && <4.23: using base-4.18.3.0
29.51 s
> Dependency extra: using extra-1.8.1
29.51 s
> Dependency filepath >=1.4.2 && <1.5 || >=1.5.0 && <1.6: using
29.51 s
> filepath-1.4.301.0
29.51 s
> Dependency megaparsec >=9.0.1 && <9.1 || >=9.2.1 && <9.3 || >=9.5.0 && <9.6 ||
29.51 s
> >=9.7.0 && <9.8: using megaparsec-9.7.0
29.51 s
> Dependency os-string: using os-string-2.0.10
29.51 s
> Dependency pathway >=0.0.1 && <0.1: using pathway-0.0.1.0
29.51 s
> Dependency pathway-compat-base >=0.0.1 && <0.1: using
29.51 s
> pathway-compat-base-0.0.1.0
29.51 s
> Dependency pathway-internal >=0.0.1 && <0.1: using pathway-internal-0.0.1.0
29.51 s
> Dependency base >=4.14.0 && <4.15 || >=4.15.0 && <4.16 || >=4.16.0 && <4.17 ||
29.51 s
> >=4.17.0 && <4.18 || >=4.18.0 && <4.19 || >=4.19.0 && <4.20 || >=4.20.0 &&
29.51 s
> <4.21 || >=4.21.0 && <4.22 || >=4.22.0 && <4.23: using base-4.18.3.0
29.51 s
> Dependency doctest >=0.16.3 && <0.17 || >=0.18.1 && <0.19 || >=0.20.1 && <0.21
29.51 s
> || >=0.21.1 && <0.22 || >=0.22.2 && <0.23 || >=0.24.2 && <0.25: using
29.51 s
> doctest-0.24.3
29.51 s
> Dependency pathway-compat-filepath: using pathway-compat-filepath-0.0.1.0
29.51 s
> Source component graph:
29.51 s
> component lib
29.51 s
> component test:doctests dependency lib
29.51 s
> Configured component graph:
29.51 s
> component pathway-compat-filepath-0.0.1.0-Ck51GFznMiC2cxIfBMz4NH
29.51 s
> include base-4.18.3.0
29.51 s
> include extra-1.8.1-FU1frm3XcM88A49dBkmtgI
29.51 s
> include filepath-1.4.301.0
29.51 s
> include megaparsec-9.7.0-EpAk7LLR2KBGAKafJPbXz1
29.51 s
> include os-string-2.0.10-19KGKnZaj8J2ODUMyNXxJr
29.51 s
> include pathway-0.0.1.0-5VJXWbvreBAfybP2NROr3
29.51 s
> include pathway-compat-base-0.0.1.0-E02izPYkwmmGdAPlQBKjbP
29.51 s
> include pathway-internal-0.0.1.0-1xeSc3z2VhRIotiMz9hdL1
29.51 s
> component pathway-compat-filepath-0.0.1.0-Bh4LT0cz7im2Vo1hGnl75g-doctests
29.51 s
> include base-4.18.3.0
29.51 s
> include doctest-0.24.3-ACQNy8u8jPjC50l4I3tyiL
29.51 s
> include pathway-compat-filepath-0.0.1.0-Ck51GFznMiC2cxIfBMz4NH
29.51 s
> Linked component graph:
29.51 s
> unit pathway-compat-filepath-0.0.1.0-Ck51GFznMiC2cxIfBMz4NH
29.51 s
> include base-4.18.3.0
29.51 s
> include extra-1.8.1-FU1frm3XcM88A49dBkmtgI
29.51 s
> include filepath-1.4.301.0
29.51 s
> include megaparsec-9.7.0-EpAk7LLR2KBGAKafJPbXz1
29.51 s
> include os-string-2.0.10-19KGKnZaj8J2ODUMyNXxJr
29.51 s
> include pathway-0.0.1.0-5VJXWbvreBAfybP2NROr3
29.51 s
> include pathway-compat-base-0.0.1.0-E02izPYkwmmGdAPlQBKjbP
29.51 s
> include pathway-internal-0.0.1.0-1xeSc3z2VhRIotiMz9hdL1
29.51 s
> Common.FilePath=pathway-compat-filepath-0.0.1.0-Ck51GFznMiC2cxIfBMz4NH:Common.FilePath,Common.OsPath=pathway-compat-filepath-0.0.1.0-Ck51GFznMiC2cxIfBMz4NH:Common.OsPath,System.FilePath=pathway-compat-filepath-0.0.1.0-Ck51GFznMiC2cxIfBMz4NH:System.FilePath,System.FilePath.Overlay=pathway-compat-filepath-0.0.1.0-Ck51GFznMiC2cxIfBMz4NH:System.FilePath.Overlay,System.FilePath.Pathway=pathway-compat-filepath-0.0.1.0-Ck51GFznMiC2cxIfBMz4NH:System.FilePath.Pathway,System.FilePath.Thin=pathway-compat-filepath-0.0.1.0-Ck51GFznMiC2cxIfBMz4NH:System.FilePath.Thin,System.OsPath=pathway-compat-filepath-0.0.1.0-Ck51GFznMiC2cxIfBMz4NH:System.OsPath,System.OsPath.Overlay=pathway-compat-filepath-0.0.1.0-Ck51GFznMiC2cxIfBMz4NH:System.OsPath.Overlay,System.OsPath.Pathway=pathway-compat-filepath-0.0.1.0-Ck51GFznMiC2cxIfBMz4NH:System.OsPath.Pathway,System.OsPath.Thin=pathway-compat-filepath-0.0.1.0-Ck51GFznMiC2cxIfBMz4NH:System.OsPath.Thin
29.51 s
> unit pathway-compat-filepath-0.0.1.0-Bh4LT0cz7im2Vo1hGnl75g-doctests
29.51 s
> include base-4.18.3.0
29.51 s
> include doctest-0.24.3-ACQNy8u8jPjC50l4I3tyiL
29.51 s
> include pathway-compat-filepath-0.0.1.0-Ck51GFznMiC2cxIfBMz4NH
29.51 s
> Ready component graph:
29.51 s
> definite pathway-compat-filepath-0.0.1.0-Ck51GFznMiC2cxIfBMz4NH
29.51 s
> depends base-4.18.3.0
29.51 s
> depends extra-1.8.1-FU1frm3XcM88A49dBkmtgI
29.51 s
> depends filepath-1.4.301.0
29.51 s
> depends megaparsec-9.7.0-EpAk7LLR2KBGAKafJPbXz1
29.51 s
> depends os-string-2.0.10-19KGKnZaj8J2ODUMyNXxJr
29.51 s
> depends pathway-0.0.1.0-5VJXWbvreBAfybP2NROr3
29.51 s
> depends pathway-compat-base-0.0.1.0-E02izPYkwmmGdAPlQBKjbP
29.51 s
> depends pathway-internal-0.0.1.0-1xeSc3z2VhRIotiMz9hdL1
29.51 s
> definite pathway-compat-filepath-0.0.1.0-Bh4LT0cz7im2Vo1hGnl75g-doctests
29.51 s
> depends base-4.18.3.0
29.51 s
> depends doctest-0.24.3-ACQNy8u8jPjC50l4I3tyiL
29.51 s
> depends pathway-compat-filepath-0.0.1.0-Ck51GFznMiC2cxIfBMz4NH
29.51 s
> Using Cabal-3.10.3.0 compiled by ghc-9.6
29.51 s
> Using compiler: ghc-9.6.7
29.51 s
> Using install prefix:
29.51 s
> /nix/store/q9fsagpd29spy55dp5m0zri4is79nfz5-pathway-compat-filepath-0.0.1.0
29.51 s
> Executables installed in:
29.51 s
> /nix/store/q9fsagpd29spy55dp5m0zri4is79nfz5-pathway-compat-filepath-0.0.1.0/bin
29.51 s
> Libraries installed in:
29.51 s
> /nix/store/q9fsagpd29spy55dp5m0zri4is79nfz5-pathway-compat-filepath-0.0.1.0/lib/ghc-9.6.7/lib/x86_64-linux-ghc-9.6.7/pathway-compat-filepath-0.0.1.0-Ck51GFznMiC2cxIfBMz4NH
29.51 s
> Dynamic Libraries installed in:
29.51 s
> /nix/store/q9fsagpd29spy55dp5m0zri4is79nfz5-pathway-compat-filepath-0.0.1.0/lib/ghc-9.6.7/lib/x86_64-linux-ghc-9.6.7
29.51 s
> Private executables installed in:
29.51 s
> /nix/store/q9fsagpd29spy55dp5m0zri4is79nfz5-pathway-compat-filepath-0.0.1.0/libexec/x86_64-linux-ghc-9.6.7/pathway-compat-filepath-0.0.1.0
29.51 s
> Data files installed in:
29.51 s
> /nix/store/q9fsagpd29spy55dp5m0zri4is79nfz5-pathway-compat-filepath-0.0.1.0/share/x86_64-linux-ghc-9.6.7/pathway-compat-filepath-0.0.1.0
29.51 s
> Documentation installed in:
29.51 s
> /nix/store/gsxpk94inw22circr76qnnbmvc6ziwhz-pathway-compat-filepath-0.0.1.0-doc/share/doc/pathway-compat-filepath-0.0.1.0
29.51 s
> Configuration files installed in:
29.51 s
> /nix/store/q9fsagpd29spy55dp5m0zri4is79nfz5-pathway-compat-filepath-0.0.1.0/etc
29.51 s
> No alex found
29.51 s
> Using ar found on system at:
29.51 s
> /nix/store/zjraf40s86y3iwhp626b934r5y6ldkbb-binutils-wrapper-2.46/bin/ar
29.51 s
> No c2hs found
29.51 s
> No cpphs found
29.51 s
> Using doctest version 0.24.3 found on system at:
29.51 s
> /nix/store/s48k56ayjjxwdbz9y7d8mnqwlcjfi1a8-doctest-0.24.3/bin/doctest
29.51 s
> Using gcc version 15.2.0 given by user at:
29.51 s
> /nix/store/29qjlshvklnyr67nhpprzgb9igmsfsjj-gcc-wrapper-15.2.0/bin/gcc
29.51 s
> Using ghc version 9.6.7 found on system at:
29.51 s
> /nix/store/2djpcnj8a25viv1y24h3mziy1gsy3fc6-ghc-9.6.7/bin/ghc
29.51 s
> Using ghc-pkg version 9.6.7 found on system at:
29.51 s
> /nix/store/2djpcnj8a25viv1y24h3mziy1gsy3fc6-ghc-9.6.7/bin/ghc-pkg-9.6.7
29.51 s
> No ghcjs found
29.51 s
> No ghcjs-pkg found
29.51 s
> No greencard found
29.51 s
> Using haddock version 2.29.2 found on system at:
29.51 s
> /nix/store/2djpcnj8a25viv1y24h3mziy1gsy3fc6-ghc-9.6.7/bin/haddock-ghc-9.6.7
29.51 s
> No happy found
29.51 s
> Using haskell-suite found on system at: haskell-suite-dummy-location
29.51 s
> Using haskell-suite-pkg found on system at: haskell-suite-pkg-dummy-location
29.51 s
> No hmake found
29.51 s
> Using hpc version 0.68 found on system at:
29.51 s
> /nix/store/2djpcnj8a25viv1y24h3mziy1gsy3fc6-ghc-9.6.7/bin/hpc-ghc-9.6.7
29.51 s
> Using hsc2hs version 0.68.9 found on system at:
29.51 s
> /nix/store/2djpcnj8a25viv1y24h3mziy1gsy3fc6-ghc-9.6.7/bin/hsc2hs-ghc-9.6.7
29.51 s
> Using hscolour version 1.25 found on system at:
29.51 s
> /nix/store/2x19jxh5g98bv0s06mdj71c1hmxi54yl-hscolour-1.25/bin/HsColour
29.51 s
> No jhc found
29.51 s
> Using ld found on system at:
29.51 s
> /nix/store/zjraf40s86y3iwhp626b934r5y6ldkbb-binutils-wrapper-2.46/bin/ld.gold
29.51 s
> No pkg-config found
29.51 s
> Using runghc version 9.6.7 found on system at:
29.51 s
> /nix/store/2djpcnj8a25viv1y24h3mziy1gsy3fc6-ghc-9.6.7/bin/runghc-9.6.7
29.51 s
> Using strip version 2.46 found on system at:
29.51 s
> /nix/store/29qjlshvklnyr67nhpprzgb9igmsfsjj-gcc-wrapper-15.2.0/bin/strip
29.51 s
> Using tar found on system at:
29.51 s
> /nix/store/z5mq2sam4484prf3kv6v6vjw1m0i7j24-gnutar-1.35/bin/tar
29.51 s
> No uhc found
29.51 s
> Running phase: buildPhase
29.51 s
> Preprocessing library for pathway-compat-filepath-0.0.1.0..
29.51 s
> Building library for pathway-compat-filepath-0.0.1.0..
29.51 s
> [ 1 of 10] Compiling Common.FilePath ( src/Common/FilePath.hs, dist/build/Common/FilePath.o, dist/build/Common/FilePath.dyn_o )
29.51 s
> [ 2 of 10] Compiling Common.OsPath ( src/Common/OsPath.hs, dist/build/Common/OsPath.o, dist/build/Common/OsPath.dyn_o )
29.51 s
>
29.51 s
> src/Common/OsPath.hs:90:23: error : [ GHC-83865 ]
29.51 s
> • Couldn't match type ‘OSS.OsString’ with ‘OsString’
29.51 s
> Expected: OsPath
29.51 s
> Actual: OSS.OsString
29.51 s
> NB: ‘OsString’
29.51 s
> is defined in ‘System.OsString.Internal.Types.Hidden’
29.51 s
> in package ‘filepath-1.4.301.0’
29.51 s
> ‘OSS.OsString’
29.51 s
> is defined in ‘System.OsString.Internal.Types’
29.51 s
> in package ‘os-string-2.0.10’
29.51 s
> • In the ‘parent’ field of a record
29.51 s
> In the expression:
29.51 s
> Format
29.51 s
> {Format.root = O.pack . pure $ O.pathSeparator,
29.51 s
> Format.current = mempty, Format.parent = OSS.unsafeEncodeUtf "..",
29.51 s
> Format.separator = O.pack . pure $ O.pathSeparator,
29.51 s
> Format.substitutions = mempty}
29.51 s
> In an equation for ‘localFormat’:
29.51 s
> localFormat
29.51 s
> = Format
29.51 s
> {Format.root = O.pack . pure $ O.pathSeparator,
29.51 s
> Format.current = mempty, Format.parent = OSS.unsafeEncodeUtf "..",
29.51 s
> Format.separator = O.pack . pure $ O.pathSeparator,
29.51 s
> Format.substitutions = mempty}
29.51 s
> |
29.51 s
> 90 | Format.parent = OSS.unsafeEncodeUtf ".." ,
29.51 s
> | ^^^^^^^^^^^^^^^^^^^^^^^^
29.51 s
> [ 3 of 10] Compiling System.FilePath.Thin ( src/System/FilePath/Thin.hs, dist/build/System/FilePath/Thin.o, dist/build/System/FilePath/Thin.dyn_o )
29.51 s
> [ 4 of 10] Compiling System.FilePath.Pathway ( src/System/FilePath/Pathway.hs, dist/build/System/FilePath/Pathway.o, dist/build/System/FilePath/Pathway.dyn_o )
29.51 s
> [ 5 of 10] Compiling System.FilePath.Overlay ( src/System/FilePath/Overlay.hs, dist/build/System/FilePath/Overlay.o, dist/build/System/FilePath/Overlay.dyn_o )
29.51 s
> [ 6 of 10] Compiling System.FilePath ( src/System/FilePath.hs, dist/build/System/FilePath.o, dist/build/System/FilePath.dyn_o )
29.51 s
For full logs, run:
29.51 s
nix log /nix/store/isq7l83m10yyykzr1f202hq4n23f43p1-pathway-compat-filepath-0.0.1.0.drv
29.51 s
error: Cannot build '/nix/store/bpr5w918izm9vxfkr6byadi3arwwsngk-ghc-9.6.7-with-packages.drv '.
29.51 s
Reason: 1 dependency failed .
29.51 s
Output paths:
29.51 s
/nix/store/w0xzk7grmg774djh9flicwfrp1k3bqw4-ghc-9.6.7-with-packages
29.51 s
error: Cannot build '/nix/store/6rvvbn4nsny64yndixwsr5kbnngamlpz-pathway-compat-directory-0.0.1.0.drv '.
29.51 s
Reason: 1 dependency failed .
29.51 s
Output paths:
29.51 s
/nix/store/fb8c9y8a3n35pz051dniy1chxnyamqsk-pathway-compat-directory-0.0.1.0-doc
29.51 s
/nix/store/m2hlbb7cw4m4wi41qg3wcapwhx8pidj3-pathway-compat-directory-0.0.1.0
29.51 s
error: Cannot build '/nix/store/gzfiby42jyphwpxkjd7q4akfcghrj0pq-pathway-compat-file-io-0.0.1.0.drv '.
29.51 s
Reason: 1 dependency failed .
29.51 s
Output paths:
29.51 s
/nix/store/4vxfzhpir4i8m0ns8m7zr6hma6fai8jc-pathway-compat-file-io-0.0.1.0-doc
29.51 s
/nix/store/iwrmym67qgm3xvlj71qlk0lf37fql3yh-pathway-compat-file-io-0.0.1.0
29.51 s
error: Cannot build '/nix/store/8ri2qmf4w6jfifamb1yb1fsb2nrjp773-pathway-compat-temporary-0.0.1.0.drv '.
29.51 s
Reason: 1 dependency failed .
29.51 s
Output paths:
29.51 s
/nix/store/1sa868r5wz084s1vx73w56xi3rh9af9d-pathway-compat-temporary-0.0.1.0
29.51 s
/nix/store/6fwn0wzs278issqpwgkkjaz9c13vw0hc-pathway-compat-temporary-0.0.1.0-doc
29.51 s
error: Cannot build '/nix/store/2w8dn50862rrwygm03k5j7l8warsd57k-pathway-system-0.0.1.0.drv '.
29.51 s
Reason: 1 dependency failed .
29.51 s
Output paths:
29.51 s
/nix/store/ps3kvxiwcm8qn4rmpnh09r10gbnn9hx1-pathway-system-0.0.1.0
29.51 s
/nix/store/q4lgkkr11sghd0k9zfay2syagb0mx8zr-pathway-system-0.0.1.0-doc
29.51 s
error: Build failed due to failed dependency
29.51 s
error: Cannot build '/nix/store/xpxxy1s8m69yjxsbmqgcpfwkzvc6c7cm-all-packages.drv '.
29.51 s
Reason: 1 dependency failed .
29.51 s
Output paths:
29.51 s
/nix/store/hdwsgcxhxv674mjsai1ydk6pm1lm4vpq-all-packages
29.51 s
Build failed due to failed dependency
29.54 s
Build failed.