1. 0.62 s $ /nix/store/9ypz3flqsrl5xl495mm8h645gadjsxi1-coreutils-9.11/bin/timeout --kill-after=15s 7200s /nix/store/23zk8sgzamrbmj1fday15szf7f2279s8-nix-2.34.7/bin/nix --extra-experimental-features nix-command --extra-experimental-features flakes --log-format internal-json build --no-link --print-out-paths git+https://github.com/sellout/pathway?ref=more-system&rev=1ea193cbc6593071794981ca0dcd055e8eb42609&shallow=1#packages.x86_64-linux.ghc967_all --print-build-logs
  2. 0.63 s warning: ignoring untrusted flake configuration setting 'allow-import-from-derivation'.
  3. 0.63 s Pass '--accept-flake-config' to trust it
  4. 0.63 s warning: ignoring untrusted flake configuration setting 'extra-experimental-features'.
  5. 0.63 s Pass '--accept-flake-config' to trust it
  6. 0.63 s warning: ignoring untrusted flake configuration setting 'extra-substituters'.
  7. 0.63 s Pass '--accept-flake-config' to trust it
  8. 0.63 s warning: ignoring untrusted flake configuration setting 'extra-trusted-public-keys'.
  9. 0.63 s Pass '--accept-flake-config' to trust it
  10. 0.63 s warning: ignoring untrusted flake configuration setting 'sandbox'.
  11. 0.63 s Pass '--accept-flake-config' to trust it
  12. 0.63 s warning: ignoring untrusted flake configuration setting 'use-registries'.
  13. 0.63 s Pass '--accept-flake-config' to trust it
  14. 0.63 s error (ignored): SQLite database '/var/cache/nix-ci-worker/eval-cache-v6/7e8cef9f9a584f12750e4112f9919eb203f4dd515b08e08f130fffcf31865d0a.sqlite' is busy
  15. 1.55 s
  16. 2.07 s Building /nix/store/isq7l83m10yyykzr1f202hq4n23f43p1-pathway-compat-filepath-0.0.1.0.drv
  17. 2.28 s [pathway-compat-filepath] Phase: setupCompilerEnvironmentPhase
  18. 2.28 s [pathway-compat-filepath] Build with /nix/store/2djpcnj8a25viv1y24h3mziy1gsy3fc6-ghc-9.6.7.
  19. 2.62 s [pathway-compat-filepath] Phase: unpackPhase
  20. 2.63 s [pathway-compat-filepath] unpacking source archive /nix/store/5z4x7vzkb1m65ccyx19wn7vcxdl9gmbf-filepath
  21. 2.64 s [pathway-compat-filepath] source root is filepath
  22. 2.65 s [pathway-compat-filepath] Phase: patchPhase
  23. 2.66 s [pathway-compat-filepath] Phase: compileBuildDriverPhase
  24. 2.67 s [pathway-compat-filepath] setupCompileFlags: -package-db=/build/tmp.ypuQ74KOZe/setup-package.conf.d -threaded
  25. 2.72 s [pathway-compat-filepath] [1 of 2] Compiling Main ( Setup.hs, /build/tmp.ypuQ74KOZe/Main.o )
  26. 2.77 s [pathway-compat-filepath] [2 of 2] Linking Setup
  27. 4.05 s [pathway-compat-filepath] Phase: updateAutotoolsGnuConfigScriptsPhase
  28. 4.07 s [pathway-compat-filepath] Phase: configurePhase
  29. 4.07 s [pathway-compat-filepath] configureFlags: --verbose --prefix=/nix/store/q9fsagpd29spy55dp5m0zri4is79nfz5-pathway-compat-filepath-0.0.1.0 --libdir=$prefix/lib/$compiler/lib --libsubdir=$abi/$libname --docdir=/nix/store/gsxpk94inw22circr76qnnbmvc6ziwhz-pathway-compat-filepath-0.0.1.0-doc/share/doc/pathway-compat-filepath-0.0.1.0 --with-gcc=gcc --package-db=/build/tmp.ypuQ74KOZe/package.conf.d --ghc-option=-j16 --ghc-option=+RTS --ghc-option=-A64M --ghc-option=-RTS --enable-library-profiling --profiling-detail=exported-functions --disable-profiling --enable-shared --disable-coverage --enable-static --disable-executable-dynamic --enable-tests --disable-benchmarks --enable-library-vanilla --disable-library-for-ghci --enable-split-sections --enable-library-stripping --enable-executable-stripping --ghc-option=-haddock --ghc-options=-Werror --extra-lib-dirs=/nix/store/pndhkk0l649lm1sj0mxk7cbwq26qd1ra-ncurses-6.6/lib --extra-lib-dirs=/nix/store/0djlg4g0b81w94k3vcaqsxsc2hh4kism-libffi-3.5.2/lib --extra-lib-dirs=/nix/store/md4paia7riiggyrj8p24c7a6vf8w7jz8-elfutils-0.194/lib --extra-lib-dirs=/nix/store/39vv2pf64gd8li48a4hpbhw2crzd8z5p-gmp-with-cxx-6.3.0/lib --extra-lib-dirs=/nix/store/7wwvald8lapkrsr72qanlw8blyn55ifx-numactl-2.0.18/lib --extra-lib-dirs=/nix/store/2djpcnj8a25viv1y24h3mziy1gsy3fc6-ghc-9.6.7/lib
  30. 4.08 s [pathway-compat-filepath] Using Parsec parser
  31. 4.08 s [pathway-compat-filepath] Configuring pathway-compat-filepath-0.0.1.0...
  32. 4.48 s [pathway-compat-filepath] Flags chosen: noisy-deprecations=True, verify-no-recursion=False
  33. 4.48 s [pathway-compat-filepath] Dependency base >=4.14.0 && <4.15 || >=4.15.0 && <4.16 || >=4.16.0 && <4.17 ||
  34. 4.48 s [pathway-compat-filepath] >=4.17.0 && <4.18 || >=4.18.0 && <4.19 || >=4.19.0 && <4.20 || >=4.20.0 &&
  35. 4.48 s [pathway-compat-filepath] <4.21 || >=4.21.0 && <4.22 || >=4.22.0 && <4.23: using base-4.18.3.0
  36. 4.48 s [pathway-compat-filepath] Dependency extra: using extra-1.8.1
  37. 4.48 s [pathway-compat-filepath] Dependency filepath >=1.4.2 && <1.5 || >=1.5.0 && <1.6: using
  38. 4.48 s [pathway-compat-filepath] filepath-1.4.301.0
  39. 4.48 s [pathway-compat-filepath] Dependency megaparsec >=9.0.1 && <9.1 || >=9.2.1 && <9.3 || >=9.5.0 && <9.6 ||
  40. 4.48 s [pathway-compat-filepath] >=9.7.0 && <9.8: using megaparsec-9.7.0
  41. 4.48 s [pathway-compat-filepath] Dependency os-string: using os-string-2.0.10
  42. 4.49 s [pathway-compat-filepath] Dependency pathway >=0.0.1 && <0.1: using pathway-0.0.1.0
  43. 4.49 s [pathway-compat-filepath] Dependency pathway-compat-base >=0.0.1 && <0.1: using
  44. 4.49 s [pathway-compat-filepath] pathway-compat-base-0.0.1.0
  45. 4.49 s [pathway-compat-filepath] Dependency pathway-internal >=0.0.1 && <0.1: using pathway-internal-0.0.1.0
  46. 4.49 s [pathway-compat-filepath] Dependency base >=4.14.0 && <4.15 || >=4.15.0 && <4.16 || >=4.16.0 && <4.17 ||
  47. 4.49 s [pathway-compat-filepath] >=4.17.0 && <4.18 || >=4.18.0 && <4.19 || >=4.19.0 && <4.20 || >=4.20.0 &&
  48. 4.49 s [pathway-compat-filepath] <4.21 || >=4.21.0 && <4.22 || >=4.22.0 && <4.23: using base-4.18.3.0
  49. 4.49 s [pathway-compat-filepath] Dependency doctest >=0.16.3 && <0.17 || >=0.18.1 && <0.19 || >=0.20.1 && <0.21
  50. 4.49 s [pathway-compat-filepath] || >=0.21.1 && <0.22 || >=0.22.2 && <0.23 || >=0.24.2 && <0.25: using
  51. 4.49 s [pathway-compat-filepath] doctest-0.24.3
  52. 4.49 s [pathway-compat-filepath] Dependency pathway-compat-filepath: using pathway-compat-filepath-0.0.1.0
  53. 4.90 s [pathway-compat-filepath] Source component graph:
  54. 4.90 s [pathway-compat-filepath] component lib
  55. 4.90 s [pathway-compat-filepath] component test:doctests dependency lib
  56. 4.90 s [pathway-compat-filepath] Configured component graph:
  57. 4.90 s [pathway-compat-filepath] component pathway-compat-filepath-0.0.1.0-Ck51GFznMiC2cxIfBMz4NH
  58. 4.90 s [pathway-compat-filepath] include base-4.18.3.0
  59. 4.90 s [pathway-compat-filepath] include extra-1.8.1-FU1frm3XcM88A49dBkmtgI
  60. 4.90 s [pathway-compat-filepath] include filepath-1.4.301.0
  61. 4.90 s [pathway-compat-filepath] include megaparsec-9.7.0-EpAk7LLR2KBGAKafJPbXz1
  62. 4.90 s [pathway-compat-filepath] include os-string-2.0.10-19KGKnZaj8J2ODUMyNXxJr
  63. 4.90 s [pathway-compat-filepath] include pathway-0.0.1.0-5VJXWbvreBAfybP2NROr3
  64. 4.90 s [pathway-compat-filepath] include pathway-compat-base-0.0.1.0-E02izPYkwmmGdAPlQBKjbP
  65. 4.90 s [pathway-compat-filepath] include pathway-internal-0.0.1.0-1xeSc3z2VhRIotiMz9hdL1
  66. 4.90 s [pathway-compat-filepath] component pathway-compat-filepath-0.0.1.0-Bh4LT0cz7im2Vo1hGnl75g-doctests
  67. 4.90 s [pathway-compat-filepath] include base-4.18.3.0
  68. 4.90 s [pathway-compat-filepath] include doctest-0.24.3-ACQNy8u8jPjC50l4I3tyiL
  69. 4.90 s [pathway-compat-filepath] include pathway-compat-filepath-0.0.1.0-Ck51GFznMiC2cxIfBMz4NH
  70. 4.90 s [pathway-compat-filepath] Linked component graph:
  71. 4.90 s [pathway-compat-filepath] unit pathway-compat-filepath-0.0.1.0-Ck51GFznMiC2cxIfBMz4NH
  72. 4.90 s [pathway-compat-filepath] include base-4.18.3.0
  73. 4.90 s [pathway-compat-filepath] include extra-1.8.1-FU1frm3XcM88A49dBkmtgI
  74. 4.90 s [pathway-compat-filepath] include filepath-1.4.301.0
  75. 4.90 s [pathway-compat-filepath] include megaparsec-9.7.0-EpAk7LLR2KBGAKafJPbXz1
  76. 4.90 s [pathway-compat-filepath] include os-string-2.0.10-19KGKnZaj8J2ODUMyNXxJr
  77. 4.90 s [pathway-compat-filepath] include pathway-0.0.1.0-5VJXWbvreBAfybP2NROr3
  78. 4.90 s [pathway-compat-filepath] include pathway-compat-base-0.0.1.0-E02izPYkwmmGdAPlQBKjbP
  79. 4.90 s [pathway-compat-filepath] include pathway-internal-0.0.1.0-1xeSc3z2VhRIotiMz9hdL1
  80. 4.90 s [pathway-compat-filepath] Common.FilePath=pathway-compat-filepath-0.0.1.0-Ck51GFznMiC2cxIfBMz4NH:Common.FilePath,Common.OsPath=pathway-compat-filepath-0.0.1.0-Ck51GFznMiC2cxIfBMz4NH:Common.OsPath,System.FilePath=pathway-compat-filepath-0.0.1.0-Ck51GFznMiC2cxIfBMz4NH:System.FilePath,System.FilePath.Overlay=pathway-compat-filepath-0.0.1.0-Ck51GFznMiC2cxIfBMz4NH:System.FilePath.Overlay,System.FilePath.Pathway=pathway-compat-filepath-0.0.1.0-Ck51GFznMiC2cxIfBMz4NH:System.FilePath.Pathway,System.FilePath.Thin=pathway-compat-filepath-0.0.1.0-Ck51GFznMiC2cxIfBMz4NH:System.FilePath.Thin,System.OsPath=pathway-compat-filepath-0.0.1.0-Ck51GFznMiC2cxIfBMz4NH:System.OsPath,System.OsPath.Overlay=pathway-compat-filepath-0.0.1.0-Ck51GFznMiC2cxIfBMz4NH:System.OsPath.Overlay,System.OsPath.Pathway=pathway-compat-filepath-0.0.1.0-Ck51GFznMiC2cxIfBMz4NH:System.OsPath.Pathway,System.OsPath.Thin=pathway-compat-filepath-0.0.1.0-Ck51GFznMiC2cxIfBMz4NH:System.OsPath.Thin
  81. 4.90 s [pathway-compat-filepath] unit pathway-compat-filepath-0.0.1.0-Bh4LT0cz7im2Vo1hGnl75g-doctests
  82. 4.90 s [pathway-compat-filepath] include base-4.18.3.0
  83. 4.90 s [pathway-compat-filepath] include doctest-0.24.3-ACQNy8u8jPjC50l4I3tyiL
  84. 4.90 s [pathway-compat-filepath] include pathway-compat-filepath-0.0.1.0-Ck51GFznMiC2cxIfBMz4NH
  85. 4.90 s [pathway-compat-filepath] Ready component graph:
  86. 4.90 s [pathway-compat-filepath] definite pathway-compat-filepath-0.0.1.0-Ck51GFznMiC2cxIfBMz4NH
  87. 4.90 s [pathway-compat-filepath] depends base-4.18.3.0
  88. 4.90 s [pathway-compat-filepath] depends extra-1.8.1-FU1frm3XcM88A49dBkmtgI
  89. 4.90 s [pathway-compat-filepath] depends filepath-1.4.301.0
  90. 4.90 s [pathway-compat-filepath] depends megaparsec-9.7.0-EpAk7LLR2KBGAKafJPbXz1
  91. 4.90 s [pathway-compat-filepath] depends os-string-2.0.10-19KGKnZaj8J2ODUMyNXxJr
  92. 4.90 s [pathway-compat-filepath] depends pathway-0.0.1.0-5VJXWbvreBAfybP2NROr3
  93. 4.90 s [pathway-compat-filepath] depends pathway-compat-base-0.0.1.0-E02izPYkwmmGdAPlQBKjbP
  94. 4.90 s [pathway-compat-filepath] depends pathway-internal-0.0.1.0-1xeSc3z2VhRIotiMz9hdL1
  95. 4.90 s [pathway-compat-filepath] definite pathway-compat-filepath-0.0.1.0-Bh4LT0cz7im2Vo1hGnl75g-doctests
  96. 4.90 s [pathway-compat-filepath] depends base-4.18.3.0
  97. 4.90 s [pathway-compat-filepath] depends doctest-0.24.3-ACQNy8u8jPjC50l4I3tyiL
  98. 4.90 s [pathway-compat-filepath] depends pathway-compat-filepath-0.0.1.0-Ck51GFznMiC2cxIfBMz4NH
  99. 4.90 s [pathway-compat-filepath] Using Cabal-3.10.3.0 compiled by ghc-9.6
  100. 4.90 s [pathway-compat-filepath] Using compiler: ghc-9.6.7
  101. 4.90 s [pathway-compat-filepath] Using install prefix:
  102. 4.90 s [pathway-compat-filepath] /nix/store/q9fsagpd29spy55dp5m0zri4is79nfz5-pathway-compat-filepath-0.0.1.0
  103. 4.90 s [pathway-compat-filepath] Executables installed in:
  104. 4.90 s [pathway-compat-filepath] /nix/store/q9fsagpd29spy55dp5m0zri4is79nfz5-pathway-compat-filepath-0.0.1.0/bin
  105. 4.90 s [pathway-compat-filepath] Libraries installed in:
  106. 4.90 s [pathway-compat-filepath] /nix/store/q9fsagpd29spy55dp5m0zri4is79nfz5-pathway-compat-filepath-0.0.1.0/lib/ghc-9.6.7/lib/x86_64-linux-ghc-9.6.7/pathway-compat-filepath-0.0.1.0-Ck51GFznMiC2cxIfBMz4NH
  107. 4.90 s [pathway-compat-filepath] Dynamic Libraries installed in:
  108. 4.90 s [pathway-compat-filepath] /nix/store/q9fsagpd29spy55dp5m0zri4is79nfz5-pathway-compat-filepath-0.0.1.0/lib/ghc-9.6.7/lib/x86_64-linux-ghc-9.6.7
  109. 4.90 s [pathway-compat-filepath] Private executables installed in:
  110. 4.90 s [pathway-compat-filepath] /nix/store/q9fsagpd29spy55dp5m0zri4is79nfz5-pathway-compat-filepath-0.0.1.0/libexec/x86_64-linux-ghc-9.6.7/pathway-compat-filepath-0.0.1.0
  111. 4.90 s [pathway-compat-filepath] Data files installed in:
  112. 4.90 s [pathway-compat-filepath] /nix/store/q9fsagpd29spy55dp5m0zri4is79nfz5-pathway-compat-filepath-0.0.1.0/share/x86_64-linux-ghc-9.6.7/pathway-compat-filepath-0.0.1.0
  113. 4.90 s [pathway-compat-filepath] Documentation installed in:
  114. 4.90 s [pathway-compat-filepath] /nix/store/gsxpk94inw22circr76qnnbmvc6ziwhz-pathway-compat-filepath-0.0.1.0-doc/share/doc/pathway-compat-filepath-0.0.1.0
  115. 4.90 s [pathway-compat-filepath] Configuration files installed in:
  116. 4.90 s [pathway-compat-filepath] /nix/store/q9fsagpd29spy55dp5m0zri4is79nfz5-pathway-compat-filepath-0.0.1.0/etc
  117. 4.90 s [pathway-compat-filepath] No alex found
  118. 4.90 s [pathway-compat-filepath] Using ar found on system at:
  119. 4.90 s [pathway-compat-filepath] /nix/store/zjraf40s86y3iwhp626b934r5y6ldkbb-binutils-wrapper-2.46/bin/ar
  120. 4.90 s [pathway-compat-filepath] No c2hs found
  121. 4.90 s [pathway-compat-filepath] No cpphs found
  122. 4.90 s [pathway-compat-filepath] Using doctest version 0.24.3 found on system at:
  123. 4.90 s [pathway-compat-filepath] /nix/store/s48k56ayjjxwdbz9y7d8mnqwlcjfi1a8-doctest-0.24.3/bin/doctest
  124. 4.90 s [pathway-compat-filepath] Using gcc version 15.2.0 given by user at:
  125. 4.90 s [pathway-compat-filepath] /nix/store/29qjlshvklnyr67nhpprzgb9igmsfsjj-gcc-wrapper-15.2.0/bin/gcc
  126. 4.90 s [pathway-compat-filepath] Using ghc version 9.6.7 found on system at:
  127. 4.90 s [pathway-compat-filepath] /nix/store/2djpcnj8a25viv1y24h3mziy1gsy3fc6-ghc-9.6.7/bin/ghc
  128. 4.90 s [pathway-compat-filepath] Using ghc-pkg version 9.6.7 found on system at:
  129. 4.90 s [pathway-compat-filepath] /nix/store/2djpcnj8a25viv1y24h3mziy1gsy3fc6-ghc-9.6.7/bin/ghc-pkg-9.6.7
  130. 4.90 s [pathway-compat-filepath] No ghcjs found
  131. 4.90 s [pathway-compat-filepath] No ghcjs-pkg found
  132. 4.90 s [pathway-compat-filepath] No greencard found
  133. 4.90 s [pathway-compat-filepath] Using haddock version 2.29.2 found on system at:
  134. 4.90 s [pathway-compat-filepath] /nix/store/2djpcnj8a25viv1y24h3mziy1gsy3fc6-ghc-9.6.7/bin/haddock-ghc-9.6.7
  135. 4.90 s [pathway-compat-filepath] No happy found
  136. 4.90 s [pathway-compat-filepath] Using haskell-suite found on system at: haskell-suite-dummy-location
  137. 4.90 s [pathway-compat-filepath] Using haskell-suite-pkg found on system at: haskell-suite-pkg-dummy-location
  138. 4.90 s [pathway-compat-filepath] No hmake found
  139. 4.90 s [pathway-compat-filepath] Using hpc version 0.68 found on system at:
  140. 4.90 s [pathway-compat-filepath] /nix/store/2djpcnj8a25viv1y24h3mziy1gsy3fc6-ghc-9.6.7/bin/hpc-ghc-9.6.7
  141. 4.90 s [pathway-compat-filepath] Using hsc2hs version 0.68.9 found on system at:
  142. 4.90 s [pathway-compat-filepath] /nix/store/2djpcnj8a25viv1y24h3mziy1gsy3fc6-ghc-9.6.7/bin/hsc2hs-ghc-9.6.7
  143. 4.90 s [pathway-compat-filepath] Using hscolour version 1.25 found on system at:
  144. 4.90 s [pathway-compat-filepath] /nix/store/2x19jxh5g98bv0s06mdj71c1hmxi54yl-hscolour-1.25/bin/HsColour
  145. 4.90 s [pathway-compat-filepath] No jhc found
  146. 4.90 s [pathway-compat-filepath] Using ld found on system at:
  147. 4.90 s [pathway-compat-filepath] /nix/store/zjraf40s86y3iwhp626b934r5y6ldkbb-binutils-wrapper-2.46/bin/ld.gold
  148. 4.90 s [pathway-compat-filepath] No pkg-config found
  149. 4.90 s [pathway-compat-filepath] Using runghc version 9.6.7 found on system at:
  150. 4.90 s [pathway-compat-filepath] /nix/store/2djpcnj8a25viv1y24h3mziy1gsy3fc6-ghc-9.6.7/bin/runghc-9.6.7
  151. 4.90 s [pathway-compat-filepath] Using strip version 2.46 found on system at:
  152. 4.90 s [pathway-compat-filepath] /nix/store/29qjlshvklnyr67nhpprzgb9igmsfsjj-gcc-wrapper-15.2.0/bin/strip
  153. 4.90 s [pathway-compat-filepath] Using tar found on system at:
  154. 4.90 s [pathway-compat-filepath] /nix/store/z5mq2sam4484prf3kv6v6vjw1m0i7j24-gnutar-1.35/bin/tar
  155. 4.90 s [pathway-compat-filepath] No uhc found
  156. 5.34 s [pathway-compat-filepath] Phase: buildPhase
  157. 5.42 s [pathway-compat-filepath] Preprocessing library for pathway-compat-filepath-0.0.1.0..
  158. 5.43 s [pathway-compat-filepath] Building library for pathway-compat-filepath-0.0.1.0..
  159. 5.51 s [pathway-compat-filepath] [ 1 of 10] Compiling Common.FilePath ( src/Common/FilePath.hs, dist/build/Common/FilePath.o, dist/build/Common/FilePath.dyn_o )
  160. 5.80 s [pathway-compat-filepath] [ 2 of 10] Compiling Common.OsPath ( src/Common/OsPath.hs, dist/build/Common/OsPath.o, dist/build/Common/OsPath.dyn_o )
  161. 8.13 s [pathway-compat-filepath]
  162. 8.13 s [pathway-compat-filepath] src/Common/OsPath.hs:90:23: error: [GHC-83865]
  163. 8.13 s [pathway-compat-filepath] • Couldn't match type ‘OSS.OsString’ with ‘OsString’
  164. 8.13 s [pathway-compat-filepath] Expected: OsPath
  165. 8.13 s [pathway-compat-filepath] Actual: OSS.OsString
  166. 8.13 s [pathway-compat-filepath] NB: ‘OsString’
  167. 8.13 s [pathway-compat-filepath] is defined in ‘System.OsString.Internal.Types.Hidden’
  168. 8.13 s [pathway-compat-filepath] in package ‘filepath-1.4.301.0’
  169. 8.13 s [pathway-compat-filepath] ‘OSS.OsString’
  170. 8.13 s [pathway-compat-filepath] is defined in ‘System.OsString.Internal.Types’
  171. 8.13 s [pathway-compat-filepath] in package ‘os-string-2.0.10’
  172. 8.13 s [pathway-compat-filepath] • In the ‘parent’ field of a record
  173. 8.13 s [pathway-compat-filepath] In the expression:
  174. 8.13 s [pathway-compat-filepath] Format
  175. 8.13 s [pathway-compat-filepath] {Format.root = O.pack . pure $ O.pathSeparator,
  176. 8.13 s [pathway-compat-filepath] Format.current = mempty, Format.parent = OSS.unsafeEncodeUtf "..",
  177. 8.13 s [pathway-compat-filepath] Format.separator = O.pack . pure $ O.pathSeparator,
  178. 8.13 s [pathway-compat-filepath] Format.substitutions = mempty}
  179. 8.13 s [pathway-compat-filepath] In an equation for ‘localFormat’:
  180. 8.13 s [pathway-compat-filepath] localFormat
  181. 8.13 s [pathway-compat-filepath] = Format
  182. 8.13 s [pathway-compat-filepath] {Format.root = O.pack . pure $ O.pathSeparator,
  183. 8.13 s [pathway-compat-filepath] Format.current = mempty, Format.parent = OSS.unsafeEncodeUtf "..",
  184. 8.13 s [pathway-compat-filepath] Format.separator = O.pack . pure $ O.pathSeparator,
  185. 8.13 s [pathway-compat-filepath] Format.substitutions = mempty}
  186. 8.13 s [pathway-compat-filepath] |
  187. 8.13 s [pathway-compat-filepath] 90 | Format.parent = OSS.unsafeEncodeUtf "..",
  188. 8.13 s [pathway-compat-filepath] | ^^^^^^^^^^^^^^^^^^^^^^^^
  189. 8.13 s [pathway-compat-filepath] [ 3 of 10] Compiling System.FilePath.Thin ( src/System/FilePath/Thin.hs, dist/build/System/FilePath/Thin.o, dist/build/System/FilePath/Thin.dyn_o )
  190. 8.13 s [pathway-compat-filepath] [ 4 of 10] Compiling System.FilePath.Pathway ( src/System/FilePath/Pathway.hs, dist/build/System/FilePath/Pathway.o, dist/build/System/FilePath/Pathway.dyn_o )
  191. 8.13 s [pathway-compat-filepath] [ 5 of 10] Compiling System.FilePath.Overlay ( src/System/FilePath/Overlay.hs, dist/build/System/FilePath/Overlay.o, dist/build/System/FilePath/Overlay.dyn_o )
  192. 8.13 s [pathway-compat-filepath] [ 6 of 10] Compiling System.FilePath ( src/System/FilePath.hs, dist/build/System/FilePath.o, dist/build/System/FilePath.dyn_o )
  193. 8.13 s Progress: 0 of 12 built (1 failed)
  194. 8.13 s Failed to build pathway-compat-filepath after 6.0s
  195. 8.13 s error: Cannot build '/nix/store/isq7l83m10yyykzr1f202hq4n23f43p1-pathway-compat-filepath-0.0.1.0.drv'.
  196. 8.13 s Reason: builder failed with exit code 1.
  197. 8.13 s Output paths:
  198. 8.13 s /nix/store/gsxpk94inw22circr76qnnbmvc6ziwhz-pathway-compat-filepath-0.0.1.0-doc
  199. 8.13 s /nix/store/q9fsagpd29spy55dp5m0zri4is79nfz5-pathway-compat-filepath-0.0.1.0
  200. 8.13 s Last 176 log lines:
  201. 8.13 s > Running phase: setupCompilerEnvironmentPhase
  202. 8.13 s > Build with /nix/store/2djpcnj8a25viv1y24h3mziy1gsy3fc6-ghc-9.6.7.
  203. 8.13 s > Running phase: unpackPhase
  204. 8.13 s > unpacking source archive /nix/store/5z4x7vzkb1m65ccyx19wn7vcxdl9gmbf-filepath
  205. 8.13 s > source root is filepath
  206. 8.13 s > Running phase: patchPhase
  207. 8.13 s > Running phase: compileBuildDriverPhase
  208. 8.13 s > setupCompileFlags: -package-db=/build/tmp.ypuQ74KOZe/setup-package.conf.d -threaded
  209. 8.13 s > [1 of 2] Compiling Main ( Setup.hs, /build/tmp.ypuQ74KOZe/Main.o )
  210. 8.13 s > [2 of 2] Linking Setup
  211. 8.13 s > Running phase: updateAutotoolsGnuConfigScriptsPhase
  212. 8.13 s > Running phase: configurePhase
  213. 8.13 s > configureFlags: --verbose --prefix=/nix/store/q9fsagpd29spy55dp5m0zri4is79nfz5-pathway-compat-filepath-0.0.1.0 --libdir=$prefix/lib/$compiler/lib --libsubdir=$abi/$libname --docdir=/nix/store/gsxpk94inw22circr76qnnbmvc6ziwhz-pathway-compat-filepath-0.0.1.0-doc/share/doc/pathway-compat-filepath-0.0.1.0 --with-gcc=gcc --package-db=/build/tmp.ypuQ74KOZe/package.conf.d --ghc-option=-j16 --ghc-option=+RTS --ghc-option=-A64M --ghc-option=-RTS --enable-library-profiling --profiling-detail=exported-functions --disable-profiling --enable-shared --disable-coverage --enable-static --disable-executable-dynamic --enable-tests --disable-benchmarks --enable-library-vanilla --disable-library-for-ghci --enable-split-sections --enable-library-stripping --enable-executable-stripping --ghc-option=-haddock --ghc-options=-Werror --extra-lib-dirs=/nix/store/pndhkk0l649lm1sj0mxk7cbwq26qd1ra-ncurses-6.6/lib --extra-lib-dirs=/nix/store/0djlg4g0b81w94k3vcaqsxsc2hh4kism-libffi-3.5.2/lib --extra-lib-dirs=/nix/store/md4paia7riiggyrj8p24c7a6vf8w7jz8-elfutils-0.194/lib --extra-lib-dirs=/nix/store/39vv2pf64gd8li48a4hpbhw2crzd8z5p-gmp-with-cxx-6.3.0/lib --extra-lib-dirs=/nix/store/7wwvald8lapkrsr72qanlw8blyn55ifx-numactl-2.0.18/lib --extra-lib-dirs=/nix/store/2djpcnj8a25viv1y24h3mziy1gsy3fc6-ghc-9.6.7/lib
  214. 8.13 s > Using Parsec parser
  215. 8.13 s > Configuring pathway-compat-filepath-0.0.1.0...
  216. 8.13 s > Flags chosen: noisy-deprecations=True, verify-no-recursion=False
  217. 8.13 s > Dependency base >=4.14.0 && <4.15 || >=4.15.0 && <4.16 || >=4.16.0 && <4.17 ||
  218. 8.13 s > >=4.17.0 && <4.18 || >=4.18.0 && <4.19 || >=4.19.0 && <4.20 || >=4.20.0 &&
  219. 8.13 s > <4.21 || >=4.21.0 && <4.22 || >=4.22.0 && <4.23: using base-4.18.3.0
  220. 8.13 s > Dependency extra: using extra-1.8.1
  221. 8.13 s > Dependency filepath >=1.4.2 && <1.5 || >=1.5.0 && <1.6: using
  222. 8.13 s > filepath-1.4.301.0
  223. 8.13 s > Dependency megaparsec >=9.0.1 && <9.1 || >=9.2.1 && <9.3 || >=9.5.0 && <9.6 ||
  224. 8.13 s > >=9.7.0 && <9.8: using megaparsec-9.7.0
  225. 8.13 s > Dependency os-string: using os-string-2.0.10
  226. 8.13 s > Dependency pathway >=0.0.1 && <0.1: using pathway-0.0.1.0
  227. 8.13 s > Dependency pathway-compat-base >=0.0.1 && <0.1: using
  228. 8.13 s > pathway-compat-base-0.0.1.0
  229. 8.13 s > Dependency pathway-internal >=0.0.1 && <0.1: using pathway-internal-0.0.1.0
  230. 8.13 s > Dependency base >=4.14.0 && <4.15 || >=4.15.0 && <4.16 || >=4.16.0 && <4.17 ||
  231. 8.13 s > >=4.17.0 && <4.18 || >=4.18.0 && <4.19 || >=4.19.0 && <4.20 || >=4.20.0 &&
  232. 8.13 s > <4.21 || >=4.21.0 && <4.22 || >=4.22.0 && <4.23: using base-4.18.3.0
  233. 8.13 s > Dependency doctest >=0.16.3 && <0.17 || >=0.18.1 && <0.19 || >=0.20.1 && <0.21
  234. 8.13 s > || >=0.21.1 && <0.22 || >=0.22.2 && <0.23 || >=0.24.2 && <0.25: using
  235. 8.13 s > doctest-0.24.3
  236. 8.13 s > Dependency pathway-compat-filepath: using pathway-compat-filepath-0.0.1.0
  237. 8.13 s > Source component graph:
  238. 8.13 s > component lib
  239. 8.13 s > component test:doctests dependency lib
  240. 8.13 s > Configured component graph:
  241. 8.13 s > component pathway-compat-filepath-0.0.1.0-Ck51GFznMiC2cxIfBMz4NH
  242. 8.13 s > include base-4.18.3.0
  243. 8.13 s > include extra-1.8.1-FU1frm3XcM88A49dBkmtgI
  244. 8.13 s > include filepath-1.4.301.0
  245. 8.13 s > include megaparsec-9.7.0-EpAk7LLR2KBGAKafJPbXz1
  246. 8.13 s > include os-string-2.0.10-19KGKnZaj8J2ODUMyNXxJr
  247. 8.13 s > include pathway-0.0.1.0-5VJXWbvreBAfybP2NROr3
  248. 8.13 s > include pathway-compat-base-0.0.1.0-E02izPYkwmmGdAPlQBKjbP
  249. 8.13 s > include pathway-internal-0.0.1.0-1xeSc3z2VhRIotiMz9hdL1
  250. 8.13 s > component pathway-compat-filepath-0.0.1.0-Bh4LT0cz7im2Vo1hGnl75g-doctests
  251. 8.13 s > include base-4.18.3.0
  252. 8.13 s > include doctest-0.24.3-ACQNy8u8jPjC50l4I3tyiL
  253. 8.13 s > include pathway-compat-filepath-0.0.1.0-Ck51GFznMiC2cxIfBMz4NH
  254. 8.13 s > Linked component graph:
  255. 8.13 s > unit pathway-compat-filepath-0.0.1.0-Ck51GFznMiC2cxIfBMz4NH
  256. 8.13 s > include base-4.18.3.0
  257. 8.13 s > include extra-1.8.1-FU1frm3XcM88A49dBkmtgI
  258. 8.13 s > include filepath-1.4.301.0
  259. 8.13 s > include megaparsec-9.7.0-EpAk7LLR2KBGAKafJPbXz1
  260. 8.13 s > include os-string-2.0.10-19KGKnZaj8J2ODUMyNXxJr
  261. 8.13 s > include pathway-0.0.1.0-5VJXWbvreBAfybP2NROr3
  262. 8.13 s > include pathway-compat-base-0.0.1.0-E02izPYkwmmGdAPlQBKjbP
  263. 8.13 s > include pathway-internal-0.0.1.0-1xeSc3z2VhRIotiMz9hdL1
  264. 8.13 s > Common.FilePath=pathway-compat-filepath-0.0.1.0-Ck51GFznMiC2cxIfBMz4NH:Common.FilePath,Common.OsPath=pathway-compat-filepath-0.0.1.0-Ck51GFznMiC2cxIfBMz4NH:Common.OsPath,System.FilePath=pathway-compat-filepath-0.0.1.0-Ck51GFznMiC2cxIfBMz4NH:System.FilePath,System.FilePath.Overlay=pathway-compat-filepath-0.0.1.0-Ck51GFznMiC2cxIfBMz4NH:System.FilePath.Overlay,System.FilePath.Pathway=pathway-compat-filepath-0.0.1.0-Ck51GFznMiC2cxIfBMz4NH:System.FilePath.Pathway,System.FilePath.Thin=pathway-compat-filepath-0.0.1.0-Ck51GFznMiC2cxIfBMz4NH:System.FilePath.Thin,System.OsPath=pathway-compat-filepath-0.0.1.0-Ck51GFznMiC2cxIfBMz4NH:System.OsPath,System.OsPath.Overlay=pathway-compat-filepath-0.0.1.0-Ck51GFznMiC2cxIfBMz4NH:System.OsPath.Overlay,System.OsPath.Pathway=pathway-compat-filepath-0.0.1.0-Ck51GFznMiC2cxIfBMz4NH:System.OsPath.Pathway,System.OsPath.Thin=pathway-compat-filepath-0.0.1.0-Ck51GFznMiC2cxIfBMz4NH:System.OsPath.Thin
  265. 8.13 s > unit pathway-compat-filepath-0.0.1.0-Bh4LT0cz7im2Vo1hGnl75g-doctests
  266. 8.13 s > include base-4.18.3.0
  267. 8.13 s > include doctest-0.24.3-ACQNy8u8jPjC50l4I3tyiL
  268. 8.13 s > include pathway-compat-filepath-0.0.1.0-Ck51GFznMiC2cxIfBMz4NH
  269. 8.13 s > Ready component graph:
  270. 8.13 s > definite pathway-compat-filepath-0.0.1.0-Ck51GFznMiC2cxIfBMz4NH
  271. 8.13 s > depends base-4.18.3.0
  272. 8.13 s > depends extra-1.8.1-FU1frm3XcM88A49dBkmtgI
  273. 8.13 s > depends filepath-1.4.301.0
  274. 8.13 s > depends megaparsec-9.7.0-EpAk7LLR2KBGAKafJPbXz1
  275. 8.13 s > depends os-string-2.0.10-19KGKnZaj8J2ODUMyNXxJr
  276. 8.13 s > depends pathway-0.0.1.0-5VJXWbvreBAfybP2NROr3
  277. 8.13 s > depends pathway-compat-base-0.0.1.0-E02izPYkwmmGdAPlQBKjbP
  278. 8.13 s > depends pathway-internal-0.0.1.0-1xeSc3z2VhRIotiMz9hdL1
  279. 8.13 s > definite pathway-compat-filepath-0.0.1.0-Bh4LT0cz7im2Vo1hGnl75g-doctests
  280. 8.13 s > depends base-4.18.3.0
  281. 8.13 s > depends doctest-0.24.3-ACQNy8u8jPjC50l4I3tyiL
  282. 8.13 s > depends pathway-compat-filepath-0.0.1.0-Ck51GFznMiC2cxIfBMz4NH
  283. 8.13 s > Using Cabal-3.10.3.0 compiled by ghc-9.6
  284. 8.13 s > Using compiler: ghc-9.6.7
  285. 8.13 s > Using install prefix:
  286. 8.13 s > /nix/store/q9fsagpd29spy55dp5m0zri4is79nfz5-pathway-compat-filepath-0.0.1.0
  287. 8.13 s > Executables installed in:
  288. 8.13 s > /nix/store/q9fsagpd29spy55dp5m0zri4is79nfz5-pathway-compat-filepath-0.0.1.0/bin
  289. 8.13 s > Libraries installed in:
  290. 8.13 s > /nix/store/q9fsagpd29spy55dp5m0zri4is79nfz5-pathway-compat-filepath-0.0.1.0/lib/ghc-9.6.7/lib/x86_64-linux-ghc-9.6.7/pathway-compat-filepath-0.0.1.0-Ck51GFznMiC2cxIfBMz4NH
  291. 8.13 s > Dynamic Libraries installed in:
  292. 8.13 s > /nix/store/q9fsagpd29spy55dp5m0zri4is79nfz5-pathway-compat-filepath-0.0.1.0/lib/ghc-9.6.7/lib/x86_64-linux-ghc-9.6.7
  293. 8.13 s > Private executables installed in:
  294. 8.13 s > /nix/store/q9fsagpd29spy55dp5m0zri4is79nfz5-pathway-compat-filepath-0.0.1.0/libexec/x86_64-linux-ghc-9.6.7/pathway-compat-filepath-0.0.1.0
  295. 8.13 s > Data files installed in:
  296. 8.13 s > /nix/store/q9fsagpd29spy55dp5m0zri4is79nfz5-pathway-compat-filepath-0.0.1.0/share/x86_64-linux-ghc-9.6.7/pathway-compat-filepath-0.0.1.0
  297. 8.13 s > Documentation installed in:
  298. 8.13 s > /nix/store/gsxpk94inw22circr76qnnbmvc6ziwhz-pathway-compat-filepath-0.0.1.0-doc/share/doc/pathway-compat-filepath-0.0.1.0
  299. 8.13 s > Configuration files installed in:
  300. 8.13 s > /nix/store/q9fsagpd29spy55dp5m0zri4is79nfz5-pathway-compat-filepath-0.0.1.0/etc
  301. 8.13 s > No alex found
  302. 8.13 s > Using ar found on system at:
  303. 8.13 s > /nix/store/zjraf40s86y3iwhp626b934r5y6ldkbb-binutils-wrapper-2.46/bin/ar
  304. 8.13 s > No c2hs found
  305. 8.13 s > No cpphs found
  306. 8.13 s > Using doctest version 0.24.3 found on system at:
  307. 8.13 s > /nix/store/s48k56ayjjxwdbz9y7d8mnqwlcjfi1a8-doctest-0.24.3/bin/doctest
  308. 8.13 s > Using gcc version 15.2.0 given by user at:
  309. 8.13 s > /nix/store/29qjlshvklnyr67nhpprzgb9igmsfsjj-gcc-wrapper-15.2.0/bin/gcc
  310. 8.13 s > Using ghc version 9.6.7 found on system at:
  311. 8.13 s > /nix/store/2djpcnj8a25viv1y24h3mziy1gsy3fc6-ghc-9.6.7/bin/ghc
  312. 8.13 s > Using ghc-pkg version 9.6.7 found on system at:
  313. 8.13 s > /nix/store/2djpcnj8a25viv1y24h3mziy1gsy3fc6-ghc-9.6.7/bin/ghc-pkg-9.6.7
  314. 8.13 s > No ghcjs found
  315. 8.13 s > No ghcjs-pkg found
  316. 8.13 s > No greencard found
  317. 8.13 s > Using haddock version 2.29.2 found on system at:
  318. 8.13 s > /nix/store/2djpcnj8a25viv1y24h3mziy1gsy3fc6-ghc-9.6.7/bin/haddock-ghc-9.6.7
  319. 8.13 s > No happy found
  320. 8.13 s > Using haskell-suite found on system at: haskell-suite-dummy-location
  321. 8.13 s > Using haskell-suite-pkg found on system at: haskell-suite-pkg-dummy-location
  322. 8.13 s > No hmake found
  323. 8.13 s > Using hpc version 0.68 found on system at:
  324. 8.13 s > /nix/store/2djpcnj8a25viv1y24h3mziy1gsy3fc6-ghc-9.6.7/bin/hpc-ghc-9.6.7
  325. 8.13 s > Using hsc2hs version 0.68.9 found on system at:
  326. 8.13 s > /nix/store/2djpcnj8a25viv1y24h3mziy1gsy3fc6-ghc-9.6.7/bin/hsc2hs-ghc-9.6.7
  327. 8.13 s > Using hscolour version 1.25 found on system at:
  328. 8.13 s > /nix/store/2x19jxh5g98bv0s06mdj71c1hmxi54yl-hscolour-1.25/bin/HsColour
  329. 8.13 s > No jhc found
  330. 8.13 s > Using ld found on system at:
  331. 8.13 s > /nix/store/zjraf40s86y3iwhp626b934r5y6ldkbb-binutils-wrapper-2.46/bin/ld.gold
  332. 8.13 s > No pkg-config found
  333. 8.13 s > Using runghc version 9.6.7 found on system at:
  334. 8.13 s > /nix/store/2djpcnj8a25viv1y24h3mziy1gsy3fc6-ghc-9.6.7/bin/runghc-9.6.7
  335. 8.13 s > Using strip version 2.46 found on system at:
  336. 8.13 s > /nix/store/29qjlshvklnyr67nhpprzgb9igmsfsjj-gcc-wrapper-15.2.0/bin/strip
  337. 8.13 s > Using tar found on system at:
  338. 8.13 s > /nix/store/z5mq2sam4484prf3kv6v6vjw1m0i7j24-gnutar-1.35/bin/tar
  339. 8.13 s > No uhc found
  340. 8.13 s > Running phase: buildPhase
  341. 8.13 s > Preprocessing library for pathway-compat-filepath-0.0.1.0..
  342. 8.13 s > Building library for pathway-compat-filepath-0.0.1.0..
  343. 8.13 s > [ 1 of 10] Compiling Common.FilePath ( src/Common/FilePath.hs, dist/build/Common/FilePath.o, dist/build/Common/FilePath.dyn_o )
  344. 8.13 s > [ 2 of 10] Compiling Common.OsPath ( src/Common/OsPath.hs, dist/build/Common/OsPath.o, dist/build/Common/OsPath.dyn_o )
  345. 8.13 s >
  346. 8.13 s > src/Common/OsPath.hs:90:23: error: [GHC-83865]
  347. 8.13 s > • Couldn't match type ‘OSS.OsString’ with ‘OsString’
  348. 8.13 s > Expected: OsPath
  349. 8.13 s > Actual: OSS.OsString
  350. 8.13 s > NB: ‘OsString’
  351. 8.13 s > is defined in ‘System.OsString.Internal.Types.Hidden’
  352. 8.13 s > in package ‘filepath-1.4.301.0’
  353. 8.13 s > ‘OSS.OsString’
  354. 8.13 s > is defined in ‘System.OsString.Internal.Types’
  355. 8.13 s > in package ‘os-string-2.0.10’
  356. 8.13 s > • In the ‘parent’ field of a record
  357. 8.13 s > In the expression:
  358. 8.13 s > Format
  359. 8.13 s > {Format.root = O.pack . pure $ O.pathSeparator,
  360. 8.13 s > Format.current = mempty, Format.parent = OSS.unsafeEncodeUtf "..",
  361. 8.13 s > Format.separator = O.pack . pure $ O.pathSeparator,
  362. 8.13 s > Format.substitutions = mempty}
  363. 8.13 s > In an equation for ‘localFormat’:
  364. 8.13 s > localFormat
  365. 8.13 s > = Format
  366. 8.13 s > {Format.root = O.pack . pure $ O.pathSeparator,
  367. 8.13 s > Format.current = mempty, Format.parent = OSS.unsafeEncodeUtf "..",
  368. 8.13 s > Format.separator = O.pack . pure $ O.pathSeparator,
  369. 8.13 s > Format.substitutions = mempty}
  370. 8.13 s > |
  371. 8.13 s > 90 | Format.parent = OSS.unsafeEncodeUtf "..",
  372. 8.13 s > | ^^^^^^^^^^^^^^^^^^^^^^^^
  373. 8.13 s > [ 3 of 10] Compiling System.FilePath.Thin ( src/System/FilePath/Thin.hs, dist/build/System/FilePath/Thin.o, dist/build/System/FilePath/Thin.dyn_o )
  374. 8.13 s > [ 4 of 10] Compiling System.FilePath.Pathway ( src/System/FilePath/Pathway.hs, dist/build/System/FilePath/Pathway.o, dist/build/System/FilePath/Pathway.dyn_o )
  375. 8.13 s > [ 5 of 10] Compiling System.FilePath.Overlay ( src/System/FilePath/Overlay.hs, dist/build/System/FilePath/Overlay.o, dist/build/System/FilePath/Overlay.dyn_o )
  376. 8.13 s > [ 6 of 10] Compiling System.FilePath ( src/System/FilePath.hs, dist/build/System/FilePath.o, dist/build/System/FilePath.dyn_o )
  377. 8.13 s For full logs, run:
  378. 8.13 s nix log /nix/store/isq7l83m10yyykzr1f202hq4n23f43p1-pathway-compat-filepath-0.0.1.0.drv
  379. 8.13 s error: Cannot build '/nix/store/isq7l83m10yyykzr1f202hq4n23f43p1-pathway-compat-filepath-0.0.1.0.drv'.
  380. 8.13 s Reason: builder failed with exit code 1.
  381. 8.13 s Output paths:
  382. 8.13 s /nix/store/gsxpk94inw22circr76qnnbmvc6ziwhz-pathway-compat-filepath-0.0.1.0-doc
  383. 8.13 s /nix/store/q9fsagpd29spy55dp5m0zri4is79nfz5-pathway-compat-filepath-0.0.1.0
  384. 8.13 s Last 176 log lines:
  385. 8.13 s > Running phase: setupCompilerEnvironmentPhase
  386. 8.13 s > Build with /nix/store/2djpcnj8a25viv1y24h3mziy1gsy3fc6-ghc-9.6.7.
  387. 8.13 s > Running phase: unpackPhase
  388. 8.13 s > unpacking source archive /nix/store/5z4x7vzkb1m65ccyx19wn7vcxdl9gmbf-filepath
  389. 8.13 s > source root is filepath
  390. 8.13 s > Running phase: patchPhase
  391. 8.13 s > Running phase: compileBuildDriverPhase
  392. 8.13 s > setupCompileFlags: -package-db=/build/tmp.ypuQ74KOZe/setup-package.conf.d -threaded
  393. 8.13 s > [1 of 2] Compiling Main ( Setup.hs, /build/tmp.ypuQ74KOZe/Main.o )
  394. 8.13 s > [2 of 2] Linking Setup
  395. 8.13 s > Running phase: updateAutotoolsGnuConfigScriptsPhase
  396. 8.13 s > Running phase: configurePhase
  397. 8.13 s > configureFlags: --verbose --prefix=/nix/store/q9fsagpd29spy55dp5m0zri4is79nfz5-pathway-compat-filepath-0.0.1.0 --libdir=$prefix/lib/$compiler/lib --libsubdir=$abi/$libname --docdir=/nix/store/gsxpk94inw22circr76qnnbmvc6ziwhz-pathway-compat-filepath-0.0.1.0-doc/share/doc/pathway-compat-filepath-0.0.1.0 --with-gcc=gcc --package-db=/build/tmp.ypuQ74KOZe/package.conf.d --ghc-option=-j16 --ghc-option=+RTS --ghc-option=-A64M --ghc-option=-RTS --enable-library-profiling --profiling-detail=exported-functions --disable-profiling --enable-shared --disable-coverage --enable-static --disable-executable-dynamic --enable-tests --disable-benchmarks --enable-library-vanilla --disable-library-for-ghci --enable-split-sections --enable-library-stripping --enable-executable-stripping --ghc-option=-haddock --ghc-options=-Werror --extra-lib-dirs=/nix/store/pndhkk0l649lm1sj0mxk7cbwq26qd1ra-ncurses-6.6/lib --extra-lib-dirs=/nix/store/0djlg4g0b81w94k3vcaqsxsc2hh4kism-libffi-3.5.2/lib --extra-lib-dirs=/nix/store/md4paia7riiggyrj8p24c7a6vf8w7jz8-elfutils-0.194/lib --extra-lib-dirs=/nix/store/39vv2pf64gd8li48a4hpbhw2crzd8z5p-gmp-with-cxx-6.3.0/lib --extra-lib-dirs=/nix/store/7wwvald8lapkrsr72qanlw8blyn55ifx-numactl-2.0.18/lib --extra-lib-dirs=/nix/store/2djpcnj8a25viv1y24h3mziy1gsy3fc6-ghc-9.6.7/lib
  398. 8.13 s > Using Parsec parser
  399. 8.13 s > Configuring pathway-compat-filepath-0.0.1.0...
  400. 8.13 s > Flags chosen: noisy-deprecations=True, verify-no-recursion=False
  401. 8.13 s > Dependency base >=4.14.0 && <4.15 || >=4.15.0 && <4.16 || >=4.16.0 && <4.17 ||
  402. 8.13 s > >=4.17.0 && <4.18 || >=4.18.0 && <4.19 || >=4.19.0 && <4.20 || >=4.20.0 &&
  403. 8.13 s > <4.21 || >=4.21.0 && <4.22 || >=4.22.0 && <4.23: using base-4.18.3.0
  404. 8.13 s > Dependency extra: using extra-1.8.1
  405. 8.13 s > Dependency filepath >=1.4.2 && <1.5 || >=1.5.0 && <1.6: using
  406. 8.13 s > filepath-1.4.301.0
  407. 8.13 s > Dependency megaparsec >=9.0.1 && <9.1 || >=9.2.1 && <9.3 || >=9.5.0 && <9.6 ||
  408. 8.13 s > >=9.7.0 && <9.8: using megaparsec-9.7.0
  409. 8.13 s > Dependency os-string: using os-string-2.0.10
  410. 8.13 s > Dependency pathway >=0.0.1 && <0.1: using pathway-0.0.1.0
  411. 8.13 s > Dependency pathway-compat-base >=0.0.1 && <0.1: using
  412. 8.13 s > pathway-compat-base-0.0.1.0
  413. 8.13 s > Dependency pathway-internal >=0.0.1 && <0.1: using pathway-internal-0.0.1.0
  414. 8.13 s > Dependency base >=4.14.0 && <4.15 || >=4.15.0 && <4.16 || >=4.16.0 && <4.17 ||
  415. 8.13 s > >=4.17.0 && <4.18 || >=4.18.0 && <4.19 || >=4.19.0 && <4.20 || >=4.20.0 &&
  416. 8.13 s > <4.21 || >=4.21.0 && <4.22 || >=4.22.0 && <4.23: using base-4.18.3.0
  417. 8.13 s > Dependency doctest >=0.16.3 && <0.17 || >=0.18.1 && <0.19 || >=0.20.1 && <0.21
  418. 8.13 s > || >=0.21.1 && <0.22 || >=0.22.2 && <0.23 || >=0.24.2 && <0.25: using
  419. 8.13 s > doctest-0.24.3
  420. 8.13 s > Dependency pathway-compat-filepath: using pathway-compat-filepath-0.0.1.0
  421. 8.13 s > Source component graph:
  422. 8.13 s > component lib
  423. 8.13 s > component test:doctests dependency lib
  424. 8.13 s > Configured component graph:
  425. 8.13 s > component pathway-compat-filepath-0.0.1.0-Ck51GFznMiC2cxIfBMz4NH
  426. 8.13 s > include base-4.18.3.0
  427. 8.13 s > include extra-1.8.1-FU1frm3XcM88A49dBkmtgI
  428. 8.13 s > include filepath-1.4.301.0
  429. 8.13 s > include megaparsec-9.7.0-EpAk7LLR2KBGAKafJPbXz1
  430. 8.13 s > include os-string-2.0.10-19KGKnZaj8J2ODUMyNXxJr
  431. 8.13 s > include pathway-0.0.1.0-5VJXWbvreBAfybP2NROr3
  432. 8.13 s > include pathway-compat-base-0.0.1.0-E02izPYkwmmGdAPlQBKjbP
  433. 8.13 s > include pathway-internal-0.0.1.0-1xeSc3z2VhRIotiMz9hdL1
  434. 8.13 s > component pathway-compat-filepath-0.0.1.0-Bh4LT0cz7im2Vo1hGnl75g-doctests
  435. 8.13 s > include base-4.18.3.0
  436. 8.13 s > include doctest-0.24.3-ACQNy8u8jPjC50l4I3tyiL
  437. 8.13 s > include pathway-compat-filepath-0.0.1.0-Ck51GFznMiC2cxIfBMz4NH
  438. 8.13 s > Linked component graph:
  439. 8.13 s > unit pathway-compat-filepath-0.0.1.0-Ck51GFznMiC2cxIfBMz4NH
  440. 8.13 s > include base-4.18.3.0
  441. 8.13 s > include extra-1.8.1-FU1frm3XcM88A49dBkmtgI
  442. 8.13 s > include filepath-1.4.301.0
  443. 8.13 s > include megaparsec-9.7.0-EpAk7LLR2KBGAKafJPbXz1
  444. 8.13 s > include os-string-2.0.10-19KGKnZaj8J2ODUMyNXxJr
  445. 8.13 s > include pathway-0.0.1.0-5VJXWbvreBAfybP2NROr3
  446. 8.13 s > include pathway-compat-base-0.0.1.0-E02izPYkwmmGdAPlQBKjbP
  447. 8.13 s > include pathway-internal-0.0.1.0-1xeSc3z2VhRIotiMz9hdL1
  448. 8.13 s > Common.FilePath=pathway-compat-filepath-0.0.1.0-Ck51GFznMiC2cxIfBMz4NH:Common.FilePath,Common.OsPath=pathway-compat-filepath-0.0.1.0-Ck51GFznMiC2cxIfBMz4NH:Common.OsPath,System.FilePath=pathway-compat-filepath-0.0.1.0-Ck51GFznMiC2cxIfBMz4NH:System.FilePath,System.FilePath.Overlay=pathway-compat-filepath-0.0.1.0-Ck51GFznMiC2cxIfBMz4NH:System.FilePath.Overlay,System.FilePath.Pathway=pathway-compat-filepath-0.0.1.0-Ck51GFznMiC2cxIfBMz4NH:System.FilePath.Pathway,System.FilePath.Thin=pathway-compat-filepath-0.0.1.0-Ck51GFznMiC2cxIfBMz4NH:System.FilePath.Thin,System.OsPath=pathway-compat-filepath-0.0.1.0-Ck51GFznMiC2cxIfBMz4NH:System.OsPath,System.OsPath.Overlay=pathway-compat-filepath-0.0.1.0-Ck51GFznMiC2cxIfBMz4NH:System.OsPath.Overlay,System.OsPath.Pathway=pathway-compat-filepath-0.0.1.0-Ck51GFznMiC2cxIfBMz4NH:System.OsPath.Pathway,System.OsPath.Thin=pathway-compat-filepath-0.0.1.0-Ck51GFznMiC2cxIfBMz4NH:System.OsPath.Thin
  449. 8.13 s > unit pathway-compat-filepath-0.0.1.0-Bh4LT0cz7im2Vo1hGnl75g-doctests
  450. 8.13 s > include base-4.18.3.0
  451. 8.13 s > include doctest-0.24.3-ACQNy8u8jPjC50l4I3tyiL
  452. 8.13 s > include pathway-compat-filepath-0.0.1.0-Ck51GFznMiC2cxIfBMz4NH
  453. 8.13 s > Ready component graph:
  454. 8.13 s > definite pathway-compat-filepath-0.0.1.0-Ck51GFznMiC2cxIfBMz4NH
  455. 8.13 s > depends base-4.18.3.0
  456. 8.13 s > depends extra-1.8.1-FU1frm3XcM88A49dBkmtgI
  457. 8.13 s > depends filepath-1.4.301.0
  458. 8.13 s > depends megaparsec-9.7.0-EpAk7LLR2KBGAKafJPbXz1
  459. 8.13 s > depends os-string-2.0.10-19KGKnZaj8J2ODUMyNXxJr
  460. 8.13 s > depends pathway-0.0.1.0-5VJXWbvreBAfybP2NROr3
  461. 8.13 s > depends pathway-compat-base-0.0.1.0-E02izPYkwmmGdAPlQBKjbP
  462. 8.13 s > depends pathway-internal-0.0.1.0-1xeSc3z2VhRIotiMz9hdL1
  463. 8.13 s > definite pathway-compat-filepath-0.0.1.0-Bh4LT0cz7im2Vo1hGnl75g-doctests
  464. 8.13 s > depends base-4.18.3.0
  465. 8.13 s > depends doctest-0.24.3-ACQNy8u8jPjC50l4I3tyiL
  466. 8.13 s > depends pathway-compat-filepath-0.0.1.0-Ck51GFznMiC2cxIfBMz4NH
  467. 8.13 s > Using Cabal-3.10.3.0 compiled by ghc-9.6
  468. 8.13 s > Using compiler: ghc-9.6.7
  469. 8.13 s > Using install prefix:
  470. 8.13 s > /nix/store/q9fsagpd29spy55dp5m0zri4is79nfz5-pathway-compat-filepath-0.0.1.0
  471. 8.13 s > Executables installed in:
  472. 8.13 s > /nix/store/q9fsagpd29spy55dp5m0zri4is79nfz5-pathway-compat-filepath-0.0.1.0/bin
  473. 8.13 s > Libraries installed in:
  474. 8.13 s > /nix/store/q9fsagpd29spy55dp5m0zri4is79nfz5-pathway-compat-filepath-0.0.1.0/lib/ghc-9.6.7/lib/x86_64-linux-ghc-9.6.7/pathway-compat-filepath-0.0.1.0-Ck51GFznMiC2cxIfBMz4NH
  475. 8.13 s > Dynamic Libraries installed in:
  476. 8.13 s > /nix/store/q9fsagpd29spy55dp5m0zri4is79nfz5-pathway-compat-filepath-0.0.1.0/lib/ghc-9.6.7/lib/x86_64-linux-ghc-9.6.7
  477. 8.13 s > Private executables installed in:
  478. 8.13 s > /nix/store/q9fsagpd29spy55dp5m0zri4is79nfz5-pathway-compat-filepath-0.0.1.0/libexec/x86_64-linux-ghc-9.6.7/pathway-compat-filepath-0.0.1.0
  479. 8.13 s > Data files installed in:
  480. 8.13 s > /nix/store/q9fsagpd29spy55dp5m0zri4is79nfz5-pathway-compat-filepath-0.0.1.0/share/x86_64-linux-ghc-9.6.7/pathway-compat-filepath-0.0.1.0
  481. 8.13 s > Documentation installed in:
  482. 8.13 s > /nix/store/gsxpk94inw22circr76qnnbmvc6ziwhz-pathway-compat-filepath-0.0.1.0-doc/share/doc/pathway-compat-filepath-0.0.1.0
  483. 8.13 s > Configuration files installed in:
  484. 8.13 s > /nix/store/q9fsagpd29spy55dp5m0zri4is79nfz5-pathway-compat-filepath-0.0.1.0/etc
  485. 8.13 s > No alex found
  486. 8.13 s > Using ar found on system at:
  487. 8.13 s > /nix/store/zjraf40s86y3iwhp626b934r5y6ldkbb-binutils-wrapper-2.46/bin/ar
  488. 8.13 s > No c2hs found
  489. 8.13 s > No cpphs found
  490. 8.13 s > Using doctest version 0.24.3 found on system at:
  491. 8.13 s > /nix/store/s48k56ayjjxwdbz9y7d8mnqwlcjfi1a8-doctest-0.24.3/bin/doctest
  492. 8.13 s > Using gcc version 15.2.0 given by user at:
  493. 8.13 s > /nix/store/29qjlshvklnyr67nhpprzgb9igmsfsjj-gcc-wrapper-15.2.0/bin/gcc
  494. 8.13 s > Using ghc version 9.6.7 found on system at:
  495. 8.13 s > /nix/store/2djpcnj8a25viv1y24h3mziy1gsy3fc6-ghc-9.6.7/bin/ghc
  496. 8.13 s > Using ghc-pkg version 9.6.7 found on system at:
  497. 8.13 s > /nix/store/2djpcnj8a25viv1y24h3mziy1gsy3fc6-ghc-9.6.7/bin/ghc-pkg-9.6.7
  498. 8.13 s > No ghcjs found
  499. 8.13 s > No ghcjs-pkg found
  500. 8.13 s > No greencard found
  501. 8.13 s > Using haddock version 2.29.2 found on system at:
  502. 8.13 s > /nix/store/2djpcnj8a25viv1y24h3mziy1gsy3fc6-ghc-9.6.7/bin/haddock-ghc-9.6.7
  503. 8.13 s > No happy found
  504. 8.13 s > Using haskell-suite found on system at: haskell-suite-dummy-location
  505. 8.13 s > Using haskell-suite-pkg found on system at: haskell-suite-pkg-dummy-location
  506. 8.13 s > No hmake found
  507. 8.13 s > Using hpc version 0.68 found on system at:
  508. 8.13 s > /nix/store/2djpcnj8a25viv1y24h3mziy1gsy3fc6-ghc-9.6.7/bin/hpc-ghc-9.6.7
  509. 8.13 s > Using hsc2hs version 0.68.9 found on system at:
  510. 8.13 s > /nix/store/2djpcnj8a25viv1y24h3mziy1gsy3fc6-ghc-9.6.7/bin/hsc2hs-ghc-9.6.7
  511. 8.13 s > Using hscolour version 1.25 found on system at:
  512. 8.13 s > /nix/store/2x19jxh5g98bv0s06mdj71c1hmxi54yl-hscolour-1.25/bin/HsColour
  513. 8.13 s > No jhc found
  514. 8.13 s > Using ld found on system at:
  515. 8.13 s > /nix/store/zjraf40s86y3iwhp626b934r5y6ldkbb-binutils-wrapper-2.46/bin/ld.gold
  516. 8.13 s > No pkg-config found
  517. 8.13 s > Using runghc version 9.6.7 found on system at:
  518. 8.13 s > /nix/store/2djpcnj8a25viv1y24h3mziy1gsy3fc6-ghc-9.6.7/bin/runghc-9.6.7
  519. 8.13 s > Using strip version 2.46 found on system at:
  520. 8.13 s > /nix/store/29qjlshvklnyr67nhpprzgb9igmsfsjj-gcc-wrapper-15.2.0/bin/strip
  521. 8.13 s > Using tar found on system at:
  522. 8.13 s > /nix/store/z5mq2sam4484prf3kv6v6vjw1m0i7j24-gnutar-1.35/bin/tar
  523. 8.13 s > No uhc found
  524. 8.13 s > Running phase: buildPhase
  525. 8.13 s > Preprocessing library for pathway-compat-filepath-0.0.1.0..
  526. 8.13 s > Building library for pathway-compat-filepath-0.0.1.0..
  527. 8.13 s > [ 1 of 10] Compiling Common.FilePath ( src/Common/FilePath.hs, dist/build/Common/FilePath.o, dist/build/Common/FilePath.dyn_o )
  528. 8.13 s > [ 2 of 10] Compiling Common.OsPath ( src/Common/OsPath.hs, dist/build/Common/OsPath.o, dist/build/Common/OsPath.dyn_o )
  529. 8.13 s >
  530. 8.13 s > src/Common/OsPath.hs:90:23: error: [GHC-83865]
  531. 8.13 s > • Couldn't match type ‘OSS.OsString’ with ‘OsString’
  532. 8.13 s > Expected: OsPath
  533. 8.13 s > Actual: OSS.OsString
  534. 8.13 s > NB: ‘OsString’
  535. 8.13 s > is defined in ‘System.OsString.Internal.Types.Hidden’
  536. 8.13 s > in package ‘filepath-1.4.301.0’
  537. 8.13 s > ‘OSS.OsString’
  538. 8.13 s > is defined in ‘System.OsString.Internal.Types’
  539. 8.13 s > in package ‘os-string-2.0.10’
  540. 8.13 s > • In the ‘parent’ field of a record
  541. 8.13 s > In the expression:
  542. 8.13 s > Format
  543. 8.13 s > {Format.root = O.pack . pure $ O.pathSeparator,
  544. 8.13 s > Format.current = mempty, Format.parent = OSS.unsafeEncodeUtf "..",
  545. 8.13 s > Format.separator = O.pack . pure $ O.pathSeparator,
  546. 8.13 s > Format.substitutions = mempty}
  547. 8.13 s > In an equation for ‘localFormat’:
  548. 8.13 s > localFormat
  549. 8.13 s > = Format
  550. 8.13 s > {Format.root = O.pack . pure $ O.pathSeparator,
  551. 8.13 s > Format.current = mempty, Format.parent = OSS.unsafeEncodeUtf "..",
  552. 8.13 s > Format.separator = O.pack . pure $ O.pathSeparator,
  553. 8.13 s > Format.substitutions = mempty}
  554. 8.13 s > |
  555. 8.13 s > 90 | Format.parent = OSS.unsafeEncodeUtf "..",
  556. 8.13 s > | ^^^^^^^^^^^^^^^^^^^^^^^^
  557. 8.13 s > [ 3 of 10] Compiling System.FilePath.Thin ( src/System/FilePath/Thin.hs, dist/build/System/FilePath/Thin.o, dist/build/System/FilePath/Thin.dyn_o )
  558. 8.13 s > [ 4 of 10] Compiling System.FilePath.Pathway ( src/System/FilePath/Pathway.hs, dist/build/System/FilePath/Pathway.o, dist/build/System/FilePath/Pathway.dyn_o )
  559. 8.13 s > [ 5 of 10] Compiling System.FilePath.Overlay ( src/System/FilePath/Overlay.hs, dist/build/System/FilePath/Overlay.o, dist/build/System/FilePath/Overlay.dyn_o )
  560. 8.13 s > [ 6 of 10] Compiling System.FilePath ( src/System/FilePath.hs, dist/build/System/FilePath.o, dist/build/System/FilePath.dyn_o )
  561. 8.13 s For full logs, run:
  562. 8.13 s nix log /nix/store/isq7l83m10yyykzr1f202hq4n23f43p1-pathway-compat-filepath-0.0.1.0.drv
  563. 8.13 s error: Cannot build '/nix/store/bpr5w918izm9vxfkr6byadi3arwwsngk-ghc-9.6.7-with-packages.drv'.
  564. 8.13 s Reason: 1 dependency failed.
  565. 8.13 s Output paths:
  566. 8.13 s /nix/store/w0xzk7grmg774djh9flicwfrp1k3bqw4-ghc-9.6.7-with-packages
  567. 8.13 s error: Cannot build '/nix/store/6rvvbn4nsny64yndixwsr5kbnngamlpz-pathway-compat-directory-0.0.1.0.drv'.
  568. 8.13 s Reason: 1 dependency failed.
  569. 8.13 s Output paths:
  570. 8.13 s /nix/store/fb8c9y8a3n35pz051dniy1chxnyamqsk-pathway-compat-directory-0.0.1.0-doc
  571. 8.13 s /nix/store/m2hlbb7cw4m4wi41qg3wcapwhx8pidj3-pathway-compat-directory-0.0.1.0
  572. 8.13 s error: Cannot build '/nix/store/gzfiby42jyphwpxkjd7q4akfcghrj0pq-pathway-compat-file-io-0.0.1.0.drv'.
  573. 8.13 s Reason: 1 dependency failed.
  574. 8.13 s Output paths:
  575. 8.13 s /nix/store/4vxfzhpir4i8m0ns8m7zr6hma6fai8jc-pathway-compat-file-io-0.0.1.0-doc
  576. 8.13 s /nix/store/iwrmym67qgm3xvlj71qlk0lf37fql3yh-pathway-compat-file-io-0.0.1.0
  577. 8.13 s error: Cannot build '/nix/store/8ri2qmf4w6jfifamb1yb1fsb2nrjp773-pathway-compat-temporary-0.0.1.0.drv'.
  578. 8.13 s Reason: 1 dependency failed.
  579. 8.13 s Output paths:
  580. 8.13 s /nix/store/1sa868r5wz084s1vx73w56xi3rh9af9d-pathway-compat-temporary-0.0.1.0
  581. 8.13 s /nix/store/6fwn0wzs278issqpwgkkjaz9c13vw0hc-pathway-compat-temporary-0.0.1.0-doc
  582. 8.13 s error: Cannot build '/nix/store/2w8dn50862rrwygm03k5j7l8warsd57k-pathway-system-0.0.1.0.drv'.
  583. 8.13 s Reason: 1 dependency failed.
  584. 8.13 s Output paths:
  585. 8.13 s /nix/store/ps3kvxiwcm8qn4rmpnh09r10gbnn9hx1-pathway-system-0.0.1.0
  586. 8.13 s /nix/store/q4lgkkr11sghd0k9zfay2syagb0mx8zr-pathway-system-0.0.1.0-doc
  587. 8.13 s error: Build failed due to failed dependency
  588. 8.13 s error: Cannot build '/nix/store/xpxxy1s8m69yjxsbmqgcpfwkzvc6c7cm-all-packages.drv'.
  589. 8.13 s Reason: 1 dependency failed.
  590. 8.13 s Output paths:
  591. 8.13 s /nix/store/hdwsgcxhxv674mjsai1ydk6pm1lm4vpq-all-packages
  592. 8.13 s Build failed due to failed dependency
  593. 8.13 s Build failed.