build packages.x86_64-linux.ghc967_all
0.62 s
$ /nix/store/9ypz3flqsrl5xl495mm8h645gadjsxi1-coreutils-9.11/bin/timeout --kill-after=15s 7200s /nix/store/23zk8sgzamrbmj1fday15szf7f2279s8-nix-2.34.7/bin/nix --extra-experimental-features nix-command --extra-experimental-features flakes --log-format internal-json build --no-link --print-out-paths git+https://github.com/sellout/pathway?ref=more-system&rev=1ea193cbc6593071794981ca0dcd055e8eb42609&shallow=1#packages.x86_64-linux.ghc967_all --print-build-logs
0.63 s
warning: ignoring untrusted flake configuration setting 'allow-import-from-derivation'.
0.63 s
Pass '--accept-flake-config' to trust it
0.63 s
warning: ignoring untrusted flake configuration setting 'extra-experimental-features'.
0.63 s
Pass '--accept-flake-config' to trust it
0.63 s
warning: ignoring untrusted flake configuration setting 'extra-substituters'.
0.63 s
Pass '--accept-flake-config' to trust it
0.63 s
warning: ignoring untrusted flake configuration setting 'extra-trusted-public-keys'.
0.63 s
Pass '--accept-flake-config' to trust it
0.63 s
warning: ignoring untrusted flake configuration setting 'sandbox'.
0.63 s
Pass '--accept-flake-config' to trust it
0.63 s
warning: ignoring untrusted flake configuration setting 'use-registries'.
0.63 s
Pass '--accept-flake-config' to trust it
0.63 s
error (ignored): SQLite database '/var/cache/nix-ci-worker/eval-cache-v6/7e8cef9f9a584f12750e4112f9919eb203f4dd515b08e08f130fffcf31865d0a.sqlite ' is busy
1.55 s
2.07 s
Building /nix/store/isq7l83m10yyykzr1f202hq4n23f43p1-pathway-compat-filepath-0.0.1.0.drv
2.28 s
[pathway-compat-filepath] Phase: setupCompilerEnvironmentPhase
2.28 s
[pathway-compat-filepath] Build with /nix/store/2djpcnj8a25viv1y24h3mziy1gsy3fc6-ghc-9.6.7.
2.62 s
[pathway-compat-filepath] Phase: unpackPhase
2.63 s
[pathway-compat-filepath] unpacking source archive /nix/store/5z4x7vzkb1m65ccyx19wn7vcxdl9gmbf-filepath
2.64 s
[pathway-compat-filepath] source root is filepath
2.65 s
[pathway-compat-filepath] Phase: patchPhase
2.66 s
[pathway-compat-filepath] Phase: compileBuildDriverPhase
2.67 s
[pathway-compat-filepath] setupCompileFlags: -package-db=/build/tmp.ypuQ74KOZe/setup-package.conf.d -threaded
2.72 s
[pathway-compat-filepath] [1 of 2] Compiling Main ( Setup.hs, /build/tmp.ypuQ74KOZe/Main.o )
2.77 s
[pathway-compat-filepath] [2 of 2] Linking Setup
4.05 s
[pathway-compat-filepath] Phase: updateAutotoolsGnuConfigScriptsPhase
4.07 s
[pathway-compat-filepath] Phase: configurePhase
4.07 s
[pathway-compat-filepath] configureFlags: --verbose --prefix=/nix/store/q9fsagpd29spy55dp5m0zri4is79nfz5-pathway-compat-filepath-0.0.1.0 --libdir=$prefix/lib/$compiler/lib --libsubdir=$abi/$libname --docdir=/nix/store/gsxpk94inw22circr76qnnbmvc6ziwhz-pathway-compat-filepath-0.0.1.0-doc/share/doc/pathway-compat-filepath-0.0.1.0 --with-gcc=gcc --package-db=/build/tmp.ypuQ74KOZe/package.conf.d --ghc-option=-j16 --ghc-option=+RTS --ghc-option=-A64M --ghc-option=-RTS --enable-library-profiling --profiling-detail=exported-functions --disable-profiling --enable-shared --disable-coverage --enable-static --disable-executable-dynamic --enable-tests --disable-benchmarks --enable-library-vanilla --disable-library-for-ghci --enable-split-sections --enable-library-stripping --enable-executable-stripping --ghc-option=-haddock --ghc-options=-Werror --extra-lib-dirs=/nix/store/pndhkk0l649lm1sj0mxk7cbwq26qd1ra-ncurses-6.6/lib --extra-lib-dirs=/nix/store/0djlg4g0b81w94k3vcaqsxsc2hh4kism-libffi-3.5.2/lib --extra-lib-dirs=/nix/store/md4paia7riiggyrj8p24c7a6vf8w7jz8-elfutils-0.194/lib --extra-lib-dirs=/nix/store/39vv2pf64gd8li48a4hpbhw2crzd8z5p-gmp-with-cxx-6.3.0/lib --extra-lib-dirs=/nix/store/7wwvald8lapkrsr72qanlw8blyn55ifx-numactl-2.0.18/lib --extra-lib-dirs=/nix/store/2djpcnj8a25viv1y24h3mziy1gsy3fc6-ghc-9.6.7/lib
4.08 s
[pathway-compat-filepath] Using Parsec parser
4.08 s
[pathway-compat-filepath] Configuring pathway-compat-filepath-0.0.1.0...
4.48 s
[pathway-compat-filepath] Flags chosen: noisy-deprecations=True, verify-no-recursion=False
4.48 s
[pathway-compat-filepath] Dependency base >=4.14.0 && <4.15 || >=4.15.0 && <4.16 || >=4.16.0 && <4.17 ||
4.48 s
[pathway-compat-filepath] >=4.17.0 && <4.18 || >=4.18.0 && <4.19 || >=4.19.0 && <4.20 || >=4.20.0 &&
4.48 s
[pathway-compat-filepath] <4.21 || >=4.21.0 && <4.22 || >=4.22.0 && <4.23: using base-4.18.3.0
4.48 s
[pathway-compat-filepath] Dependency extra: using extra-1.8.1
4.48 s
[pathway-compat-filepath] Dependency filepath >=1.4.2 && <1.5 || >=1.5.0 && <1.6: using
4.48 s
[pathway-compat-filepath] filepath-1.4.301.0
4.48 s
[pathway-compat-filepath] Dependency megaparsec >=9.0.1 && <9.1 || >=9.2.1 && <9.3 || >=9.5.0 && <9.6 ||
4.48 s
[pathway-compat-filepath] >=9.7.0 && <9.8: using megaparsec-9.7.0
4.48 s
[pathway-compat-filepath] Dependency os-string: using os-string-2.0.10
4.49 s
[pathway-compat-filepath] Dependency pathway >=0.0.1 && <0.1: using pathway-0.0.1.0
4.49 s
[pathway-compat-filepath] Dependency pathway-compat-base >=0.0.1 && <0.1: using
4.49 s
[pathway-compat-filepath] pathway-compat-base-0.0.1.0
4.49 s
[pathway-compat-filepath] Dependency pathway-internal >=0.0.1 && <0.1: using pathway-internal-0.0.1.0
4.49 s
[pathway-compat-filepath] Dependency base >=4.14.0 && <4.15 || >=4.15.0 && <4.16 || >=4.16.0 && <4.17 ||
4.49 s
[pathway-compat-filepath] >=4.17.0 && <4.18 || >=4.18.0 && <4.19 || >=4.19.0 && <4.20 || >=4.20.0 &&
4.49 s
[pathway-compat-filepath] <4.21 || >=4.21.0 && <4.22 || >=4.22.0 && <4.23: using base-4.18.3.0
4.49 s
[pathway-compat-filepath] Dependency doctest >=0.16.3 && <0.17 || >=0.18.1 && <0.19 || >=0.20.1 && <0.21
4.49 s
[pathway-compat-filepath] || >=0.21.1 && <0.22 || >=0.22.2 && <0.23 || >=0.24.2 && <0.25: using
4.49 s
[pathway-compat-filepath] doctest-0.24.3
4.49 s
[pathway-compat-filepath] Dependency pathway-compat-filepath: using pathway-compat-filepath-0.0.1.0
4.90 s
[pathway-compat-filepath] Source component graph:
4.90 s
[pathway-compat-filepath] component lib
4.90 s
[pathway-compat-filepath] component test:doctests dependency lib
4.90 s
[pathway-compat-filepath] Configured component graph:
4.90 s
[pathway-compat-filepath] component pathway-compat-filepath-0.0.1.0-Ck51GFznMiC2cxIfBMz4NH
4.90 s
[pathway-compat-filepath] include base-4.18.3.0
4.90 s
[pathway-compat-filepath] include extra-1.8.1-FU1frm3XcM88A49dBkmtgI
4.90 s
[pathway-compat-filepath] include filepath-1.4.301.0
4.90 s
[pathway-compat-filepath] include megaparsec-9.7.0-EpAk7LLR2KBGAKafJPbXz1
4.90 s
[pathway-compat-filepath] include os-string-2.0.10-19KGKnZaj8J2ODUMyNXxJr
4.90 s
[pathway-compat-filepath] include pathway-0.0.1.0-5VJXWbvreBAfybP2NROr3
4.90 s
[pathway-compat-filepath] include pathway-compat-base-0.0.1.0-E02izPYkwmmGdAPlQBKjbP
4.90 s
[pathway-compat-filepath] include pathway-internal-0.0.1.0-1xeSc3z2VhRIotiMz9hdL1
4.90 s
[pathway-compat-filepath] component pathway-compat-filepath-0.0.1.0-Bh4LT0cz7im2Vo1hGnl75g-doctests
4.90 s
[pathway-compat-filepath] include base-4.18.3.0
4.90 s
[pathway-compat-filepath] include doctest-0.24.3-ACQNy8u8jPjC50l4I3tyiL
4.90 s
[pathway-compat-filepath] include pathway-compat-filepath-0.0.1.0-Ck51GFznMiC2cxIfBMz4NH
4.90 s
[pathway-compat-filepath] Linked component graph:
4.90 s
[pathway-compat-filepath] unit pathway-compat-filepath-0.0.1.0-Ck51GFznMiC2cxIfBMz4NH
4.90 s
[pathway-compat-filepath] include base-4.18.3.0
4.90 s
[pathway-compat-filepath] include extra-1.8.1-FU1frm3XcM88A49dBkmtgI
4.90 s
[pathway-compat-filepath] include filepath-1.4.301.0
4.90 s
[pathway-compat-filepath] include megaparsec-9.7.0-EpAk7LLR2KBGAKafJPbXz1
4.90 s
[pathway-compat-filepath] include os-string-2.0.10-19KGKnZaj8J2ODUMyNXxJr
4.90 s
[pathway-compat-filepath] include pathway-0.0.1.0-5VJXWbvreBAfybP2NROr3
4.90 s
[pathway-compat-filepath] include pathway-compat-base-0.0.1.0-E02izPYkwmmGdAPlQBKjbP
4.90 s
[pathway-compat-filepath] include pathway-internal-0.0.1.0-1xeSc3z2VhRIotiMz9hdL1
4.90 s
[pathway-compat-filepath] Common.FilePath=pathway-compat-filepath-0.0.1.0-Ck51GFznMiC2cxIfBMz4NH:Common.FilePath,Common.OsPath=pathway-compat-filepath-0.0.1.0-Ck51GFznMiC2cxIfBMz4NH:Common.OsPath,System.FilePath=pathway-compat-filepath-0.0.1.0-Ck51GFznMiC2cxIfBMz4NH:System.FilePath,System.FilePath.Overlay=pathway-compat-filepath-0.0.1.0-Ck51GFznMiC2cxIfBMz4NH:System.FilePath.Overlay,System.FilePath.Pathway=pathway-compat-filepath-0.0.1.0-Ck51GFznMiC2cxIfBMz4NH:System.FilePath.Pathway,System.FilePath.Thin=pathway-compat-filepath-0.0.1.0-Ck51GFznMiC2cxIfBMz4NH:System.FilePath.Thin,System.OsPath=pathway-compat-filepath-0.0.1.0-Ck51GFznMiC2cxIfBMz4NH:System.OsPath,System.OsPath.Overlay=pathway-compat-filepath-0.0.1.0-Ck51GFznMiC2cxIfBMz4NH:System.OsPath.Overlay,System.OsPath.Pathway=pathway-compat-filepath-0.0.1.0-Ck51GFznMiC2cxIfBMz4NH:System.OsPath.Pathway,System.OsPath.Thin=pathway-compat-filepath-0.0.1.0-Ck51GFznMiC2cxIfBMz4NH:System.OsPath.Thin
4.90 s
[pathway-compat-filepath] unit pathway-compat-filepath-0.0.1.0-Bh4LT0cz7im2Vo1hGnl75g-doctests
4.90 s
[pathway-compat-filepath] include base-4.18.3.0
4.90 s
[pathway-compat-filepath] include doctest-0.24.3-ACQNy8u8jPjC50l4I3tyiL
4.90 s
[pathway-compat-filepath] include pathway-compat-filepath-0.0.1.0-Ck51GFznMiC2cxIfBMz4NH
4.90 s
[pathway-compat-filepath] Ready component graph:
4.90 s
[pathway-compat-filepath] definite pathway-compat-filepath-0.0.1.0-Ck51GFznMiC2cxIfBMz4NH
4.90 s
[pathway-compat-filepath] depends base-4.18.3.0
4.90 s
[pathway-compat-filepath] depends extra-1.8.1-FU1frm3XcM88A49dBkmtgI
4.90 s
[pathway-compat-filepath] depends filepath-1.4.301.0
4.90 s
[pathway-compat-filepath] depends megaparsec-9.7.0-EpAk7LLR2KBGAKafJPbXz1
4.90 s
[pathway-compat-filepath] depends os-string-2.0.10-19KGKnZaj8J2ODUMyNXxJr
4.90 s
[pathway-compat-filepath] depends pathway-0.0.1.0-5VJXWbvreBAfybP2NROr3
4.90 s
[pathway-compat-filepath] depends pathway-compat-base-0.0.1.0-E02izPYkwmmGdAPlQBKjbP
4.90 s
[pathway-compat-filepath] depends pathway-internal-0.0.1.0-1xeSc3z2VhRIotiMz9hdL1
4.90 s
[pathway-compat-filepath] definite pathway-compat-filepath-0.0.1.0-Bh4LT0cz7im2Vo1hGnl75g-doctests
4.90 s
[pathway-compat-filepath] depends base-4.18.3.0
4.90 s
[pathway-compat-filepath] depends doctest-0.24.3-ACQNy8u8jPjC50l4I3tyiL
4.90 s
[pathway-compat-filepath] depends pathway-compat-filepath-0.0.1.0-Ck51GFznMiC2cxIfBMz4NH
4.90 s
[pathway-compat-filepath] Using Cabal-3.10.3.0 compiled by ghc-9.6
4.90 s
[pathway-compat-filepath] Using compiler: ghc-9.6.7
4.90 s
[pathway-compat-filepath] Using install prefix:
4.90 s
[pathway-compat-filepath] /nix/store/q9fsagpd29spy55dp5m0zri4is79nfz5-pathway-compat-filepath-0.0.1.0
4.90 s
[pathway-compat-filepath] Executables installed in:
4.90 s
[pathway-compat-filepath] /nix/store/q9fsagpd29spy55dp5m0zri4is79nfz5-pathway-compat-filepath-0.0.1.0/bin
4.90 s
[pathway-compat-filepath] Libraries installed in:
4.90 s
[pathway-compat-filepath] /nix/store/q9fsagpd29spy55dp5m0zri4is79nfz5-pathway-compat-filepath-0.0.1.0/lib/ghc-9.6.7/lib/x86_64-linux-ghc-9.6.7/pathway-compat-filepath-0.0.1.0-Ck51GFznMiC2cxIfBMz4NH
4.90 s
[pathway-compat-filepath] Dynamic Libraries installed in:
4.90 s
[pathway-compat-filepath] /nix/store/q9fsagpd29spy55dp5m0zri4is79nfz5-pathway-compat-filepath-0.0.1.0/lib/ghc-9.6.7/lib/x86_64-linux-ghc-9.6.7
4.90 s
[pathway-compat-filepath] Private executables installed in:
4.90 s
[pathway-compat-filepath] /nix/store/q9fsagpd29spy55dp5m0zri4is79nfz5-pathway-compat-filepath-0.0.1.0/libexec/x86_64-linux-ghc-9.6.7/pathway-compat-filepath-0.0.1.0
4.90 s
[pathway-compat-filepath] Data files installed in:
4.90 s
[pathway-compat-filepath] /nix/store/q9fsagpd29spy55dp5m0zri4is79nfz5-pathway-compat-filepath-0.0.1.0/share/x86_64-linux-ghc-9.6.7/pathway-compat-filepath-0.0.1.0
4.90 s
[pathway-compat-filepath] Documentation installed in:
4.90 s
[pathway-compat-filepath] /nix/store/gsxpk94inw22circr76qnnbmvc6ziwhz-pathway-compat-filepath-0.0.1.0-doc/share/doc/pathway-compat-filepath-0.0.1.0
4.90 s
[pathway-compat-filepath] Configuration files installed in:
4.90 s
[pathway-compat-filepath] /nix/store/q9fsagpd29spy55dp5m0zri4is79nfz5-pathway-compat-filepath-0.0.1.0/etc
4.90 s
[pathway-compat-filepath] No alex found
4.90 s
[pathway-compat-filepath] Using ar found on system at:
4.90 s
[pathway-compat-filepath] /nix/store/zjraf40s86y3iwhp626b934r5y6ldkbb-binutils-wrapper-2.46/bin/ar
4.90 s
[pathway-compat-filepath] No c2hs found
4.90 s
[pathway-compat-filepath] No cpphs found
4.90 s
[pathway-compat-filepath] Using doctest version 0.24.3 found on system at:
4.90 s
[pathway-compat-filepath] /nix/store/s48k56ayjjxwdbz9y7d8mnqwlcjfi1a8-doctest-0.24.3/bin/doctest
4.90 s
[pathway-compat-filepath] Using gcc version 15.2.0 given by user at:
4.90 s
[pathway-compat-filepath] /nix/store/29qjlshvklnyr67nhpprzgb9igmsfsjj-gcc-wrapper-15.2.0/bin/gcc
4.90 s
[pathway-compat-filepath] Using ghc version 9.6.7 found on system at:
4.90 s
[pathway-compat-filepath] /nix/store/2djpcnj8a25viv1y24h3mziy1gsy3fc6-ghc-9.6.7/bin/ghc
4.90 s
[pathway-compat-filepath] Using ghc-pkg version 9.6.7 found on system at:
4.90 s
[pathway-compat-filepath] /nix/store/2djpcnj8a25viv1y24h3mziy1gsy3fc6-ghc-9.6.7/bin/ghc-pkg-9.6.7
4.90 s
[pathway-compat-filepath] No ghcjs found
4.90 s
[pathway-compat-filepath] No ghcjs-pkg found
4.90 s
[pathway-compat-filepath] No greencard found
4.90 s
[pathway-compat-filepath] Using haddock version 2.29.2 found on system at:
4.90 s
[pathway-compat-filepath] /nix/store/2djpcnj8a25viv1y24h3mziy1gsy3fc6-ghc-9.6.7/bin/haddock-ghc-9.6.7
4.90 s
[pathway-compat-filepath] No happy found
4.90 s
[pathway-compat-filepath] Using haskell-suite found on system at: haskell-suite-dummy-location
4.90 s
[pathway-compat-filepath] Using haskell-suite-pkg found on system at: haskell-suite-pkg-dummy-location
4.90 s
[pathway-compat-filepath] No hmake found
4.90 s
[pathway-compat-filepath] Using hpc version 0.68 found on system at:
4.90 s
[pathway-compat-filepath] /nix/store/2djpcnj8a25viv1y24h3mziy1gsy3fc6-ghc-9.6.7/bin/hpc-ghc-9.6.7
4.90 s
[pathway-compat-filepath] Using hsc2hs version 0.68.9 found on system at:
4.90 s
[pathway-compat-filepath] /nix/store/2djpcnj8a25viv1y24h3mziy1gsy3fc6-ghc-9.6.7/bin/hsc2hs-ghc-9.6.7
4.90 s
[pathway-compat-filepath] Using hscolour version 1.25 found on system at:
4.90 s
[pathway-compat-filepath] /nix/store/2x19jxh5g98bv0s06mdj71c1hmxi54yl-hscolour-1.25/bin/HsColour
4.90 s
[pathway-compat-filepath] No jhc found
4.90 s
[pathway-compat-filepath] Using ld found on system at:
4.90 s
[pathway-compat-filepath] /nix/store/zjraf40s86y3iwhp626b934r5y6ldkbb-binutils-wrapper-2.46/bin/ld.gold
4.90 s
[pathway-compat-filepath] No pkg-config found
4.90 s
[pathway-compat-filepath] Using runghc version 9.6.7 found on system at:
4.90 s
[pathway-compat-filepath] /nix/store/2djpcnj8a25viv1y24h3mziy1gsy3fc6-ghc-9.6.7/bin/runghc-9.6.7
4.90 s
[pathway-compat-filepath] Using strip version 2.46 found on system at:
4.90 s
[pathway-compat-filepath] /nix/store/29qjlshvklnyr67nhpprzgb9igmsfsjj-gcc-wrapper-15.2.0/bin/strip
4.90 s
[pathway-compat-filepath] Using tar found on system at:
4.90 s
[pathway-compat-filepath] /nix/store/z5mq2sam4484prf3kv6v6vjw1m0i7j24-gnutar-1.35/bin/tar
4.90 s
[pathway-compat-filepath] No uhc found
5.34 s
[pathway-compat-filepath] Phase: buildPhase
5.42 s
[pathway-compat-filepath] Preprocessing library for pathway-compat-filepath-0.0.1.0..
5.43 s
[pathway-compat-filepath] Building library for pathway-compat-filepath-0.0.1.0..
5.51 s
[pathway-compat-filepath] [ 1 of 10] Compiling Common.FilePath ( src/Common/FilePath.hs, dist/build/Common/FilePath.o, dist/build/Common/FilePath.dyn_o )
5.80 s
[pathway-compat-filepath] [ 2 of 10] Compiling Common.OsPath ( src/Common/OsPath.hs, dist/build/Common/OsPath.o, dist/build/Common/OsPath.dyn_o )
8.13 s
[pathway-compat-filepath]
8.13 s
[pathway-compat-filepath] src/Common/OsPath.hs:90:23: error : [ GHC-83865 ]
8.13 s
[pathway-compat-filepath] • Couldn't match type ‘OSS.OsString’ with ‘OsString’
8.13 s
[pathway-compat-filepath] Expected: OsPath
8.13 s
[pathway-compat-filepath] Actual: OSS.OsString
8.13 s
[pathway-compat-filepath] NB: ‘OsString’
8.13 s
[pathway-compat-filepath] is defined in ‘System.OsString.Internal.Types.Hidden’
8.13 s
[pathway-compat-filepath] in package ‘filepath-1.4.301.0’
8.13 s
[pathway-compat-filepath] ‘OSS.OsString’
8.13 s
[pathway-compat-filepath] is defined in ‘System.OsString.Internal.Types’
8.13 s
[pathway-compat-filepath] in package ‘os-string-2.0.10’
8.13 s
[pathway-compat-filepath] • In the ‘parent’ field of a record
8.13 s
[pathway-compat-filepath] In the expression:
8.13 s
[pathway-compat-filepath] Format
8.13 s
[pathway-compat-filepath] {Format.root = O.pack . pure $ O.pathSeparator,
8.13 s
[pathway-compat-filepath] Format.current = mempty, Format.parent = OSS.unsafeEncodeUtf "..",
8.13 s
[pathway-compat-filepath] Format.separator = O.pack . pure $ O.pathSeparator,
8.13 s
[pathway-compat-filepath] Format.substitutions = mempty}
8.13 s
[pathway-compat-filepath] In an equation for ‘localFormat’:
8.13 s
[pathway-compat-filepath] localFormat
8.13 s
[pathway-compat-filepath] = Format
8.13 s
[pathway-compat-filepath] {Format.root = O.pack . pure $ O.pathSeparator,
8.13 s
[pathway-compat-filepath] Format.current = mempty, Format.parent = OSS.unsafeEncodeUtf "..",
8.13 s
[pathway-compat-filepath] Format.separator = O.pack . pure $ O.pathSeparator,
8.13 s
[pathway-compat-filepath] Format.substitutions = mempty}
8.13 s
[pathway-compat-filepath] |
8.13 s
[pathway-compat-filepath] 90 | Format.parent = OSS.unsafeEncodeUtf ".." ,
8.13 s
[pathway-compat-filepath] | ^^^^^^^^^^^^^^^^^^^^^^^^
8.13 s
[pathway-compat-filepath] [ 3 of 10] Compiling System.FilePath.Thin ( src/System/FilePath/Thin.hs, dist/build/System/FilePath/Thin.o, dist/build/System/FilePath/Thin.dyn_o )
8.13 s
[pathway-compat-filepath] [ 4 of 10] Compiling System.FilePath.Pathway ( src/System/FilePath/Pathway.hs, dist/build/System/FilePath/Pathway.o, dist/build/System/FilePath/Pathway.dyn_o )
8.13 s
[pathway-compat-filepath] [ 5 of 10] Compiling System.FilePath.Overlay ( src/System/FilePath/Overlay.hs, dist/build/System/FilePath/Overlay.o, dist/build/System/FilePath/Overlay.dyn_o )
8.13 s
[pathway-compat-filepath] [ 6 of 10] Compiling System.FilePath ( src/System/FilePath.hs, dist/build/System/FilePath.o, dist/build/System/FilePath.dyn_o )
8.13 s
Progress: 0 of 12 built (1 failed)
8.13 s
Failed to build pathway-compat-filepath after 6.0s
8.13 s
error: Cannot build '/nix/store/isq7l83m10yyykzr1f202hq4n23f43p1-pathway-compat-filepath-0.0.1.0.drv '.
8.13 s
Reason: builder failed with exit code 1 .
8.13 s
Output paths:
8.13 s
/nix/store/gsxpk94inw22circr76qnnbmvc6ziwhz-pathway-compat-filepath-0.0.1.0-doc
8.13 s
/nix/store/q9fsagpd29spy55dp5m0zri4is79nfz5-pathway-compat-filepath-0.0.1.0
8.13 s
Last 176 log lines:
8.13 s
> Running phase: setupCompilerEnvironmentPhase
8.13 s
> Build with /nix/store/2djpcnj8a25viv1y24h3mziy1gsy3fc6-ghc-9.6.7.
8.13 s
> Running phase: unpackPhase
8.13 s
> unpacking source archive /nix/store/5z4x7vzkb1m65ccyx19wn7vcxdl9gmbf-filepath
8.13 s
> source root is filepath
8.13 s
> Running phase: patchPhase
8.13 s
> Running phase: compileBuildDriverPhase
8.13 s
> setupCompileFlags: -package-db=/build/tmp.ypuQ74KOZe/setup-package.conf.d -threaded
8.13 s
> [1 of 2] Compiling Main ( Setup.hs, /build/tmp.ypuQ74KOZe/Main.o )
8.13 s
> [2 of 2] Linking Setup
8.13 s
> Running phase: updateAutotoolsGnuConfigScriptsPhase
8.13 s
> Running phase: configurePhase
8.13 s
> configureFlags: --verbose --prefix=/nix/store/q9fsagpd29spy55dp5m0zri4is79nfz5-pathway-compat-filepath-0.0.1.0 --libdir=$prefix/lib/$compiler/lib --libsubdir=$abi/$libname --docdir=/nix/store/gsxpk94inw22circr76qnnbmvc6ziwhz-pathway-compat-filepath-0.0.1.0-doc/share/doc/pathway-compat-filepath-0.0.1.0 --with-gcc=gcc --package-db=/build/tmp.ypuQ74KOZe/package.conf.d --ghc-option=-j16 --ghc-option=+RTS --ghc-option=-A64M --ghc-option=-RTS --enable-library-profiling --profiling-detail=exported-functions --disable-profiling --enable-shared --disable-coverage --enable-static --disable-executable-dynamic --enable-tests --disable-benchmarks --enable-library-vanilla --disable-library-for-ghci --enable-split-sections --enable-library-stripping --enable-executable-stripping --ghc-option=-haddock --ghc-options=-Werror --extra-lib-dirs=/nix/store/pndhkk0l649lm1sj0mxk7cbwq26qd1ra-ncurses-6.6/lib --extra-lib-dirs=/nix/store/0djlg4g0b81w94k3vcaqsxsc2hh4kism-libffi-3.5.2/lib --extra-lib-dirs=/nix/store/md4paia7riiggyrj8p24c7a6vf8w7jz8-elfutils-0.194/lib --extra-lib-dirs=/nix/store/39vv2pf64gd8li48a4hpbhw2crzd8z5p-gmp-with-cxx-6.3.0/lib --extra-lib-dirs=/nix/store/7wwvald8lapkrsr72qanlw8blyn55ifx-numactl-2.0.18/lib --extra-lib-dirs=/nix/store/2djpcnj8a25viv1y24h3mziy1gsy3fc6-ghc-9.6.7/lib
8.13 s
> Using Parsec parser
8.13 s
> Configuring pathway-compat-filepath-0.0.1.0...
8.13 s
> Flags chosen: noisy-deprecations=True, verify-no-recursion=False
8.13 s
> Dependency base >=4.14.0 && <4.15 || >=4.15.0 && <4.16 || >=4.16.0 && <4.17 ||
8.13 s
> >=4.17.0 && <4.18 || >=4.18.0 && <4.19 || >=4.19.0 && <4.20 || >=4.20.0 &&
8.13 s
> <4.21 || >=4.21.0 && <4.22 || >=4.22.0 && <4.23: using base-4.18.3.0
8.13 s
> Dependency extra: using extra-1.8.1
8.13 s
> Dependency filepath >=1.4.2 && <1.5 || >=1.5.0 && <1.6: using
8.13 s
> filepath-1.4.301.0
8.13 s
> Dependency megaparsec >=9.0.1 && <9.1 || >=9.2.1 && <9.3 || >=9.5.0 && <9.6 ||
8.13 s
> >=9.7.0 && <9.8: using megaparsec-9.7.0
8.13 s
> Dependency os-string: using os-string-2.0.10
8.13 s
> Dependency pathway >=0.0.1 && <0.1: using pathway-0.0.1.0
8.13 s
> Dependency pathway-compat-base >=0.0.1 && <0.1: using
8.13 s
> pathway-compat-base-0.0.1.0
8.13 s
> Dependency pathway-internal >=0.0.1 && <0.1: using pathway-internal-0.0.1.0
8.13 s
> Dependency base >=4.14.0 && <4.15 || >=4.15.0 && <4.16 || >=4.16.0 && <4.17 ||
8.13 s
> >=4.17.0 && <4.18 || >=4.18.0 && <4.19 || >=4.19.0 && <4.20 || >=4.20.0 &&
8.13 s
> <4.21 || >=4.21.0 && <4.22 || >=4.22.0 && <4.23: using base-4.18.3.0
8.13 s
> Dependency doctest >=0.16.3 && <0.17 || >=0.18.1 && <0.19 || >=0.20.1 && <0.21
8.13 s
> || >=0.21.1 && <0.22 || >=0.22.2 && <0.23 || >=0.24.2 && <0.25: using
8.13 s
> doctest-0.24.3
8.13 s
> Dependency pathway-compat-filepath: using pathway-compat-filepath-0.0.1.0
8.13 s
> Source component graph:
8.13 s
> component lib
8.13 s
> component test:doctests dependency lib
8.13 s
> Configured component graph:
8.13 s
> component pathway-compat-filepath-0.0.1.0-Ck51GFznMiC2cxIfBMz4NH
8.13 s
> include base-4.18.3.0
8.13 s
> include extra-1.8.1-FU1frm3XcM88A49dBkmtgI
8.13 s
> include filepath-1.4.301.0
8.13 s
> include megaparsec-9.7.0-EpAk7LLR2KBGAKafJPbXz1
8.13 s
> include os-string-2.0.10-19KGKnZaj8J2ODUMyNXxJr
8.13 s
> include pathway-0.0.1.0-5VJXWbvreBAfybP2NROr3
8.13 s
> include pathway-compat-base-0.0.1.0-E02izPYkwmmGdAPlQBKjbP
8.13 s
> include pathway-internal-0.0.1.0-1xeSc3z2VhRIotiMz9hdL1
8.13 s
> component pathway-compat-filepath-0.0.1.0-Bh4LT0cz7im2Vo1hGnl75g-doctests
8.13 s
> include base-4.18.3.0
8.13 s
> include doctest-0.24.3-ACQNy8u8jPjC50l4I3tyiL
8.13 s
> include pathway-compat-filepath-0.0.1.0-Ck51GFznMiC2cxIfBMz4NH
8.13 s
> Linked component graph:
8.13 s
> unit pathway-compat-filepath-0.0.1.0-Ck51GFznMiC2cxIfBMz4NH
8.13 s
> include base-4.18.3.0
8.13 s
> include extra-1.8.1-FU1frm3XcM88A49dBkmtgI
8.13 s
> include filepath-1.4.301.0
8.13 s
> include megaparsec-9.7.0-EpAk7LLR2KBGAKafJPbXz1
8.13 s
> include os-string-2.0.10-19KGKnZaj8J2ODUMyNXxJr
8.13 s
> include pathway-0.0.1.0-5VJXWbvreBAfybP2NROr3
8.13 s
> include pathway-compat-base-0.0.1.0-E02izPYkwmmGdAPlQBKjbP
8.13 s
> include pathway-internal-0.0.1.0-1xeSc3z2VhRIotiMz9hdL1
8.13 s
> Common.FilePath=pathway-compat-filepath-0.0.1.0-Ck51GFznMiC2cxIfBMz4NH:Common.FilePath,Common.OsPath=pathway-compat-filepath-0.0.1.0-Ck51GFznMiC2cxIfBMz4NH:Common.OsPath,System.FilePath=pathway-compat-filepath-0.0.1.0-Ck51GFznMiC2cxIfBMz4NH:System.FilePath,System.FilePath.Overlay=pathway-compat-filepath-0.0.1.0-Ck51GFznMiC2cxIfBMz4NH:System.FilePath.Overlay,System.FilePath.Pathway=pathway-compat-filepath-0.0.1.0-Ck51GFznMiC2cxIfBMz4NH:System.FilePath.Pathway,System.FilePath.Thin=pathway-compat-filepath-0.0.1.0-Ck51GFznMiC2cxIfBMz4NH:System.FilePath.Thin,System.OsPath=pathway-compat-filepath-0.0.1.0-Ck51GFznMiC2cxIfBMz4NH:System.OsPath,System.OsPath.Overlay=pathway-compat-filepath-0.0.1.0-Ck51GFznMiC2cxIfBMz4NH:System.OsPath.Overlay,System.OsPath.Pathway=pathway-compat-filepath-0.0.1.0-Ck51GFznMiC2cxIfBMz4NH:System.OsPath.Pathway,System.OsPath.Thin=pathway-compat-filepath-0.0.1.0-Ck51GFznMiC2cxIfBMz4NH:System.OsPath.Thin
8.13 s
> unit pathway-compat-filepath-0.0.1.0-Bh4LT0cz7im2Vo1hGnl75g-doctests
8.13 s
> include base-4.18.3.0
8.13 s
> include doctest-0.24.3-ACQNy8u8jPjC50l4I3tyiL
8.13 s
> include pathway-compat-filepath-0.0.1.0-Ck51GFznMiC2cxIfBMz4NH
8.13 s
> Ready component graph:
8.13 s
> definite pathway-compat-filepath-0.0.1.0-Ck51GFznMiC2cxIfBMz4NH
8.13 s
> depends base-4.18.3.0
8.13 s
> depends extra-1.8.1-FU1frm3XcM88A49dBkmtgI
8.13 s
> depends filepath-1.4.301.0
8.13 s
> depends megaparsec-9.7.0-EpAk7LLR2KBGAKafJPbXz1
8.13 s
> depends os-string-2.0.10-19KGKnZaj8J2ODUMyNXxJr
8.13 s
> depends pathway-0.0.1.0-5VJXWbvreBAfybP2NROr3
8.13 s
> depends pathway-compat-base-0.0.1.0-E02izPYkwmmGdAPlQBKjbP
8.13 s
> depends pathway-internal-0.0.1.0-1xeSc3z2VhRIotiMz9hdL1
8.13 s
> definite pathway-compat-filepath-0.0.1.0-Bh4LT0cz7im2Vo1hGnl75g-doctests
8.13 s
> depends base-4.18.3.0
8.13 s
> depends doctest-0.24.3-ACQNy8u8jPjC50l4I3tyiL
8.13 s
> depends pathway-compat-filepath-0.0.1.0-Ck51GFznMiC2cxIfBMz4NH
8.13 s
> Using Cabal-3.10.3.0 compiled by ghc-9.6
8.13 s
> Using compiler: ghc-9.6.7
8.13 s
> Using install prefix:
8.13 s
> /nix/store/q9fsagpd29spy55dp5m0zri4is79nfz5-pathway-compat-filepath-0.0.1.0
8.13 s
> Executables installed in:
8.13 s
> /nix/store/q9fsagpd29spy55dp5m0zri4is79nfz5-pathway-compat-filepath-0.0.1.0/bin
8.13 s
> Libraries installed in:
8.13 s
> /nix/store/q9fsagpd29spy55dp5m0zri4is79nfz5-pathway-compat-filepath-0.0.1.0/lib/ghc-9.6.7/lib/x86_64-linux-ghc-9.6.7/pathway-compat-filepath-0.0.1.0-Ck51GFznMiC2cxIfBMz4NH
8.13 s
> Dynamic Libraries installed in:
8.13 s
> /nix/store/q9fsagpd29spy55dp5m0zri4is79nfz5-pathway-compat-filepath-0.0.1.0/lib/ghc-9.6.7/lib/x86_64-linux-ghc-9.6.7
8.13 s
> Private executables installed in:
8.13 s
> /nix/store/q9fsagpd29spy55dp5m0zri4is79nfz5-pathway-compat-filepath-0.0.1.0/libexec/x86_64-linux-ghc-9.6.7/pathway-compat-filepath-0.0.1.0
8.13 s
> Data files installed in:
8.13 s
> /nix/store/q9fsagpd29spy55dp5m0zri4is79nfz5-pathway-compat-filepath-0.0.1.0/share/x86_64-linux-ghc-9.6.7/pathway-compat-filepath-0.0.1.0
8.13 s
> Documentation installed in:
8.13 s
> /nix/store/gsxpk94inw22circr76qnnbmvc6ziwhz-pathway-compat-filepath-0.0.1.0-doc/share/doc/pathway-compat-filepath-0.0.1.0
8.13 s
> Configuration files installed in:
8.13 s
> /nix/store/q9fsagpd29spy55dp5m0zri4is79nfz5-pathway-compat-filepath-0.0.1.0/etc
8.13 s
> No alex found
8.13 s
> Using ar found on system at:
8.13 s
> /nix/store/zjraf40s86y3iwhp626b934r5y6ldkbb-binutils-wrapper-2.46/bin/ar
8.13 s
> No c2hs found
8.13 s
> No cpphs found
8.13 s
> Using doctest version 0.24.3 found on system at:
8.13 s
> /nix/store/s48k56ayjjxwdbz9y7d8mnqwlcjfi1a8-doctest-0.24.3/bin/doctest
8.13 s
> Using gcc version 15.2.0 given by user at:
8.13 s
> /nix/store/29qjlshvklnyr67nhpprzgb9igmsfsjj-gcc-wrapper-15.2.0/bin/gcc
8.13 s
> Using ghc version 9.6.7 found on system at:
8.13 s
> /nix/store/2djpcnj8a25viv1y24h3mziy1gsy3fc6-ghc-9.6.7/bin/ghc
8.13 s
> Using ghc-pkg version 9.6.7 found on system at:
8.13 s
> /nix/store/2djpcnj8a25viv1y24h3mziy1gsy3fc6-ghc-9.6.7/bin/ghc-pkg-9.6.7
8.13 s
> No ghcjs found
8.13 s
> No ghcjs-pkg found
8.13 s
> No greencard found
8.13 s
> Using haddock version 2.29.2 found on system at:
8.13 s
> /nix/store/2djpcnj8a25viv1y24h3mziy1gsy3fc6-ghc-9.6.7/bin/haddock-ghc-9.6.7
8.13 s
> No happy found
8.13 s
> Using haskell-suite found on system at: haskell-suite-dummy-location
8.13 s
> Using haskell-suite-pkg found on system at: haskell-suite-pkg-dummy-location
8.13 s
> No hmake found
8.13 s
> Using hpc version 0.68 found on system at:
8.13 s
> /nix/store/2djpcnj8a25viv1y24h3mziy1gsy3fc6-ghc-9.6.7/bin/hpc-ghc-9.6.7
8.13 s
> Using hsc2hs version 0.68.9 found on system at:
8.13 s
> /nix/store/2djpcnj8a25viv1y24h3mziy1gsy3fc6-ghc-9.6.7/bin/hsc2hs-ghc-9.6.7
8.13 s
> Using hscolour version 1.25 found on system at:
8.13 s
> /nix/store/2x19jxh5g98bv0s06mdj71c1hmxi54yl-hscolour-1.25/bin/HsColour
8.13 s
> No jhc found
8.13 s
> Using ld found on system at:
8.13 s
> /nix/store/zjraf40s86y3iwhp626b934r5y6ldkbb-binutils-wrapper-2.46/bin/ld.gold
8.13 s
> No pkg-config found
8.13 s
> Using runghc version 9.6.7 found on system at:
8.13 s
> /nix/store/2djpcnj8a25viv1y24h3mziy1gsy3fc6-ghc-9.6.7/bin/runghc-9.6.7
8.13 s
> Using strip version 2.46 found on system at:
8.13 s
> /nix/store/29qjlshvklnyr67nhpprzgb9igmsfsjj-gcc-wrapper-15.2.0/bin/strip
8.13 s
> Using tar found on system at:
8.13 s
> /nix/store/z5mq2sam4484prf3kv6v6vjw1m0i7j24-gnutar-1.35/bin/tar
8.13 s
> No uhc found
8.13 s
> Running phase: buildPhase
8.13 s
> Preprocessing library for pathway-compat-filepath-0.0.1.0..
8.13 s
> Building library for pathway-compat-filepath-0.0.1.0..
8.13 s
> [ 1 of 10] Compiling Common.FilePath ( src/Common/FilePath.hs, dist/build/Common/FilePath.o, dist/build/Common/FilePath.dyn_o )
8.13 s
> [ 2 of 10] Compiling Common.OsPath ( src/Common/OsPath.hs, dist/build/Common/OsPath.o, dist/build/Common/OsPath.dyn_o )
8.13 s
>
8.13 s
> src/Common/OsPath.hs:90:23: error : [ GHC-83865 ]
8.13 s
> • Couldn't match type ‘OSS.OsString’ with ‘OsString’
8.13 s
> Expected: OsPath
8.13 s
> Actual: OSS.OsString
8.13 s
> NB: ‘OsString’
8.13 s
> is defined in ‘System.OsString.Internal.Types.Hidden’
8.13 s
> in package ‘filepath-1.4.301.0’
8.13 s
> ‘OSS.OsString’
8.13 s
> is defined in ‘System.OsString.Internal.Types’
8.13 s
> in package ‘os-string-2.0.10’
8.13 s
> • In the ‘parent’ field of a record
8.13 s
> In the expression:
8.13 s
> Format
8.13 s
> {Format.root = O.pack . pure $ O.pathSeparator,
8.13 s
> Format.current = mempty, Format.parent = OSS.unsafeEncodeUtf "..",
8.13 s
> Format.separator = O.pack . pure $ O.pathSeparator,
8.13 s
> Format.substitutions = mempty}
8.13 s
> In an equation for ‘localFormat’:
8.13 s
> localFormat
8.13 s
> = Format
8.13 s
> {Format.root = O.pack . pure $ O.pathSeparator,
8.13 s
> Format.current = mempty, Format.parent = OSS.unsafeEncodeUtf "..",
8.13 s
> Format.separator = O.pack . pure $ O.pathSeparator,
8.13 s
> Format.substitutions = mempty}
8.13 s
> |
8.13 s
> 90 | Format.parent = OSS.unsafeEncodeUtf ".." ,
8.13 s
> | ^^^^^^^^^^^^^^^^^^^^^^^^
8.13 s
> [ 3 of 10] Compiling System.FilePath.Thin ( src/System/FilePath/Thin.hs, dist/build/System/FilePath/Thin.o, dist/build/System/FilePath/Thin.dyn_o )
8.13 s
> [ 4 of 10] Compiling System.FilePath.Pathway ( src/System/FilePath/Pathway.hs, dist/build/System/FilePath/Pathway.o, dist/build/System/FilePath/Pathway.dyn_o )
8.13 s
> [ 5 of 10] Compiling System.FilePath.Overlay ( src/System/FilePath/Overlay.hs, dist/build/System/FilePath/Overlay.o, dist/build/System/FilePath/Overlay.dyn_o )
8.13 s
> [ 6 of 10] Compiling System.FilePath ( src/System/FilePath.hs, dist/build/System/FilePath.o, dist/build/System/FilePath.dyn_o )
8.13 s
For full logs, run:
8.13 s
nix log /nix/store/isq7l83m10yyykzr1f202hq4n23f43p1-pathway-compat-filepath-0.0.1.0.drv
8.13 s
error: Cannot build '/nix/store/isq7l83m10yyykzr1f202hq4n23f43p1-pathway-compat-filepath-0.0.1.0.drv '.
8.13 s
Reason: builder failed with exit code 1 .
8.13 s
Output paths:
8.13 s
/nix/store/gsxpk94inw22circr76qnnbmvc6ziwhz-pathway-compat-filepath-0.0.1.0-doc
8.13 s
/nix/store/q9fsagpd29spy55dp5m0zri4is79nfz5-pathway-compat-filepath-0.0.1.0
8.13 s
Last 176 log lines:
8.13 s
> Running phase: setupCompilerEnvironmentPhase
8.13 s
> Build with /nix/store/2djpcnj8a25viv1y24h3mziy1gsy3fc6-ghc-9.6.7.
8.13 s
> Running phase: unpackPhase
8.13 s
> unpacking source archive /nix/store/5z4x7vzkb1m65ccyx19wn7vcxdl9gmbf-filepath
8.13 s
> source root is filepath
8.13 s
> Running phase: patchPhase
8.13 s
> Running phase: compileBuildDriverPhase
8.13 s
> setupCompileFlags: -package-db=/build/tmp.ypuQ74KOZe/setup-package.conf.d -threaded
8.13 s
> [1 of 2] Compiling Main ( Setup.hs, /build/tmp.ypuQ74KOZe/Main.o )
8.13 s
> [2 of 2] Linking Setup
8.13 s
> Running phase: updateAutotoolsGnuConfigScriptsPhase
8.13 s
> Running phase: configurePhase
8.13 s
> configureFlags: --verbose --prefix=/nix/store/q9fsagpd29spy55dp5m0zri4is79nfz5-pathway-compat-filepath-0.0.1.0 --libdir=$prefix/lib/$compiler/lib --libsubdir=$abi/$libname --docdir=/nix/store/gsxpk94inw22circr76qnnbmvc6ziwhz-pathway-compat-filepath-0.0.1.0-doc/share/doc/pathway-compat-filepath-0.0.1.0 --with-gcc=gcc --package-db=/build/tmp.ypuQ74KOZe/package.conf.d --ghc-option=-j16 --ghc-option=+RTS --ghc-option=-A64M --ghc-option=-RTS --enable-library-profiling --profiling-detail=exported-functions --disable-profiling --enable-shared --disable-coverage --enable-static --disable-executable-dynamic --enable-tests --disable-benchmarks --enable-library-vanilla --disable-library-for-ghci --enable-split-sections --enable-library-stripping --enable-executable-stripping --ghc-option=-haddock --ghc-options=-Werror --extra-lib-dirs=/nix/store/pndhkk0l649lm1sj0mxk7cbwq26qd1ra-ncurses-6.6/lib --extra-lib-dirs=/nix/store/0djlg4g0b81w94k3vcaqsxsc2hh4kism-libffi-3.5.2/lib --extra-lib-dirs=/nix/store/md4paia7riiggyrj8p24c7a6vf8w7jz8-elfutils-0.194/lib --extra-lib-dirs=/nix/store/39vv2pf64gd8li48a4hpbhw2crzd8z5p-gmp-with-cxx-6.3.0/lib --extra-lib-dirs=/nix/store/7wwvald8lapkrsr72qanlw8blyn55ifx-numactl-2.0.18/lib --extra-lib-dirs=/nix/store/2djpcnj8a25viv1y24h3mziy1gsy3fc6-ghc-9.6.7/lib
8.13 s
> Using Parsec parser
8.13 s
> Configuring pathway-compat-filepath-0.0.1.0...
8.13 s
> Flags chosen: noisy-deprecations=True, verify-no-recursion=False
8.13 s
> Dependency base >=4.14.0 && <4.15 || >=4.15.0 && <4.16 || >=4.16.0 && <4.17 ||
8.13 s
> >=4.17.0 && <4.18 || >=4.18.0 && <4.19 || >=4.19.0 && <4.20 || >=4.20.0 &&
8.13 s
> <4.21 || >=4.21.0 && <4.22 || >=4.22.0 && <4.23: using base-4.18.3.0
8.13 s
> Dependency extra: using extra-1.8.1
8.13 s
> Dependency filepath >=1.4.2 && <1.5 || >=1.5.0 && <1.6: using
8.13 s
> filepath-1.4.301.0
8.13 s
> Dependency megaparsec >=9.0.1 && <9.1 || >=9.2.1 && <9.3 || >=9.5.0 && <9.6 ||
8.13 s
> >=9.7.0 && <9.8: using megaparsec-9.7.0
8.13 s
> Dependency os-string: using os-string-2.0.10
8.13 s
> Dependency pathway >=0.0.1 && <0.1: using pathway-0.0.1.0
8.13 s
> Dependency pathway-compat-base >=0.0.1 && <0.1: using
8.13 s
> pathway-compat-base-0.0.1.0
8.13 s
> Dependency pathway-internal >=0.0.1 && <0.1: using pathway-internal-0.0.1.0
8.13 s
> Dependency base >=4.14.0 && <4.15 || >=4.15.0 && <4.16 || >=4.16.0 && <4.17 ||
8.13 s
> >=4.17.0 && <4.18 || >=4.18.0 && <4.19 || >=4.19.0 && <4.20 || >=4.20.0 &&
8.13 s
> <4.21 || >=4.21.0 && <4.22 || >=4.22.0 && <4.23: using base-4.18.3.0
8.13 s
> Dependency doctest >=0.16.3 && <0.17 || >=0.18.1 && <0.19 || >=0.20.1 && <0.21
8.13 s
> || >=0.21.1 && <0.22 || >=0.22.2 && <0.23 || >=0.24.2 && <0.25: using
8.13 s
> doctest-0.24.3
8.13 s
> Dependency pathway-compat-filepath: using pathway-compat-filepath-0.0.1.0
8.13 s
> Source component graph:
8.13 s
> component lib
8.13 s
> component test:doctests dependency lib
8.13 s
> Configured component graph:
8.13 s
> component pathway-compat-filepath-0.0.1.0-Ck51GFznMiC2cxIfBMz4NH
8.13 s
> include base-4.18.3.0
8.13 s
> include extra-1.8.1-FU1frm3XcM88A49dBkmtgI
8.13 s
> include filepath-1.4.301.0
8.13 s
> include megaparsec-9.7.0-EpAk7LLR2KBGAKafJPbXz1
8.13 s
> include os-string-2.0.10-19KGKnZaj8J2ODUMyNXxJr
8.13 s
> include pathway-0.0.1.0-5VJXWbvreBAfybP2NROr3
8.13 s
> include pathway-compat-base-0.0.1.0-E02izPYkwmmGdAPlQBKjbP
8.13 s
> include pathway-internal-0.0.1.0-1xeSc3z2VhRIotiMz9hdL1
8.13 s
> component pathway-compat-filepath-0.0.1.0-Bh4LT0cz7im2Vo1hGnl75g-doctests
8.13 s
> include base-4.18.3.0
8.13 s
> include doctest-0.24.3-ACQNy8u8jPjC50l4I3tyiL
8.13 s
> include pathway-compat-filepath-0.0.1.0-Ck51GFznMiC2cxIfBMz4NH
8.13 s
> Linked component graph:
8.13 s
> unit pathway-compat-filepath-0.0.1.0-Ck51GFznMiC2cxIfBMz4NH
8.13 s
> include base-4.18.3.0
8.13 s
> include extra-1.8.1-FU1frm3XcM88A49dBkmtgI
8.13 s
> include filepath-1.4.301.0
8.13 s
> include megaparsec-9.7.0-EpAk7LLR2KBGAKafJPbXz1
8.13 s
> include os-string-2.0.10-19KGKnZaj8J2ODUMyNXxJr
8.13 s
> include pathway-0.0.1.0-5VJXWbvreBAfybP2NROr3
8.13 s
> include pathway-compat-base-0.0.1.0-E02izPYkwmmGdAPlQBKjbP
8.13 s
> include pathway-internal-0.0.1.0-1xeSc3z2VhRIotiMz9hdL1
8.13 s
> Common.FilePath=pathway-compat-filepath-0.0.1.0-Ck51GFznMiC2cxIfBMz4NH:Common.FilePath,Common.OsPath=pathway-compat-filepath-0.0.1.0-Ck51GFznMiC2cxIfBMz4NH:Common.OsPath,System.FilePath=pathway-compat-filepath-0.0.1.0-Ck51GFznMiC2cxIfBMz4NH:System.FilePath,System.FilePath.Overlay=pathway-compat-filepath-0.0.1.0-Ck51GFznMiC2cxIfBMz4NH:System.FilePath.Overlay,System.FilePath.Pathway=pathway-compat-filepath-0.0.1.0-Ck51GFznMiC2cxIfBMz4NH:System.FilePath.Pathway,System.FilePath.Thin=pathway-compat-filepath-0.0.1.0-Ck51GFznMiC2cxIfBMz4NH:System.FilePath.Thin,System.OsPath=pathway-compat-filepath-0.0.1.0-Ck51GFznMiC2cxIfBMz4NH:System.OsPath,System.OsPath.Overlay=pathway-compat-filepath-0.0.1.0-Ck51GFznMiC2cxIfBMz4NH:System.OsPath.Overlay,System.OsPath.Pathway=pathway-compat-filepath-0.0.1.0-Ck51GFznMiC2cxIfBMz4NH:System.OsPath.Pathway,System.OsPath.Thin=pathway-compat-filepath-0.0.1.0-Ck51GFznMiC2cxIfBMz4NH:System.OsPath.Thin
8.13 s
> unit pathway-compat-filepath-0.0.1.0-Bh4LT0cz7im2Vo1hGnl75g-doctests
8.13 s
> include base-4.18.3.0
8.13 s
> include doctest-0.24.3-ACQNy8u8jPjC50l4I3tyiL
8.13 s
> include pathway-compat-filepath-0.0.1.0-Ck51GFznMiC2cxIfBMz4NH
8.13 s
> Ready component graph:
8.13 s
> definite pathway-compat-filepath-0.0.1.0-Ck51GFznMiC2cxIfBMz4NH
8.13 s
> depends base-4.18.3.0
8.13 s
> depends extra-1.8.1-FU1frm3XcM88A49dBkmtgI
8.13 s
> depends filepath-1.4.301.0
8.13 s
> depends megaparsec-9.7.0-EpAk7LLR2KBGAKafJPbXz1
8.13 s
> depends os-string-2.0.10-19KGKnZaj8J2ODUMyNXxJr
8.13 s
> depends pathway-0.0.1.0-5VJXWbvreBAfybP2NROr3
8.13 s
> depends pathway-compat-base-0.0.1.0-E02izPYkwmmGdAPlQBKjbP
8.13 s
> depends pathway-internal-0.0.1.0-1xeSc3z2VhRIotiMz9hdL1
8.13 s
> definite pathway-compat-filepath-0.0.1.0-Bh4LT0cz7im2Vo1hGnl75g-doctests
8.13 s
> depends base-4.18.3.0
8.13 s
> depends doctest-0.24.3-ACQNy8u8jPjC50l4I3tyiL
8.13 s
> depends pathway-compat-filepath-0.0.1.0-Ck51GFznMiC2cxIfBMz4NH
8.13 s
> Using Cabal-3.10.3.0 compiled by ghc-9.6
8.13 s
> Using compiler: ghc-9.6.7
8.13 s
> Using install prefix:
8.13 s
> /nix/store/q9fsagpd29spy55dp5m0zri4is79nfz5-pathway-compat-filepath-0.0.1.0
8.13 s
> Executables installed in:
8.13 s
> /nix/store/q9fsagpd29spy55dp5m0zri4is79nfz5-pathway-compat-filepath-0.0.1.0/bin
8.13 s
> Libraries installed in:
8.13 s
> /nix/store/q9fsagpd29spy55dp5m0zri4is79nfz5-pathway-compat-filepath-0.0.1.0/lib/ghc-9.6.7/lib/x86_64-linux-ghc-9.6.7/pathway-compat-filepath-0.0.1.0-Ck51GFznMiC2cxIfBMz4NH
8.13 s
> Dynamic Libraries installed in:
8.13 s
> /nix/store/q9fsagpd29spy55dp5m0zri4is79nfz5-pathway-compat-filepath-0.0.1.0/lib/ghc-9.6.7/lib/x86_64-linux-ghc-9.6.7
8.13 s
> Private executables installed in:
8.13 s
> /nix/store/q9fsagpd29spy55dp5m0zri4is79nfz5-pathway-compat-filepath-0.0.1.0/libexec/x86_64-linux-ghc-9.6.7/pathway-compat-filepath-0.0.1.0
8.13 s
> Data files installed in:
8.13 s
> /nix/store/q9fsagpd29spy55dp5m0zri4is79nfz5-pathway-compat-filepath-0.0.1.0/share/x86_64-linux-ghc-9.6.7/pathway-compat-filepath-0.0.1.0
8.13 s
> Documentation installed in:
8.13 s
> /nix/store/gsxpk94inw22circr76qnnbmvc6ziwhz-pathway-compat-filepath-0.0.1.0-doc/share/doc/pathway-compat-filepath-0.0.1.0
8.13 s
> Configuration files installed in:
8.13 s
> /nix/store/q9fsagpd29spy55dp5m0zri4is79nfz5-pathway-compat-filepath-0.0.1.0/etc
8.13 s
> No alex found
8.13 s
> Using ar found on system at:
8.13 s
> /nix/store/zjraf40s86y3iwhp626b934r5y6ldkbb-binutils-wrapper-2.46/bin/ar
8.13 s
> No c2hs found
8.13 s
> No cpphs found
8.13 s
> Using doctest version 0.24.3 found on system at:
8.13 s
> /nix/store/s48k56ayjjxwdbz9y7d8mnqwlcjfi1a8-doctest-0.24.3/bin/doctest
8.13 s
> Using gcc version 15.2.0 given by user at:
8.13 s
> /nix/store/29qjlshvklnyr67nhpprzgb9igmsfsjj-gcc-wrapper-15.2.0/bin/gcc
8.13 s
> Using ghc version 9.6.7 found on system at:
8.13 s
> /nix/store/2djpcnj8a25viv1y24h3mziy1gsy3fc6-ghc-9.6.7/bin/ghc
8.13 s
> Using ghc-pkg version 9.6.7 found on system at:
8.13 s
> /nix/store/2djpcnj8a25viv1y24h3mziy1gsy3fc6-ghc-9.6.7/bin/ghc-pkg-9.6.7
8.13 s
> No ghcjs found
8.13 s
> No ghcjs-pkg found
8.13 s
> No greencard found
8.13 s
> Using haddock version 2.29.2 found on system at:
8.13 s
> /nix/store/2djpcnj8a25viv1y24h3mziy1gsy3fc6-ghc-9.6.7/bin/haddock-ghc-9.6.7
8.13 s
> No happy found
8.13 s
> Using haskell-suite found on system at: haskell-suite-dummy-location
8.13 s
> Using haskell-suite-pkg found on system at: haskell-suite-pkg-dummy-location
8.13 s
> No hmake found
8.13 s
> Using hpc version 0.68 found on system at:
8.13 s
> /nix/store/2djpcnj8a25viv1y24h3mziy1gsy3fc6-ghc-9.6.7/bin/hpc-ghc-9.6.7
8.13 s
> Using hsc2hs version 0.68.9 found on system at:
8.13 s
> /nix/store/2djpcnj8a25viv1y24h3mziy1gsy3fc6-ghc-9.6.7/bin/hsc2hs-ghc-9.6.7
8.13 s
> Using hscolour version 1.25 found on system at:
8.13 s
> /nix/store/2x19jxh5g98bv0s06mdj71c1hmxi54yl-hscolour-1.25/bin/HsColour
8.13 s
> No jhc found
8.13 s
> Using ld found on system at:
8.13 s
> /nix/store/zjraf40s86y3iwhp626b934r5y6ldkbb-binutils-wrapper-2.46/bin/ld.gold
8.13 s
> No pkg-config found
8.13 s
> Using runghc version 9.6.7 found on system at:
8.13 s
> /nix/store/2djpcnj8a25viv1y24h3mziy1gsy3fc6-ghc-9.6.7/bin/runghc-9.6.7
8.13 s
> Using strip version 2.46 found on system at:
8.13 s
> /nix/store/29qjlshvklnyr67nhpprzgb9igmsfsjj-gcc-wrapper-15.2.0/bin/strip
8.13 s
> Using tar found on system at:
8.13 s
> /nix/store/z5mq2sam4484prf3kv6v6vjw1m0i7j24-gnutar-1.35/bin/tar
8.13 s
> No uhc found
8.13 s
> Running phase: buildPhase
8.13 s
> Preprocessing library for pathway-compat-filepath-0.0.1.0..
8.13 s
> Building library for pathway-compat-filepath-0.0.1.0..
8.13 s
> [ 1 of 10] Compiling Common.FilePath ( src/Common/FilePath.hs, dist/build/Common/FilePath.o, dist/build/Common/FilePath.dyn_o )
8.13 s
> [ 2 of 10] Compiling Common.OsPath ( src/Common/OsPath.hs, dist/build/Common/OsPath.o, dist/build/Common/OsPath.dyn_o )
8.13 s
>
8.13 s
> src/Common/OsPath.hs:90:23: error : [ GHC-83865 ]
8.13 s
> • Couldn't match type ‘OSS.OsString’ with ‘OsString’
8.13 s
> Expected: OsPath
8.13 s
> Actual: OSS.OsString
8.13 s
> NB: ‘OsString’
8.13 s
> is defined in ‘System.OsString.Internal.Types.Hidden’
8.13 s
> in package ‘filepath-1.4.301.0’
8.13 s
> ‘OSS.OsString’
8.13 s
> is defined in ‘System.OsString.Internal.Types’
8.13 s
> in package ‘os-string-2.0.10’
8.13 s
> • In the ‘parent’ field of a record
8.13 s
> In the expression:
8.13 s
> Format
8.13 s
> {Format.root = O.pack . pure $ O.pathSeparator,
8.13 s
> Format.current = mempty, Format.parent = OSS.unsafeEncodeUtf "..",
8.13 s
> Format.separator = O.pack . pure $ O.pathSeparator,
8.13 s
> Format.substitutions = mempty}
8.13 s
> In an equation for ‘localFormat’:
8.13 s
> localFormat
8.13 s
> = Format
8.13 s
> {Format.root = O.pack . pure $ O.pathSeparator,
8.13 s
> Format.current = mempty, Format.parent = OSS.unsafeEncodeUtf "..",
8.13 s
> Format.separator = O.pack . pure $ O.pathSeparator,
8.13 s
> Format.substitutions = mempty}
8.13 s
> |
8.13 s
> 90 | Format.parent = OSS.unsafeEncodeUtf ".." ,
8.13 s
> | ^^^^^^^^^^^^^^^^^^^^^^^^
8.13 s
> [ 3 of 10] Compiling System.FilePath.Thin ( src/System/FilePath/Thin.hs, dist/build/System/FilePath/Thin.o, dist/build/System/FilePath/Thin.dyn_o )
8.13 s
> [ 4 of 10] Compiling System.FilePath.Pathway ( src/System/FilePath/Pathway.hs, dist/build/System/FilePath/Pathway.o, dist/build/System/FilePath/Pathway.dyn_o )
8.13 s
> [ 5 of 10] Compiling System.FilePath.Overlay ( src/System/FilePath/Overlay.hs, dist/build/System/FilePath/Overlay.o, dist/build/System/FilePath/Overlay.dyn_o )
8.13 s
> [ 6 of 10] Compiling System.FilePath ( src/System/FilePath.hs, dist/build/System/FilePath.o, dist/build/System/FilePath.dyn_o )
8.13 s
For full logs, run:
8.13 s
nix log /nix/store/isq7l83m10yyykzr1f202hq4n23f43p1-pathway-compat-filepath-0.0.1.0.drv
8.13 s
error: Cannot build '/nix/store/bpr5w918izm9vxfkr6byadi3arwwsngk-ghc-9.6.7-with-packages.drv '.
8.13 s
Reason: 1 dependency failed .
8.13 s
Output paths:
8.13 s
/nix/store/w0xzk7grmg774djh9flicwfrp1k3bqw4-ghc-9.6.7-with-packages
8.13 s
error: Cannot build '/nix/store/6rvvbn4nsny64yndixwsr5kbnngamlpz-pathway-compat-directory-0.0.1.0.drv '.
8.13 s
Reason: 1 dependency failed .
8.13 s
Output paths:
8.13 s
/nix/store/fb8c9y8a3n35pz051dniy1chxnyamqsk-pathway-compat-directory-0.0.1.0-doc
8.13 s
/nix/store/m2hlbb7cw4m4wi41qg3wcapwhx8pidj3-pathway-compat-directory-0.0.1.0
8.13 s
error: Cannot build '/nix/store/gzfiby42jyphwpxkjd7q4akfcghrj0pq-pathway-compat-file-io-0.0.1.0.drv '.
8.13 s
Reason: 1 dependency failed .
8.13 s
Output paths:
8.13 s
/nix/store/4vxfzhpir4i8m0ns8m7zr6hma6fai8jc-pathway-compat-file-io-0.0.1.0-doc
8.13 s
/nix/store/iwrmym67qgm3xvlj71qlk0lf37fql3yh-pathway-compat-file-io-0.0.1.0
8.13 s
error: Cannot build '/nix/store/8ri2qmf4w6jfifamb1yb1fsb2nrjp773-pathway-compat-temporary-0.0.1.0.drv '.
8.13 s
Reason: 1 dependency failed .
8.13 s
Output paths:
8.13 s
/nix/store/1sa868r5wz084s1vx73w56xi3rh9af9d-pathway-compat-temporary-0.0.1.0
8.13 s
/nix/store/6fwn0wzs278issqpwgkkjaz9c13vw0hc-pathway-compat-temporary-0.0.1.0-doc
8.13 s
error: Cannot build '/nix/store/2w8dn50862rrwygm03k5j7l8warsd57k-pathway-system-0.0.1.0.drv '.
8.13 s
Reason: 1 dependency failed .
8.13 s
Output paths:
8.13 s
/nix/store/ps3kvxiwcm8qn4rmpnh09r10gbnn9hx1-pathway-system-0.0.1.0
8.13 s
/nix/store/q4lgkkr11sghd0k9zfay2syagb0mx8zr-pathway-system-0.0.1.0-doc
8.13 s
error: Build failed due to failed dependency
8.13 s
error: Cannot build '/nix/store/xpxxy1s8m69yjxsbmqgcpfwkzvc6c7cm-all-packages.drv '.
8.13 s
Reason: 1 dependency failed .
8.13 s
Output paths:
8.13 s
/nix/store/hdwsgcxhxv674mjsai1ydk6pm1lm4vpq-all-packages
8.13 s
Build failed due to failed dependency
8.13 s
Build failed.