0.22 s
$ /nix/store/9ypz3flqsrl5xl495mm8h645gadjsxi1-coreutils-9.11/bin/timeout --kill-after=15s 7200s /nix/store/23zk8sgzamrbmj1fday15szf7f2279s8-nix-2.34.7/bin/nix --extra-experimental-features nix-command --extra-experimental-features flakes --log-format internal-json build --no-link --print-out-paths git+https://github.com/sellout/pathway?ref=more-system&rev=1ea193cbc6593071794981ca0dcd055e8eb42609&shallow=1#packages.x86_64-linux.ghc984_all --print-build-logs
0.24 s
warning: ignoring untrusted flake configuration setting 'allow-import-from-derivation'.
0.24 s
Pass '--accept-flake-config' to trust it
0.24 s
warning: ignoring untrusted flake configuration setting 'extra-experimental-features'.
0.24 s
Pass '--accept-flake-config' to trust it
0.24 s
warning: ignoring untrusted flake configuration setting 'extra-substituters'.
0.24 s
Pass '--accept-flake-config' to trust it
0.24 s
warning: ignoring untrusted flake configuration setting 'extra-trusted-public-keys'.
0.24 s
Pass '--accept-flake-config' to trust it
0.24 s
warning: ignoring untrusted flake configuration setting 'sandbox'.
0.24 s
Pass '--accept-flake-config' to trust it
0.24 s
warning: ignoring untrusted flake configuration setting 'use-registries'.
0.24 s
Pass '--accept-flake-config' to trust it
0.24 s
error (ignored): SQLite database '/var/cache/nix-ci-worker/eval-cache-v6/7e8cef9f9a584f12750e4112f9919eb203f4dd515b08e08f130fffcf31865d0a.sqlite ' is busy
1.59 s
2.05 s
Building /nix/store/rfxaff3ggz29012sg3f1gl5j59dk5nzp-pathway-compat-base-0.0.1.0.drv
2.27 s
[pathway-compat-base] Phase: setupCompilerEnvironmentPhase
2.28 s
[pathway-compat-base] Build with /nix/store/7r9b0bl984hdgd70nf5p8raa55kml491-ghc-9.8.4.
2.60 s
[pathway-compat-base] Phase: unpackPhase
2.61 s
[pathway-compat-base] unpacking source archive /nix/store/ga56x34386fcqgj51vg6p532znb23d3g-base
2.62 s
[pathway-compat-base] source root is base
2.63 s
[pathway-compat-base] Phase: patchPhase
2.64 s
[pathway-compat-base] Phase: compileBuildDriverPhase
2.65 s
[pathway-compat-base] setupCompileFlags: -package-db=/build/tmp.Etstllu8xW/setup-package.conf.d -threaded
2.70 s
[pathway-compat-base] [1 of 2] Compiling Main ( Setup.hs, /build/tmp.Etstllu8xW/Main.o )
2.75 s
[pathway-compat-base] [2 of 2] Linking Setup
4.05 s
[pathway-compat-base] Phase: updateAutotoolsGnuConfigScriptsPhase
4.07 s
[pathway-compat-base] Phase: configurePhase
4.07 s
[pathway-compat-base] configureFlags: --verbose --prefix=/nix/store/lcicpysisnrcl5wpnlag2pks0zzv3frw-pathway-compat-base-0.0.1.0 --libdir=$prefix/lib/$compiler/lib --libsubdir=$abi/$libname --docdir=/nix/store/7274h69mlzj5111kzlccd4ddhcz4mj8h-pathway-compat-base-0.0.1.0-doc/share/doc/pathway-compat-base-0.0.1.0 --with-gcc=gcc --package-db=/build/tmp.Etstllu8xW/package.conf.d --ghc-option=-j16 --ghc-option=+RTS --ghc-option=-A64M --ghc-option=-RTS --enable-library-profiling --profiling-detail=exported-functions --disable-profiling --enable-shared --disable-coverage --enable-static --disable-executable-dynamic --enable-tests --disable-benchmarks --enable-library-vanilla --disable-library-for-ghci --enable-split-sections --enable-library-stripping --enable-executable-stripping --ghc-option=-haddock --ghc-options=-Werror --extra-lib-dirs=/nix/store/pndhkk0l649lm1sj0mxk7cbwq26qd1ra-ncurses-6.6/lib --extra-lib-dirs=/nix/store/0djlg4g0b81w94k3vcaqsxsc2hh4kism-libffi-3.5.2/lib --extra-lib-dirs=/nix/store/md4paia7riiggyrj8p24c7a6vf8w7jz8-elfutils-0.194/lib --extra-lib-dirs=/nix/store/39vv2pf64gd8li48a4hpbhw2crzd8z5p-gmp-with-cxx-6.3.0/lib --extra-lib-dirs=/nix/store/7wwvald8lapkrsr72qanlw8blyn55ifx-numactl-2.0.18/lib --extra-lib-dirs=/nix/store/7r9b0bl984hdgd70nf5p8raa55kml491-ghc-9.8.4/lib
4.08 s
[pathway-compat-base] Using Parsec parser
4.08 s
[pathway-compat-base] Configuring pathway-compat-base-0.0.1.0...
4.42 s
[pathway-compat-base] Flags chosen: noisy-deprecations=True, verify-no-recursion=False
4.42 s
[pathway-compat-base] Dependency base >=4.14.0 && <4.15 || >=4.15.0 && <4.16 || >=4.16.0 && <4.17 ||
4.42 s
[pathway-compat-base] >=4.17.0 && <4.18 || >=4.18.0 && <4.19 || >=4.19.0 && <4.20 || >=4.20.0 &&
4.42 s
[pathway-compat-base] <4.21 || >=4.21.0 && <4.22 || >=4.22.0 && <4.23: using base-4.19.2.0
4.42 s
[pathway-compat-base] Dependency exceptions: using exceptions-0.10.7
4.42 s
[pathway-compat-base] Dependency megaparsec >=9.0.1 && <9.1 || >=9.2.1 && <9.3 || >=9.5.0 && <9.6 ||
4.42 s
[pathway-compat-base] >=9.7.0 && <9.8: using megaparsec-9.7.0
4.42 s
[pathway-compat-base] Dependency pathway >=0.0.1 && <0.1: using pathway-0.0.1.0
4.42 s
[pathway-compat-base] Dependency variant: using variant-1.0.2
4.42 s
[pathway-compat-base] Dependency base >=4.14.0 && <4.15 || >=4.15.0 && <4.16 || >=4.16.0 && <4.17 ||
4.42 s
[pathway-compat-base] >=4.17.0 && <4.18 || >=4.18.0 && <4.19 || >=4.19.0 && <4.20 || >=4.20.0 &&
4.42 s
[pathway-compat-base] <4.21 || >=4.21.0 && <4.22 || >=4.22.0 && <4.23: using base-4.19.2.0
4.42 s
[pathway-compat-base] Dependency doctest >=0.16.3 && <0.17 || >=0.18.1 && <0.19 || >=0.20.1 && <0.21
4.42 s
[pathway-compat-base] || >=0.21.1 && <0.22 || >=0.22.2 && <0.23 || >=0.24.2 && <0.25: using
4.42 s
[pathway-compat-base] doctest-0.24.3
4.42 s
[pathway-compat-base] Dependency pathway-compat-base: using pathway-compat-base-0.0.1.0
4.77 s
[pathway-compat-base] Source component graph:
4.77 s
[pathway-compat-base] component lib
4.77 s
[pathway-compat-base] component test:doctests dependency lib
4.77 s
[pathway-compat-base] Configured component graph:
4.77 s
[pathway-compat-base] component pathway-compat-base-0.0.1.0-8ldj6SPXbxq2Shd8yFeOpr
4.77 s
[pathway-compat-base] include base-4.19.2.0-934f
4.77 s
[pathway-compat-base] include exceptions-0.10.7-2ac1
4.77 s
[pathway-compat-base] include megaparsec-9.7.0-10vHZAF1maw9O8p2gXs66N
4.77 s
[pathway-compat-base] include pathway-0.0.1.0-H5uD0SRA9755UrSqFBaCYE
4.77 s
[pathway-compat-base] include variant-1.0.2-LM0Un02zMMi4aizfZ11g92
4.77 s
[pathway-compat-base] component pathway-compat-base-0.0.1.0-2zQvX9jjaD62mq1j1l7L7-doctests
4.77 s
[pathway-compat-base] include base-4.19.2.0-934f
4.77 s
[pathway-compat-base] include doctest-0.24.3-1aDs7zEYV5r7raSsXr9TQC
4.77 s
[pathway-compat-base] include pathway-compat-base-0.0.1.0-8ldj6SPXbxq2Shd8yFeOpr
4.77 s
[pathway-compat-base] Linked component graph:
4.77 s
[pathway-compat-base] unit pathway-compat-base-0.0.1.0-8ldj6SPXbxq2Shd8yFeOpr
4.77 s
[pathway-compat-base] include base-4.19.2.0-934f
4.77 s
[pathway-compat-base] include exceptions-0.10.7-2ac1
4.77 s
[pathway-compat-base] include megaparsec-9.7.0-10vHZAF1maw9O8p2gXs66N
4.77 s
[pathway-compat-base] include pathway-0.0.1.0-H5uD0SRA9755UrSqFBaCYE
4.77 s
[pathway-compat-base] include variant-1.0.2-LM0Un02zMMi4aizfZ11g92
4.77 s
[pathway-compat-base] Common=pathway-compat-base-0.0.1.0-8ldj6SPXbxq2Shd8yFeOpr:Common,System.Environment.DropIn=pathway-compat-base-0.0.1.0-8ldj6SPXbxq2Shd8yFeOpr:System.Environment.DropIn,System.Environment.Overlay=pathway-compat-base-0.0.1.0-8ldj6SPXbxq2Shd8yFeOpr:System.Environment.Overlay,System.Environment.Pathway=pathway-compat-base-0.0.1.0-8ldj6SPXbxq2Shd8yFeOpr:System.Environment.Pathway,System.Environment.Thin=pathway-compat-base-0.0.1.0-8ldj6SPXbxq2Shd8yFeOpr:System.Environment.Thin,System.IO.Caught=pathway-compat-base-0.0.1.0-8ldj6SPXbxq2Shd8yFeOpr:System.IO.Caught,System.IO.DropIn=pathway-compat-base-0.0.1.0-8ldj6SPXbxq2Shd8yFeOpr:System.IO.DropIn,System.IO.Error.Caught=pathway-compat-base-0.0.1.0-8ldj6SPXbxq2Shd8yFeOpr:System.IO.Error.Caught,System.IO.Error.DropIn=pathway-compat-base-0.0.1.0-8ldj6SPXbxq2Shd8yFeOpr:System.IO.Error.DropIn,System.IO.Error.Overlay=pathway-compat-base-0.0.1.0-8ldj6SPXbxq2Shd8yFeOpr:System.IO.Error.Overlay,System.IO.Error.Pathway=pathway-compat-base-0.0.1.0-8ldj6SPXbxq2Shd8yFeOpr:System.IO.Error.Pathway,System.IO.Error.Thin=pathway-compat-base-0.0.1.0-8ldj6SPXbxq2Shd8yFeOpr:System.IO.Error.Thin,System.IO.Overlay=pathway-compat-base-0.0.1.0-8ldj6SPXbxq2Shd8yFeOpr:System.IO.Overlay,System.IO.Pathway=pathway-compat-base-0.0.1.0-8ldj6SPXbxq2Shd8yFeOpr:System.IO.Pathway,System.IO.Thin=pathway-compat-base-0.0.1.0-8ldj6SPXbxq2Shd8yFeOpr:System.IO.Thin
4.77 s
[pathway-compat-base] unit pathway-compat-base-0.0.1.0-2zQvX9jjaD62mq1j1l7L7-doctests
4.77 s
[pathway-compat-base] include base-4.19.2.0-934f
4.77 s
[pathway-compat-base] include doctest-0.24.3-1aDs7zEYV5r7raSsXr9TQC
4.77 s
[pathway-compat-base] include pathway-compat-base-0.0.1.0-8ldj6SPXbxq2Shd8yFeOpr
4.77 s
[pathway-compat-base] Ready component graph:
4.77 s
[pathway-compat-base] definite pathway-compat-base-0.0.1.0-8ldj6SPXbxq2Shd8yFeOpr
4.77 s
[pathway-compat-base] depends base-4.19.2.0-934f
4.77 s
[pathway-compat-base] depends exceptions-0.10.7-2ac1
4.77 s
[pathway-compat-base] depends megaparsec-9.7.0-10vHZAF1maw9O8p2gXs66N
4.77 s
[pathway-compat-base] depends pathway-0.0.1.0-H5uD0SRA9755UrSqFBaCYE
4.77 s
[pathway-compat-base] depends variant-1.0.2-LM0Un02zMMi4aizfZ11g92
4.77 s
[pathway-compat-base] definite pathway-compat-base-0.0.1.0-2zQvX9jjaD62mq1j1l7L7-doctests
4.77 s
[pathway-compat-base] depends base-4.19.2.0-934f
4.77 s
[pathway-compat-base] depends doctest-0.24.3-1aDs7zEYV5r7raSsXr9TQC
4.77 s
[pathway-compat-base] depends pathway-compat-base-0.0.1.0-8ldj6SPXbxq2Shd8yFeOpr
4.77 s
[pathway-compat-base] Using Cabal-3.10.3.0 compiled by ghc-9.8
4.77 s
[pathway-compat-base] Using compiler: ghc-9.8.4
4.77 s
[pathway-compat-base] Using install prefix:
4.77 s
[pathway-compat-base] /nix/store/lcicpysisnrcl5wpnlag2pks0zzv3frw-pathway-compat-base-0.0.1.0
4.77 s
[pathway-compat-base] Executables installed in:
4.77 s
[pathway-compat-base] /nix/store/lcicpysisnrcl5wpnlag2pks0zzv3frw-pathway-compat-base-0.0.1.0/bin
4.77 s
[pathway-compat-base] Libraries installed in:
4.77 s
[pathway-compat-base] /nix/store/lcicpysisnrcl5wpnlag2pks0zzv3frw-pathway-compat-base-0.0.1.0/lib/ghc-9.8.4/lib/x86_64-linux-ghc-9.8.4/pathway-compat-base-0.0.1.0-8ldj6SPXbxq2Shd8yFeOpr
4.77 s
[pathway-compat-base] Dynamic Libraries installed in:
4.77 s
[pathway-compat-base] /nix/store/lcicpysisnrcl5wpnlag2pks0zzv3frw-pathway-compat-base-0.0.1.0/lib/ghc-9.8.4/lib/x86_64-linux-ghc-9.8.4
4.77 s
[pathway-compat-base] Private executables installed in:
4.77 s
[pathway-compat-base] /nix/store/lcicpysisnrcl5wpnlag2pks0zzv3frw-pathway-compat-base-0.0.1.0/libexec/x86_64-linux-ghc-9.8.4/pathway-compat-base-0.0.1.0
4.77 s
[pathway-compat-base] Data files installed in:
4.77 s
[pathway-compat-base] /nix/store/lcicpysisnrcl5wpnlag2pks0zzv3frw-pathway-compat-base-0.0.1.0/share/x86_64-linux-ghc-9.8.4/pathway-compat-base-0.0.1.0
4.77 s
[pathway-compat-base] Documentation installed in:
4.77 s
[pathway-compat-base] /nix/store/7274h69mlzj5111kzlccd4ddhcz4mj8h-pathway-compat-base-0.0.1.0-doc/share/doc/pathway-compat-base-0.0.1.0
4.77 s
[pathway-compat-base] Configuration files installed in:
4.77 s
[pathway-compat-base] /nix/store/lcicpysisnrcl5wpnlag2pks0zzv3frw-pathway-compat-base-0.0.1.0/etc
4.77 s
[pathway-compat-base] No alex found
4.77 s
[pathway-compat-base] Using ar found on system at:
4.77 s
[pathway-compat-base] /nix/store/zjraf40s86y3iwhp626b934r5y6ldkbb-binutils-wrapper-2.46/bin/ar
4.77 s
[pathway-compat-base] No c2hs found
4.77 s
[pathway-compat-base] No cpphs found
4.77 s
[pathway-compat-base] Using doctest version 0.24.3 found on system at:
4.77 s
[pathway-compat-base] /nix/store/2y183b1vsybv0157vfr59yhdwjkpqfkn-doctest-0.24.3/bin/doctest
4.77 s
[pathway-compat-base] Using gcc version 15.2.0 given by user at:
4.77 s
[pathway-compat-base] /nix/store/29qjlshvklnyr67nhpprzgb9igmsfsjj-gcc-wrapper-15.2.0/bin/gcc
4.77 s
[pathway-compat-base] Using ghc version 9.8.4 found on system at:
4.77 s
[pathway-compat-base] /nix/store/7r9b0bl984hdgd70nf5p8raa55kml491-ghc-9.8.4/bin/ghc
4.77 s
[pathway-compat-base] Using ghc-pkg version 9.8.4 found on system at:
4.77 s
[pathway-compat-base] /nix/store/7r9b0bl984hdgd70nf5p8raa55kml491-ghc-9.8.4/bin/ghc-pkg-9.8.4
4.77 s
[pathway-compat-base] No ghcjs found
4.77 s
[pathway-compat-base] No ghcjs-pkg found
4.77 s
[pathway-compat-base] No greencard found
4.77 s
[pathway-compat-base] Using haddock version 2.30.0 found on system at:
4.77 s
[pathway-compat-base] /nix/store/7r9b0bl984hdgd70nf5p8raa55kml491-ghc-9.8.4/bin/haddock-ghc-9.8.4
4.77 s
[pathway-compat-base] No happy found
4.77 s
[pathway-compat-base] Using haskell-suite found on system at: haskell-suite-dummy-location
4.77 s
[pathway-compat-base] Using haskell-suite-pkg found on system at: haskell-suite-pkg-dummy-location
4.77 s
[pathway-compat-base] No hmake found
4.77 s
[pathway-compat-base] Using hpc version 0.69 found on system at:
4.77 s
[pathway-compat-base] /nix/store/7r9b0bl984hdgd70nf5p8raa55kml491-ghc-9.8.4/bin/hpc-ghc-9.8.4
4.77 s
[pathway-compat-base] Using hsc2hs version 0.68.10 found on system at:
4.77 s
[pathway-compat-base] /nix/store/7r9b0bl984hdgd70nf5p8raa55kml491-ghc-9.8.4/bin/hsc2hs-ghc-9.8.4
4.77 s
[pathway-compat-base] Using hscolour version 1.25 found on system at:
4.77 s
[pathway-compat-base] /nix/store/awnxn98rlw62rrjwli6d2lb4d27mrzzw-hscolour-1.25/bin/HsColour
4.77 s
[pathway-compat-base] No jhc found
4.77 s
[pathway-compat-base] Using ld found on system at:
4.77 s
[pathway-compat-base] /nix/store/zjraf40s86y3iwhp626b934r5y6ldkbb-binutils-wrapper-2.46/bin/ld.gold
4.77 s
[pathway-compat-base] No pkg-config found
4.77 s
[pathway-compat-base] Using runghc version 9.8.4 found on system at:
4.77 s
[pathway-compat-base] /nix/store/7r9b0bl984hdgd70nf5p8raa55kml491-ghc-9.8.4/bin/runghc-9.8.4
4.77 s
[pathway-compat-base] Using strip version 2.46 found on system at:
4.77 s
[pathway-compat-base] /nix/store/29qjlshvklnyr67nhpprzgb9igmsfsjj-gcc-wrapper-15.2.0/bin/strip
4.77 s
[pathway-compat-base] Using tar found on system at:
4.77 s
[pathway-compat-base] /nix/store/z5mq2sam4484prf3kv6v6vjw1m0i7j24-gnutar-1.35/bin/tar
4.77 s
[pathway-compat-base] No uhc found
5.20 s
[pathway-compat-base] Phase: buildPhase
5.26 s
[pathway-compat-base] Preprocessing library for pathway-compat-base-0.0.1.0..
5.29 s
[pathway-compat-base] Building library for pathway-compat-base-0.0.1.0..
5.41 s
[pathway-compat-base] [ 1 of 15] Compiling Common ( src/Common.hs, dist/build/Common.o, dist/build/Common.dyn_o )
5.86 s
[pathway-compat-base] [ 2 of 15] Compiling System.Environment.Thin ( src/System/Environment/Thin.hs, dist/build/System/Environment/Thin.o, dist/build/System/Environment/Thin.dyn_o )
5.93 s
[pathway-compat-base] [ 3 of 15] Compiling System.Environment.Pathway ( src/System/Environment/Pathway.hs, dist/build/System/Environment/Pathway.o, dist/build/System/Environment/Pathway.dyn_o )
5.96 s
[pathway-compat-base] [ 4 of 15] Compiling System.Environment.Overlay ( src/System/Environment/Overlay.hs, dist/build/System/Environment/Overlay.o, dist/build/System/Environment/Overlay.dyn_o )
5.98 s
[pathway-compat-base] [ 5 of 15] Compiling System.Environment.DropIn ( src/System/Environment/DropIn.hs, dist/build/System/Environment/DropIn.o, dist/build/System/Environment/DropIn.dyn_o )
6.01 s
[pathway-compat-base] [ 6 of 15] Compiling System.IO.Error.Caught ( src/System/IO/Error/Caught.hs, dist/build/System/IO/Error/Caught.o, dist/build/System/IO/Error/Caught.dyn_o )
6.01 s
[pathway-compat-base] [ 7 of 15] Compiling System.IO.Error.Thin ( src/System/IO/Error/Thin.hs, dist/build/System/IO/Error/Thin.o, dist/build/System/IO/Error/Thin.dyn_o )
6.01 s
[pathway-compat-base] [ 8 of 15] Compiling System.IO.Error.Pathway ( src/System/IO/Error/Pathway.hs, dist/build/System/IO/Error/Pathway.o, dist/build/System/IO/Error/Pathway.dyn_o )
6.01 s
[pathway-compat-base] [ 9 of 15] Compiling System.IO.Error.Overlay ( src/System/IO/Error/Overlay.hs, dist/build/System/IO/Error/Overlay.o, dist/build/System/IO/Error/Overlay.dyn_o )
6.01 s
[pathway-compat-base] [10 of 15] Compiling System.IO.Error.DropIn ( src/System/IO/Error/DropIn.hs, dist/build/System/IO/Error/DropIn.o, dist/build/System/IO/Error/DropIn.dyn_o )
6.01 s
[pathway-compat-base] [11 of 15] Compiling System.IO.Thin ( src/System/IO/Thin.hs, dist/build/System/IO/Thin.o, dist/build/System/IO/Thin.dyn_o )
6.01 s
[pathway-compat-base] [12 of 15] Compiling System.IO.Overlay ( src/System/IO/Overlay.hs, dist/build/System/IO/Overlay.o, dist/build/System/IO/Overlay.dyn_o )
6.04 s
[pathway-compat-base] [13 of 15] Compiling System.IO.DropIn ( src/System/IO/DropIn.hs, dist/build/System/IO/DropIn.o, dist/build/System/IO/DropIn.dyn_o )
6.07 s
[pathway-compat-base] [14 of 15] Compiling System.IO.Caught ( src/System/IO/Caught.hs, dist/build/System/IO/Caught.o, dist/build/System/IO/Caught.dyn_o )
6.07 s
[pathway-compat-base] [15 of 15] Compiling System.IO.Pathway ( src/System/IO/Pathway.hs, dist/build/System/IO/Pathway.o, dist/build/System/IO/Pathway.dyn_o )
6.34 s
[pathway-compat-base] [ 1 of 15] Compiling Common ( src/Common.hs, dist/build/Common.p_o )
6.90 s
[pathway-compat-base] [ 2 of 15] Compiling System.Environment.Thin ( src/System/Environment/Thin.hs, dist/build/System/Environment/Thin.p_o )
7.07 s
[pathway-compat-base] [ 3 of 15] Compiling System.Environment.Pathway ( src/System/Environment/Pathway.hs, dist/build/System/Environment/Pathway.p_o )
7.24 s
[pathway-compat-base] [ 4 of 15] Compiling System.Environment.Overlay ( src/System/Environment/Overlay.hs, dist/build/System/Environment/Overlay.p_o )
7.25 s
[pathway-compat-base] [ 5 of 15] Compiling System.Environment.DropIn ( src/System/Environment/DropIn.hs, dist/build/System/Environment/DropIn.p_o )
7.40 s
[pathway-compat-base] [ 6 of 15] Compiling System.IO.Error.Caught ( src/System/IO/Error/Caught.hs, dist/build/System/IO/Error/Caught.p_o )
7.40 s
[pathway-compat-base] [ 7 of 15] Compiling System.IO.Error.Thin ( src/System/IO/Error/Thin.hs, dist/build/System/IO/Error/Thin.p_o )
7.40 s
[pathway-compat-base] [ 8 of 15] Compiling System.IO.Error.Pathway ( src/System/IO/Error/Pathway.hs, dist/build/System/IO/Error/Pathway.p_o )
7.40 s
[pathway-compat-base] [ 9 of 15] Compiling System.IO.Error.Overlay ( src/System/IO/Error/Overlay.hs, dist/build/System/IO/Error/Overlay.p_o )
7.40 s
[pathway-compat-base] [10 of 15] Compiling System.IO.Error.DropIn ( src/System/IO/Error/DropIn.hs, dist/build/System/IO/Error/DropIn.p_o )
7.40 s
[pathway-compat-base] [11 of 15] Compiling System.IO.Thin ( src/System/IO/Thin.hs, dist/build/System/IO/Thin.p_o )
7.40 s
[pathway-compat-base] [12 of 15] Compiling System.IO.Overlay ( src/System/IO/Overlay.hs, dist/build/System/IO/Overlay.p_o )
7.40 s
[pathway-compat-base] [13 of 15] Compiling System.IO.DropIn ( src/System/IO/DropIn.hs, dist/build/System/IO/DropIn.p_o )
7.50 s
[pathway-compat-base] [14 of 15] Compiling System.IO.Caught ( src/System/IO/Caught.hs, dist/build/System/IO/Caught.p_o )
7.50 s
[pathway-compat-base] [15 of 15] Compiling System.IO.Pathway ( src/System/IO/Pathway.hs, dist/build/System/IO/Pathway.p_o )
9.73 s
[pathway-compat-base] Preprocessing test suite 'doctests' for pathway-compat-base-0.0.1.0..
9.73 s
[pathway-compat-base] Building test suite 'doctests' for pathway-compat-base-0.0.1.0..
9.81 s
[pathway-compat-base] [1 of 2] Compiling Build_doctests ( dist/build/doctests/autogen/Build_doctests.hs, dist/build/doctests/doctests-tmp/Build_doctests.o )
10.05 s
[pathway-compat-base] [2 of 2] Compiling Main ( tests/doctests.hs, dist/build/doctests/doctests-tmp/Main.o )
10.33 s
[pathway-compat-base] [3 of 3] Linking dist/build/doctests/doctests
13.83 s
[pathway-compat-base] Phase: checkPhase
13.87 s
[pathway-compat-base] Running 1 test suites...
13.87 s
[pathway-compat-base] Test suite doctests: RUNNING...
14.20 s
[pathway-compat-base]
14.20 s
[pathway-compat-base] on the commandline: warning: [GHC-98887]
14.20 s
[pathway-compat-base] -XTemplateHaskell is not allowed in Safe Haskell; ignoring -XTemplateHaskell
14.20 s
[pathway-compat-base]
14.20 s
[pathway-compat-base] on the commandline: warning: [GHC-98887]
14.20 s
[pathway-compat-base] -XTemplateHaskell is not allowed in Safe Haskell; ignoring -XTemplateHaskell
14.20 s
[pathway-compat-base]
14.20 s
[pathway-compat-base] on the commandline: warning: [GHC-98887]
14.20 s
[pathway-compat-base] -XTemplateHaskell is not allowed in Safe Haskell; ignoring -XTemplateHaskell
14.21 s
[pathway-compat-base]
14.21 s
[pathway-compat-base] on the commandline: warning: [GHC-98887]
14.21 s
[pathway-compat-base] -XTemplateHaskell is not allowed in Safe Haskell; ignoring -XTemplateHaskell
14.23 s
[pathway-compat-base]
14.23 s
[pathway-compat-base] on the commandline: warning: [GHC-98887]
14.23 s
[pathway-compat-base] -XTemplateHaskell is not allowed in Safe Haskell; ignoring -XTemplateHaskell
14.23 s
[pathway-compat-base]
14.23 s
[pathway-compat-base] on the commandline: warning: [GHC-98887]
14.23 s
[pathway-compat-base] -XTemplateHaskell is not allowed in Safe Haskell; ignoring -XTemplateHaskell
14.23 s
[pathway-compat-base]
14.23 s
[pathway-compat-base] on the commandline: warning: [GHC-98887]
14.23 s
[pathway-compat-base] -XTemplateHaskell is not allowed in Safe Haskell; ignoring -XTemplateHaskell
14.23 s
[pathway-compat-base]
14.23 s
[pathway-compat-base] on the commandline: warning: [GHC-98887]
14.23 s
[pathway-compat-base] -XTemplateHaskell is not allowed in Safe Haskell; ignoring -XTemplateHaskell
14.23 s
[pathway-compat-base]
14.23 s
[pathway-compat-base] on the commandline: warning: [GHC-98887]
14.23 s
[pathway-compat-base] -XTemplateHaskell is not allowed in Safe Haskell; ignoring -XTemplateHaskell
14.24 s
[pathway-compat-base]
14.24 s
[pathway-compat-base] on the commandline: warning: [GHC-98887]
14.24 s
[pathway-compat-base] -XTemplateHaskell is not allowed in Safe Haskell; ignoring -XTemplateHaskell
14.24 s
[pathway-compat-base]
14.24 s
[pathway-compat-base] on the commandline: warning: [GHC-98887]
14.24 s
[pathway-compat-base] -XTemplateHaskell is not allowed in Safe Haskell; ignoring -XTemplateHaskell
14.24 s
[pathway-compat-base]
14.24 s
[pathway-compat-base] on the commandline: warning: [GHC-98887]
14.24 s
[pathway-compat-base] -XTemplateHaskell is not allowed in Safe Haskell; ignoring -XTemplateHaskell
14.24 s
[pathway-compat-base]
14.24 s
[pathway-compat-base] on the commandline: warning: [GHC-98887]
14.24 s
[pathway-compat-base] -XTemplateHaskell is not allowed in Safe Haskell; ignoring -XTemplateHaskell
14.24 s
[pathway-compat-base]
14.24 s
[pathway-compat-base] on the commandline: warning: [GHC-98887]
14.24 s
[pathway-compat-base] -XTemplateHaskell is not allowed in Safe Haskell; ignoring -XTemplateHaskell
14.26 s
[pathway-compat-base]
14.26 s
[pathway-compat-base] on the commandline: warning: [GHC-98887]
14.26 s
[pathway-compat-base] -XTemplateHaskell is not allowed in Safe Haskell; ignoring -XTemplateHaskell
14.26 s
[pathway-compat-base]
14.26 s
[pathway-compat-base] on the commandline: warning: [GHC-98887]
14.26 s
[pathway-compat-base] -XTemplateHaskell is not allowed in Safe Haskell; ignoring -XTemplateHaskell
14.26 s
[pathway-compat-base]
14.26 s
[pathway-compat-base] on the commandline: warning: [GHC-98887]
14.26 s
[pathway-compat-base] -XTemplateHaskell is not allowed in Safe Haskell; ignoring -XTemplateHaskell
14.26 s
[pathway-compat-base]
14.26 s
[pathway-compat-base] on the commandline: warning: [GHC-98887]
14.26 s
[pathway-compat-base] -XTemplateHaskell is not allowed in Safe Haskell; ignoring -XTemplateHaskell
14.26 s
[pathway-compat-base]
14.26 s
[pathway-compat-base] on the commandline: warning: [GHC-98887]
14.26 s
[pathway-compat-base] -XTemplateHaskell is not allowed in Safe Haskell; ignoring -XTemplateHaskell
14.26 s
[pathway-compat-base]
14.26 s
[pathway-compat-base] on the commandline: warning: [GHC-98887]
14.26 s
[pathway-compat-base] -XTemplateHaskell is not allowed in Safe Haskell; ignoring -XTemplateHaskell
14.26 s
[pathway-compat-base]
14.26 s
[pathway-compat-base] on the commandline: warning: [GHC-98887]
14.26 s
[pathway-compat-base] -XTemplateHaskell is not allowed in Safe Haskell; ignoring -XTemplateHaskell
14.26 s
[pathway-compat-base]
14.27 s
[pathway-compat-base] on the commandline: warning: [GHC-98887]
14.27 s
[pathway-compat-base] -XTemplateHaskell is not allowed in Safe Haskell; ignoring -XTemplateHaskell
14.27 s
[pathway-compat-base]
14.27 s
[pathway-compat-base] on the commandline: warning: [GHC-98887]
14.27 s
[pathway-compat-base] -XTemplateHaskell is not allowed in Safe Haskell; ignoring -XTemplateHaskell
14.74 s
[pathway-compat-base] Examples: 0 Tried: 0 Errors: 0 Failures: 0
14.79 s
[pathway-compat-base] Test suite doctests: PASS
14.79 s
[pathway-compat-base] Test suite logged to: dist/test/pathway-compat-base-0.0.1.0-doctests.log
14.79 s
[pathway-compat-base] 1 of 1 test suites (1 of 1 test cases) passed.
14.80 s
[pathway-compat-base] Phase: haddockPhase
14.93 s
[pathway-compat-base] Preprocessing library for pathway-compat-base-0.0.1.0..
14.94 s
[pathway-compat-base] Running Haddock on library for pathway-compat-base-0.0.1.0..
14.94 s
[pathway-compat-base] Warning: The documentation for the following packages are not installed. No
14.94 s
[pathway-compat-base] links will be generated to these packages: vector-0.13.2.0
14.99 s
[pathway-compat-base] Warning: --source-* options are ignored when --hyperlinked-source is enabled.
15.18 s
[pathway-compat-base] [ 1 of 15] Compiling Common ( src/Common.hs, nothing )
15.46 s
[pathway-compat-base] [ 2 of 15] Compiling System.Environment.Thin ( src/System/Environment/Thin.hs, nothing )
15.49 s
[pathway-compat-base] [ 3 of 15] Compiling System.Environment.Pathway ( src/System/Environment/Pathway.hs, nothing )
15.49 s
[pathway-compat-base] [ 4 of 15] Compiling System.Environment.Overlay ( src/System/Environment/Overlay.hs, nothing )
15.49 s
[pathway-compat-base] [ 5 of 15] Compiling System.Environment.DropIn ( src/System/Environment/DropIn.hs, nothing )
15.49 s
[pathway-compat-base] [ 6 of 15] Compiling System.IO.Error.Caught ( src/System/IO/Error/Caught.hs, nothing )
15.49 s
[pathway-compat-base] [ 7 of 15] Compiling System.IO.Error.Thin ( src/System/IO/Error/Thin.hs, nothing )
15.49 s
[pathway-compat-base] [ 8 of 15] Compiling System.IO.Error.Pathway ( src/System/IO/Error/Pathway.hs, nothing )
15.49 s
[pathway-compat-base] [ 9 of 15] Compiling System.IO.Error.Overlay ( src/System/IO/Error/Overlay.hs, nothing )
15.49 s
[pathway-compat-base] [10 of 15] Compiling System.IO.Error.DropIn ( src/System/IO/Error/DropIn.hs, nothing )
15.49 s
[pathway-compat-base] [11 of 15] Compiling System.IO.Thin ( src/System/IO/Thin.hs, nothing )
15.49 s
[pathway-compat-base] [12 of 15] Compiling System.IO.Overlay ( src/System/IO/Overlay.hs, nothing )
15.49 s
[pathway-compat-base] [13 of 15] Compiling System.IO.DropIn ( src/System/IO/DropIn.hs, nothing )
15.49 s
[pathway-compat-base] [14 of 15] Compiling System.IO.Caught ( src/System/IO/Caught.hs, nothing )
15.50 s
[pathway-compat-base] [15 of 15] Compiling System.IO.Pathway ( src/System/IO/Pathway.hs, nothing )
15.50 s
[pathway-compat-base] Haddock coverage:
15.51 s
[pathway-compat-base] Warning: '</?>' is out of scope.
15.51 s
[pathway-compat-base] If you qualify the identifier, haddock can try to link it anyway.
15.51 s
[pathway-compat-base] Warning: '<$>' is out of scope.
15.51 s
[pathway-compat-base] If you qualify the identifier, haddock can try to link it anyway.
15.51 s
[pathway-compat-base] Warning: 'getCurrentDirectory' is out of scope.
15.51 s
[pathway-compat-base] If you qualify the identifier, haddock can try to link it anyway.
15.51 s
[pathway-compat-base] Warning: 'makeRelativeToCurrentDirectory' is out of scope.
15.51 s
[pathway-compat-base] If you qualify the identifier, haddock can try to link it anyway.
15.51 s
[pathway-compat-base] Warning: 'IOError' is out of scope.
15.51 s
[pathway-compat-base] If you qualify the identifier, haddock can try to link it anyway.
15.51 s
[pathway-compat-base] 14% ( 1 / 7) in 'Common'
15.51 s
[pathway-compat-base] Missing documentation for:
15.51 s
[pathway-compat-base] InternalFailure (src/Common.hs:69)
15.51 s
[pathway-compat-base] toPathRep (src/Common.hs:85)
15.51 s
[pathway-compat-base] fromPathRep (src/Common.hs:91)
15.51 s
[pathway-compat-base] handleAnchoredPath (src/Common.hs:98)
15.51 s
[pathway-compat-base] absFileFromPathRep (src/Common.hs:104)
15.51 s
[pathway-compat-base] fileFromPathRep (src/Common.hs:120)
15.51 s
[pathway-compat-base] Warning: '</?>' is out of scope.
15.51 s
[pathway-compat-base] If you qualify the identifier, haddock can try to link it anyway.
15.51 s
[pathway-compat-base] Warning: 'getCurrentDirectory' is out of scope.
15.51 s
[pathway-compat-base] If you qualify the identifier, haddock can try to link it anyway.
15.51 s
[pathway-compat-base] Warning: 'makeRelativeToCurrentDirectory' is out of scope.
15.51 s
[pathway-compat-base] If you qualify the identifier, haddock can try to link it anyway.
15.51 s
[pathway-compat-base] Warning: 'IOError' is out of scope.
15.51 s
[pathway-compat-base] If you qualify the identifier, haddock can try to link it anyway.
15.51 s
[pathway-compat-base] Warning: 'Anchored' is out of scope.
15.51 s
[pathway-compat-base] If you qualify the identifier, haddock can try to link it anyway.
15.51 s
[pathway-compat-base] 33% ( 1 / 3) in 'System.Environment.Thin'
15.51 s
[pathway-compat-base] Missing documentation for:
15.51 s
[pathway-compat-base] executablePath (src/System/Environment/Thin.hs:58)
15.51 s
[pathway-compat-base] getExecutablePath (src/System/Environment/Thin.hs:72)
15.51 s
[pathway-compat-base] 100% ( 11 / 11) in 'System.Environment.Pathway'
15.51 s
[pathway-compat-base] Warning: '</?>' is out of scope.
15.51 s
[pathway-compat-base] If you qualify the identifier, haddock can try to link it anyway.
15.51 s
[pathway-compat-base] Warning: 'getCurrentDirectory' is out of scope.
15.51 s
[pathway-compat-base] If you qualify the identifier, haddock can try to link it anyway.
15.51 s
[pathway-compat-base] Warning: 'makeRelativeToCurrentDirectory' is out of scope.
15.51 s
[pathway-compat-base] If you qualify the identifier, haddock can try to link it anyway.
15.51 s
[pathway-compat-base] Warning: 'IOError' is out of scope.
15.51 s
[pathway-compat-base] If you qualify the identifier, haddock can try to link it anyway.
15.51 s
[pathway-compat-base] 33% ( 1 / 3) in 'System.Environment.Overlay'
15.51 s
[pathway-compat-base] Missing documentation for:
15.51 s
[pathway-compat-base] executablePath (src/System/Environment/Overlay.hs:51)
15.51 s
[pathway-compat-base] getExecutablePath (src/System/Environment/Overlay.hs:55)
15.51 s
[pathway-compat-base] 100% ( 11 / 11) in 'System.Environment.DropIn'
15.52 s
[pathway-compat-base] 90% ( 10 / 11) in 'System.IO.Error.Caught'
15.52 s
[pathway-compat-base] Missing documentation for:
15.52 s
[pathway-compat-base] AlreadyInUseError (src/System/IO/Error/Caught.hs:103)
15.52 s
[pathway-compat-base] 0% ( 0 / 5) in 'System.IO.Error.Thin'
15.52 s
[pathway-compat-base] Missing documentation for:
15.52 s
[pathway-compat-base] Module header
15.52 s
[pathway-compat-base] mkIOError (src/System/IO/Error/Thin.hs:29)
15.52 s
[pathway-compat-base] annotateIOError (src/System/IO/Error/Thin.hs:33)
15.52 s
[pathway-compat-base] ioeGetFileName (src/System/IO/Error/Thin.hs:39)
15.52 s
[pathway-compat-base] ioeSetFileName (src/System/IO/Error/Thin.hs:42)
15.52 s
[pathway-compat-base] 82% ( 37 / 45) in 'System.IO.Error.Pathway'
15.52 s
[pathway-compat-base] Missing documentation for:
15.52 s
[pathway-compat-base] ioeGetErrorType
15.52 s
[pathway-compat-base] ioeGetErrorString
15.52 s
[pathway-compat-base] ioeGetLocation
15.52 s
[pathway-compat-base] ioeGetHandle
15.52 s
[pathway-compat-base] ioeSetErrorType
15.52 s
[pathway-compat-base] ioeSetErrorString
15.52 s
[pathway-compat-base] ioeSetLocation
15.52 s
[pathway-compat-base] ioeSetHandle
15.52 s
[pathway-compat-base] 0% ( 0 / 2) in 'System.IO.Error.Overlay'
15.52 s
[pathway-compat-base] Missing documentation for:
15.52 s
[pathway-compat-base] Module header
15.52 s
[pathway-compat-base] ioeGetFileName (src/System/IO/Error/Overlay.hs:21)
15.52 s
[pathway-compat-base] 76% ( 36 / 47) in 'System.IO.Error.DropIn'
15.52 s
[pathway-compat-base] Missing documentation for:
15.52 s
[pathway-compat-base] ioeGetErrorType
15.52 s
[pathway-compat-base] ioeGetErrorString
15.52 s
[pathway-compat-base] ioeGetLocation
15.52 s
[pathway-compat-base] ioeGetHandle
15.52 s
[pathway-compat-base] ioeSetErrorType
15.52 s
[pathway-compat-base] ioeSetErrorString
15.52 s
[pathway-compat-base] ioeSetLocation
15.52 s
[pathway-compat-base] ioeSetHandle
15.52 s
[pathway-compat-base] mkIOError (src/System/IO/Error/Thin.hs:29)
15.52 s
[pathway-compat-base] ioeSetFileName (src/System/IO/Error/Thin.hs:42)
15.52 s
[pathway-compat-base] annotateIOError (src/System/IO/Error/Thin.hs:33)
15.52 s
[pathway-compat-base] 0% ( 0 / 13) in 'System.IO.Thin'
15.52 s
[pathway-compat-base] Missing documentation for:
15.52 s
[pathway-compat-base] Module header
15.52 s
[pathway-compat-base] withFile (src/System/IO/Thin.hs:32)
15.52 s
[pathway-compat-base] openFile (src/System/IO/Thin.hs:35)
15.52 s
[pathway-compat-base] readFile (src/System/IO/Thin.hs:38)
15.52 s
[pathway-compat-base] readFile' (src/System/IO/Thin.hs:41)
15.52 s
[pathway-compat-base] writeFile (src/System/IO/Thin.hs:44)
15.52 s
[pathway-compat-base] appendFile (src/System/IO/Thin.hs:47)
15.52 s
[pathway-compat-base] withBinaryFile (src/System/IO/Thin.hs:50)
15.52 s
[pathway-compat-base] openBinaryFile (src/System/IO/Thin.hs:53)
15.52 s
[pathway-compat-base] openTempFile (src/System/IO/Thin.hs:66)
15.52 s
[pathway-compat-base] openBinaryTempFile (src/System/IO/Thin.hs:80)
15.52 s
[pathway-compat-base] openTempFileWithDefaultPermissions (src/System/IO/Thin.hs:89)
15.52 s
[pathway-compat-base] openBinaryTempFileWithDefaultPermissions (src/System/IO/Thin.hs:98)
15.52 s
[pathway-compat-base] 0% ( 0 / 5) in 'System.IO.Overlay'
15.52 s
[pathway-compat-base] Missing documentation for:
15.52 s
[pathway-compat-base] Module header
15.52 s
[pathway-compat-base] openTempFile (src/System/IO/Overlay.hs:24)
15.52 s
[pathway-compat-base] openBinaryTempFile (src/System/IO/Overlay.hs:30)
15.52 s
[pathway-compat-base] openTempFileWithDefaultPermissions (src/System/IO/Overlay.hs:34)
15.52 s
[pathway-compat-base] openBinaryTempFileWithDefaultPermissions (src/System/IO/Overlay.hs:41)
15.52 s
[pathway-compat-base] 80% ( 73 / 91) in 'System.IO.DropIn'
15.52 s
[pathway-compat-base] Missing documentation for:
15.52 s
[pathway-compat-base] stdout
15.52 s
[pathway-compat-base] stdin
15.52 s
[pathway-compat-base] stderr
15.52 s
[pathway-compat-base] hPutBufNonBlocking
15.52 s
[pathway-compat-base] HandlePosn
15.52 s
[pathway-compat-base] hIsOpen
15.52 s
[pathway-compat-base] hIsClosed
15.52 s
[pathway-compat-base] hIsReadable
15.52 s
[pathway-compat-base] hIsWritable
15.53 s
[pathway-compat-base] hIsSeekable
15.53 s
[pathway-compat-base] openFile (src/System/IO/Thin.hs:35)
15.53 s
[pathway-compat-base] readFile' (src/System/IO/Thin.hs:41)
15.53 s
[pathway-compat-base] writeFile (src/System/IO/Thin.hs:44)
15.53 s
[pathway-compat-base] withFile (src/System/IO/Thin.hs:32)
15.53 s
[pathway-compat-base] openBinaryFile (src/System/IO/Thin.hs:53)
15.53 s
[pathway-compat-base] withBinaryFile (src/System/IO/Thin.hs:50)
15.53 s
[pathway-compat-base] readFile (src/System/IO/Thin.hs:38)
15.53 s
[pathway-compat-base] appendFile (src/System/IO/Thin.hs:47)
15.53 s
[pathway-compat-base] 20% ( 1 / 5) in 'System.IO.Caught'
15.53 s
[pathway-compat-base] Missing documentation for:
15.53 s
[pathway-compat-base] Module header
15.53 s
[pathway-compat-base] OpenFileFailure (src/System/IO/Caught.hs:38)
15.53 s
[pathway-compat-base] openFile (src/System/IO/Caught.hs:50)
15.53 s
[pathway-compat-base] recoverOpenFileFailure (src/System/IO/Caught.hs:41)
15.53 s
[pathway-compat-base] 77% ( 73 / 94) in 'System.IO.Pathway'
15.53 s
[pathway-compat-base] Missing documentation for:
15.53 s
[pathway-compat-base] stdout
15.53 s
[pathway-compat-base] stdin
15.53 s
[pathway-compat-base] stderr
15.53 s
[pathway-compat-base] hPutBufNonBlocking
15.53 s
[pathway-compat-base] HandlePosn
15.53 s
[pathway-compat-base] hIsOpen
15.53 s
[pathway-compat-base] hIsClosed
15.53 s
[pathway-compat-base] hIsReadable
15.53 s
[pathway-compat-base] hIsWritable
15.53 s
[pathway-compat-base] hIsSeekable
15.53 s
[pathway-compat-base] readFile' (src/System/IO/Thin.hs:41)
15.53 s
[pathway-compat-base] writeFile (src/System/IO/Thin.hs:44)
15.53 s
[pathway-compat-base] withFile (src/System/IO/Thin.hs:32)
15.53 s
[pathway-compat-base] openBinaryFile (src/System/IO/Thin.hs:53)
15.53 s
[pathway-compat-base] withBinaryFile (src/System/IO/Thin.hs:50)
15.53 s
[pathway-compat-base] readFile (src/System/IO/Thin.hs:38)
15.53 s
[pathway-compat-base] appendFile (src/System/IO/Thin.hs:47)
15.53 s
[pathway-compat-base] openTempFile (src/System/IO/Thin.hs:66)
15.53 s
[pathway-compat-base] openBinaryTempFile (src/System/IO/Thin.hs:80)
15.53 s
[pathway-compat-base] openTempFileWithDefaultPermissions (src/System/IO/Thin.hs:89)
15.53 s
[pathway-compat-base] openBinaryTempFileWithDefaultPermissions (src/System/IO/Thin.hs:98)
15.95 s
[pathway-compat-base] Warning: Common: could not find link destinations for:
15.95 s
[pathway-compat-base] - Common.Rep_InternalFailure
15.95 s
[pathway-compat-base] Warning: System.IO.Error.Caught: could not find link destinations for:
15.95 s
[pathway-compat-base] - System.IO.Error.Caught.Rep_UnsatisfiedConstraints
15.95 s
[pathway-compat-base] - System.IO.Error.Caught.Rep_UnsupportedOperation
15.95 s
[pathway-compat-base] - System.IO.Error.Caught.Rep_AlreadyInUseError
15.95 s
[pathway-compat-base] - System.IO.Error.Caught.Rep_AlreadyExistsError
15.95 s
[pathway-compat-base] - System.IO.Error.Caught.Rep_DoesNotExistError
15.95 s
[pathway-compat-base] - System.IO.Error.Caught.Rep_FullError
15.95 s
[pathway-compat-base] - System.IO.Error.Caught.Rep_InappropriateType
15.95 s
[pathway-compat-base] - System.IO.Error.Caught.Rep_InvalidArgument
15.95 s
[pathway-compat-base] - System.IO.Error.Caught.Rep_HardwareFault
15.95 s
[pathway-compat-base] - System.IO.Error.Caught.Rep_PermissionError
15.96 s
[pathway-compat-base] Warning: System.IO.DropIn: could not find link destinations for:
15.96 s
[pathway-compat-base] - Control.Monad.Primitive.D:R:PrimStateIO
15.96 s
[pathway-compat-base] - Text.Printf.UPrintf
15.96 s
[pathway-compat-base] - Text.Printf.hspr
15.96 s
[pathway-compat-base] - Text.Printf.spr
15.97 s
[pathway-compat-base] Warning: System.IO.Pathway: could not find link destinations for:
15.97 s
[pathway-compat-base] - Control.Monad.Primitive.D:R:PrimStateIO
15.97 s
[pathway-compat-base] - Text.Printf.UPrintf
15.97 s
[pathway-compat-base] - Text.Printf.hspr
15.97 s
[pathway-compat-base] - Text.Printf.spr
20.43 s
[pathway-compat-base] Documentation created: dist/doc/html/pathway-compat-base/,
20.44 s
[pathway-compat-base] dist/doc/html/pathway-compat-base/pathway-compat-base.txt
20.49 s
[pathway-compat-base] Preprocessing test suite 'doctests' for pathway-compat-base-0.0.1.0..
20.50 s
[pathway-compat-base] Phase: installPhase
22.31 s
[pathway-compat-base] Installing library in /nix/store/lcicpysisnrcl5wpnlag2pks0zzv3frw-pathway-compat-base-0.0.1.0/lib/ghc-9.8.4/lib/x86_64-linux-ghc-9.8.4/pathway-compat-base-0.0.1.0-8ldj6SPXbxq2Shd8yFeOpr
22.31 s
[pathway-compat-base] Phase: fixupPhase
22.31 s
[pathway-compat-base] shrinking RPATHs of ELF executables and libraries in /nix/store/lcicpysisnrcl5wpnlag2pks0zzv3frw-pathway-compat-base-0.0.1.0
22.31 s
[pathway-compat-base] shrinking /nix/store/lcicpysisnrcl5wpnlag2pks0zzv3frw-pathway-compat-base-0.0.1.0/lib/ghc-9.8.4/lib/x86_64-linux-ghc-9.8.4/libHSpathway-compat-base-0.0.1.0-8ldj6SPXbxq2Shd8yFeOpr-ghc9.8.4.so
22.31 s
[pathway-compat-base] checking for references to /build/ in /nix/store/lcicpysisnrcl5wpnlag2pks0zzv3frw-pathway-compat-base-0.0.1.0...
22.31 s
[pathway-compat-base] patching script interpreter paths in /nix/store/lcicpysisnrcl5wpnlag2pks0zzv3frw-pathway-compat-base-0.0.1.0
22.31 s
[pathway-compat-base] stripping (with command strip and flags -S -p) in /nix/store/lcicpysisnrcl5wpnlag2pks0zzv3frw-pathway-compat-base-0.0.1.0/lib
22.31 s
[pathway-compat-base] shrinking RPATHs of ELF executables and libraries in /nix/store/7274h69mlzj5111kzlccd4ddhcz4mj8h-pathway-compat-base-0.0.1.0-doc
22.31 s
[pathway-compat-base] checking for references to /build/ in /nix/store/7274h69mlzj5111kzlccd4ddhcz4mj8h-pathway-compat-base-0.0.1.0-doc...
22.31 s
[pathway-compat-base] patching script interpreter paths in /nix/store/7274h69mlzj5111kzlccd4ddhcz4mj8h-pathway-compat-base-0.0.1.0-doc
22.31 s
[pathway-compat-base:post-build] Uploading to cachix cache "sellout": /nix/store/7274h69mlzj5111kzlccd4ddhcz4mj8h-pathway-compat-base-0.0.1.0-doc /nix/store/lcicpysisnrcl5wpnlag2pks0zzv3frw-pathway-compat-base-0.0.1.0
22.31 s
[pathway-compat-base:post-build] Pushing 2 paths (186 are already present) using zstd to cache sellout ⏳
22.31 s
[pathway-compat-base:post-build]
22.31 s
[pathway-compat-base:post-build] Pushing /nix/store/7274h69mlzj5111kzlccd4ddhcz4mj8h-pathway-compat-base-0.0.1.0-doc (1.92 MiB)
22.31 s
[pathway-compat-base:post-build] Pushing /nix/store/lcicpysisnrcl5wpnlag2pks0zzv3frw-pathway-compat-base-0.0.1.0 (2.02 MiB)
23.32 s
[pathway-compat-base:post-build]
23.32 s
[pathway-compat-base:post-build] All done.
23.34 s
[pathway-compat-base:post-build] Uploading to the NixCI cache: /nix/store/7274h69mlzj5111kzlccd4ddhcz4mj8h-pathway-compat-base-0.0.1.0-doc /nix/store/lcicpysisnrcl5wpnlag2pks0zzv3frw-pathway-compat-base-0.0.1.0
23.37 s
[pathway-compat-base:post-build] warning: 'warn-short-path-literals' is deprecated, use 'lint-short-path-literals = ignore' instead
23.39 s
[pathway-compat-base:post-build] copying 2 paths...
23.39 s
[pathway-compat-base:post-build] copying path '/nix/store/7274h69mlzj5111kzlccd4ddhcz4mj8h-pathway-compat-base-0.0.1.0-doc' to 'https://cache.nix-ci.com'...
23.74 s
[pathway-compat-base:post-build] copying path '/nix/store/lcicpysisnrcl5wpnlag2pks0zzv3frw-pathway-compat-base-0.0.1.0' to 'https://cache.nix-ci.com'...
24.22 s
[pathway-compat-base:post-build] warning: 'warn-short-path-literals' is deprecated, use 'lint-short-path-literals = ignore' instead
24.51 s
[pathway-compat-base:post-build] copying 1 paths...
24.51 s
[pathway-compat-base:post-build] copying path '/nix/store/rfxaff3ggz29012sg3f1gl5j59dk5nzp-pathway-compat-base-0.0.1.0.drv' to 'https://cache.nix-ci.com'...
24.66 s
Uploaded pathway-compat-base in 2.3s
24.66 s
Progress: 1 of 15 built
24.66 s
Built pathway-compat-base in 22.6s
24.69 s
Building /nix/store/psj7qq98d0nc1x3mcxvgminpvlszfrfm-pathway-compat-filepath-0.0.1.0.drv
24.89 s
[pathway-compat-filepath] Phase: setupCompilerEnvironmentPhase
24.90 s
[pathway-compat-filepath] Build with /nix/store/7r9b0bl984hdgd70nf5p8raa55kml491-ghc-9.8.4.
25.22 s
[pathway-compat-filepath] Phase: unpackPhase
25.23 s
[pathway-compat-filepath] unpacking source archive /nix/store/5z4x7vzkb1m65ccyx19wn7vcxdl9gmbf-filepath
25.24 s
[pathway-compat-filepath] source root is filepath
25.25 s
[pathway-compat-filepath] Phase: patchPhase
25.26 s
[pathway-compat-filepath] Phase: compileBuildDriverPhase
25.27 s
[pathway-compat-filepath] setupCompileFlags: -package-db=/build/tmp.biVzhidzsF/setup-package.conf.d -threaded
25.31 s
[pathway-compat-filepath] [1 of 2] Compiling Main ( Setup.hs, /build/tmp.biVzhidzsF/Main.o )
25.36 s
[pathway-compat-filepath] [2 of 2] Linking Setup
26.65 s
[pathway-compat-filepath] Phase: updateAutotoolsGnuConfigScriptsPhase
26.67 s
[pathway-compat-filepath] Phase: configurePhase
26.69 s
[pathway-compat-filepath] configureFlags: --verbose --prefix=/nix/store/xghx2j0inbha0jqrcxmvc3ljvvx1i77g-pathway-compat-filepath-0.0.1.0 --libdir=$prefix/lib/$compiler/lib --libsubdir=$abi/$libname --docdir=/nix/store/c3wlvp65ypvkb08q9pcr7hq7wygmm4g4-pathway-compat-filepath-0.0.1.0-doc/share/doc/pathway-compat-filepath-0.0.1.0 --with-gcc=gcc --package-db=/build/tmp.biVzhidzsF/package.conf.d --ghc-option=-j16 --ghc-option=+RTS --ghc-option=-A64M --ghc-option=-RTS --enable-library-profiling --profiling-detail=exported-functions --disable-profiling --enable-shared --disable-coverage --enable-static --disable-executable-dynamic --enable-tests --disable-benchmarks --enable-library-vanilla --disable-library-for-ghci --enable-split-sections --enable-library-stripping --enable-executable-stripping --ghc-option=-haddock --ghc-options=-Werror --extra-lib-dirs=/nix/store/pndhkk0l649lm1sj0mxk7cbwq26qd1ra-ncurses-6.6/lib --extra-lib-dirs=/nix/store/0djlg4g0b81w94k3vcaqsxsc2hh4kism-libffi-3.5.2/lib --extra-lib-dirs=/nix/store/md4paia7riiggyrj8p24c7a6vf8w7jz8-elfutils-0.194/lib --extra-lib-dirs=/nix/store/39vv2pf64gd8li48a4hpbhw2crzd8z5p-gmp-with-cxx-6.3.0/lib --extra-lib-dirs=/nix/store/7wwvald8lapkrsr72qanlw8blyn55ifx-numactl-2.0.18/lib --extra-lib-dirs=/nix/store/7r9b0bl984hdgd70nf5p8raa55kml491-ghc-9.8.4/lib
26.69 s
[pathway-compat-filepath] Using Parsec parser
26.69 s
[pathway-compat-filepath] Configuring pathway-compat-filepath-0.0.1.0...
27.04 s
[pathway-compat-filepath] Flags chosen: noisy-deprecations=True, verify-no-recursion=False
27.04 s
[pathway-compat-filepath] Dependency base >=4.14.0 && <4.15 || >=4.15.0 && <4.16 || >=4.16.0 && <4.17 ||
27.04 s
[pathway-compat-filepath] >=4.17.0 && <4.18 || >=4.18.0 && <4.19 || >=4.19.0 && <4.20 || >=4.20.0 &&
27.04 s
[pathway-compat-filepath] <4.21 || >=4.21.0 && <4.22 || >=4.22.0 && <4.23: using base-4.19.2.0
27.04 s
[pathway-compat-filepath] Dependency extra: using extra-1.8.1
27.04 s
[pathway-compat-filepath] Dependency filepath >=1.4.2 && <1.5 || >=1.5.0 && <1.6: using
27.04 s
[pathway-compat-filepath] filepath-1.4.301.0
27.04 s
[pathway-compat-filepath] Dependency megaparsec >=9.0.1 && <9.1 || >=9.2.1 && <9.3 || >=9.5.0 && <9.6 ||
27.04 s
[pathway-compat-filepath] >=9.7.0 && <9.8: using megaparsec-9.7.0
27.04 s
[pathway-compat-filepath] Dependency os-string: using os-string-2.0.10
27.04 s
[pathway-compat-filepath] Dependency pathway >=0.0.1 && <0.1: using pathway-0.0.1.0
27.04 s
[pathway-compat-filepath] Dependency pathway-compat-base >=0.0.1 && <0.1: using
27.04 s
[pathway-compat-filepath] pathway-compat-base-0.0.1.0
27.04 s
[pathway-compat-filepath] Dependency pathway-internal >=0.0.1 && <0.1: using pathway-internal-0.0.1.0
27.04 s
[pathway-compat-filepath] Dependency base >=4.14.0 && <4.15 || >=4.15.0 && <4.16 || >=4.16.0 && <4.17 ||
27.04 s
[pathway-compat-filepath] >=4.17.0 && <4.18 || >=4.18.0 && <4.19 || >=4.19.0 && <4.20 || >=4.20.0 &&
27.04 s
[pathway-compat-filepath] <4.21 || >=4.21.0 && <4.22 || >=4.22.0 && <4.23: using base-4.19.2.0
27.04 s
[pathway-compat-filepath] Dependency doctest >=0.16.3 && <0.17 || >=0.18.1 && <0.19 || >=0.20.1 && <0.21
27.04 s
[pathway-compat-filepath] || >=0.21.1 && <0.22 || >=0.22.2 && <0.23 || >=0.24.2 && <0.25: using
27.04 s
[pathway-compat-filepath] doctest-0.24.3
27.04 s
[pathway-compat-filepath] Dependency pathway-compat-filepath: using pathway-compat-filepath-0.0.1.0
27.39 s
[pathway-compat-filepath] Source component graph:
27.39 s
[pathway-compat-filepath] component lib
27.39 s
[pathway-compat-filepath] component test:doctests dependency lib
27.39 s
[pathway-compat-filepath] Configured component graph:
27.39 s
[pathway-compat-filepath] component pathway-compat-filepath-0.0.1.0-6KN1Vlb8yPeBopmlZtXyrR
27.39 s
[pathway-compat-filepath] include base-4.19.2.0-934f
27.39 s
[pathway-compat-filepath] include extra-1.8.1-F4oHgTKCper3ZiIUPZjGPK
27.39 s
[pathway-compat-filepath] include filepath-1.4.301.0-6e15
27.39 s
[pathway-compat-filepath] include megaparsec-9.7.0-10vHZAF1maw9O8p2gXs66N
27.39 s
[pathway-compat-filepath] include os-string-2.0.10-HbyG8qgShpTHKXL8bZ3UK8
27.39 s
[pathway-compat-filepath] include pathway-0.0.1.0-H5uD0SRA9755UrSqFBaCYE
27.39 s
[pathway-compat-filepath] include pathway-compat-base-0.0.1.0-8ldj6SPXbxq2Shd8yFeOpr
27.39 s
[pathway-compat-filepath] include pathway-internal-0.0.1.0-Lnjdb2M8cxN196wSdsfQUK
27.39 s
[pathway-compat-filepath] component pathway-compat-filepath-0.0.1.0-LoaDJ8tbb2m5kfHmaP2B9c-doctests
27.39 s
[pathway-compat-filepath] include base-4.19.2.0-934f
27.39 s
[pathway-compat-filepath] include doctest-0.24.3-1aDs7zEYV5r7raSsXr9TQC
27.39 s
[pathway-compat-filepath] include pathway-compat-filepath-0.0.1.0-6KN1Vlb8yPeBopmlZtXyrR
27.39 s
[pathway-compat-filepath] Linked component graph:
27.39 s
[pathway-compat-filepath] unit pathway-compat-filepath-0.0.1.0-6KN1Vlb8yPeBopmlZtXyrR
27.39 s
[pathway-compat-filepath] include base-4.19.2.0-934f
27.39 s
[pathway-compat-filepath] include extra-1.8.1-F4oHgTKCper3ZiIUPZjGPK
27.39 s
[pathway-compat-filepath] include filepath-1.4.301.0-6e15
27.39 s
[pathway-compat-filepath] include megaparsec-9.7.0-10vHZAF1maw9O8p2gXs66N
27.39 s
[pathway-compat-filepath] include os-string-2.0.10-HbyG8qgShpTHKXL8bZ3UK8
27.39 s
[pathway-compat-filepath] include pathway-0.0.1.0-H5uD0SRA9755UrSqFBaCYE
27.39 s
[pathway-compat-filepath] include pathway-compat-base-0.0.1.0-8ldj6SPXbxq2Shd8yFeOpr
27.39 s
[pathway-compat-filepath] include pathway-internal-0.0.1.0-Lnjdb2M8cxN196wSdsfQUK
27.39 s
[pathway-compat-filepath] Common.FilePath=pathway-compat-filepath-0.0.1.0-6KN1Vlb8yPeBopmlZtXyrR:Common.FilePath,Common.OsPath=pathway-compat-filepath-0.0.1.0-6KN1Vlb8yPeBopmlZtXyrR:Common.OsPath,System.FilePath=pathway-compat-filepath-0.0.1.0-6KN1Vlb8yPeBopmlZtXyrR:System.FilePath,System.FilePath.Overlay=pathway-compat-filepath-0.0.1.0-6KN1Vlb8yPeBopmlZtXyrR:System.FilePath.Overlay,System.FilePath.Pathway=pathway-compat-filepath-0.0.1.0-6KN1Vlb8yPeBopmlZtXyrR:System.FilePath.Pathway,System.FilePath.Thin=pathway-compat-filepath-0.0.1.0-6KN1Vlb8yPeBopmlZtXyrR:System.FilePath.Thin,System.OsPath=pathway-compat-filepath-0.0.1.0-6KN1Vlb8yPeBopmlZtXyrR:System.OsPath,System.OsPath.Overlay=pathway-compat-filepath-0.0.1.0-6KN1Vlb8yPeBopmlZtXyrR:System.OsPath.Overlay,System.OsPath.Pathway=pathway-compat-filepath-0.0.1.0-6KN1Vlb8yPeBopmlZtXyrR:System.OsPath.Pathway,System.OsPath.Thin=pathway-compat-filepath-0.0.1.0-6KN1Vlb8yPeBopmlZtXyrR:System.OsPath.Thin
27.39 s
[pathway-compat-filepath] unit pathway-compat-filepath-0.0.1.0-LoaDJ8tbb2m5kfHmaP2B9c-doctests
27.39 s
[pathway-compat-filepath] include base-4.19.2.0-934f
27.39 s
[pathway-compat-filepath] include doctest-0.24.3-1aDs7zEYV5r7raSsXr9TQC
27.39 s
[pathway-compat-filepath] include pathway-compat-filepath-0.0.1.0-6KN1Vlb8yPeBopmlZtXyrR
27.39 s
[pathway-compat-filepath] Ready component graph:
27.39 s
[pathway-compat-filepath] definite pathway-compat-filepath-0.0.1.0-6KN1Vlb8yPeBopmlZtXyrR
27.39 s
[pathway-compat-filepath] depends base-4.19.2.0-934f
27.39 s
[pathway-compat-filepath] depends extra-1.8.1-F4oHgTKCper3ZiIUPZjGPK
27.39 s
[pathway-compat-filepath] depends filepath-1.4.301.0-6e15
27.39 s
[pathway-compat-filepath] depends megaparsec-9.7.0-10vHZAF1maw9O8p2gXs66N
27.39 s
[pathway-compat-filepath] depends os-string-2.0.10-HbyG8qgShpTHKXL8bZ3UK8
27.39 s
[pathway-compat-filepath] depends pathway-0.0.1.0-H5uD0SRA9755UrSqFBaCYE
27.39 s
[pathway-compat-filepath] depends pathway-compat-base-0.0.1.0-8ldj6SPXbxq2Shd8yFeOpr
27.39 s
[pathway-compat-filepath] depends pathway-internal-0.0.1.0-Lnjdb2M8cxN196wSdsfQUK
27.39 s
[pathway-compat-filepath] definite pathway-compat-filepath-0.0.1.0-LoaDJ8tbb2m5kfHmaP2B9c-doctests
27.39 s
[pathway-compat-filepath] depends base-4.19.2.0-934f
27.39 s
[pathway-compat-filepath] depends doctest-0.24.3-1aDs7zEYV5r7raSsXr9TQC
27.39 s
[pathway-compat-filepath] depends pathway-compat-filepath-0.0.1.0-6KN1Vlb8yPeBopmlZtXyrR
27.39 s
[pathway-compat-filepath] Using Cabal-3.10.3.0 compiled by ghc-9.8
27.39 s
[pathway-compat-filepath] Using compiler: ghc-9.8.4
27.39 s
[pathway-compat-filepath] Using install prefix:
27.39 s
[pathway-compat-filepath] /nix/store/xghx2j0inbha0jqrcxmvc3ljvvx1i77g-pathway-compat-filepath-0.0.1.0
27.39 s
[pathway-compat-filepath] Executables installed in:
27.39 s
[pathway-compat-filepath] /nix/store/xghx2j0inbha0jqrcxmvc3ljvvx1i77g-pathway-compat-filepath-0.0.1.0/bin
27.39 s
[pathway-compat-filepath] Libraries installed in:
27.39 s
[pathway-compat-filepath] /nix/store/xghx2j0inbha0jqrcxmvc3ljvvx1i77g-pathway-compat-filepath-0.0.1.0/lib/ghc-9.8.4/lib/x86_64-linux-ghc-9.8.4/pathway-compat-filepath-0.0.1.0-6KN1Vlb8yPeBopmlZtXyrR
27.39 s
[pathway-compat-filepath] Dynamic Libraries installed in:
27.39 s
[pathway-compat-filepath] /nix/store/xghx2j0inbha0jqrcxmvc3ljvvx1i77g-pathway-compat-filepath-0.0.1.0/lib/ghc-9.8.4/lib/x86_64-linux-ghc-9.8.4
27.39 s
[pathway-compat-filepath] Private executables installed in:
27.39 s
[pathway-compat-filepath] /nix/store/xghx2j0inbha0jqrcxmvc3ljvvx1i77g-pathway-compat-filepath-0.0.1.0/libexec/x86_64-linux-ghc-9.8.4/pathway-compat-filepath-0.0.1.0
27.39 s
[pathway-compat-filepath] Data files installed in:
27.39 s
[pathway-compat-filepath] /nix/store/xghx2j0inbha0jqrcxmvc3ljvvx1i77g-pathway-compat-filepath-0.0.1.0/share/x86_64-linux-ghc-9.8.4/pathway-compat-filepath-0.0.1.0
27.39 s
[pathway-compat-filepath] Documentation installed in:
27.39 s
[pathway-compat-filepath] /nix/store/c3wlvp65ypvkb08q9pcr7hq7wygmm4g4-pathway-compat-filepath-0.0.1.0-doc/share/doc/pathway-compat-filepath-0.0.1.0
27.39 s
[pathway-compat-filepath] Configuration files installed in:
27.39 s
[pathway-compat-filepath] /nix/store/xghx2j0inbha0jqrcxmvc3ljvvx1i77g-pathway-compat-filepath-0.0.1.0/etc
27.39 s
[pathway-compat-filepath] No alex found
27.39 s
[pathway-compat-filepath] Using ar found on system at:
27.39 s
[pathway-compat-filepath] /nix/store/zjraf40s86y3iwhp626b934r5y6ldkbb-binutils-wrapper-2.46/bin/ar
27.39 s
[pathway-compat-filepath] No c2hs found
27.39 s
[pathway-compat-filepath] No cpphs found
27.39 s
[pathway-compat-filepath] Using doctest version 0.24.3 found on system at:
27.39 s
[pathway-compat-filepath] /nix/store/2y183b1vsybv0157vfr59yhdwjkpqfkn-doctest-0.24.3/bin/doctest
27.39 s
[pathway-compat-filepath] Using gcc version 15.2.0 given by user at:
27.39 s
[pathway-compat-filepath] /nix/store/29qjlshvklnyr67nhpprzgb9igmsfsjj-gcc-wrapper-15.2.0/bin/gcc
27.39 s
[pathway-compat-filepath] Using ghc version 9.8.4 found on system at:
27.39 s
[pathway-compat-filepath] /nix/store/7r9b0bl984hdgd70nf5p8raa55kml491-ghc-9.8.4/bin/ghc
27.39 s
[pathway-compat-filepath] Using ghc-pkg version 9.8.4 found on system at:
27.39 s
[pathway-compat-filepath] /nix/store/7r9b0bl984hdgd70nf5p8raa55kml491-ghc-9.8.4/bin/ghc-pkg-9.8.4
27.39 s
[pathway-compat-filepath] No ghcjs found
27.39 s
[pathway-compat-filepath] No ghcjs-pkg found
27.39 s
[pathway-compat-filepath] No greencard found
27.39 s
[pathway-compat-filepath] Using haddock version 2.30.0 found on system at:
27.39 s
[pathway-compat-filepath] /nix/store/7r9b0bl984hdgd70nf5p8raa55kml491-ghc-9.8.4/bin/haddock-ghc-9.8.4
27.39 s
[pathway-compat-filepath] No happy found
27.39 s
[pathway-compat-filepath] Using haskell-suite found on system at: haskell-suite-dummy-location
27.39 s
[pathway-compat-filepath] Using haskell-suite-pkg found on system at: haskell-suite-pkg-dummy-location
27.39 s
[pathway-compat-filepath] No hmake found
27.39 s
[pathway-compat-filepath] Using hpc version 0.69 found on system at:
27.39 s
[pathway-compat-filepath] /nix/store/7r9b0bl984hdgd70nf5p8raa55kml491-ghc-9.8.4/bin/hpc-ghc-9.8.4
27.39 s
[pathway-compat-filepath] Using hsc2hs version 0.68.10 found on system at:
27.39 s
[pathway-compat-filepath] /nix/store/7r9b0bl984hdgd70nf5p8raa55kml491-ghc-9.8.4/bin/hsc2hs-ghc-9.8.4
27.39 s
[pathway-compat-filepath] Using hscolour version 1.25 found on system at:
27.39 s
[pathway-compat-filepath] /nix/store/awnxn98rlw62rrjwli6d2lb4d27mrzzw-hscolour-1.25/bin/HsColour
27.39 s
[pathway-compat-filepath] No jhc found
27.39 s
[pathway-compat-filepath] Using ld found on system at:
27.39 s
[pathway-compat-filepath] /nix/store/zjraf40s86y3iwhp626b934r5y6ldkbb-binutils-wrapper-2.46/bin/ld.gold
27.39 s
[pathway-compat-filepath] No pkg-config found
27.39 s
[pathway-compat-filepath] Using runghc version 9.8.4 found on system at:
27.39 s
[pathway-compat-filepath] /nix/store/7r9b0bl984hdgd70nf5p8raa55kml491-ghc-9.8.4/bin/runghc-9.8.4
27.39 s
[pathway-compat-filepath] Using strip version 2.46 found on system at:
27.39 s
[pathway-compat-filepath] /nix/store/29qjlshvklnyr67nhpprzgb9igmsfsjj-gcc-wrapper-15.2.0/bin/strip
27.39 s
[pathway-compat-filepath] Using tar found on system at:
27.39 s
[pathway-compat-filepath] /nix/store/z5mq2sam4484prf3kv6v6vjw1m0i7j24-gnutar-1.35/bin/tar
27.39 s
[pathway-compat-filepath] No uhc found
27.83 s
[pathway-compat-filepath] Phase: buildPhase
27.90 s
[pathway-compat-filepath] Preprocessing library for pathway-compat-filepath-0.0.1.0..
27.90 s
[pathway-compat-filepath] Building library for pathway-compat-filepath-0.0.1.0..
27.98 s
[pathway-compat-filepath] [ 1 of 10] Compiling Common.FilePath ( src/Common/FilePath.hs, dist/build/Common/FilePath.o, dist/build/Common/FilePath.dyn_o )
28.27 s
[pathway-compat-filepath] [ 2 of 10] Compiling Common.OsPath ( src/Common/OsPath.hs, dist/build/Common/OsPath.o, dist/build/Common/OsPath.dyn_o )
28.27 s
[pathway-compat-filepath]
28.27 s
[pathway-compat-filepath] src/Common/OsPath.hs:90:23: error : [ GHC-83865 ]
28.27 s
[pathway-compat-filepath] • Couldn't match type ‘OSS.OsString’ with ‘OsString’
28.27 s
[pathway-compat-filepath] Expected: OsPath
28.27 s
[pathway-compat-filepath] Actual: OSS.OsString
28.27 s
[pathway-compat-filepath] NB: ‘OsString’
28.27 s
[pathway-compat-filepath] is defined in ‘System.OsString.Internal.Types.Hidden’
28.27 s
[pathway-compat-filepath] in package ‘filepath-1.4.301.0’
28.27 s
[pathway-compat-filepath] ‘OSS.OsString’
28.27 s
[pathway-compat-filepath] is defined in ‘System.OsString.Internal.Types’
28.27 s
[pathway-compat-filepath] in package ‘os-string-2.0.10’
28.27 s
[pathway-compat-filepath] • In the ‘parent’ field of a record
28.27 s
[pathway-compat-filepath] In the expression:
28.27 s
[pathway-compat-filepath] Format
28.27 s
[pathway-compat-filepath] {root = O.pack . pure $ O.pathSeparator, current = mempty,
28.27 s
[pathway-compat-filepath] parent = OSS.unsafeEncodeUtf "..",
28.27 s
[pathway-compat-filepath] separator = O.pack . pure $ O.pathSeparator,
28.27 s
[pathway-compat-filepath] substitutions = mempty}
28.27 s
[pathway-compat-filepath] In an equation for ‘localFormat’:
28.27 s
[pathway-compat-filepath] localFormat
28.27 s
[pathway-compat-filepath] = Format
28.27 s
[pathway-compat-filepath] {root = O.pack . pure $ O.pathSeparator, current = mempty,
28.27 s
[pathway-compat-filepath] parent = OSS.unsafeEncodeUtf "..",
28.27 s
[pathway-compat-filepath] separator = O.pack . pure $ O.pathSeparator,
28.27 s
[pathway-compat-filepath] substitutions = mempty}
28.27 s
[pathway-compat-filepath] |
28.27 s
[pathway-compat-filepath] 90 | Format.parent = OSS.unsafeEncodeUtf ".." ,
28.27 s
[pathway-compat-filepath] | ^^^^^^^^^^^^^^^^^^^^^^^^
28.27 s
[pathway-compat-filepath] [ 3 of 10] Compiling System.FilePath.Thin ( src/System/FilePath/Thin.hs, dist/build/System/FilePath/Thin.o, dist/build/System/FilePath/Thin.dyn_o )
28.37 s
[pathway-compat-filepath] [ 4 of 10] Compiling System.FilePath.Pathway ( src/System/FilePath/Pathway.hs, dist/build/System/FilePath/Pathway.o, dist/build/System/FilePath/Pathway.dyn_o )
28.40 s
[pathway-compat-filepath] [ 5 of 10] Compiling System.FilePath.Overlay ( src/System/FilePath/Overlay.hs, dist/build/System/FilePath/Overlay.o, dist/build/System/FilePath/Overlay.dyn_o )
28.42 s
[pathway-compat-filepath] [ 6 of 10] Compiling System.FilePath ( src/System/FilePath.hs, dist/build/System/FilePath.o, dist/build/System/FilePath.dyn_o )
28.54 s
Progress: 1 of 13 built (1 failed)
28.54 s
Failed to build pathway-compat-filepath after 3.8s
28.54 s
error: Cannot build '/nix/store/psj7qq98d0nc1x3mcxvgminpvlszfrfm-pathway-compat-filepath-0.0.1.0.drv '.
28.54 s
Reason: builder failed with exit code 1 .
28.54 s
Output paths:
28.54 s
/nix/store/c3wlvp65ypvkb08q9pcr7hq7wygmm4g4-pathway-compat-filepath-0.0.1.0-doc
28.54 s
/nix/store/xghx2j0inbha0jqrcxmvc3ljvvx1i77g-pathway-compat-filepath-0.0.1.0
28.54 s
Last 176 log lines:
28.54 s
> Running phase: setupCompilerEnvironmentPhase
28.54 s
> Build with /nix/store/7r9b0bl984hdgd70nf5p8raa55kml491-ghc-9.8.4.
28.54 s
> Running phase: unpackPhase
28.54 s
> unpacking source archive /nix/store/5z4x7vzkb1m65ccyx19wn7vcxdl9gmbf-filepath
28.54 s
> source root is filepath
28.54 s
> Running phase: patchPhase
28.54 s
> Running phase: compileBuildDriverPhase
28.54 s
> setupCompileFlags: -package-db=/build/tmp.biVzhidzsF/setup-package.conf.d -threaded
28.54 s
> [1 of 2] Compiling Main ( Setup.hs, /build/tmp.biVzhidzsF/Main.o )
28.54 s
> [2 of 2] Linking Setup
28.54 s
> Running phase: updateAutotoolsGnuConfigScriptsPhase
28.54 s
> Running phase: configurePhase
28.54 s
> configureFlags: --verbose --prefix=/nix/store/xghx2j0inbha0jqrcxmvc3ljvvx1i77g-pathway-compat-filepath-0.0.1.0 --libdir=$prefix/lib/$compiler/lib --libsubdir=$abi/$libname --docdir=/nix/store/c3wlvp65ypvkb08q9pcr7hq7wygmm4g4-pathway-compat-filepath-0.0.1.0-doc/share/doc/pathway-compat-filepath-0.0.1.0 --with-gcc=gcc --package-db=/build/tmp.biVzhidzsF/package.conf.d --ghc-option=-j16 --ghc-option=+RTS --ghc-option=-A64M --ghc-option=-RTS --enable-library-profiling --profiling-detail=exported-functions --disable-profiling --enable-shared --disable-coverage --enable-static --disable-executable-dynamic --enable-tests --disable-benchmarks --enable-library-vanilla --disable-library-for-ghci --enable-split-sections --enable-library-stripping --enable-executable-stripping --ghc-option=-haddock --ghc-options=-Werror --extra-lib-dirs=/nix/store/pndhkk0l649lm1sj0mxk7cbwq26qd1ra-ncurses-6.6/lib --extra-lib-dirs=/nix/store/0djlg4g0b81w94k3vcaqsxsc2hh4kism-libffi-3.5.2/lib --extra-lib-dirs=/nix/store/md4paia7riiggyrj8p24c7a6vf8w7jz8-elfutils-0.194/lib --extra-lib-dirs=/nix/store/39vv2pf64gd8li48a4hpbhw2crzd8z5p-gmp-with-cxx-6.3.0/lib --extra-lib-dirs=/nix/store/7wwvald8lapkrsr72qanlw8blyn55ifx-numactl-2.0.18/lib --extra-lib-dirs=/nix/store/7r9b0bl984hdgd70nf5p8raa55kml491-ghc-9.8.4/lib
28.54 s
> Using Parsec parser
28.54 s
> Configuring pathway-compat-filepath-0.0.1.0...
28.54 s
> Flags chosen: noisy-deprecations=True, verify-no-recursion=False
28.54 s
> Dependency base >=4.14.0 && <4.15 || >=4.15.0 && <4.16 || >=4.16.0 && <4.17 ||
28.54 s
> >=4.17.0 && <4.18 || >=4.18.0 && <4.19 || >=4.19.0 && <4.20 || >=4.20.0 &&
28.54 s
> <4.21 || >=4.21.0 && <4.22 || >=4.22.0 && <4.23: using base-4.19.2.0
28.54 s
> Dependency extra: using extra-1.8.1
28.54 s
> Dependency filepath >=1.4.2 && <1.5 || >=1.5.0 && <1.6: using
28.54 s
> filepath-1.4.301.0
28.54 s
> Dependency megaparsec >=9.0.1 && <9.1 || >=9.2.1 && <9.3 || >=9.5.0 && <9.6 ||
28.54 s
> >=9.7.0 && <9.8: using megaparsec-9.7.0
28.54 s
> Dependency os-string: using os-string-2.0.10
28.54 s
> Dependency pathway >=0.0.1 && <0.1: using pathway-0.0.1.0
28.54 s
> Dependency pathway-compat-base >=0.0.1 && <0.1: using
28.54 s
> pathway-compat-base-0.0.1.0
28.54 s
> Dependency pathway-internal >=0.0.1 && <0.1: using pathway-internal-0.0.1.0
28.54 s
> Dependency base >=4.14.0 && <4.15 || >=4.15.0 && <4.16 || >=4.16.0 && <4.17 ||
28.54 s
> >=4.17.0 && <4.18 || >=4.18.0 && <4.19 || >=4.19.0 && <4.20 || >=4.20.0 &&
28.54 s
> <4.21 || >=4.21.0 && <4.22 || >=4.22.0 && <4.23: using base-4.19.2.0
28.54 s
> Dependency doctest >=0.16.3 && <0.17 || >=0.18.1 && <0.19 || >=0.20.1 && <0.21
28.54 s
> || >=0.21.1 && <0.22 || >=0.22.2 && <0.23 || >=0.24.2 && <0.25: using
28.54 s
> doctest-0.24.3
28.54 s
> Dependency pathway-compat-filepath: using pathway-compat-filepath-0.0.1.0
28.54 s
> Source component graph:
28.54 s
> component lib
28.54 s
> component test:doctests dependency lib
28.54 s
> Configured component graph:
28.54 s
> component pathway-compat-filepath-0.0.1.0-6KN1Vlb8yPeBopmlZtXyrR
28.54 s
> include base-4.19.2.0-934f
28.54 s
> include extra-1.8.1-F4oHgTKCper3ZiIUPZjGPK
28.54 s
> include filepath-1.4.301.0-6e15
28.54 s
> include megaparsec-9.7.0-10vHZAF1maw9O8p2gXs66N
28.54 s
> include os-string-2.0.10-HbyG8qgShpTHKXL8bZ3UK8
28.54 s
> include pathway-0.0.1.0-H5uD0SRA9755UrSqFBaCYE
28.54 s
> include pathway-compat-base-0.0.1.0-8ldj6SPXbxq2Shd8yFeOpr
28.54 s
> include pathway-internal-0.0.1.0-Lnjdb2M8cxN196wSdsfQUK
28.54 s
> component pathway-compat-filepath-0.0.1.0-LoaDJ8tbb2m5kfHmaP2B9c-doctests
28.54 s
> include base-4.19.2.0-934f
28.54 s
> include doctest-0.24.3-1aDs7zEYV5r7raSsXr9TQC
28.54 s
> include pathway-compat-filepath-0.0.1.0-6KN1Vlb8yPeBopmlZtXyrR
28.54 s
> Linked component graph:
28.54 s
> unit pathway-compat-filepath-0.0.1.0-6KN1Vlb8yPeBopmlZtXyrR
28.54 s
> include base-4.19.2.0-934f
28.54 s
> include extra-1.8.1-F4oHgTKCper3ZiIUPZjGPK
28.54 s
> include filepath-1.4.301.0-6e15
28.54 s
> include megaparsec-9.7.0-10vHZAF1maw9O8p2gXs66N
28.54 s
> include os-string-2.0.10-HbyG8qgShpTHKXL8bZ3UK8
28.54 s
> include pathway-0.0.1.0-H5uD0SRA9755UrSqFBaCYE
28.54 s
> include pathway-compat-base-0.0.1.0-8ldj6SPXbxq2Shd8yFeOpr
28.54 s
> include pathway-internal-0.0.1.0-Lnjdb2M8cxN196wSdsfQUK
28.54 s
> Common.FilePath=pathway-compat-filepath-0.0.1.0-6KN1Vlb8yPeBopmlZtXyrR:Common.FilePath,Common.OsPath=pathway-compat-filepath-0.0.1.0-6KN1Vlb8yPeBopmlZtXyrR:Common.OsPath,System.FilePath=pathway-compat-filepath-0.0.1.0-6KN1Vlb8yPeBopmlZtXyrR:System.FilePath,System.FilePath.Overlay=pathway-compat-filepath-0.0.1.0-6KN1Vlb8yPeBopmlZtXyrR:System.FilePath.Overlay,System.FilePath.Pathway=pathway-compat-filepath-0.0.1.0-6KN1Vlb8yPeBopmlZtXyrR:System.FilePath.Pathway,System.FilePath.Thin=pathway-compat-filepath-0.0.1.0-6KN1Vlb8yPeBopmlZtXyrR:System.FilePath.Thin,System.OsPath=pathway-compat-filepath-0.0.1.0-6KN1Vlb8yPeBopmlZtXyrR:System.OsPath,System.OsPath.Overlay=pathway-compat-filepath-0.0.1.0-6KN1Vlb8yPeBopmlZtXyrR:System.OsPath.Overlay,System.OsPath.Pathway=pathway-compat-filepath-0.0.1.0-6KN1Vlb8yPeBopmlZtXyrR:System.OsPath.Pathway,System.OsPath.Thin=pathway-compat-filepath-0.0.1.0-6KN1Vlb8yPeBopmlZtXyrR:System.OsPath.Thin
28.54 s
> unit pathway-compat-filepath-0.0.1.0-LoaDJ8tbb2m5kfHmaP2B9c-doctests
28.54 s
> include base-4.19.2.0-934f
28.54 s
> include doctest-0.24.3-1aDs7zEYV5r7raSsXr9TQC
28.54 s
> include pathway-compat-filepath-0.0.1.0-6KN1Vlb8yPeBopmlZtXyrR
28.54 s
> Ready component graph:
28.54 s
> definite pathway-compat-filepath-0.0.1.0-6KN1Vlb8yPeBopmlZtXyrR
28.54 s
> depends base-4.19.2.0-934f
28.54 s
> depends extra-1.8.1-F4oHgTKCper3ZiIUPZjGPK
28.54 s
> depends filepath-1.4.301.0-6e15
28.54 s
> depends megaparsec-9.7.0-10vHZAF1maw9O8p2gXs66N
28.54 s
> depends os-string-2.0.10-HbyG8qgShpTHKXL8bZ3UK8
28.54 s
> depends pathway-0.0.1.0-H5uD0SRA9755UrSqFBaCYE
28.54 s
> depends pathway-compat-base-0.0.1.0-8ldj6SPXbxq2Shd8yFeOpr
28.54 s
> depends pathway-internal-0.0.1.0-Lnjdb2M8cxN196wSdsfQUK
28.54 s
> definite pathway-compat-filepath-0.0.1.0-LoaDJ8tbb2m5kfHmaP2B9c-doctests
28.54 s
> depends base-4.19.2.0-934f
28.54 s
> depends doctest-0.24.3-1aDs7zEYV5r7raSsXr9TQC
28.54 s
> depends pathway-compat-filepath-0.0.1.0-6KN1Vlb8yPeBopmlZtXyrR
28.54 s
> Using Cabal-3.10.3.0 compiled by ghc-9.8
28.54 s
> Using compiler: ghc-9.8.4
28.54 s
> Using install prefix:
28.54 s
> /nix/store/xghx2j0inbha0jqrcxmvc3ljvvx1i77g-pathway-compat-filepath-0.0.1.0
28.54 s
> Executables installed in:
28.54 s
> /nix/store/xghx2j0inbha0jqrcxmvc3ljvvx1i77g-pathway-compat-filepath-0.0.1.0/bin
28.54 s
> Libraries installed in:
28.54 s
> /nix/store/xghx2j0inbha0jqrcxmvc3ljvvx1i77g-pathway-compat-filepath-0.0.1.0/lib/ghc-9.8.4/lib/x86_64-linux-ghc-9.8.4/pathway-compat-filepath-0.0.1.0-6KN1Vlb8yPeBopmlZtXyrR
28.54 s
> Dynamic Libraries installed in:
28.54 s
> /nix/store/xghx2j0inbha0jqrcxmvc3ljvvx1i77g-pathway-compat-filepath-0.0.1.0/lib/ghc-9.8.4/lib/x86_64-linux-ghc-9.8.4
28.54 s
> Private executables installed in:
28.54 s
> /nix/store/xghx2j0inbha0jqrcxmvc3ljvvx1i77g-pathway-compat-filepath-0.0.1.0/libexec/x86_64-linux-ghc-9.8.4/pathway-compat-filepath-0.0.1.0
28.54 s
> Data files installed in:
28.54 s
> /nix/store/xghx2j0inbha0jqrcxmvc3ljvvx1i77g-pathway-compat-filepath-0.0.1.0/share/x86_64-linux-ghc-9.8.4/pathway-compat-filepath-0.0.1.0
28.54 s
> Documentation installed in:
28.54 s
> /nix/store/c3wlvp65ypvkb08q9pcr7hq7wygmm4g4-pathway-compat-filepath-0.0.1.0-doc/share/doc/pathway-compat-filepath-0.0.1.0
28.54 s
> Configuration files installed in:
28.54 s
> /nix/store/xghx2j0inbha0jqrcxmvc3ljvvx1i77g-pathway-compat-filepath-0.0.1.0/etc
28.54 s
> No alex found
28.54 s
> Using ar found on system at:
28.54 s
> /nix/store/zjraf40s86y3iwhp626b934r5y6ldkbb-binutils-wrapper-2.46/bin/ar
28.54 s
> No c2hs found
28.54 s
> No cpphs found
28.54 s
> Using doctest version 0.24.3 found on system at:
28.54 s
> /nix/store/2y183b1vsybv0157vfr59yhdwjkpqfkn-doctest-0.24.3/bin/doctest
28.54 s
> Using gcc version 15.2.0 given by user at:
28.54 s
> /nix/store/29qjlshvklnyr67nhpprzgb9igmsfsjj-gcc-wrapper-15.2.0/bin/gcc
28.54 s
> Using ghc version 9.8.4 found on system at:
28.54 s
> /nix/store/7r9b0bl984hdgd70nf5p8raa55kml491-ghc-9.8.4/bin/ghc
28.54 s
> Using ghc-pkg version 9.8.4 found on system at:
28.54 s
> /nix/store/7r9b0bl984hdgd70nf5p8raa55kml491-ghc-9.8.4/bin/ghc-pkg-9.8.4
28.54 s
> No ghcjs found
28.54 s
> No ghcjs-pkg found
28.54 s
> No greencard found
28.54 s
> Using haddock version 2.30.0 found on system at:
28.54 s
> /nix/store/7r9b0bl984hdgd70nf5p8raa55kml491-ghc-9.8.4/bin/haddock-ghc-9.8.4
28.54 s
> No happy found
28.54 s
> Using haskell-suite found on system at: haskell-suite-dummy-location
28.54 s
> Using haskell-suite-pkg found on system at: haskell-suite-pkg-dummy-location
28.54 s
> No hmake found
28.54 s
> Using hpc version 0.69 found on system at:
28.54 s
> /nix/store/7r9b0bl984hdgd70nf5p8raa55kml491-ghc-9.8.4/bin/hpc-ghc-9.8.4
28.54 s
> Using hsc2hs version 0.68.10 found on system at:
28.54 s
> /nix/store/7r9b0bl984hdgd70nf5p8raa55kml491-ghc-9.8.4/bin/hsc2hs-ghc-9.8.4
28.54 s
> Using hscolour version 1.25 found on system at:
28.54 s
> /nix/store/awnxn98rlw62rrjwli6d2lb4d27mrzzw-hscolour-1.25/bin/HsColour
28.54 s
> No jhc found
28.54 s
> Using ld found on system at:
28.54 s
> /nix/store/zjraf40s86y3iwhp626b934r5y6ldkbb-binutils-wrapper-2.46/bin/ld.gold
28.54 s
> No pkg-config found
28.54 s
> Using runghc version 9.8.4 found on system at:
28.54 s
> /nix/store/7r9b0bl984hdgd70nf5p8raa55kml491-ghc-9.8.4/bin/runghc-9.8.4
28.54 s
> Using strip version 2.46 found on system at:
28.54 s
> /nix/store/29qjlshvklnyr67nhpprzgb9igmsfsjj-gcc-wrapper-15.2.0/bin/strip
28.54 s
> Using tar found on system at:
28.54 s
> /nix/store/z5mq2sam4484prf3kv6v6vjw1m0i7j24-gnutar-1.35/bin/tar
28.54 s
> No uhc found
28.54 s
> Running phase: buildPhase
28.54 s
> Preprocessing library for pathway-compat-filepath-0.0.1.0..
28.54 s
> Building library for pathway-compat-filepath-0.0.1.0..
28.54 s
> [ 1 of 10] Compiling Common.FilePath ( src/Common/FilePath.hs, dist/build/Common/FilePath.o, dist/build/Common/FilePath.dyn_o )
28.54 s
> [ 2 of 10] Compiling Common.OsPath ( src/Common/OsPath.hs, dist/build/Common/OsPath.o, dist/build/Common/OsPath.dyn_o )
28.54 s
>
28.54 s
> src/Common/OsPath.hs:90:23: error : [ GHC-83865 ]
28.54 s
> • Couldn't match type ‘OSS.OsString’ with ‘OsString’
28.54 s
> Expected: OsPath
28.54 s
> Actual: OSS.OsString
28.54 s
> NB: ‘OsString’
28.54 s
> is defined in ‘System.OsString.Internal.Types.Hidden’
28.54 s
> in package ‘filepath-1.4.301.0’
28.54 s
> ‘OSS.OsString’
28.54 s
> is defined in ‘System.OsString.Internal.Types’
28.54 s
> in package ‘os-string-2.0.10’
28.54 s
> • In the ‘parent’ field of a record
28.54 s
> In the expression:
28.54 s
> Format
28.54 s
> {root = O.pack . pure $ O.pathSeparator, current = mempty,
28.54 s
> parent = OSS.unsafeEncodeUtf "..",
28.54 s
> separator = O.pack . pure $ O.pathSeparator,
28.54 s
> substitutions = mempty}
28.54 s
> In an equation for ‘localFormat’:
28.54 s
> localFormat
28.54 s
> = Format
28.54 s
> {root = O.pack . pure $ O.pathSeparator, current = mempty,
28.54 s
> parent = OSS.unsafeEncodeUtf "..",
28.54 s
> separator = O.pack . pure $ O.pathSeparator,
28.54 s
> substitutions = mempty}
28.54 s
> |
28.54 s
> 90 | Format.parent = OSS.unsafeEncodeUtf ".." ,
28.54 s
> | ^^^^^^^^^^^^^^^^^^^^^^^^
28.54 s
> [ 3 of 10] Compiling System.FilePath.Thin ( src/System/FilePath/Thin.hs, dist/build/System/FilePath/Thin.o, dist/build/System/FilePath/Thin.dyn_o )
28.54 s
> [ 4 of 10] Compiling System.FilePath.Pathway ( src/System/FilePath/Pathway.hs, dist/build/System/FilePath/Pathway.o, dist/build/System/FilePath/Pathway.dyn_o )
28.54 s
> [ 5 of 10] Compiling System.FilePath.Overlay ( src/System/FilePath/Overlay.hs, dist/build/System/FilePath/Overlay.o, dist/build/System/FilePath/Overlay.dyn_o )
28.54 s
> [ 6 of 10] Compiling System.FilePath ( src/System/FilePath.hs, dist/build/System/FilePath.o, dist/build/System/FilePath.dyn_o )
28.54 s
For full logs, run:
28.54 s
nix log /nix/store/psj7qq98d0nc1x3mcxvgminpvlszfrfm-pathway-compat-filepath-0.0.1.0.drv
28.54 s
error: Cannot build '/nix/store/psj7qq98d0nc1x3mcxvgminpvlszfrfm-pathway-compat-filepath-0.0.1.0.drv '.
28.54 s
Reason: builder failed with exit code 1 .
28.54 s
Output paths:
28.54 s
/nix/store/c3wlvp65ypvkb08q9pcr7hq7wygmm4g4-pathway-compat-filepath-0.0.1.0-doc
28.54 s
/nix/store/xghx2j0inbha0jqrcxmvc3ljvvx1i77g-pathway-compat-filepath-0.0.1.0
28.54 s
Last 176 log lines:
28.54 s
> Running phase: setupCompilerEnvironmentPhase
28.54 s
> Build with /nix/store/7r9b0bl984hdgd70nf5p8raa55kml491-ghc-9.8.4.
28.54 s
> Running phase: unpackPhase
28.54 s
> unpacking source archive /nix/store/5z4x7vzkb1m65ccyx19wn7vcxdl9gmbf-filepath
28.54 s
> source root is filepath
28.54 s
> Running phase: patchPhase
28.54 s
> Running phase: compileBuildDriverPhase
28.54 s
> setupCompileFlags: -package-db=/build/tmp.biVzhidzsF/setup-package.conf.d -threaded
28.54 s
> [1 of 2] Compiling Main ( Setup.hs, /build/tmp.biVzhidzsF/Main.o )
28.54 s
> [2 of 2] Linking Setup
28.54 s
> Running phase: updateAutotoolsGnuConfigScriptsPhase
28.54 s
> Running phase: configurePhase
28.54 s
> configureFlags: --verbose --prefix=/nix/store/xghx2j0inbha0jqrcxmvc3ljvvx1i77g-pathway-compat-filepath-0.0.1.0 --libdir=$prefix/lib/$compiler/lib --libsubdir=$abi/$libname --docdir=/nix/store/c3wlvp65ypvkb08q9pcr7hq7wygmm4g4-pathway-compat-filepath-0.0.1.0-doc/share/doc/pathway-compat-filepath-0.0.1.0 --with-gcc=gcc --package-db=/build/tmp.biVzhidzsF/package.conf.d --ghc-option=-j16 --ghc-option=+RTS --ghc-option=-A64M --ghc-option=-RTS --enable-library-profiling --profiling-detail=exported-functions --disable-profiling --enable-shared --disable-coverage --enable-static --disable-executable-dynamic --enable-tests --disable-benchmarks --enable-library-vanilla --disable-library-for-ghci --enable-split-sections --enable-library-stripping --enable-executable-stripping --ghc-option=-haddock --ghc-options=-Werror --extra-lib-dirs=/nix/store/pndhkk0l649lm1sj0mxk7cbwq26qd1ra-ncurses-6.6/lib --extra-lib-dirs=/nix/store/0djlg4g0b81w94k3vcaqsxsc2hh4kism-libffi-3.5.2/lib --extra-lib-dirs=/nix/store/md4paia7riiggyrj8p24c7a6vf8w7jz8-elfutils-0.194/lib --extra-lib-dirs=/nix/store/39vv2pf64gd8li48a4hpbhw2crzd8z5p-gmp-with-cxx-6.3.0/lib --extra-lib-dirs=/nix/store/7wwvald8lapkrsr72qanlw8blyn55ifx-numactl-2.0.18/lib --extra-lib-dirs=/nix/store/7r9b0bl984hdgd70nf5p8raa55kml491-ghc-9.8.4/lib
28.54 s
> Using Parsec parser
28.54 s
> Configuring pathway-compat-filepath-0.0.1.0...
28.54 s
> Flags chosen: noisy-deprecations=True, verify-no-recursion=False
28.54 s
> Dependency base >=4.14.0 && <4.15 || >=4.15.0 && <4.16 || >=4.16.0 && <4.17 ||
28.54 s
> >=4.17.0 && <4.18 || >=4.18.0 && <4.19 || >=4.19.0 && <4.20 || >=4.20.0 &&
28.54 s
> <4.21 || >=4.21.0 && <4.22 || >=4.22.0 && <4.23: using base-4.19.2.0
28.54 s
> Dependency extra: using extra-1.8.1
28.54 s
> Dependency filepath >=1.4.2 && <1.5 || >=1.5.0 && <1.6: using
28.54 s
> filepath-1.4.301.0
28.54 s
> Dependency megaparsec >=9.0.1 && <9.1 || >=9.2.1 && <9.3 || >=9.5.0 && <9.6 ||
28.54 s
> >=9.7.0 && <9.8: using megaparsec-9.7.0
28.54 s
> Dependency os-string: using os-string-2.0.10
28.54 s
> Dependency pathway >=0.0.1 && <0.1: using pathway-0.0.1.0
28.54 s
> Dependency pathway-compat-base >=0.0.1 && <0.1: using
28.54 s
> pathway-compat-base-0.0.1.0
28.54 s
> Dependency pathway-internal >=0.0.1 && <0.1: using pathway-internal-0.0.1.0
28.54 s
> Dependency base >=4.14.0 && <4.15 || >=4.15.0 && <4.16 || >=4.16.0 && <4.17 ||
28.54 s
> >=4.17.0 && <4.18 || >=4.18.0 && <4.19 || >=4.19.0 && <4.20 || >=4.20.0 &&
28.54 s
> <4.21 || >=4.21.0 && <4.22 || >=4.22.0 && <4.23: using base-4.19.2.0
28.54 s
> Dependency doctest >=0.16.3 && <0.17 || >=0.18.1 && <0.19 || >=0.20.1 && <0.21
28.54 s
> || >=0.21.1 && <0.22 || >=0.22.2 && <0.23 || >=0.24.2 && <0.25: using
28.54 s
> doctest-0.24.3
28.54 s
> Dependency pathway-compat-filepath: using pathway-compat-filepath-0.0.1.0
28.54 s
> Source component graph:
28.54 s
> component lib
28.54 s
> component test:doctests dependency lib
28.54 s
> Configured component graph:
28.54 s
> component pathway-compat-filepath-0.0.1.0-6KN1Vlb8yPeBopmlZtXyrR
28.54 s
> include base-4.19.2.0-934f
28.54 s
> include extra-1.8.1-F4oHgTKCper3ZiIUPZjGPK
28.54 s
> include filepath-1.4.301.0-6e15
28.54 s
> include megaparsec-9.7.0-10vHZAF1maw9O8p2gXs66N
28.54 s
> include os-string-2.0.10-HbyG8qgShpTHKXL8bZ3UK8
28.54 s
> include pathway-0.0.1.0-H5uD0SRA9755UrSqFBaCYE
28.54 s
> include pathway-compat-base-0.0.1.0-8ldj6SPXbxq2Shd8yFeOpr
28.54 s
> include pathway-internal-0.0.1.0-Lnjdb2M8cxN196wSdsfQUK
28.54 s
> component pathway-compat-filepath-0.0.1.0-LoaDJ8tbb2m5kfHmaP2B9c-doctests
28.54 s
> include base-4.19.2.0-934f
28.54 s
> include doctest-0.24.3-1aDs7zEYV5r7raSsXr9TQC
28.54 s
> include pathway-compat-filepath-0.0.1.0-6KN1Vlb8yPeBopmlZtXyrR
28.54 s
> Linked component graph:
28.54 s
> unit pathway-compat-filepath-0.0.1.0-6KN1Vlb8yPeBopmlZtXyrR
28.54 s
> include base-4.19.2.0-934f
28.54 s
> include extra-1.8.1-F4oHgTKCper3ZiIUPZjGPK
28.54 s
> include filepath-1.4.301.0-6e15
28.54 s
> include megaparsec-9.7.0-10vHZAF1maw9O8p2gXs66N
28.54 s
> include os-string-2.0.10-HbyG8qgShpTHKXL8bZ3UK8
28.54 s
> include pathway-0.0.1.0-H5uD0SRA9755UrSqFBaCYE
28.54 s
> include pathway-compat-base-0.0.1.0-8ldj6SPXbxq2Shd8yFeOpr
28.54 s
> include pathway-internal-0.0.1.0-Lnjdb2M8cxN196wSdsfQUK
28.54 s
> Common.FilePath=pathway-compat-filepath-0.0.1.0-6KN1Vlb8yPeBopmlZtXyrR:Common.FilePath,Common.OsPath=pathway-compat-filepath-0.0.1.0-6KN1Vlb8yPeBopmlZtXyrR:Common.OsPath,System.FilePath=pathway-compat-filepath-0.0.1.0-6KN1Vlb8yPeBopmlZtXyrR:System.FilePath,System.FilePath.Overlay=pathway-compat-filepath-0.0.1.0-6KN1Vlb8yPeBopmlZtXyrR:System.FilePath.Overlay,System.FilePath.Pathway=pathway-compat-filepath-0.0.1.0-6KN1Vlb8yPeBopmlZtXyrR:System.FilePath.Pathway,System.FilePath.Thin=pathway-compat-filepath-0.0.1.0-6KN1Vlb8yPeBopmlZtXyrR:System.FilePath.Thin,System.OsPath=pathway-compat-filepath-0.0.1.0-6KN1Vlb8yPeBopmlZtXyrR:System.OsPath,System.OsPath.Overlay=pathway-compat-filepath-0.0.1.0-6KN1Vlb8yPeBopmlZtXyrR:System.OsPath.Overlay,System.OsPath.Pathway=pathway-compat-filepath-0.0.1.0-6KN1Vlb8yPeBopmlZtXyrR:System.OsPath.Pathway,System.OsPath.Thin=pathway-compat-filepath-0.0.1.0-6KN1Vlb8yPeBopmlZtXyrR:System.OsPath.Thin
28.54 s
> unit pathway-compat-filepath-0.0.1.0-LoaDJ8tbb2m5kfHmaP2B9c-doctests
28.54 s
> include base-4.19.2.0-934f
28.54 s
> include doctest-0.24.3-1aDs7zEYV5r7raSsXr9TQC
28.54 s
> include pathway-compat-filepath-0.0.1.0-6KN1Vlb8yPeBopmlZtXyrR
28.54 s
> Ready component graph:
28.54 s
> definite pathway-compat-filepath-0.0.1.0-6KN1Vlb8yPeBopmlZtXyrR
28.54 s
> depends base-4.19.2.0-934f
28.54 s
> depends extra-1.8.1-F4oHgTKCper3ZiIUPZjGPK
28.54 s
> depends filepath-1.4.301.0-6e15
28.54 s
> depends megaparsec-9.7.0-10vHZAF1maw9O8p2gXs66N
28.54 s
> depends os-string-2.0.10-HbyG8qgShpTHKXL8bZ3UK8
28.54 s
> depends pathway-0.0.1.0-H5uD0SRA9755UrSqFBaCYE
28.54 s
> depends pathway-compat-base-0.0.1.0-8ldj6SPXbxq2Shd8yFeOpr
28.54 s
> depends pathway-internal-0.0.1.0-Lnjdb2M8cxN196wSdsfQUK
28.54 s
> definite pathway-compat-filepath-0.0.1.0-LoaDJ8tbb2m5kfHmaP2B9c-doctests
28.54 s
> depends base-4.19.2.0-934f
28.54 s
> depends doctest-0.24.3-1aDs7zEYV5r7raSsXr9TQC
28.54 s
> depends pathway-compat-filepath-0.0.1.0-6KN1Vlb8yPeBopmlZtXyrR
28.54 s
> Using Cabal-3.10.3.0 compiled by ghc-9.8
28.54 s
> Using compiler: ghc-9.8.4
28.54 s
> Using install prefix:
28.54 s
> /nix/store/xghx2j0inbha0jqrcxmvc3ljvvx1i77g-pathway-compat-filepath-0.0.1.0
28.54 s
> Executables installed in:
28.54 s
> /nix/store/xghx2j0inbha0jqrcxmvc3ljvvx1i77g-pathway-compat-filepath-0.0.1.0/bin
28.54 s
> Libraries installed in:
28.54 s
> /nix/store/xghx2j0inbha0jqrcxmvc3ljvvx1i77g-pathway-compat-filepath-0.0.1.0/lib/ghc-9.8.4/lib/x86_64-linux-ghc-9.8.4/pathway-compat-filepath-0.0.1.0-6KN1Vlb8yPeBopmlZtXyrR
28.54 s
> Dynamic Libraries installed in:
28.54 s
> /nix/store/xghx2j0inbha0jqrcxmvc3ljvvx1i77g-pathway-compat-filepath-0.0.1.0/lib/ghc-9.8.4/lib/x86_64-linux-ghc-9.8.4
28.54 s
> Private executables installed in:
28.54 s
> /nix/store/xghx2j0inbha0jqrcxmvc3ljvvx1i77g-pathway-compat-filepath-0.0.1.0/libexec/x86_64-linux-ghc-9.8.4/pathway-compat-filepath-0.0.1.0
28.54 s
> Data files installed in:
28.54 s
> /nix/store/xghx2j0inbha0jqrcxmvc3ljvvx1i77g-pathway-compat-filepath-0.0.1.0/share/x86_64-linux-ghc-9.8.4/pathway-compat-filepath-0.0.1.0
28.54 s
> Documentation installed in:
28.54 s
> /nix/store/c3wlvp65ypvkb08q9pcr7hq7wygmm4g4-pathway-compat-filepath-0.0.1.0-doc/share/doc/pathway-compat-filepath-0.0.1.0
28.54 s
> Configuration files installed in:
28.54 s
> /nix/store/xghx2j0inbha0jqrcxmvc3ljvvx1i77g-pathway-compat-filepath-0.0.1.0/etc
28.54 s
> No alex found
28.54 s
> Using ar found on system at:
28.54 s
> /nix/store/zjraf40s86y3iwhp626b934r5y6ldkbb-binutils-wrapper-2.46/bin/ar
28.54 s
> No c2hs found
28.54 s
> No cpphs found
28.54 s
> Using doctest version 0.24.3 found on system at:
28.54 s
> /nix/store/2y183b1vsybv0157vfr59yhdwjkpqfkn-doctest-0.24.3/bin/doctest
28.54 s
> Using gcc version 15.2.0 given by user at:
28.54 s
> /nix/store/29qjlshvklnyr67nhpprzgb9igmsfsjj-gcc-wrapper-15.2.0/bin/gcc
28.54 s
> Using ghc version 9.8.4 found on system at:
28.54 s
> /nix/store/7r9b0bl984hdgd70nf5p8raa55kml491-ghc-9.8.4/bin/ghc
28.54 s
> Using ghc-pkg version 9.8.4 found on system at:
28.54 s
> /nix/store/7r9b0bl984hdgd70nf5p8raa55kml491-ghc-9.8.4/bin/ghc-pkg-9.8.4
28.54 s
> No ghcjs found
28.54 s
> No ghcjs-pkg found
28.54 s
> No greencard found
28.54 s
> Using haddock version 2.30.0 found on system at:
28.54 s
> /nix/store/7r9b0bl984hdgd70nf5p8raa55kml491-ghc-9.8.4/bin/haddock-ghc-9.8.4
28.54 s
> No happy found
28.54 s
> Using haskell-suite found on system at: haskell-suite-dummy-location
28.54 s
> Using haskell-suite-pkg found on system at: haskell-suite-pkg-dummy-location
28.54 s
> No hmake found
28.54 s
> Using hpc version 0.69 found on system at:
28.54 s
> /nix/store/7r9b0bl984hdgd70nf5p8raa55kml491-ghc-9.8.4/bin/hpc-ghc-9.8.4
28.54 s
> Using hsc2hs version 0.68.10 found on system at:
28.54 s
> /nix/store/7r9b0bl984hdgd70nf5p8raa55kml491-ghc-9.8.4/bin/hsc2hs-ghc-9.8.4
28.54 s
> Using hscolour version 1.25 found on system at:
28.54 s
> /nix/store/awnxn98rlw62rrjwli6d2lb4d27mrzzw-hscolour-1.25/bin/HsColour
28.54 s
> No jhc found
28.54 s
> Using ld found on system at:
28.54 s
> /nix/store/zjraf40s86y3iwhp626b934r5y6ldkbb-binutils-wrapper-2.46/bin/ld.gold
28.54 s
> No pkg-config found
28.54 s
> Using runghc version 9.8.4 found on system at:
28.54 s
> /nix/store/7r9b0bl984hdgd70nf5p8raa55kml491-ghc-9.8.4/bin/runghc-9.8.4
28.54 s
> Using strip version 2.46 found on system at:
28.54 s
> /nix/store/29qjlshvklnyr67nhpprzgb9igmsfsjj-gcc-wrapper-15.2.0/bin/strip
28.54 s
> Using tar found on system at:
28.54 s
> /nix/store/z5mq2sam4484prf3kv6v6vjw1m0i7j24-gnutar-1.35/bin/tar
28.54 s
> No uhc found
28.54 s
> Running phase: buildPhase
28.54 s
> Preprocessing library for pathway-compat-filepath-0.0.1.0..
28.54 s
> Building library for pathway-compat-filepath-0.0.1.0..
28.54 s
> [ 1 of 10] Compiling Common.FilePath ( src/Common/FilePath.hs, dist/build/Common/FilePath.o, dist/build/Common/FilePath.dyn_o )
28.54 s
> [ 2 of 10] Compiling Common.OsPath ( src/Common/OsPath.hs, dist/build/Common/OsPath.o, dist/build/Common/OsPath.dyn_o )
28.54 s
>
28.54 s
> src/Common/OsPath.hs:90:23: error : [ GHC-83865 ]
28.54 s
> • Couldn't match type ‘OSS.OsString’ with ‘OsString’
28.54 s
> Expected: OsPath
28.54 s
> Actual: OSS.OsString
28.54 s
> NB: ‘OsString’
28.54 s
> is defined in ‘System.OsString.Internal.Types.Hidden’
28.54 s
> in package ‘filepath-1.4.301.0’
28.54 s
> ‘OSS.OsString’
28.54 s
> is defined in ‘System.OsString.Internal.Types’
28.54 s
> in package ‘os-string-2.0.10’
28.54 s
> • In the ‘parent’ field of a record
28.54 s
> In the expression:
28.54 s
> Format
28.54 s
> {root = O.pack . pure $ O.pathSeparator, current = mempty,
28.54 s
> parent = OSS.unsafeEncodeUtf "..",
28.54 s
> separator = O.pack . pure $ O.pathSeparator,
28.54 s
> substitutions = mempty}
28.54 s
> In an equation for ‘localFormat’:
28.54 s
> localFormat
28.54 s
> = Format
28.54 s
> {root = O.pack . pure $ O.pathSeparator, current = mempty,
28.54 s
> parent = OSS.unsafeEncodeUtf "..",
28.54 s
> separator = O.pack . pure $ O.pathSeparator,
28.54 s
> substitutions = mempty}
28.54 s
> |
28.54 s
> 90 | Format.parent = OSS.unsafeEncodeUtf ".." ,
28.54 s
> | ^^^^^^^^^^^^^^^^^^^^^^^^
28.54 s
> [ 3 of 10] Compiling System.FilePath.Thin ( src/System/FilePath/Thin.hs, dist/build/System/FilePath/Thin.o, dist/build/System/FilePath/Thin.dyn_o )
28.54 s
> [ 4 of 10] Compiling System.FilePath.Pathway ( src/System/FilePath/Pathway.hs, dist/build/System/FilePath/Pathway.o, dist/build/System/FilePath/Pathway.dyn_o )
28.54 s
> [ 5 of 10] Compiling System.FilePath.Overlay ( src/System/FilePath/Overlay.hs, dist/build/System/FilePath/Overlay.o, dist/build/System/FilePath/Overlay.dyn_o )
28.54 s
> [ 6 of 10] Compiling System.FilePath ( src/System/FilePath.hs, dist/build/System/FilePath.o, dist/build/System/FilePath.dyn_o )
28.54 s
For full logs, run:
28.54 s
nix log /nix/store/psj7qq98d0nc1x3mcxvgminpvlszfrfm-pathway-compat-filepath-0.0.1.0.drv
28.54 s
error: Cannot build '/nix/store/mdvhamhmncfil55by5mc62fj69n99c1w-ghc-9.8.4-with-packages.drv '.
28.54 s
Reason: 1 dependency failed .
28.54 s
Output paths:
28.54 s
/nix/store/1vvvayslravlsnbd962y9bsp4c7jiah4-ghc-9.8.4-with-packages
28.54 s
error: Cannot build '/nix/store/gcbdv7d9xmvf3jabhv7lbf50a4k5v0fr-pathway-compat-directory-0.0.1.0.drv '.
28.54 s
Reason: 1 dependency failed .
28.54 s
Output paths:
28.54 s
/nix/store/lvz4jclqs4hqq1k7fi74rl20419aaqmb-pathway-compat-directory-0.0.1.0-doc
28.54 s
/nix/store/prcri98x3bq55i3pffsm2c0z5bzjivpn-pathway-compat-directory-0.0.1.0
28.54 s
error: Cannot build '/nix/store/9a7ba0q649sjp2fjr2p7yi6l6nv7byak-pathway-compat-file-io-0.0.1.0.drv '.
28.54 s
Reason: 1 dependency failed .
28.54 s
Output paths:
28.54 s
/nix/store/hdd4f2is9svyj3zx5czk0mblia6i8w1a-pathway-compat-file-io-0.0.1.0
28.54 s
/nix/store/j2d5178hlcgldkj6jcq2cv6q83ny0rrf-pathway-compat-file-io-0.0.1.0-doc
28.54 s
error: Cannot build '/nix/store/q4yq83in56ixb5fi8pprb2xbkwr7kr8k-pathway-compat-temporary-0.0.1.0.drv '.
28.54 s
Reason: 1 dependency failed .
28.54 s
Output paths:
28.54 s
/nix/store/lklwgvwpcq480fqmdc66fzc45nj1iphl-pathway-compat-temporary-0.0.1.0-doc
28.54 s
/nix/store/zvmf2y70q878a2fgdpk9mqznfca8j5nl-pathway-compat-temporary-0.0.1.0
28.54 s
error: Cannot build '/nix/store/b8ay2gw1cg8jpdkd4j5nnn95zrmnypv8-pathway-system-0.0.1.0.drv '.
28.54 s
Reason: 1 dependency failed .
28.54 s
Output paths:
28.54 s
/nix/store/chy1q398chqybipav6k9l04drrrmg2ks-pathway-system-0.0.1.0
28.54 s
/nix/store/k1vv04ssh3mky3f4y6s9m92vh0ia5sxq-pathway-system-0.0.1.0-doc
28.54 s
error: Build failed due to failed dependency
28.54 s
error: Cannot build '/nix/store/45nwy0mckisgy5fbckfqw9v5qjaqj1pk-all-packages.drv '.
28.54 s
Reason: 1 dependency failed .
28.54 s
Output paths:
28.54 s
/nix/store/j5jvn7qhq6j0j8hjffc4b4zlrk8kz60j-all-packages
28.54 s
Build failed due to failed dependency
28.57 s
Build failed.