build packages.x86_64-linux.ghc984_all

Reproduce this run
Retry Run
  1. 0.22 s $ /nix/store/9ypz3flqsrl5xl495mm8h645gadjsxi1-coreutils-9.11/bin/timeout --kill-after=15s 7200s /nix/store/23zk8sgzamrbmj1fday15szf7f2279s8-nix-2.34.7/bin/nix --extra-experimental-features nix-command --extra-experimental-features flakes --log-format internal-json build --no-link --print-out-paths git+https://github.com/sellout/pathway?ref=more-system&rev=1ea193cbc6593071794981ca0dcd055e8eb42609&shallow=1#packages.x86_64-linux.ghc984_all --print-build-logs
  2. 0.24 s warning: ignoring untrusted flake configuration setting 'allow-import-from-derivation'.
  3. 0.24 s Pass '--accept-flake-config' to trust it
  4. 0.24 s warning: ignoring untrusted flake configuration setting 'extra-experimental-features'.
  5. 0.24 s Pass '--accept-flake-config' to trust it
  6. 0.24 s warning: ignoring untrusted flake configuration setting 'extra-substituters'.
  7. 0.24 s Pass '--accept-flake-config' to trust it
  8. 0.24 s warning: ignoring untrusted flake configuration setting 'extra-trusted-public-keys'.
  9. 0.24 s Pass '--accept-flake-config' to trust it
  10. 0.24 s warning: ignoring untrusted flake configuration setting 'sandbox'.
  11. 0.24 s Pass '--accept-flake-config' to trust it
  12. 0.24 s warning: ignoring untrusted flake configuration setting 'use-registries'.
  13. 0.24 s Pass '--accept-flake-config' to trust it
  14. 0.24 s error (ignored): SQLite database '/var/cache/nix-ci-worker/eval-cache-v6/7e8cef9f9a584f12750e4112f9919eb203f4dd515b08e08f130fffcf31865d0a.sqlite' is busy
  15. 1.59 s
  16. 2.05 s Building /nix/store/rfxaff3ggz29012sg3f1gl5j59dk5nzp-pathway-compat-base-0.0.1.0.drv
  17. 2.27 s [pathway-compat-base] Phase: setupCompilerEnvironmentPhase
  18. 2.28 s [pathway-compat-base] Build with /nix/store/7r9b0bl984hdgd70nf5p8raa55kml491-ghc-9.8.4.
  19. 2.60 s [pathway-compat-base] Phase: unpackPhase
  20. 2.61 s [pathway-compat-base] unpacking source archive /nix/store/ga56x34386fcqgj51vg6p532znb23d3g-base
  21. 2.62 s [pathway-compat-base] source root is base
  22. 2.63 s [pathway-compat-base] Phase: patchPhase
  23. 2.64 s [pathway-compat-base] Phase: compileBuildDriverPhase
  24. 2.65 s [pathway-compat-base] setupCompileFlags: -package-db=/build/tmp.Etstllu8xW/setup-package.conf.d -threaded
  25. 2.70 s [pathway-compat-base] [1 of 2] Compiling Main ( Setup.hs, /build/tmp.Etstllu8xW/Main.o )
  26. 2.75 s [pathway-compat-base] [2 of 2] Linking Setup
  27. 4.05 s [pathway-compat-base] Phase: updateAutotoolsGnuConfigScriptsPhase
  28. 4.07 s [pathway-compat-base] Phase: configurePhase
  29. 4.07 s [pathway-compat-base] configureFlags: --verbose --prefix=/nix/store/lcicpysisnrcl5wpnlag2pks0zzv3frw-pathway-compat-base-0.0.1.0 --libdir=$prefix/lib/$compiler/lib --libsubdir=$abi/$libname --docdir=/nix/store/7274h69mlzj5111kzlccd4ddhcz4mj8h-pathway-compat-base-0.0.1.0-doc/share/doc/pathway-compat-base-0.0.1.0 --with-gcc=gcc --package-db=/build/tmp.Etstllu8xW/package.conf.d --ghc-option=-j16 --ghc-option=+RTS --ghc-option=-A64M --ghc-option=-RTS --enable-library-profiling --profiling-detail=exported-functions --disable-profiling --enable-shared --disable-coverage --enable-static --disable-executable-dynamic --enable-tests --disable-benchmarks --enable-library-vanilla --disable-library-for-ghci --enable-split-sections --enable-library-stripping --enable-executable-stripping --ghc-option=-haddock --ghc-options=-Werror --extra-lib-dirs=/nix/store/pndhkk0l649lm1sj0mxk7cbwq26qd1ra-ncurses-6.6/lib --extra-lib-dirs=/nix/store/0djlg4g0b81w94k3vcaqsxsc2hh4kism-libffi-3.5.2/lib --extra-lib-dirs=/nix/store/md4paia7riiggyrj8p24c7a6vf8w7jz8-elfutils-0.194/lib --extra-lib-dirs=/nix/store/39vv2pf64gd8li48a4hpbhw2crzd8z5p-gmp-with-cxx-6.3.0/lib --extra-lib-dirs=/nix/store/7wwvald8lapkrsr72qanlw8blyn55ifx-numactl-2.0.18/lib --extra-lib-dirs=/nix/store/7r9b0bl984hdgd70nf5p8raa55kml491-ghc-9.8.4/lib
  30. 4.08 s [pathway-compat-base] Using Parsec parser
  31. 4.08 s [pathway-compat-base] Configuring pathway-compat-base-0.0.1.0...
  32. 4.42 s [pathway-compat-base] Flags chosen: noisy-deprecations=True, verify-no-recursion=False
  33. 4.42 s [pathway-compat-base] Dependency base >=4.14.0 && <4.15 || >=4.15.0 && <4.16 || >=4.16.0 && <4.17 ||
  34. 4.42 s [pathway-compat-base] >=4.17.0 && <4.18 || >=4.18.0 && <4.19 || >=4.19.0 && <4.20 || >=4.20.0 &&
  35. 4.42 s [pathway-compat-base] <4.21 || >=4.21.0 && <4.22 || >=4.22.0 && <4.23: using base-4.19.2.0
  36. 4.42 s [pathway-compat-base] Dependency exceptions: using exceptions-0.10.7
  37. 4.42 s [pathway-compat-base] Dependency megaparsec >=9.0.1 && <9.1 || >=9.2.1 && <9.3 || >=9.5.0 && <9.6 ||
  38. 4.42 s [pathway-compat-base] >=9.7.0 && <9.8: using megaparsec-9.7.0
  39. 4.42 s [pathway-compat-base] Dependency pathway >=0.0.1 && <0.1: using pathway-0.0.1.0
  40. 4.42 s [pathway-compat-base] Dependency variant: using variant-1.0.2
  41. 4.42 s [pathway-compat-base] Dependency base >=4.14.0 && <4.15 || >=4.15.0 && <4.16 || >=4.16.0 && <4.17 ||
  42. 4.42 s [pathway-compat-base] >=4.17.0 && <4.18 || >=4.18.0 && <4.19 || >=4.19.0 && <4.20 || >=4.20.0 &&
  43. 4.42 s [pathway-compat-base] <4.21 || >=4.21.0 && <4.22 || >=4.22.0 && <4.23: using base-4.19.2.0
  44. 4.42 s [pathway-compat-base] Dependency doctest >=0.16.3 && <0.17 || >=0.18.1 && <0.19 || >=0.20.1 && <0.21
  45. 4.42 s [pathway-compat-base] || >=0.21.1 && <0.22 || >=0.22.2 && <0.23 || >=0.24.2 && <0.25: using
  46. 4.42 s [pathway-compat-base] doctest-0.24.3
  47. 4.42 s [pathway-compat-base] Dependency pathway-compat-base: using pathway-compat-base-0.0.1.0
  48. 4.77 s [pathway-compat-base] Source component graph:
  49. 4.77 s [pathway-compat-base] component lib
  50. 4.77 s [pathway-compat-base] component test:doctests dependency lib
  51. 4.77 s [pathway-compat-base] Configured component graph:
  52. 4.77 s [pathway-compat-base] component pathway-compat-base-0.0.1.0-8ldj6SPXbxq2Shd8yFeOpr
  53. 4.77 s [pathway-compat-base] include base-4.19.2.0-934f
  54. 4.77 s [pathway-compat-base] include exceptions-0.10.7-2ac1
  55. 4.77 s [pathway-compat-base] include megaparsec-9.7.0-10vHZAF1maw9O8p2gXs66N
  56. 4.77 s [pathway-compat-base] include pathway-0.0.1.0-H5uD0SRA9755UrSqFBaCYE
  57. 4.77 s [pathway-compat-base] include variant-1.0.2-LM0Un02zMMi4aizfZ11g92
  58. 4.77 s [pathway-compat-base] component pathway-compat-base-0.0.1.0-2zQvX9jjaD62mq1j1l7L7-doctests
  59. 4.77 s [pathway-compat-base] include base-4.19.2.0-934f
  60. 4.77 s [pathway-compat-base] include doctest-0.24.3-1aDs7zEYV5r7raSsXr9TQC
  61. 4.77 s [pathway-compat-base] include pathway-compat-base-0.0.1.0-8ldj6SPXbxq2Shd8yFeOpr
  62. 4.77 s [pathway-compat-base] Linked component graph:
  63. 4.77 s [pathway-compat-base] unit pathway-compat-base-0.0.1.0-8ldj6SPXbxq2Shd8yFeOpr
  64. 4.77 s [pathway-compat-base] include base-4.19.2.0-934f
  65. 4.77 s [pathway-compat-base] include exceptions-0.10.7-2ac1
  66. 4.77 s [pathway-compat-base] include megaparsec-9.7.0-10vHZAF1maw9O8p2gXs66N
  67. 4.77 s [pathway-compat-base] include pathway-0.0.1.0-H5uD0SRA9755UrSqFBaCYE
  68. 4.77 s [pathway-compat-base] include variant-1.0.2-LM0Un02zMMi4aizfZ11g92
  69. 4.77 s [pathway-compat-base] Common=pathway-compat-base-0.0.1.0-8ldj6SPXbxq2Shd8yFeOpr:Common,System.Environment.DropIn=pathway-compat-base-0.0.1.0-8ldj6SPXbxq2Shd8yFeOpr:System.Environment.DropIn,System.Environment.Overlay=pathway-compat-base-0.0.1.0-8ldj6SPXbxq2Shd8yFeOpr:System.Environment.Overlay,System.Environment.Pathway=pathway-compat-base-0.0.1.0-8ldj6SPXbxq2Shd8yFeOpr:System.Environment.Pathway,System.Environment.Thin=pathway-compat-base-0.0.1.0-8ldj6SPXbxq2Shd8yFeOpr:System.Environment.Thin,System.IO.Caught=pathway-compat-base-0.0.1.0-8ldj6SPXbxq2Shd8yFeOpr:System.IO.Caught,System.IO.DropIn=pathway-compat-base-0.0.1.0-8ldj6SPXbxq2Shd8yFeOpr:System.IO.DropIn,System.IO.Error.Caught=pathway-compat-base-0.0.1.0-8ldj6SPXbxq2Shd8yFeOpr:System.IO.Error.Caught,System.IO.Error.DropIn=pathway-compat-base-0.0.1.0-8ldj6SPXbxq2Shd8yFeOpr:System.IO.Error.DropIn,System.IO.Error.Overlay=pathway-compat-base-0.0.1.0-8ldj6SPXbxq2Shd8yFeOpr:System.IO.Error.Overlay,System.IO.Error.Pathway=pathway-compat-base-0.0.1.0-8ldj6SPXbxq2Shd8yFeOpr:System.IO.Error.Pathway,System.IO.Error.Thin=pathway-compat-base-0.0.1.0-8ldj6SPXbxq2Shd8yFeOpr:System.IO.Error.Thin,System.IO.Overlay=pathway-compat-base-0.0.1.0-8ldj6SPXbxq2Shd8yFeOpr:System.IO.Overlay,System.IO.Pathway=pathway-compat-base-0.0.1.0-8ldj6SPXbxq2Shd8yFeOpr:System.IO.Pathway,System.IO.Thin=pathway-compat-base-0.0.1.0-8ldj6SPXbxq2Shd8yFeOpr:System.IO.Thin
  70. 4.77 s [pathway-compat-base] unit pathway-compat-base-0.0.1.0-2zQvX9jjaD62mq1j1l7L7-doctests
  71. 4.77 s [pathway-compat-base] include base-4.19.2.0-934f
  72. 4.77 s [pathway-compat-base] include doctest-0.24.3-1aDs7zEYV5r7raSsXr9TQC
  73. 4.77 s [pathway-compat-base] include pathway-compat-base-0.0.1.0-8ldj6SPXbxq2Shd8yFeOpr
  74. 4.77 s [pathway-compat-base] Ready component graph:
  75. 4.77 s [pathway-compat-base] definite pathway-compat-base-0.0.1.0-8ldj6SPXbxq2Shd8yFeOpr
  76. 4.77 s [pathway-compat-base] depends base-4.19.2.0-934f
  77. 4.77 s [pathway-compat-base] depends exceptions-0.10.7-2ac1
  78. 4.77 s [pathway-compat-base] depends megaparsec-9.7.0-10vHZAF1maw9O8p2gXs66N
  79. 4.77 s [pathway-compat-base] depends pathway-0.0.1.0-H5uD0SRA9755UrSqFBaCYE
  80. 4.77 s [pathway-compat-base] depends variant-1.0.2-LM0Un02zMMi4aizfZ11g92
  81. 4.77 s [pathway-compat-base] definite pathway-compat-base-0.0.1.0-2zQvX9jjaD62mq1j1l7L7-doctests
  82. 4.77 s [pathway-compat-base] depends base-4.19.2.0-934f
  83. 4.77 s [pathway-compat-base] depends doctest-0.24.3-1aDs7zEYV5r7raSsXr9TQC
  84. 4.77 s [pathway-compat-base] depends pathway-compat-base-0.0.1.0-8ldj6SPXbxq2Shd8yFeOpr
  85. 4.77 s [pathway-compat-base] Using Cabal-3.10.3.0 compiled by ghc-9.8
  86. 4.77 s [pathway-compat-base] Using compiler: ghc-9.8.4
  87. 4.77 s [pathway-compat-base] Using install prefix:
  88. 4.77 s [pathway-compat-base] /nix/store/lcicpysisnrcl5wpnlag2pks0zzv3frw-pathway-compat-base-0.0.1.0
  89. 4.77 s [pathway-compat-base] Executables installed in:
  90. 4.77 s [pathway-compat-base] /nix/store/lcicpysisnrcl5wpnlag2pks0zzv3frw-pathway-compat-base-0.0.1.0/bin
  91. 4.77 s [pathway-compat-base] Libraries installed in:
  92. 4.77 s [pathway-compat-base] /nix/store/lcicpysisnrcl5wpnlag2pks0zzv3frw-pathway-compat-base-0.0.1.0/lib/ghc-9.8.4/lib/x86_64-linux-ghc-9.8.4/pathway-compat-base-0.0.1.0-8ldj6SPXbxq2Shd8yFeOpr
  93. 4.77 s [pathway-compat-base] Dynamic Libraries installed in:
  94. 4.77 s [pathway-compat-base] /nix/store/lcicpysisnrcl5wpnlag2pks0zzv3frw-pathway-compat-base-0.0.1.0/lib/ghc-9.8.4/lib/x86_64-linux-ghc-9.8.4
  95. 4.77 s [pathway-compat-base] Private executables installed in:
  96. 4.77 s [pathway-compat-base] /nix/store/lcicpysisnrcl5wpnlag2pks0zzv3frw-pathway-compat-base-0.0.1.0/libexec/x86_64-linux-ghc-9.8.4/pathway-compat-base-0.0.1.0
  97. 4.77 s [pathway-compat-base] Data files installed in:
  98. 4.77 s [pathway-compat-base] /nix/store/lcicpysisnrcl5wpnlag2pks0zzv3frw-pathway-compat-base-0.0.1.0/share/x86_64-linux-ghc-9.8.4/pathway-compat-base-0.0.1.0
  99. 4.77 s [pathway-compat-base] Documentation installed in:
  100. 4.77 s [pathway-compat-base] /nix/store/7274h69mlzj5111kzlccd4ddhcz4mj8h-pathway-compat-base-0.0.1.0-doc/share/doc/pathway-compat-base-0.0.1.0
  101. 4.77 s [pathway-compat-base] Configuration files installed in:
  102. 4.77 s [pathway-compat-base] /nix/store/lcicpysisnrcl5wpnlag2pks0zzv3frw-pathway-compat-base-0.0.1.0/etc
  103. 4.77 s [pathway-compat-base] No alex found
  104. 4.77 s [pathway-compat-base] Using ar found on system at:
  105. 4.77 s [pathway-compat-base] /nix/store/zjraf40s86y3iwhp626b934r5y6ldkbb-binutils-wrapper-2.46/bin/ar
  106. 4.77 s [pathway-compat-base] No c2hs found
  107. 4.77 s [pathway-compat-base] No cpphs found
  108. 4.77 s [pathway-compat-base] Using doctest version 0.24.3 found on system at:
  109. 4.77 s [pathway-compat-base] /nix/store/2y183b1vsybv0157vfr59yhdwjkpqfkn-doctest-0.24.3/bin/doctest
  110. 4.77 s [pathway-compat-base] Using gcc version 15.2.0 given by user at:
  111. 4.77 s [pathway-compat-base] /nix/store/29qjlshvklnyr67nhpprzgb9igmsfsjj-gcc-wrapper-15.2.0/bin/gcc
  112. 4.77 s [pathway-compat-base] Using ghc version 9.8.4 found on system at:
  113. 4.77 s [pathway-compat-base] /nix/store/7r9b0bl984hdgd70nf5p8raa55kml491-ghc-9.8.4/bin/ghc
  114. 4.77 s [pathway-compat-base] Using ghc-pkg version 9.8.4 found on system at:
  115. 4.77 s [pathway-compat-base] /nix/store/7r9b0bl984hdgd70nf5p8raa55kml491-ghc-9.8.4/bin/ghc-pkg-9.8.4
  116. 4.77 s [pathway-compat-base] No ghcjs found
  117. 4.77 s [pathway-compat-base] No ghcjs-pkg found
  118. 4.77 s [pathway-compat-base] No greencard found
  119. 4.77 s [pathway-compat-base] Using haddock version 2.30.0 found on system at:
  120. 4.77 s [pathway-compat-base] /nix/store/7r9b0bl984hdgd70nf5p8raa55kml491-ghc-9.8.4/bin/haddock-ghc-9.8.4
  121. 4.77 s [pathway-compat-base] No happy found
  122. 4.77 s [pathway-compat-base] Using haskell-suite found on system at: haskell-suite-dummy-location
  123. 4.77 s [pathway-compat-base] Using haskell-suite-pkg found on system at: haskell-suite-pkg-dummy-location
  124. 4.77 s [pathway-compat-base] No hmake found
  125. 4.77 s [pathway-compat-base] Using hpc version 0.69 found on system at:
  126. 4.77 s [pathway-compat-base] /nix/store/7r9b0bl984hdgd70nf5p8raa55kml491-ghc-9.8.4/bin/hpc-ghc-9.8.4
  127. 4.77 s [pathway-compat-base] Using hsc2hs version 0.68.10 found on system at:
  128. 4.77 s [pathway-compat-base] /nix/store/7r9b0bl984hdgd70nf5p8raa55kml491-ghc-9.8.4/bin/hsc2hs-ghc-9.8.4
  129. 4.77 s [pathway-compat-base] Using hscolour version 1.25 found on system at:
  130. 4.77 s [pathway-compat-base] /nix/store/awnxn98rlw62rrjwli6d2lb4d27mrzzw-hscolour-1.25/bin/HsColour
  131. 4.77 s [pathway-compat-base] No jhc found
  132. 4.77 s [pathway-compat-base] Using ld found on system at:
  133. 4.77 s [pathway-compat-base] /nix/store/zjraf40s86y3iwhp626b934r5y6ldkbb-binutils-wrapper-2.46/bin/ld.gold
  134. 4.77 s [pathway-compat-base] No pkg-config found
  135. 4.77 s [pathway-compat-base] Using runghc version 9.8.4 found on system at:
  136. 4.77 s [pathway-compat-base] /nix/store/7r9b0bl984hdgd70nf5p8raa55kml491-ghc-9.8.4/bin/runghc-9.8.4
  137. 4.77 s [pathway-compat-base] Using strip version 2.46 found on system at:
  138. 4.77 s [pathway-compat-base] /nix/store/29qjlshvklnyr67nhpprzgb9igmsfsjj-gcc-wrapper-15.2.0/bin/strip
  139. 4.77 s [pathway-compat-base] Using tar found on system at:
  140. 4.77 s [pathway-compat-base] /nix/store/z5mq2sam4484prf3kv6v6vjw1m0i7j24-gnutar-1.35/bin/tar
  141. 4.77 s [pathway-compat-base] No uhc found
  142. 5.20 s [pathway-compat-base] Phase: buildPhase
  143. 5.26 s [pathway-compat-base] Preprocessing library for pathway-compat-base-0.0.1.0..
  144. 5.29 s [pathway-compat-base] Building library for pathway-compat-base-0.0.1.0..
  145. 5.41 s [pathway-compat-base] [ 1 of 15] Compiling Common ( src/Common.hs, dist/build/Common.o, dist/build/Common.dyn_o )
  146. 5.86 s [pathway-compat-base] [ 2 of 15] Compiling System.Environment.Thin ( src/System/Environment/Thin.hs, dist/build/System/Environment/Thin.o, dist/build/System/Environment/Thin.dyn_o )
  147. 5.93 s [pathway-compat-base] [ 3 of 15] Compiling System.Environment.Pathway ( src/System/Environment/Pathway.hs, dist/build/System/Environment/Pathway.o, dist/build/System/Environment/Pathway.dyn_o )
  148. 5.96 s [pathway-compat-base] [ 4 of 15] Compiling System.Environment.Overlay ( src/System/Environment/Overlay.hs, dist/build/System/Environment/Overlay.o, dist/build/System/Environment/Overlay.dyn_o )
  149. 5.98 s [pathway-compat-base] [ 5 of 15] Compiling System.Environment.DropIn ( src/System/Environment/DropIn.hs, dist/build/System/Environment/DropIn.o, dist/build/System/Environment/DropIn.dyn_o )
  150. 6.01 s [pathway-compat-base] [ 6 of 15] Compiling System.IO.Error.Caught ( src/System/IO/Error/Caught.hs, dist/build/System/IO/Error/Caught.o, dist/build/System/IO/Error/Caught.dyn_o )
  151. 6.01 s [pathway-compat-base] [ 7 of 15] Compiling System.IO.Error.Thin ( src/System/IO/Error/Thin.hs, dist/build/System/IO/Error/Thin.o, dist/build/System/IO/Error/Thin.dyn_o )
  152. 6.01 s [pathway-compat-base] [ 8 of 15] Compiling System.IO.Error.Pathway ( src/System/IO/Error/Pathway.hs, dist/build/System/IO/Error/Pathway.o, dist/build/System/IO/Error/Pathway.dyn_o )
  153. 6.01 s [pathway-compat-base] [ 9 of 15] Compiling System.IO.Error.Overlay ( src/System/IO/Error/Overlay.hs, dist/build/System/IO/Error/Overlay.o, dist/build/System/IO/Error/Overlay.dyn_o )
  154. 6.01 s [pathway-compat-base] [10 of 15] Compiling System.IO.Error.DropIn ( src/System/IO/Error/DropIn.hs, dist/build/System/IO/Error/DropIn.o, dist/build/System/IO/Error/DropIn.dyn_o )
  155. 6.01 s [pathway-compat-base] [11 of 15] Compiling System.IO.Thin ( src/System/IO/Thin.hs, dist/build/System/IO/Thin.o, dist/build/System/IO/Thin.dyn_o )
  156. 6.01 s [pathway-compat-base] [12 of 15] Compiling System.IO.Overlay ( src/System/IO/Overlay.hs, dist/build/System/IO/Overlay.o, dist/build/System/IO/Overlay.dyn_o )
  157. 6.04 s [pathway-compat-base] [13 of 15] Compiling System.IO.DropIn ( src/System/IO/DropIn.hs, dist/build/System/IO/DropIn.o, dist/build/System/IO/DropIn.dyn_o )
  158. 6.07 s [pathway-compat-base] [14 of 15] Compiling System.IO.Caught ( src/System/IO/Caught.hs, dist/build/System/IO/Caught.o, dist/build/System/IO/Caught.dyn_o )
  159. 6.07 s [pathway-compat-base] [15 of 15] Compiling System.IO.Pathway ( src/System/IO/Pathway.hs, dist/build/System/IO/Pathway.o, dist/build/System/IO/Pathway.dyn_o )
  160. 6.34 s [pathway-compat-base] [ 1 of 15] Compiling Common ( src/Common.hs, dist/build/Common.p_o )
  161. 6.90 s [pathway-compat-base] [ 2 of 15] Compiling System.Environment.Thin ( src/System/Environment/Thin.hs, dist/build/System/Environment/Thin.p_o )
  162. 7.07 s [pathway-compat-base] [ 3 of 15] Compiling System.Environment.Pathway ( src/System/Environment/Pathway.hs, dist/build/System/Environment/Pathway.p_o )
  163. 7.24 s [pathway-compat-base] [ 4 of 15] Compiling System.Environment.Overlay ( src/System/Environment/Overlay.hs, dist/build/System/Environment/Overlay.p_o )
  164. 7.25 s [pathway-compat-base] [ 5 of 15] Compiling System.Environment.DropIn ( src/System/Environment/DropIn.hs, dist/build/System/Environment/DropIn.p_o )
  165. 7.40 s [pathway-compat-base] [ 6 of 15] Compiling System.IO.Error.Caught ( src/System/IO/Error/Caught.hs, dist/build/System/IO/Error/Caught.p_o )
  166. 7.40 s [pathway-compat-base] [ 7 of 15] Compiling System.IO.Error.Thin ( src/System/IO/Error/Thin.hs, dist/build/System/IO/Error/Thin.p_o )
  167. 7.40 s [pathway-compat-base] [ 8 of 15] Compiling System.IO.Error.Pathway ( src/System/IO/Error/Pathway.hs, dist/build/System/IO/Error/Pathway.p_o )
  168. 7.40 s [pathway-compat-base] [ 9 of 15] Compiling System.IO.Error.Overlay ( src/System/IO/Error/Overlay.hs, dist/build/System/IO/Error/Overlay.p_o )
  169. 7.40 s [pathway-compat-base] [10 of 15] Compiling System.IO.Error.DropIn ( src/System/IO/Error/DropIn.hs, dist/build/System/IO/Error/DropIn.p_o )
  170. 7.40 s [pathway-compat-base] [11 of 15] Compiling System.IO.Thin ( src/System/IO/Thin.hs, dist/build/System/IO/Thin.p_o )
  171. 7.40 s [pathway-compat-base] [12 of 15] Compiling System.IO.Overlay ( src/System/IO/Overlay.hs, dist/build/System/IO/Overlay.p_o )
  172. 7.40 s [pathway-compat-base] [13 of 15] Compiling System.IO.DropIn ( src/System/IO/DropIn.hs, dist/build/System/IO/DropIn.p_o )
  173. 7.50 s [pathway-compat-base] [14 of 15] Compiling System.IO.Caught ( src/System/IO/Caught.hs, dist/build/System/IO/Caught.p_o )
  174. 7.50 s [pathway-compat-base] [15 of 15] Compiling System.IO.Pathway ( src/System/IO/Pathway.hs, dist/build/System/IO/Pathway.p_o )
  175. 9.73 s [pathway-compat-base] Preprocessing test suite 'doctests' for pathway-compat-base-0.0.1.0..
  176. 9.73 s [pathway-compat-base] Building test suite 'doctests' for pathway-compat-base-0.0.1.0..
  177. 9.81 s [pathway-compat-base] [1 of 2] Compiling Build_doctests ( dist/build/doctests/autogen/Build_doctests.hs, dist/build/doctests/doctests-tmp/Build_doctests.o )
  178. 10.05 s [pathway-compat-base] [2 of 2] Compiling Main ( tests/doctests.hs, dist/build/doctests/doctests-tmp/Main.o )
  179. 10.33 s [pathway-compat-base] [3 of 3] Linking dist/build/doctests/doctests
  180. 13.83 s [pathway-compat-base] Phase: checkPhase
  181. 13.87 s [pathway-compat-base] Running 1 test suites...
  182. 13.87 s [pathway-compat-base] Test suite doctests: RUNNING...
  183. 14.20 s [pathway-compat-base]
  184. 14.20 s [pathway-compat-base] on the commandline: warning: [GHC-98887]
  185. 14.20 s [pathway-compat-base] -XTemplateHaskell is not allowed in Safe Haskell; ignoring -XTemplateHaskell
  186. 14.20 s [pathway-compat-base]
  187. 14.20 s [pathway-compat-base] on the commandline: warning: [GHC-98887]
  188. 14.20 s [pathway-compat-base] -XTemplateHaskell is not allowed in Safe Haskell; ignoring -XTemplateHaskell
  189. 14.20 s [pathway-compat-base]
  190. 14.20 s [pathway-compat-base] on the commandline: warning: [GHC-98887]
  191. 14.20 s [pathway-compat-base] -XTemplateHaskell is not allowed in Safe Haskell; ignoring -XTemplateHaskell
  192. 14.21 s [pathway-compat-base]
  193. 14.21 s [pathway-compat-base] on the commandline: warning: [GHC-98887]
  194. 14.21 s [pathway-compat-base] -XTemplateHaskell is not allowed in Safe Haskell; ignoring -XTemplateHaskell
  195. 14.23 s [pathway-compat-base]
  196. 14.23 s [pathway-compat-base] on the commandline: warning: [GHC-98887]
  197. 14.23 s [pathway-compat-base] -XTemplateHaskell is not allowed in Safe Haskell; ignoring -XTemplateHaskell
  198. 14.23 s [pathway-compat-base]
  199. 14.23 s [pathway-compat-base] on the commandline: warning: [GHC-98887]
  200. 14.23 s [pathway-compat-base] -XTemplateHaskell is not allowed in Safe Haskell; ignoring -XTemplateHaskell
  201. 14.23 s [pathway-compat-base]
  202. 14.23 s [pathway-compat-base] on the commandline: warning: [GHC-98887]
  203. 14.23 s [pathway-compat-base] -XTemplateHaskell is not allowed in Safe Haskell; ignoring -XTemplateHaskell
  204. 14.23 s [pathway-compat-base]
  205. 14.23 s [pathway-compat-base] on the commandline: warning: [GHC-98887]
  206. 14.23 s [pathway-compat-base] -XTemplateHaskell is not allowed in Safe Haskell; ignoring -XTemplateHaskell
  207. 14.23 s [pathway-compat-base]
  208. 14.23 s [pathway-compat-base] on the commandline: warning: [GHC-98887]
  209. 14.23 s [pathway-compat-base] -XTemplateHaskell is not allowed in Safe Haskell; ignoring -XTemplateHaskell
  210. 14.24 s [pathway-compat-base]
  211. 14.24 s [pathway-compat-base] on the commandline: warning: [GHC-98887]
  212. 14.24 s [pathway-compat-base] -XTemplateHaskell is not allowed in Safe Haskell; ignoring -XTemplateHaskell
  213. 14.24 s [pathway-compat-base]
  214. 14.24 s [pathway-compat-base] on the commandline: warning: [GHC-98887]
  215. 14.24 s [pathway-compat-base] -XTemplateHaskell is not allowed in Safe Haskell; ignoring -XTemplateHaskell
  216. 14.24 s [pathway-compat-base]
  217. 14.24 s [pathway-compat-base] on the commandline: warning: [GHC-98887]
  218. 14.24 s [pathway-compat-base] -XTemplateHaskell is not allowed in Safe Haskell; ignoring -XTemplateHaskell
  219. 14.24 s [pathway-compat-base]
  220. 14.24 s [pathway-compat-base] on the commandline: warning: [GHC-98887]
  221. 14.24 s [pathway-compat-base] -XTemplateHaskell is not allowed in Safe Haskell; ignoring -XTemplateHaskell
  222. 14.24 s [pathway-compat-base]
  223. 14.24 s [pathway-compat-base] on the commandline: warning: [GHC-98887]
  224. 14.24 s [pathway-compat-base] -XTemplateHaskell is not allowed in Safe Haskell; ignoring -XTemplateHaskell
  225. 14.26 s [pathway-compat-base]
  226. 14.26 s [pathway-compat-base] on the commandline: warning: [GHC-98887]
  227. 14.26 s [pathway-compat-base] -XTemplateHaskell is not allowed in Safe Haskell; ignoring -XTemplateHaskell
  228. 14.26 s [pathway-compat-base]
  229. 14.26 s [pathway-compat-base] on the commandline: warning: [GHC-98887]
  230. 14.26 s [pathway-compat-base] -XTemplateHaskell is not allowed in Safe Haskell; ignoring -XTemplateHaskell
  231. 14.26 s [pathway-compat-base]
  232. 14.26 s [pathway-compat-base] on the commandline: warning: [GHC-98887]
  233. 14.26 s [pathway-compat-base] -XTemplateHaskell is not allowed in Safe Haskell; ignoring -XTemplateHaskell
  234. 14.26 s [pathway-compat-base]
  235. 14.26 s [pathway-compat-base] on the commandline: warning: [GHC-98887]
  236. 14.26 s [pathway-compat-base] -XTemplateHaskell is not allowed in Safe Haskell; ignoring -XTemplateHaskell
  237. 14.26 s [pathway-compat-base]
  238. 14.26 s [pathway-compat-base] on the commandline: warning: [GHC-98887]
  239. 14.26 s [pathway-compat-base] -XTemplateHaskell is not allowed in Safe Haskell; ignoring -XTemplateHaskell
  240. 14.26 s [pathway-compat-base]
  241. 14.26 s [pathway-compat-base] on the commandline: warning: [GHC-98887]
  242. 14.26 s [pathway-compat-base] -XTemplateHaskell is not allowed in Safe Haskell; ignoring -XTemplateHaskell
  243. 14.26 s [pathway-compat-base]
  244. 14.26 s [pathway-compat-base] on the commandline: warning: [GHC-98887]
  245. 14.26 s [pathway-compat-base] -XTemplateHaskell is not allowed in Safe Haskell; ignoring -XTemplateHaskell
  246. 14.26 s [pathway-compat-base]
  247. 14.27 s [pathway-compat-base] on the commandline: warning: [GHC-98887]
  248. 14.27 s [pathway-compat-base] -XTemplateHaskell is not allowed in Safe Haskell; ignoring -XTemplateHaskell
  249. 14.27 s [pathway-compat-base]
  250. 14.27 s [pathway-compat-base] on the commandline: warning: [GHC-98887]
  251. 14.27 s [pathway-compat-base] -XTemplateHaskell is not allowed in Safe Haskell; ignoring -XTemplateHaskell
  252. 14.74 s [pathway-compat-base] Examples: 0 Tried: 0 Errors: 0 Failures: 0
  253. 14.79 s [pathway-compat-base] Test suite doctests: PASS
  254. 14.79 s [pathway-compat-base] Test suite logged to: dist/test/pathway-compat-base-0.0.1.0-doctests.log
  255. 14.79 s [pathway-compat-base] 1 of 1 test suites (1 of 1 test cases) passed.
  256. 14.80 s [pathway-compat-base] Phase: haddockPhase
  257. 14.93 s [pathway-compat-base] Preprocessing library for pathway-compat-base-0.0.1.0..
  258. 14.94 s [pathway-compat-base] Running Haddock on library for pathway-compat-base-0.0.1.0..
  259. 14.94 s [pathway-compat-base] Warning: The documentation for the following packages are not installed. No
  260. 14.94 s [pathway-compat-base] links will be generated to these packages: vector-0.13.2.0
  261. 14.99 s [pathway-compat-base] Warning: --source-* options are ignored when --hyperlinked-source is enabled.
  262. 15.18 s [pathway-compat-base] [ 1 of 15] Compiling Common ( src/Common.hs, nothing )
  263. 15.46 s [pathway-compat-base] [ 2 of 15] Compiling System.Environment.Thin ( src/System/Environment/Thin.hs, nothing )
  264. 15.49 s [pathway-compat-base] [ 3 of 15] Compiling System.Environment.Pathway ( src/System/Environment/Pathway.hs, nothing )
  265. 15.49 s [pathway-compat-base] [ 4 of 15] Compiling System.Environment.Overlay ( src/System/Environment/Overlay.hs, nothing )
  266. 15.49 s [pathway-compat-base] [ 5 of 15] Compiling System.Environment.DropIn ( src/System/Environment/DropIn.hs, nothing )
  267. 15.49 s [pathway-compat-base] [ 6 of 15] Compiling System.IO.Error.Caught ( src/System/IO/Error/Caught.hs, nothing )
  268. 15.49 s [pathway-compat-base] [ 7 of 15] Compiling System.IO.Error.Thin ( src/System/IO/Error/Thin.hs, nothing )
  269. 15.49 s [pathway-compat-base] [ 8 of 15] Compiling System.IO.Error.Pathway ( src/System/IO/Error/Pathway.hs, nothing )
  270. 15.49 s [pathway-compat-base] [ 9 of 15] Compiling System.IO.Error.Overlay ( src/System/IO/Error/Overlay.hs, nothing )
  271. 15.49 s [pathway-compat-base] [10 of 15] Compiling System.IO.Error.DropIn ( src/System/IO/Error/DropIn.hs, nothing )
  272. 15.49 s [pathway-compat-base] [11 of 15] Compiling System.IO.Thin ( src/System/IO/Thin.hs, nothing )
  273. 15.49 s [pathway-compat-base] [12 of 15] Compiling System.IO.Overlay ( src/System/IO/Overlay.hs, nothing )
  274. 15.49 s [pathway-compat-base] [13 of 15] Compiling System.IO.DropIn ( src/System/IO/DropIn.hs, nothing )
  275. 15.49 s [pathway-compat-base] [14 of 15] Compiling System.IO.Caught ( src/System/IO/Caught.hs, nothing )
  276. 15.50 s [pathway-compat-base] [15 of 15] Compiling System.IO.Pathway ( src/System/IO/Pathway.hs, nothing )
  277. 15.50 s [pathway-compat-base] Haddock coverage:
  278. 15.51 s [pathway-compat-base] Warning: '</?>' is out of scope.
  279. 15.51 s [pathway-compat-base] If you qualify the identifier, haddock can try to link it anyway.
  280. 15.51 s [pathway-compat-base] Warning: '<$>' is out of scope.
  281. 15.51 s [pathway-compat-base] If you qualify the identifier, haddock can try to link it anyway.
  282. 15.51 s [pathway-compat-base] Warning: 'getCurrentDirectory' is out of scope.
  283. 15.51 s [pathway-compat-base] If you qualify the identifier, haddock can try to link it anyway.
  284. 15.51 s [pathway-compat-base] Warning: 'makeRelativeToCurrentDirectory' is out of scope.
  285. 15.51 s [pathway-compat-base] If you qualify the identifier, haddock can try to link it anyway.
  286. 15.51 s [pathway-compat-base] Warning: 'IOError' is out of scope.
  287. 15.51 s [pathway-compat-base] If you qualify the identifier, haddock can try to link it anyway.
  288. 15.51 s [pathway-compat-base] 14% ( 1 / 7) in 'Common'
  289. 15.51 s [pathway-compat-base] Missing documentation for:
  290. 15.51 s [pathway-compat-base] InternalFailure (src/Common.hs:69)
  291. 15.51 s [pathway-compat-base] toPathRep (src/Common.hs:85)
  292. 15.51 s [pathway-compat-base] fromPathRep (src/Common.hs:91)
  293. 15.51 s [pathway-compat-base] handleAnchoredPath (src/Common.hs:98)
  294. 15.51 s [pathway-compat-base] absFileFromPathRep (src/Common.hs:104)
  295. 15.51 s [pathway-compat-base] fileFromPathRep (src/Common.hs:120)
  296. 15.51 s [pathway-compat-base] Warning: '</?>' is out of scope.
  297. 15.51 s [pathway-compat-base] If you qualify the identifier, haddock can try to link it anyway.
  298. 15.51 s [pathway-compat-base] Warning: 'getCurrentDirectory' is out of scope.
  299. 15.51 s [pathway-compat-base] If you qualify the identifier, haddock can try to link it anyway.
  300. 15.51 s [pathway-compat-base] Warning: 'makeRelativeToCurrentDirectory' is out of scope.
  301. 15.51 s [pathway-compat-base] If you qualify the identifier, haddock can try to link it anyway.
  302. 15.51 s [pathway-compat-base] Warning: 'IOError' is out of scope.
  303. 15.51 s [pathway-compat-base] If you qualify the identifier, haddock can try to link it anyway.
  304. 15.51 s [pathway-compat-base] Warning: 'Anchored' is out of scope.
  305. 15.51 s [pathway-compat-base] If you qualify the identifier, haddock can try to link it anyway.
  306. 15.51 s [pathway-compat-base] 33% ( 1 / 3) in 'System.Environment.Thin'
  307. 15.51 s [pathway-compat-base] Missing documentation for:
  308. 15.51 s [pathway-compat-base] executablePath (src/System/Environment/Thin.hs:58)
  309. 15.51 s [pathway-compat-base] getExecutablePath (src/System/Environment/Thin.hs:72)
  310. 15.51 s [pathway-compat-base] 100% ( 11 / 11) in 'System.Environment.Pathway'
  311. 15.51 s [pathway-compat-base] Warning: '</?>' is out of scope.
  312. 15.51 s [pathway-compat-base] If you qualify the identifier, haddock can try to link it anyway.
  313. 15.51 s [pathway-compat-base] Warning: 'getCurrentDirectory' is out of scope.
  314. 15.51 s [pathway-compat-base] If you qualify the identifier, haddock can try to link it anyway.
  315. 15.51 s [pathway-compat-base] Warning: 'makeRelativeToCurrentDirectory' is out of scope.
  316. 15.51 s [pathway-compat-base] If you qualify the identifier, haddock can try to link it anyway.
  317. 15.51 s [pathway-compat-base] Warning: 'IOError' is out of scope.
  318. 15.51 s [pathway-compat-base] If you qualify the identifier, haddock can try to link it anyway.
  319. 15.51 s [pathway-compat-base] 33% ( 1 / 3) in 'System.Environment.Overlay'
  320. 15.51 s [pathway-compat-base] Missing documentation for:
  321. 15.51 s [pathway-compat-base] executablePath (src/System/Environment/Overlay.hs:51)
  322. 15.51 s [pathway-compat-base] getExecutablePath (src/System/Environment/Overlay.hs:55)
  323. 15.51 s [pathway-compat-base] 100% ( 11 / 11) in 'System.Environment.DropIn'
  324. 15.52 s [pathway-compat-base] 90% ( 10 / 11) in 'System.IO.Error.Caught'
  325. 15.52 s [pathway-compat-base] Missing documentation for:
  326. 15.52 s [pathway-compat-base] AlreadyInUseError (src/System/IO/Error/Caught.hs:103)
  327. 15.52 s [pathway-compat-base] 0% ( 0 / 5) in 'System.IO.Error.Thin'
  328. 15.52 s [pathway-compat-base] Missing documentation for:
  329. 15.52 s [pathway-compat-base] Module header
  330. 15.52 s [pathway-compat-base] mkIOError (src/System/IO/Error/Thin.hs:29)
  331. 15.52 s [pathway-compat-base] annotateIOError (src/System/IO/Error/Thin.hs:33)
  332. 15.52 s [pathway-compat-base] ioeGetFileName (src/System/IO/Error/Thin.hs:39)
  333. 15.52 s [pathway-compat-base] ioeSetFileName (src/System/IO/Error/Thin.hs:42)
  334. 15.52 s [pathway-compat-base] 82% ( 37 / 45) in 'System.IO.Error.Pathway'
  335. 15.52 s [pathway-compat-base] Missing documentation for:
  336. 15.52 s [pathway-compat-base] ioeGetErrorType
  337. 15.52 s [pathway-compat-base] ioeGetErrorString
  338. 15.52 s [pathway-compat-base] ioeGetLocation
  339. 15.52 s [pathway-compat-base] ioeGetHandle
  340. 15.52 s [pathway-compat-base] ioeSetErrorType
  341. 15.52 s [pathway-compat-base] ioeSetErrorString
  342. 15.52 s [pathway-compat-base] ioeSetLocation
  343. 15.52 s [pathway-compat-base] ioeSetHandle
  344. 15.52 s [pathway-compat-base] 0% ( 0 / 2) in 'System.IO.Error.Overlay'
  345. 15.52 s [pathway-compat-base] Missing documentation for:
  346. 15.52 s [pathway-compat-base] Module header
  347. 15.52 s [pathway-compat-base] ioeGetFileName (src/System/IO/Error/Overlay.hs:21)
  348. 15.52 s [pathway-compat-base] 76% ( 36 / 47) in 'System.IO.Error.DropIn'
  349. 15.52 s [pathway-compat-base] Missing documentation for:
  350. 15.52 s [pathway-compat-base] ioeGetErrorType
  351. 15.52 s [pathway-compat-base] ioeGetErrorString
  352. 15.52 s [pathway-compat-base] ioeGetLocation
  353. 15.52 s [pathway-compat-base] ioeGetHandle
  354. 15.52 s [pathway-compat-base] ioeSetErrorType
  355. 15.52 s [pathway-compat-base] ioeSetErrorString
  356. 15.52 s [pathway-compat-base] ioeSetLocation
  357. 15.52 s [pathway-compat-base] ioeSetHandle
  358. 15.52 s [pathway-compat-base] mkIOError (src/System/IO/Error/Thin.hs:29)
  359. 15.52 s [pathway-compat-base] ioeSetFileName (src/System/IO/Error/Thin.hs:42)
  360. 15.52 s [pathway-compat-base] annotateIOError (src/System/IO/Error/Thin.hs:33)
  361. 15.52 s [pathway-compat-base] 0% ( 0 / 13) in 'System.IO.Thin'
  362. 15.52 s [pathway-compat-base] Missing documentation for:
  363. 15.52 s [pathway-compat-base] Module header
  364. 15.52 s [pathway-compat-base] withFile (src/System/IO/Thin.hs:32)
  365. 15.52 s [pathway-compat-base] openFile (src/System/IO/Thin.hs:35)
  366. 15.52 s [pathway-compat-base] readFile (src/System/IO/Thin.hs:38)
  367. 15.52 s [pathway-compat-base] readFile' (src/System/IO/Thin.hs:41)
  368. 15.52 s [pathway-compat-base] writeFile (src/System/IO/Thin.hs:44)
  369. 15.52 s [pathway-compat-base] appendFile (src/System/IO/Thin.hs:47)
  370. 15.52 s [pathway-compat-base] withBinaryFile (src/System/IO/Thin.hs:50)
  371. 15.52 s [pathway-compat-base] openBinaryFile (src/System/IO/Thin.hs:53)
  372. 15.52 s [pathway-compat-base] openTempFile (src/System/IO/Thin.hs:66)
  373. 15.52 s [pathway-compat-base] openBinaryTempFile (src/System/IO/Thin.hs:80)
  374. 15.52 s [pathway-compat-base] openTempFileWithDefaultPermissions (src/System/IO/Thin.hs:89)
  375. 15.52 s [pathway-compat-base] openBinaryTempFileWithDefaultPermissions (src/System/IO/Thin.hs:98)
  376. 15.52 s [pathway-compat-base] 0% ( 0 / 5) in 'System.IO.Overlay'
  377. 15.52 s [pathway-compat-base] Missing documentation for:
  378. 15.52 s [pathway-compat-base] Module header
  379. 15.52 s [pathway-compat-base] openTempFile (src/System/IO/Overlay.hs:24)
  380. 15.52 s [pathway-compat-base] openBinaryTempFile (src/System/IO/Overlay.hs:30)
  381. 15.52 s [pathway-compat-base] openTempFileWithDefaultPermissions (src/System/IO/Overlay.hs:34)
  382. 15.52 s [pathway-compat-base] openBinaryTempFileWithDefaultPermissions (src/System/IO/Overlay.hs:41)
  383. 15.52 s [pathway-compat-base] 80% ( 73 / 91) in 'System.IO.DropIn'
  384. 15.52 s [pathway-compat-base] Missing documentation for:
  385. 15.52 s [pathway-compat-base] stdout
  386. 15.52 s [pathway-compat-base] stdin
  387. 15.52 s [pathway-compat-base] stderr
  388. 15.52 s [pathway-compat-base] hPutBufNonBlocking
  389. 15.52 s [pathway-compat-base] HandlePosn
  390. 15.52 s [pathway-compat-base] hIsOpen
  391. 15.52 s [pathway-compat-base] hIsClosed
  392. 15.52 s [pathway-compat-base] hIsReadable
  393. 15.52 s [pathway-compat-base] hIsWritable
  394. 15.53 s [pathway-compat-base] hIsSeekable
  395. 15.53 s [pathway-compat-base] openFile (src/System/IO/Thin.hs:35)
  396. 15.53 s [pathway-compat-base] readFile' (src/System/IO/Thin.hs:41)
  397. 15.53 s [pathway-compat-base] writeFile (src/System/IO/Thin.hs:44)
  398. 15.53 s [pathway-compat-base] withFile (src/System/IO/Thin.hs:32)
  399. 15.53 s [pathway-compat-base] openBinaryFile (src/System/IO/Thin.hs:53)
  400. 15.53 s [pathway-compat-base] withBinaryFile (src/System/IO/Thin.hs:50)
  401. 15.53 s [pathway-compat-base] readFile (src/System/IO/Thin.hs:38)
  402. 15.53 s [pathway-compat-base] appendFile (src/System/IO/Thin.hs:47)
  403. 15.53 s [pathway-compat-base] 20% ( 1 / 5) in 'System.IO.Caught'
  404. 15.53 s [pathway-compat-base] Missing documentation for:
  405. 15.53 s [pathway-compat-base] Module header
  406. 15.53 s [pathway-compat-base] OpenFileFailure (src/System/IO/Caught.hs:38)
  407. 15.53 s [pathway-compat-base] openFile (src/System/IO/Caught.hs:50)
  408. 15.53 s [pathway-compat-base] recoverOpenFileFailure (src/System/IO/Caught.hs:41)
  409. 15.53 s [pathway-compat-base] 77% ( 73 / 94) in 'System.IO.Pathway'
  410. 15.53 s [pathway-compat-base] Missing documentation for:
  411. 15.53 s [pathway-compat-base] stdout
  412. 15.53 s [pathway-compat-base] stdin
  413. 15.53 s [pathway-compat-base] stderr
  414. 15.53 s [pathway-compat-base] hPutBufNonBlocking
  415. 15.53 s [pathway-compat-base] HandlePosn
  416. 15.53 s [pathway-compat-base] hIsOpen
  417. 15.53 s [pathway-compat-base] hIsClosed
  418. 15.53 s [pathway-compat-base] hIsReadable
  419. 15.53 s [pathway-compat-base] hIsWritable
  420. 15.53 s [pathway-compat-base] hIsSeekable
  421. 15.53 s [pathway-compat-base] readFile' (src/System/IO/Thin.hs:41)
  422. 15.53 s [pathway-compat-base] writeFile (src/System/IO/Thin.hs:44)
  423. 15.53 s [pathway-compat-base] withFile (src/System/IO/Thin.hs:32)
  424. 15.53 s [pathway-compat-base] openBinaryFile (src/System/IO/Thin.hs:53)
  425. 15.53 s [pathway-compat-base] withBinaryFile (src/System/IO/Thin.hs:50)
  426. 15.53 s [pathway-compat-base] readFile (src/System/IO/Thin.hs:38)
  427. 15.53 s [pathway-compat-base] appendFile (src/System/IO/Thin.hs:47)
  428. 15.53 s [pathway-compat-base] openTempFile (src/System/IO/Thin.hs:66)
  429. 15.53 s [pathway-compat-base] openBinaryTempFile (src/System/IO/Thin.hs:80)
  430. 15.53 s [pathway-compat-base] openTempFileWithDefaultPermissions (src/System/IO/Thin.hs:89)
  431. 15.53 s [pathway-compat-base] openBinaryTempFileWithDefaultPermissions (src/System/IO/Thin.hs:98)
  432. 15.95 s [pathway-compat-base] Warning: Common: could not find link destinations for:
  433. 15.95 s [pathway-compat-base] - Common.Rep_InternalFailure
  434. 15.95 s [pathway-compat-base] Warning: System.IO.Error.Caught: could not find link destinations for:
  435. 15.95 s [pathway-compat-base] - System.IO.Error.Caught.Rep_UnsatisfiedConstraints
  436. 15.95 s [pathway-compat-base] - System.IO.Error.Caught.Rep_UnsupportedOperation
  437. 15.95 s [pathway-compat-base] - System.IO.Error.Caught.Rep_AlreadyInUseError
  438. 15.95 s [pathway-compat-base] - System.IO.Error.Caught.Rep_AlreadyExistsError
  439. 15.95 s [pathway-compat-base] - System.IO.Error.Caught.Rep_DoesNotExistError
  440. 15.95 s [pathway-compat-base] - System.IO.Error.Caught.Rep_FullError
  441. 15.95 s [pathway-compat-base] - System.IO.Error.Caught.Rep_InappropriateType
  442. 15.95 s [pathway-compat-base] - System.IO.Error.Caught.Rep_InvalidArgument
  443. 15.95 s [pathway-compat-base] - System.IO.Error.Caught.Rep_HardwareFault
  444. 15.95 s [pathway-compat-base] - System.IO.Error.Caught.Rep_PermissionError
  445. 15.96 s [pathway-compat-base] Warning: System.IO.DropIn: could not find link destinations for:
  446. 15.96 s [pathway-compat-base] - Control.Monad.Primitive.D:R:PrimStateIO
  447. 15.96 s [pathway-compat-base] - Text.Printf.UPrintf
  448. 15.96 s [pathway-compat-base] - Text.Printf.hspr
  449. 15.96 s [pathway-compat-base] - Text.Printf.spr
  450. 15.97 s [pathway-compat-base] Warning: System.IO.Pathway: could not find link destinations for:
  451. 15.97 s [pathway-compat-base] - Control.Monad.Primitive.D:R:PrimStateIO
  452. 15.97 s [pathway-compat-base] - Text.Printf.UPrintf
  453. 15.97 s [pathway-compat-base] - Text.Printf.hspr
  454. 15.97 s [pathway-compat-base] - Text.Printf.spr
  455. 20.43 s [pathway-compat-base] Documentation created: dist/doc/html/pathway-compat-base/,
  456. 20.44 s [pathway-compat-base] dist/doc/html/pathway-compat-base/pathway-compat-base.txt
  457. 20.49 s [pathway-compat-base] Preprocessing test suite 'doctests' for pathway-compat-base-0.0.1.0..
  458. 20.50 s [pathway-compat-base] Phase: installPhase
  459. 22.31 s [pathway-compat-base] Installing library in /nix/store/lcicpysisnrcl5wpnlag2pks0zzv3frw-pathway-compat-base-0.0.1.0/lib/ghc-9.8.4/lib/x86_64-linux-ghc-9.8.4/pathway-compat-base-0.0.1.0-8ldj6SPXbxq2Shd8yFeOpr
  460. 22.31 s [pathway-compat-base] Phase: fixupPhase
  461. 22.31 s [pathway-compat-base] shrinking RPATHs of ELF executables and libraries in /nix/store/lcicpysisnrcl5wpnlag2pks0zzv3frw-pathway-compat-base-0.0.1.0
  462. 22.31 s [pathway-compat-base] shrinking /nix/store/lcicpysisnrcl5wpnlag2pks0zzv3frw-pathway-compat-base-0.0.1.0/lib/ghc-9.8.4/lib/x86_64-linux-ghc-9.8.4/libHSpathway-compat-base-0.0.1.0-8ldj6SPXbxq2Shd8yFeOpr-ghc9.8.4.so
  463. 22.31 s [pathway-compat-base] checking for references to /build/ in /nix/store/lcicpysisnrcl5wpnlag2pks0zzv3frw-pathway-compat-base-0.0.1.0...
  464. 22.31 s [pathway-compat-base] patching script interpreter paths in /nix/store/lcicpysisnrcl5wpnlag2pks0zzv3frw-pathway-compat-base-0.0.1.0
  465. 22.31 s [pathway-compat-base] stripping (with command strip and flags -S -p) in /nix/store/lcicpysisnrcl5wpnlag2pks0zzv3frw-pathway-compat-base-0.0.1.0/lib
  466. 22.31 s [pathway-compat-base] shrinking RPATHs of ELF executables and libraries in /nix/store/7274h69mlzj5111kzlccd4ddhcz4mj8h-pathway-compat-base-0.0.1.0-doc
  467. 22.31 s [pathway-compat-base] checking for references to /build/ in /nix/store/7274h69mlzj5111kzlccd4ddhcz4mj8h-pathway-compat-base-0.0.1.0-doc...
  468. 22.31 s [pathway-compat-base] patching script interpreter paths in /nix/store/7274h69mlzj5111kzlccd4ddhcz4mj8h-pathway-compat-base-0.0.1.0-doc
  469. 22.31 s [pathway-compat-base:post-build] Uploading to cachix cache "sellout": /nix/store/7274h69mlzj5111kzlccd4ddhcz4mj8h-pathway-compat-base-0.0.1.0-doc /nix/store/lcicpysisnrcl5wpnlag2pks0zzv3frw-pathway-compat-base-0.0.1.0
  470. 22.31 s [pathway-compat-base:post-build] Pushing 2 paths (186 are already present) using zstd to cache sellout ⏳
  471. 22.31 s [pathway-compat-base:post-build]
  472. 22.31 s [pathway-compat-base:post-build] Pushing /nix/store/7274h69mlzj5111kzlccd4ddhcz4mj8h-pathway-compat-base-0.0.1.0-doc (1.92 MiB)
  473. 22.31 s [pathway-compat-base:post-build] Pushing /nix/store/lcicpysisnrcl5wpnlag2pks0zzv3frw-pathway-compat-base-0.0.1.0 (2.02 MiB)
  474. 23.32 s [pathway-compat-base:post-build]
  475. 23.32 s [pathway-compat-base:post-build] All done.
  476. 23.34 s [pathway-compat-base:post-build] Uploading to the NixCI cache: /nix/store/7274h69mlzj5111kzlccd4ddhcz4mj8h-pathway-compat-base-0.0.1.0-doc /nix/store/lcicpysisnrcl5wpnlag2pks0zzv3frw-pathway-compat-base-0.0.1.0
  477. 23.37 s [pathway-compat-base:post-build] warning: 'warn-short-path-literals' is deprecated, use 'lint-short-path-literals = ignore' instead
  478. 23.39 s [pathway-compat-base:post-build] copying 2 paths...
  479. 23.39 s [pathway-compat-base:post-build] copying path '/nix/store/7274h69mlzj5111kzlccd4ddhcz4mj8h-pathway-compat-base-0.0.1.0-doc' to 'https://cache.nix-ci.com'...
  480. 23.74 s [pathway-compat-base:post-build] copying path '/nix/store/lcicpysisnrcl5wpnlag2pks0zzv3frw-pathway-compat-base-0.0.1.0' to 'https://cache.nix-ci.com'...
  481. 24.22 s [pathway-compat-base:post-build] warning: 'warn-short-path-literals' is deprecated, use 'lint-short-path-literals = ignore' instead
  482. 24.51 s [pathway-compat-base:post-build] copying 1 paths...
  483. 24.51 s [pathway-compat-base:post-build] copying path '/nix/store/rfxaff3ggz29012sg3f1gl5j59dk5nzp-pathway-compat-base-0.0.1.0.drv' to 'https://cache.nix-ci.com'...
  484. 24.66 s Uploaded pathway-compat-base in 2.3s
  485. 24.66 s Progress: 1 of 15 built
  486. 24.66 s Built pathway-compat-base in 22.6s
  487. 24.69 s Building /nix/store/psj7qq98d0nc1x3mcxvgminpvlszfrfm-pathway-compat-filepath-0.0.1.0.drv
  488. 24.89 s [pathway-compat-filepath] Phase: setupCompilerEnvironmentPhase
  489. 24.90 s [pathway-compat-filepath] Build with /nix/store/7r9b0bl984hdgd70nf5p8raa55kml491-ghc-9.8.4.
  490. 25.22 s [pathway-compat-filepath] Phase: unpackPhase
  491. 25.23 s [pathway-compat-filepath] unpacking source archive /nix/store/5z4x7vzkb1m65ccyx19wn7vcxdl9gmbf-filepath
  492. 25.24 s [pathway-compat-filepath] source root is filepath
  493. 25.25 s [pathway-compat-filepath] Phase: patchPhase
  494. 25.26 s [pathway-compat-filepath] Phase: compileBuildDriverPhase
  495. 25.27 s [pathway-compat-filepath] setupCompileFlags: -package-db=/build/tmp.biVzhidzsF/setup-package.conf.d -threaded
  496. 25.31 s [pathway-compat-filepath] [1 of 2] Compiling Main ( Setup.hs, /build/tmp.biVzhidzsF/Main.o )
  497. 25.36 s [pathway-compat-filepath] [2 of 2] Linking Setup
  498. 26.65 s [pathway-compat-filepath] Phase: updateAutotoolsGnuConfigScriptsPhase
  499. 26.67 s [pathway-compat-filepath] Phase: configurePhase
  500. 26.69 s [pathway-compat-filepath] configureFlags: --verbose --prefix=/nix/store/xghx2j0inbha0jqrcxmvc3ljvvx1i77g-pathway-compat-filepath-0.0.1.0 --libdir=$prefix/lib/$compiler/lib --libsubdir=$abi/$libname --docdir=/nix/store/c3wlvp65ypvkb08q9pcr7hq7wygmm4g4-pathway-compat-filepath-0.0.1.0-doc/share/doc/pathway-compat-filepath-0.0.1.0 --with-gcc=gcc --package-db=/build/tmp.biVzhidzsF/package.conf.d --ghc-option=-j16 --ghc-option=+RTS --ghc-option=-A64M --ghc-option=-RTS --enable-library-profiling --profiling-detail=exported-functions --disable-profiling --enable-shared --disable-coverage --enable-static --disable-executable-dynamic --enable-tests --disable-benchmarks --enable-library-vanilla --disable-library-for-ghci --enable-split-sections --enable-library-stripping --enable-executable-stripping --ghc-option=-haddock --ghc-options=-Werror --extra-lib-dirs=/nix/store/pndhkk0l649lm1sj0mxk7cbwq26qd1ra-ncurses-6.6/lib --extra-lib-dirs=/nix/store/0djlg4g0b81w94k3vcaqsxsc2hh4kism-libffi-3.5.2/lib --extra-lib-dirs=/nix/store/md4paia7riiggyrj8p24c7a6vf8w7jz8-elfutils-0.194/lib --extra-lib-dirs=/nix/store/39vv2pf64gd8li48a4hpbhw2crzd8z5p-gmp-with-cxx-6.3.0/lib --extra-lib-dirs=/nix/store/7wwvald8lapkrsr72qanlw8blyn55ifx-numactl-2.0.18/lib --extra-lib-dirs=/nix/store/7r9b0bl984hdgd70nf5p8raa55kml491-ghc-9.8.4/lib
  501. 26.69 s [pathway-compat-filepath] Using Parsec parser
  502. 26.69 s [pathway-compat-filepath] Configuring pathway-compat-filepath-0.0.1.0...
  503. 27.04 s [pathway-compat-filepath] Flags chosen: noisy-deprecations=True, verify-no-recursion=False
  504. 27.04 s [pathway-compat-filepath] Dependency base >=4.14.0 && <4.15 || >=4.15.0 && <4.16 || >=4.16.0 && <4.17 ||
  505. 27.04 s [pathway-compat-filepath] >=4.17.0 && <4.18 || >=4.18.0 && <4.19 || >=4.19.0 && <4.20 || >=4.20.0 &&
  506. 27.04 s [pathway-compat-filepath] <4.21 || >=4.21.0 && <4.22 || >=4.22.0 && <4.23: using base-4.19.2.0
  507. 27.04 s [pathway-compat-filepath] Dependency extra: using extra-1.8.1
  508. 27.04 s [pathway-compat-filepath] Dependency filepath >=1.4.2 && <1.5 || >=1.5.0 && <1.6: using
  509. 27.04 s [pathway-compat-filepath] filepath-1.4.301.0
  510. 27.04 s [pathway-compat-filepath] Dependency megaparsec >=9.0.1 && <9.1 || >=9.2.1 && <9.3 || >=9.5.0 && <9.6 ||
  511. 27.04 s [pathway-compat-filepath] >=9.7.0 && <9.8: using megaparsec-9.7.0
  512. 27.04 s [pathway-compat-filepath] Dependency os-string: using os-string-2.0.10
  513. 27.04 s [pathway-compat-filepath] Dependency pathway >=0.0.1 && <0.1: using pathway-0.0.1.0
  514. 27.04 s [pathway-compat-filepath] Dependency pathway-compat-base >=0.0.1 && <0.1: using
  515. 27.04 s [pathway-compat-filepath] pathway-compat-base-0.0.1.0
  516. 27.04 s [pathway-compat-filepath] Dependency pathway-internal >=0.0.1 && <0.1: using pathway-internal-0.0.1.0
  517. 27.04 s [pathway-compat-filepath] Dependency base >=4.14.0 && <4.15 || >=4.15.0 && <4.16 || >=4.16.0 && <4.17 ||
  518. 27.04 s [pathway-compat-filepath] >=4.17.0 && <4.18 || >=4.18.0 && <4.19 || >=4.19.0 && <4.20 || >=4.20.0 &&
  519. 27.04 s [pathway-compat-filepath] <4.21 || >=4.21.0 && <4.22 || >=4.22.0 && <4.23: using base-4.19.2.0
  520. 27.04 s [pathway-compat-filepath] Dependency doctest >=0.16.3 && <0.17 || >=0.18.1 && <0.19 || >=0.20.1 && <0.21
  521. 27.04 s [pathway-compat-filepath] || >=0.21.1 && <0.22 || >=0.22.2 && <0.23 || >=0.24.2 && <0.25: using
  522. 27.04 s [pathway-compat-filepath] doctest-0.24.3
  523. 27.04 s [pathway-compat-filepath] Dependency pathway-compat-filepath: using pathway-compat-filepath-0.0.1.0
  524. 27.39 s [pathway-compat-filepath] Source component graph:
  525. 27.39 s [pathway-compat-filepath] component lib
  526. 27.39 s [pathway-compat-filepath] component test:doctests dependency lib
  527. 27.39 s [pathway-compat-filepath] Configured component graph:
  528. 27.39 s [pathway-compat-filepath] component pathway-compat-filepath-0.0.1.0-6KN1Vlb8yPeBopmlZtXyrR
  529. 27.39 s [pathway-compat-filepath] include base-4.19.2.0-934f
  530. 27.39 s [pathway-compat-filepath] include extra-1.8.1-F4oHgTKCper3ZiIUPZjGPK
  531. 27.39 s [pathway-compat-filepath] include filepath-1.4.301.0-6e15
  532. 27.39 s [pathway-compat-filepath] include megaparsec-9.7.0-10vHZAF1maw9O8p2gXs66N
  533. 27.39 s [pathway-compat-filepath] include os-string-2.0.10-HbyG8qgShpTHKXL8bZ3UK8
  534. 27.39 s [pathway-compat-filepath] include pathway-0.0.1.0-H5uD0SRA9755UrSqFBaCYE
  535. 27.39 s [pathway-compat-filepath] include pathway-compat-base-0.0.1.0-8ldj6SPXbxq2Shd8yFeOpr
  536. 27.39 s [pathway-compat-filepath] include pathway-internal-0.0.1.0-Lnjdb2M8cxN196wSdsfQUK
  537. 27.39 s [pathway-compat-filepath] component pathway-compat-filepath-0.0.1.0-LoaDJ8tbb2m5kfHmaP2B9c-doctests
  538. 27.39 s [pathway-compat-filepath] include base-4.19.2.0-934f
  539. 27.39 s [pathway-compat-filepath] include doctest-0.24.3-1aDs7zEYV5r7raSsXr9TQC
  540. 27.39 s [pathway-compat-filepath] include pathway-compat-filepath-0.0.1.0-6KN1Vlb8yPeBopmlZtXyrR
  541. 27.39 s [pathway-compat-filepath] Linked component graph:
  542. 27.39 s [pathway-compat-filepath] unit pathway-compat-filepath-0.0.1.0-6KN1Vlb8yPeBopmlZtXyrR
  543. 27.39 s [pathway-compat-filepath] include base-4.19.2.0-934f
  544. 27.39 s [pathway-compat-filepath] include extra-1.8.1-F4oHgTKCper3ZiIUPZjGPK
  545. 27.39 s [pathway-compat-filepath] include filepath-1.4.301.0-6e15
  546. 27.39 s [pathway-compat-filepath] include megaparsec-9.7.0-10vHZAF1maw9O8p2gXs66N
  547. 27.39 s [pathway-compat-filepath] include os-string-2.0.10-HbyG8qgShpTHKXL8bZ3UK8
  548. 27.39 s [pathway-compat-filepath] include pathway-0.0.1.0-H5uD0SRA9755UrSqFBaCYE
  549. 27.39 s [pathway-compat-filepath] include pathway-compat-base-0.0.1.0-8ldj6SPXbxq2Shd8yFeOpr
  550. 27.39 s [pathway-compat-filepath] include pathway-internal-0.0.1.0-Lnjdb2M8cxN196wSdsfQUK
  551. 27.39 s [pathway-compat-filepath] Common.FilePath=pathway-compat-filepath-0.0.1.0-6KN1Vlb8yPeBopmlZtXyrR:Common.FilePath,Common.OsPath=pathway-compat-filepath-0.0.1.0-6KN1Vlb8yPeBopmlZtXyrR:Common.OsPath,System.FilePath=pathway-compat-filepath-0.0.1.0-6KN1Vlb8yPeBopmlZtXyrR:System.FilePath,System.FilePath.Overlay=pathway-compat-filepath-0.0.1.0-6KN1Vlb8yPeBopmlZtXyrR:System.FilePath.Overlay,System.FilePath.Pathway=pathway-compat-filepath-0.0.1.0-6KN1Vlb8yPeBopmlZtXyrR:System.FilePath.Pathway,System.FilePath.Thin=pathway-compat-filepath-0.0.1.0-6KN1Vlb8yPeBopmlZtXyrR:System.FilePath.Thin,System.OsPath=pathway-compat-filepath-0.0.1.0-6KN1Vlb8yPeBopmlZtXyrR:System.OsPath,System.OsPath.Overlay=pathway-compat-filepath-0.0.1.0-6KN1Vlb8yPeBopmlZtXyrR:System.OsPath.Overlay,System.OsPath.Pathway=pathway-compat-filepath-0.0.1.0-6KN1Vlb8yPeBopmlZtXyrR:System.OsPath.Pathway,System.OsPath.Thin=pathway-compat-filepath-0.0.1.0-6KN1Vlb8yPeBopmlZtXyrR:System.OsPath.Thin
  552. 27.39 s [pathway-compat-filepath] unit pathway-compat-filepath-0.0.1.0-LoaDJ8tbb2m5kfHmaP2B9c-doctests
  553. 27.39 s [pathway-compat-filepath] include base-4.19.2.0-934f
  554. 27.39 s [pathway-compat-filepath] include doctest-0.24.3-1aDs7zEYV5r7raSsXr9TQC
  555. 27.39 s [pathway-compat-filepath] include pathway-compat-filepath-0.0.1.0-6KN1Vlb8yPeBopmlZtXyrR
  556. 27.39 s [pathway-compat-filepath] Ready component graph:
  557. 27.39 s [pathway-compat-filepath] definite pathway-compat-filepath-0.0.1.0-6KN1Vlb8yPeBopmlZtXyrR
  558. 27.39 s [pathway-compat-filepath] depends base-4.19.2.0-934f
  559. 27.39 s [pathway-compat-filepath] depends extra-1.8.1-F4oHgTKCper3ZiIUPZjGPK
  560. 27.39 s [pathway-compat-filepath] depends filepath-1.4.301.0-6e15
  561. 27.39 s [pathway-compat-filepath] depends megaparsec-9.7.0-10vHZAF1maw9O8p2gXs66N
  562. 27.39 s [pathway-compat-filepath] depends os-string-2.0.10-HbyG8qgShpTHKXL8bZ3UK8
  563. 27.39 s [pathway-compat-filepath] depends pathway-0.0.1.0-H5uD0SRA9755UrSqFBaCYE
  564. 27.39 s [pathway-compat-filepath] depends pathway-compat-base-0.0.1.0-8ldj6SPXbxq2Shd8yFeOpr
  565. 27.39 s [pathway-compat-filepath] depends pathway-internal-0.0.1.0-Lnjdb2M8cxN196wSdsfQUK
  566. 27.39 s [pathway-compat-filepath] definite pathway-compat-filepath-0.0.1.0-LoaDJ8tbb2m5kfHmaP2B9c-doctests
  567. 27.39 s [pathway-compat-filepath] depends base-4.19.2.0-934f
  568. 27.39 s [pathway-compat-filepath] depends doctest-0.24.3-1aDs7zEYV5r7raSsXr9TQC
  569. 27.39 s [pathway-compat-filepath] depends pathway-compat-filepath-0.0.1.0-6KN1Vlb8yPeBopmlZtXyrR
  570. 27.39 s [pathway-compat-filepath] Using Cabal-3.10.3.0 compiled by ghc-9.8
  571. 27.39 s [pathway-compat-filepath] Using compiler: ghc-9.8.4
  572. 27.39 s [pathway-compat-filepath] Using install prefix:
  573. 27.39 s [pathway-compat-filepath] /nix/store/xghx2j0inbha0jqrcxmvc3ljvvx1i77g-pathway-compat-filepath-0.0.1.0
  574. 27.39 s [pathway-compat-filepath] Executables installed in:
  575. 27.39 s [pathway-compat-filepath] /nix/store/xghx2j0inbha0jqrcxmvc3ljvvx1i77g-pathway-compat-filepath-0.0.1.0/bin
  576. 27.39 s [pathway-compat-filepath] Libraries installed in:
  577. 27.39 s [pathway-compat-filepath] /nix/store/xghx2j0inbha0jqrcxmvc3ljvvx1i77g-pathway-compat-filepath-0.0.1.0/lib/ghc-9.8.4/lib/x86_64-linux-ghc-9.8.4/pathway-compat-filepath-0.0.1.0-6KN1Vlb8yPeBopmlZtXyrR
  578. 27.39 s [pathway-compat-filepath] Dynamic Libraries installed in:
  579. 27.39 s [pathway-compat-filepath] /nix/store/xghx2j0inbha0jqrcxmvc3ljvvx1i77g-pathway-compat-filepath-0.0.1.0/lib/ghc-9.8.4/lib/x86_64-linux-ghc-9.8.4
  580. 27.39 s [pathway-compat-filepath] Private executables installed in:
  581. 27.39 s [pathway-compat-filepath] /nix/store/xghx2j0inbha0jqrcxmvc3ljvvx1i77g-pathway-compat-filepath-0.0.1.0/libexec/x86_64-linux-ghc-9.8.4/pathway-compat-filepath-0.0.1.0
  582. 27.39 s [pathway-compat-filepath] Data files installed in:
  583. 27.39 s [pathway-compat-filepath] /nix/store/xghx2j0inbha0jqrcxmvc3ljvvx1i77g-pathway-compat-filepath-0.0.1.0/share/x86_64-linux-ghc-9.8.4/pathway-compat-filepath-0.0.1.0
  584. 27.39 s [pathway-compat-filepath] Documentation installed in:
  585. 27.39 s [pathway-compat-filepath] /nix/store/c3wlvp65ypvkb08q9pcr7hq7wygmm4g4-pathway-compat-filepath-0.0.1.0-doc/share/doc/pathway-compat-filepath-0.0.1.0
  586. 27.39 s [pathway-compat-filepath] Configuration files installed in:
  587. 27.39 s [pathway-compat-filepath] /nix/store/xghx2j0inbha0jqrcxmvc3ljvvx1i77g-pathway-compat-filepath-0.0.1.0/etc
  588. 27.39 s [pathway-compat-filepath] No alex found
  589. 27.39 s [pathway-compat-filepath] Using ar found on system at:
  590. 27.39 s [pathway-compat-filepath] /nix/store/zjraf40s86y3iwhp626b934r5y6ldkbb-binutils-wrapper-2.46/bin/ar
  591. 27.39 s [pathway-compat-filepath] No c2hs found
  592. 27.39 s [pathway-compat-filepath] No cpphs found
  593. 27.39 s [pathway-compat-filepath] Using doctest version 0.24.3 found on system at:
  594. 27.39 s [pathway-compat-filepath] /nix/store/2y183b1vsybv0157vfr59yhdwjkpqfkn-doctest-0.24.3/bin/doctest
  595. 27.39 s [pathway-compat-filepath] Using gcc version 15.2.0 given by user at:
  596. 27.39 s [pathway-compat-filepath] /nix/store/29qjlshvklnyr67nhpprzgb9igmsfsjj-gcc-wrapper-15.2.0/bin/gcc
  597. 27.39 s [pathway-compat-filepath] Using ghc version 9.8.4 found on system at:
  598. 27.39 s [pathway-compat-filepath] /nix/store/7r9b0bl984hdgd70nf5p8raa55kml491-ghc-9.8.4/bin/ghc
  599. 27.39 s [pathway-compat-filepath] Using ghc-pkg version 9.8.4 found on system at:
  600. 27.39 s [pathway-compat-filepath] /nix/store/7r9b0bl984hdgd70nf5p8raa55kml491-ghc-9.8.4/bin/ghc-pkg-9.8.4
  601. 27.39 s [pathway-compat-filepath] No ghcjs found
  602. 27.39 s [pathway-compat-filepath] No ghcjs-pkg found
  603. 27.39 s [pathway-compat-filepath] No greencard found
  604. 27.39 s [pathway-compat-filepath] Using haddock version 2.30.0 found on system at:
  605. 27.39 s [pathway-compat-filepath] /nix/store/7r9b0bl984hdgd70nf5p8raa55kml491-ghc-9.8.4/bin/haddock-ghc-9.8.4
  606. 27.39 s [pathway-compat-filepath] No happy found
  607. 27.39 s [pathway-compat-filepath] Using haskell-suite found on system at: haskell-suite-dummy-location
  608. 27.39 s [pathway-compat-filepath] Using haskell-suite-pkg found on system at: haskell-suite-pkg-dummy-location
  609. 27.39 s [pathway-compat-filepath] No hmake found
  610. 27.39 s [pathway-compat-filepath] Using hpc version 0.69 found on system at:
  611. 27.39 s [pathway-compat-filepath] /nix/store/7r9b0bl984hdgd70nf5p8raa55kml491-ghc-9.8.4/bin/hpc-ghc-9.8.4
  612. 27.39 s [pathway-compat-filepath] Using hsc2hs version 0.68.10 found on system at:
  613. 27.39 s [pathway-compat-filepath] /nix/store/7r9b0bl984hdgd70nf5p8raa55kml491-ghc-9.8.4/bin/hsc2hs-ghc-9.8.4
  614. 27.39 s [pathway-compat-filepath] Using hscolour version 1.25 found on system at:
  615. 27.39 s [pathway-compat-filepath] /nix/store/awnxn98rlw62rrjwli6d2lb4d27mrzzw-hscolour-1.25/bin/HsColour
  616. 27.39 s [pathway-compat-filepath] No jhc found
  617. 27.39 s [pathway-compat-filepath] Using ld found on system at:
  618. 27.39 s [pathway-compat-filepath] /nix/store/zjraf40s86y3iwhp626b934r5y6ldkbb-binutils-wrapper-2.46/bin/ld.gold
  619. 27.39 s [pathway-compat-filepath] No pkg-config found
  620. 27.39 s [pathway-compat-filepath] Using runghc version 9.8.4 found on system at:
  621. 27.39 s [pathway-compat-filepath] /nix/store/7r9b0bl984hdgd70nf5p8raa55kml491-ghc-9.8.4/bin/runghc-9.8.4
  622. 27.39 s [pathway-compat-filepath] Using strip version 2.46 found on system at:
  623. 27.39 s [pathway-compat-filepath] /nix/store/29qjlshvklnyr67nhpprzgb9igmsfsjj-gcc-wrapper-15.2.0/bin/strip
  624. 27.39 s [pathway-compat-filepath] Using tar found on system at:
  625. 27.39 s [pathway-compat-filepath] /nix/store/z5mq2sam4484prf3kv6v6vjw1m0i7j24-gnutar-1.35/bin/tar
  626. 27.39 s [pathway-compat-filepath] No uhc found
  627. 27.83 s [pathway-compat-filepath] Phase: buildPhase
  628. 27.90 s [pathway-compat-filepath] Preprocessing library for pathway-compat-filepath-0.0.1.0..
  629. 27.90 s [pathway-compat-filepath] Building library for pathway-compat-filepath-0.0.1.0..
  630. 27.98 s [pathway-compat-filepath] [ 1 of 10] Compiling Common.FilePath ( src/Common/FilePath.hs, dist/build/Common/FilePath.o, dist/build/Common/FilePath.dyn_o )
  631. 28.27 s [pathway-compat-filepath] [ 2 of 10] Compiling Common.OsPath ( src/Common/OsPath.hs, dist/build/Common/OsPath.o, dist/build/Common/OsPath.dyn_o )
  632. 28.27 s [pathway-compat-filepath]
  633. 28.27 s [pathway-compat-filepath] src/Common/OsPath.hs:90:23: error: [GHC-83865]
  634. 28.27 s [pathway-compat-filepath] • Couldn't match type ‘OSS.OsString’ with ‘OsString’
  635. 28.27 s [pathway-compat-filepath] Expected: OsPath
  636. 28.27 s [pathway-compat-filepath] Actual: OSS.OsString
  637. 28.27 s [pathway-compat-filepath] NB: ‘OsString’
  638. 28.27 s [pathway-compat-filepath] is defined in ‘System.OsString.Internal.Types.Hidden’
  639. 28.27 s [pathway-compat-filepath] in package ‘filepath-1.4.301.0’
  640. 28.27 s [pathway-compat-filepath] ‘OSS.OsString’
  641. 28.27 s [pathway-compat-filepath] is defined in ‘System.OsString.Internal.Types’
  642. 28.27 s [pathway-compat-filepath] in package ‘os-string-2.0.10’
  643. 28.27 s [pathway-compat-filepath] • In the ‘parent’ field of a record
  644. 28.27 s [pathway-compat-filepath] In the expression:
  645. 28.27 s [pathway-compat-filepath] Format
  646. 28.27 s [pathway-compat-filepath] {root = O.pack . pure $ O.pathSeparator, current = mempty,
  647. 28.27 s [pathway-compat-filepath] parent = OSS.unsafeEncodeUtf "..",
  648. 28.27 s [pathway-compat-filepath] separator = O.pack . pure $ O.pathSeparator,
  649. 28.27 s [pathway-compat-filepath] substitutions = mempty}
  650. 28.27 s [pathway-compat-filepath] In an equation for ‘localFormat’:
  651. 28.27 s [pathway-compat-filepath] localFormat
  652. 28.27 s [pathway-compat-filepath] = Format
  653. 28.27 s [pathway-compat-filepath] {root = O.pack . pure $ O.pathSeparator, current = mempty,
  654. 28.27 s [pathway-compat-filepath] parent = OSS.unsafeEncodeUtf "..",
  655. 28.27 s [pathway-compat-filepath] separator = O.pack . pure $ O.pathSeparator,
  656. 28.27 s [pathway-compat-filepath] substitutions = mempty}
  657. 28.27 s [pathway-compat-filepath] |
  658. 28.27 s [pathway-compat-filepath] 90 | Format.parent = OSS.unsafeEncodeUtf "..",
  659. 28.27 s [pathway-compat-filepath] | ^^^^^^^^^^^^^^^^^^^^^^^^
  660. 28.27 s [pathway-compat-filepath] [ 3 of 10] Compiling System.FilePath.Thin ( src/System/FilePath/Thin.hs, dist/build/System/FilePath/Thin.o, dist/build/System/FilePath/Thin.dyn_o )
  661. 28.37 s [pathway-compat-filepath] [ 4 of 10] Compiling System.FilePath.Pathway ( src/System/FilePath/Pathway.hs, dist/build/System/FilePath/Pathway.o, dist/build/System/FilePath/Pathway.dyn_o )
  662. 28.40 s [pathway-compat-filepath] [ 5 of 10] Compiling System.FilePath.Overlay ( src/System/FilePath/Overlay.hs, dist/build/System/FilePath/Overlay.o, dist/build/System/FilePath/Overlay.dyn_o )
  663. 28.42 s [pathway-compat-filepath] [ 6 of 10] Compiling System.FilePath ( src/System/FilePath.hs, dist/build/System/FilePath.o, dist/build/System/FilePath.dyn_o )
  664. 28.54 s Progress: 1 of 13 built (1 failed)
  665. 28.54 s Failed to build pathway-compat-filepath after 3.8s
  666. 28.54 s error: Cannot build '/nix/store/psj7qq98d0nc1x3mcxvgminpvlszfrfm-pathway-compat-filepath-0.0.1.0.drv'.
  667. 28.54 s Reason: builder failed with exit code 1.
  668. 28.54 s Output paths:
  669. 28.54 s /nix/store/c3wlvp65ypvkb08q9pcr7hq7wygmm4g4-pathway-compat-filepath-0.0.1.0-doc
  670. 28.54 s /nix/store/xghx2j0inbha0jqrcxmvc3ljvvx1i77g-pathway-compat-filepath-0.0.1.0
  671. 28.54 s Last 176 log lines:
  672. 28.54 s > Running phase: setupCompilerEnvironmentPhase
  673. 28.54 s > Build with /nix/store/7r9b0bl984hdgd70nf5p8raa55kml491-ghc-9.8.4.
  674. 28.54 s > Running phase: unpackPhase
  675. 28.54 s > unpacking source archive /nix/store/5z4x7vzkb1m65ccyx19wn7vcxdl9gmbf-filepath
  676. 28.54 s > source root is filepath
  677. 28.54 s > Running phase: patchPhase
  678. 28.54 s > Running phase: compileBuildDriverPhase
  679. 28.54 s > setupCompileFlags: -package-db=/build/tmp.biVzhidzsF/setup-package.conf.d -threaded
  680. 28.54 s > [1 of 2] Compiling Main ( Setup.hs, /build/tmp.biVzhidzsF/Main.o )
  681. 28.54 s > [2 of 2] Linking Setup
  682. 28.54 s > Running phase: updateAutotoolsGnuConfigScriptsPhase
  683. 28.54 s > Running phase: configurePhase
  684. 28.54 s > configureFlags: --verbose --prefix=/nix/store/xghx2j0inbha0jqrcxmvc3ljvvx1i77g-pathway-compat-filepath-0.0.1.0 --libdir=$prefix/lib/$compiler/lib --libsubdir=$abi/$libname --docdir=/nix/store/c3wlvp65ypvkb08q9pcr7hq7wygmm4g4-pathway-compat-filepath-0.0.1.0-doc/share/doc/pathway-compat-filepath-0.0.1.0 --with-gcc=gcc --package-db=/build/tmp.biVzhidzsF/package.conf.d --ghc-option=-j16 --ghc-option=+RTS --ghc-option=-A64M --ghc-option=-RTS --enable-library-profiling --profiling-detail=exported-functions --disable-profiling --enable-shared --disable-coverage --enable-static --disable-executable-dynamic --enable-tests --disable-benchmarks --enable-library-vanilla --disable-library-for-ghci --enable-split-sections --enable-library-stripping --enable-executable-stripping --ghc-option=-haddock --ghc-options=-Werror --extra-lib-dirs=/nix/store/pndhkk0l649lm1sj0mxk7cbwq26qd1ra-ncurses-6.6/lib --extra-lib-dirs=/nix/store/0djlg4g0b81w94k3vcaqsxsc2hh4kism-libffi-3.5.2/lib --extra-lib-dirs=/nix/store/md4paia7riiggyrj8p24c7a6vf8w7jz8-elfutils-0.194/lib --extra-lib-dirs=/nix/store/39vv2pf64gd8li48a4hpbhw2crzd8z5p-gmp-with-cxx-6.3.0/lib --extra-lib-dirs=/nix/store/7wwvald8lapkrsr72qanlw8blyn55ifx-numactl-2.0.18/lib --extra-lib-dirs=/nix/store/7r9b0bl984hdgd70nf5p8raa55kml491-ghc-9.8.4/lib
  685. 28.54 s > Using Parsec parser
  686. 28.54 s > Configuring pathway-compat-filepath-0.0.1.0...
  687. 28.54 s > Flags chosen: noisy-deprecations=True, verify-no-recursion=False
  688. 28.54 s > Dependency base >=4.14.0 && <4.15 || >=4.15.0 && <4.16 || >=4.16.0 && <4.17 ||
  689. 28.54 s > >=4.17.0 && <4.18 || >=4.18.0 && <4.19 || >=4.19.0 && <4.20 || >=4.20.0 &&
  690. 28.54 s > <4.21 || >=4.21.0 && <4.22 || >=4.22.0 && <4.23: using base-4.19.2.0
  691. 28.54 s > Dependency extra: using extra-1.8.1
  692. 28.54 s > Dependency filepath >=1.4.2 && <1.5 || >=1.5.0 && <1.6: using
  693. 28.54 s > filepath-1.4.301.0
  694. 28.54 s > Dependency megaparsec >=9.0.1 && <9.1 || >=9.2.1 && <9.3 || >=9.5.0 && <9.6 ||
  695. 28.54 s > >=9.7.0 && <9.8: using megaparsec-9.7.0
  696. 28.54 s > Dependency os-string: using os-string-2.0.10
  697. 28.54 s > Dependency pathway >=0.0.1 && <0.1: using pathway-0.0.1.0
  698. 28.54 s > Dependency pathway-compat-base >=0.0.1 && <0.1: using
  699. 28.54 s > pathway-compat-base-0.0.1.0
  700. 28.54 s > Dependency pathway-internal >=0.0.1 && <0.1: using pathway-internal-0.0.1.0
  701. 28.54 s > Dependency base >=4.14.0 && <4.15 || >=4.15.0 && <4.16 || >=4.16.0 && <4.17 ||
  702. 28.54 s > >=4.17.0 && <4.18 || >=4.18.0 && <4.19 || >=4.19.0 && <4.20 || >=4.20.0 &&
  703. 28.54 s > <4.21 || >=4.21.0 && <4.22 || >=4.22.0 && <4.23: using base-4.19.2.0
  704. 28.54 s > Dependency doctest >=0.16.3 && <0.17 || >=0.18.1 && <0.19 || >=0.20.1 && <0.21
  705. 28.54 s > || >=0.21.1 && <0.22 || >=0.22.2 && <0.23 || >=0.24.2 && <0.25: using
  706. 28.54 s > doctest-0.24.3
  707. 28.54 s > Dependency pathway-compat-filepath: using pathway-compat-filepath-0.0.1.0
  708. 28.54 s > Source component graph:
  709. 28.54 s > component lib
  710. 28.54 s > component test:doctests dependency lib
  711. 28.54 s > Configured component graph:
  712. 28.54 s > component pathway-compat-filepath-0.0.1.0-6KN1Vlb8yPeBopmlZtXyrR
  713. 28.54 s > include base-4.19.2.0-934f
  714. 28.54 s > include extra-1.8.1-F4oHgTKCper3ZiIUPZjGPK
  715. 28.54 s > include filepath-1.4.301.0-6e15
  716. 28.54 s > include megaparsec-9.7.0-10vHZAF1maw9O8p2gXs66N
  717. 28.54 s > include os-string-2.0.10-HbyG8qgShpTHKXL8bZ3UK8
  718. 28.54 s > include pathway-0.0.1.0-H5uD0SRA9755UrSqFBaCYE
  719. 28.54 s > include pathway-compat-base-0.0.1.0-8ldj6SPXbxq2Shd8yFeOpr
  720. 28.54 s > include pathway-internal-0.0.1.0-Lnjdb2M8cxN196wSdsfQUK
  721. 28.54 s > component pathway-compat-filepath-0.0.1.0-LoaDJ8tbb2m5kfHmaP2B9c-doctests
  722. 28.54 s > include base-4.19.2.0-934f
  723. 28.54 s > include doctest-0.24.3-1aDs7zEYV5r7raSsXr9TQC
  724. 28.54 s > include pathway-compat-filepath-0.0.1.0-6KN1Vlb8yPeBopmlZtXyrR
  725. 28.54 s > Linked component graph:
  726. 28.54 s > unit pathway-compat-filepath-0.0.1.0-6KN1Vlb8yPeBopmlZtXyrR
  727. 28.54 s > include base-4.19.2.0-934f
  728. 28.54 s > include extra-1.8.1-F4oHgTKCper3ZiIUPZjGPK
  729. 28.54 s > include filepath-1.4.301.0-6e15
  730. 28.54 s > include megaparsec-9.7.0-10vHZAF1maw9O8p2gXs66N
  731. 28.54 s > include os-string-2.0.10-HbyG8qgShpTHKXL8bZ3UK8
  732. 28.54 s > include pathway-0.0.1.0-H5uD0SRA9755UrSqFBaCYE
  733. 28.54 s > include pathway-compat-base-0.0.1.0-8ldj6SPXbxq2Shd8yFeOpr
  734. 28.54 s > include pathway-internal-0.0.1.0-Lnjdb2M8cxN196wSdsfQUK
  735. 28.54 s > Common.FilePath=pathway-compat-filepath-0.0.1.0-6KN1Vlb8yPeBopmlZtXyrR:Common.FilePath,Common.OsPath=pathway-compat-filepath-0.0.1.0-6KN1Vlb8yPeBopmlZtXyrR:Common.OsPath,System.FilePath=pathway-compat-filepath-0.0.1.0-6KN1Vlb8yPeBopmlZtXyrR:System.FilePath,System.FilePath.Overlay=pathway-compat-filepath-0.0.1.0-6KN1Vlb8yPeBopmlZtXyrR:System.FilePath.Overlay,System.FilePath.Pathway=pathway-compat-filepath-0.0.1.0-6KN1Vlb8yPeBopmlZtXyrR:System.FilePath.Pathway,System.FilePath.Thin=pathway-compat-filepath-0.0.1.0-6KN1Vlb8yPeBopmlZtXyrR:System.FilePath.Thin,System.OsPath=pathway-compat-filepath-0.0.1.0-6KN1Vlb8yPeBopmlZtXyrR:System.OsPath,System.OsPath.Overlay=pathway-compat-filepath-0.0.1.0-6KN1Vlb8yPeBopmlZtXyrR:System.OsPath.Overlay,System.OsPath.Pathway=pathway-compat-filepath-0.0.1.0-6KN1Vlb8yPeBopmlZtXyrR:System.OsPath.Pathway,System.OsPath.Thin=pathway-compat-filepath-0.0.1.0-6KN1Vlb8yPeBopmlZtXyrR:System.OsPath.Thin
  736. 28.54 s > unit pathway-compat-filepath-0.0.1.0-LoaDJ8tbb2m5kfHmaP2B9c-doctests
  737. 28.54 s > include base-4.19.2.0-934f
  738. 28.54 s > include doctest-0.24.3-1aDs7zEYV5r7raSsXr9TQC
  739. 28.54 s > include pathway-compat-filepath-0.0.1.0-6KN1Vlb8yPeBopmlZtXyrR
  740. 28.54 s > Ready component graph:
  741. 28.54 s > definite pathway-compat-filepath-0.0.1.0-6KN1Vlb8yPeBopmlZtXyrR
  742. 28.54 s > depends base-4.19.2.0-934f
  743. 28.54 s > depends extra-1.8.1-F4oHgTKCper3ZiIUPZjGPK
  744. 28.54 s > depends filepath-1.4.301.0-6e15
  745. 28.54 s > depends megaparsec-9.7.0-10vHZAF1maw9O8p2gXs66N
  746. 28.54 s > depends os-string-2.0.10-HbyG8qgShpTHKXL8bZ3UK8
  747. 28.54 s > depends pathway-0.0.1.0-H5uD0SRA9755UrSqFBaCYE
  748. 28.54 s > depends pathway-compat-base-0.0.1.0-8ldj6SPXbxq2Shd8yFeOpr
  749. 28.54 s > depends pathway-internal-0.0.1.0-Lnjdb2M8cxN196wSdsfQUK
  750. 28.54 s > definite pathway-compat-filepath-0.0.1.0-LoaDJ8tbb2m5kfHmaP2B9c-doctests
  751. 28.54 s > depends base-4.19.2.0-934f
  752. 28.54 s > depends doctest-0.24.3-1aDs7zEYV5r7raSsXr9TQC
  753. 28.54 s > depends pathway-compat-filepath-0.0.1.0-6KN1Vlb8yPeBopmlZtXyrR
  754. 28.54 s > Using Cabal-3.10.3.0 compiled by ghc-9.8
  755. 28.54 s > Using compiler: ghc-9.8.4
  756. 28.54 s > Using install prefix:
  757. 28.54 s > /nix/store/xghx2j0inbha0jqrcxmvc3ljvvx1i77g-pathway-compat-filepath-0.0.1.0
  758. 28.54 s > Executables installed in:
  759. 28.54 s > /nix/store/xghx2j0inbha0jqrcxmvc3ljvvx1i77g-pathway-compat-filepath-0.0.1.0/bin
  760. 28.54 s > Libraries installed in:
  761. 28.54 s > /nix/store/xghx2j0inbha0jqrcxmvc3ljvvx1i77g-pathway-compat-filepath-0.0.1.0/lib/ghc-9.8.4/lib/x86_64-linux-ghc-9.8.4/pathway-compat-filepath-0.0.1.0-6KN1Vlb8yPeBopmlZtXyrR
  762. 28.54 s > Dynamic Libraries installed in:
  763. 28.54 s > /nix/store/xghx2j0inbha0jqrcxmvc3ljvvx1i77g-pathway-compat-filepath-0.0.1.0/lib/ghc-9.8.4/lib/x86_64-linux-ghc-9.8.4
  764. 28.54 s > Private executables installed in:
  765. 28.54 s > /nix/store/xghx2j0inbha0jqrcxmvc3ljvvx1i77g-pathway-compat-filepath-0.0.1.0/libexec/x86_64-linux-ghc-9.8.4/pathway-compat-filepath-0.0.1.0
  766. 28.54 s > Data files installed in:
  767. 28.54 s > /nix/store/xghx2j0inbha0jqrcxmvc3ljvvx1i77g-pathway-compat-filepath-0.0.1.0/share/x86_64-linux-ghc-9.8.4/pathway-compat-filepath-0.0.1.0
  768. 28.54 s > Documentation installed in:
  769. 28.54 s > /nix/store/c3wlvp65ypvkb08q9pcr7hq7wygmm4g4-pathway-compat-filepath-0.0.1.0-doc/share/doc/pathway-compat-filepath-0.0.1.0
  770. 28.54 s > Configuration files installed in:
  771. 28.54 s > /nix/store/xghx2j0inbha0jqrcxmvc3ljvvx1i77g-pathway-compat-filepath-0.0.1.0/etc
  772. 28.54 s > No alex found
  773. 28.54 s > Using ar found on system at:
  774. 28.54 s > /nix/store/zjraf40s86y3iwhp626b934r5y6ldkbb-binutils-wrapper-2.46/bin/ar
  775. 28.54 s > No c2hs found
  776. 28.54 s > No cpphs found
  777. 28.54 s > Using doctest version 0.24.3 found on system at:
  778. 28.54 s > /nix/store/2y183b1vsybv0157vfr59yhdwjkpqfkn-doctest-0.24.3/bin/doctest
  779. 28.54 s > Using gcc version 15.2.0 given by user at:
  780. 28.54 s > /nix/store/29qjlshvklnyr67nhpprzgb9igmsfsjj-gcc-wrapper-15.2.0/bin/gcc
  781. 28.54 s > Using ghc version 9.8.4 found on system at:
  782. 28.54 s > /nix/store/7r9b0bl984hdgd70nf5p8raa55kml491-ghc-9.8.4/bin/ghc
  783. 28.54 s > Using ghc-pkg version 9.8.4 found on system at:
  784. 28.54 s > /nix/store/7r9b0bl984hdgd70nf5p8raa55kml491-ghc-9.8.4/bin/ghc-pkg-9.8.4
  785. 28.54 s > No ghcjs found
  786. 28.54 s > No ghcjs-pkg found
  787. 28.54 s > No greencard found
  788. 28.54 s > Using haddock version 2.30.0 found on system at:
  789. 28.54 s > /nix/store/7r9b0bl984hdgd70nf5p8raa55kml491-ghc-9.8.4/bin/haddock-ghc-9.8.4
  790. 28.54 s > No happy found
  791. 28.54 s > Using haskell-suite found on system at: haskell-suite-dummy-location
  792. 28.54 s > Using haskell-suite-pkg found on system at: haskell-suite-pkg-dummy-location
  793. 28.54 s > No hmake found
  794. 28.54 s > Using hpc version 0.69 found on system at:
  795. 28.54 s > /nix/store/7r9b0bl984hdgd70nf5p8raa55kml491-ghc-9.8.4/bin/hpc-ghc-9.8.4
  796. 28.54 s > Using hsc2hs version 0.68.10 found on system at:
  797. 28.54 s > /nix/store/7r9b0bl984hdgd70nf5p8raa55kml491-ghc-9.8.4/bin/hsc2hs-ghc-9.8.4
  798. 28.54 s > Using hscolour version 1.25 found on system at:
  799. 28.54 s > /nix/store/awnxn98rlw62rrjwli6d2lb4d27mrzzw-hscolour-1.25/bin/HsColour
  800. 28.54 s > No jhc found
  801. 28.54 s > Using ld found on system at:
  802. 28.54 s > /nix/store/zjraf40s86y3iwhp626b934r5y6ldkbb-binutils-wrapper-2.46/bin/ld.gold
  803. 28.54 s > No pkg-config found
  804. 28.54 s > Using runghc version 9.8.4 found on system at:
  805. 28.54 s > /nix/store/7r9b0bl984hdgd70nf5p8raa55kml491-ghc-9.8.4/bin/runghc-9.8.4
  806. 28.54 s > Using strip version 2.46 found on system at:
  807. 28.54 s > /nix/store/29qjlshvklnyr67nhpprzgb9igmsfsjj-gcc-wrapper-15.2.0/bin/strip
  808. 28.54 s > Using tar found on system at:
  809. 28.54 s > /nix/store/z5mq2sam4484prf3kv6v6vjw1m0i7j24-gnutar-1.35/bin/tar
  810. 28.54 s > No uhc found
  811. 28.54 s > Running phase: buildPhase
  812. 28.54 s > Preprocessing library for pathway-compat-filepath-0.0.1.0..
  813. 28.54 s > Building library for pathway-compat-filepath-0.0.1.0..
  814. 28.54 s > [ 1 of 10] Compiling Common.FilePath ( src/Common/FilePath.hs, dist/build/Common/FilePath.o, dist/build/Common/FilePath.dyn_o )
  815. 28.54 s > [ 2 of 10] Compiling Common.OsPath ( src/Common/OsPath.hs, dist/build/Common/OsPath.o, dist/build/Common/OsPath.dyn_o )
  816. 28.54 s >
  817. 28.54 s > src/Common/OsPath.hs:90:23: error: [GHC-83865]
  818. 28.54 s > • Couldn't match type ‘OSS.OsString’ with ‘OsString’
  819. 28.54 s > Expected: OsPath
  820. 28.54 s > Actual: OSS.OsString
  821. 28.54 s > NB: ‘OsString’
  822. 28.54 s > is defined in ‘System.OsString.Internal.Types.Hidden’
  823. 28.54 s > in package ‘filepath-1.4.301.0’
  824. 28.54 s > ‘OSS.OsString’
  825. 28.54 s > is defined in ‘System.OsString.Internal.Types’
  826. 28.54 s > in package ‘os-string-2.0.10’
  827. 28.54 s > • In the ‘parent’ field of a record
  828. 28.54 s > In the expression:
  829. 28.54 s > Format
  830. 28.54 s > {root = O.pack . pure $ O.pathSeparator, current = mempty,
  831. 28.54 s > parent = OSS.unsafeEncodeUtf "..",
  832. 28.54 s > separator = O.pack . pure $ O.pathSeparator,
  833. 28.54 s > substitutions = mempty}
  834. 28.54 s > In an equation for ‘localFormat’:
  835. 28.54 s > localFormat
  836. 28.54 s > = Format
  837. 28.54 s > {root = O.pack . pure $ O.pathSeparator, current = mempty,
  838. 28.54 s > parent = OSS.unsafeEncodeUtf "..",
  839. 28.54 s > separator = O.pack . pure $ O.pathSeparator,
  840. 28.54 s > substitutions = mempty}
  841. 28.54 s > |
  842. 28.54 s > 90 | Format.parent = OSS.unsafeEncodeUtf "..",
  843. 28.54 s > | ^^^^^^^^^^^^^^^^^^^^^^^^
  844. 28.54 s > [ 3 of 10] Compiling System.FilePath.Thin ( src/System/FilePath/Thin.hs, dist/build/System/FilePath/Thin.o, dist/build/System/FilePath/Thin.dyn_o )
  845. 28.54 s > [ 4 of 10] Compiling System.FilePath.Pathway ( src/System/FilePath/Pathway.hs, dist/build/System/FilePath/Pathway.o, dist/build/System/FilePath/Pathway.dyn_o )
  846. 28.54 s > [ 5 of 10] Compiling System.FilePath.Overlay ( src/System/FilePath/Overlay.hs, dist/build/System/FilePath/Overlay.o, dist/build/System/FilePath/Overlay.dyn_o )
  847. 28.54 s > [ 6 of 10] Compiling System.FilePath ( src/System/FilePath.hs, dist/build/System/FilePath.o, dist/build/System/FilePath.dyn_o )
  848. 28.54 s For full logs, run:
  849. 28.54 s nix log /nix/store/psj7qq98d0nc1x3mcxvgminpvlszfrfm-pathway-compat-filepath-0.0.1.0.drv
  850. 28.54 s error: Cannot build '/nix/store/psj7qq98d0nc1x3mcxvgminpvlszfrfm-pathway-compat-filepath-0.0.1.0.drv'.
  851. 28.54 s Reason: builder failed with exit code 1.
  852. 28.54 s Output paths:
  853. 28.54 s /nix/store/c3wlvp65ypvkb08q9pcr7hq7wygmm4g4-pathway-compat-filepath-0.0.1.0-doc
  854. 28.54 s /nix/store/xghx2j0inbha0jqrcxmvc3ljvvx1i77g-pathway-compat-filepath-0.0.1.0
  855. 28.54 s Last 176 log lines:
  856. 28.54 s > Running phase: setupCompilerEnvironmentPhase
  857. 28.54 s > Build with /nix/store/7r9b0bl984hdgd70nf5p8raa55kml491-ghc-9.8.4.
  858. 28.54 s > Running phase: unpackPhase
  859. 28.54 s > unpacking source archive /nix/store/5z4x7vzkb1m65ccyx19wn7vcxdl9gmbf-filepath
  860. 28.54 s > source root is filepath
  861. 28.54 s > Running phase: patchPhase
  862. 28.54 s > Running phase: compileBuildDriverPhase
  863. 28.54 s > setupCompileFlags: -package-db=/build/tmp.biVzhidzsF/setup-package.conf.d -threaded
  864. 28.54 s > [1 of 2] Compiling Main ( Setup.hs, /build/tmp.biVzhidzsF/Main.o )
  865. 28.54 s > [2 of 2] Linking Setup
  866. 28.54 s > Running phase: updateAutotoolsGnuConfigScriptsPhase
  867. 28.54 s > Running phase: configurePhase
  868. 28.54 s > configureFlags: --verbose --prefix=/nix/store/xghx2j0inbha0jqrcxmvc3ljvvx1i77g-pathway-compat-filepath-0.0.1.0 --libdir=$prefix/lib/$compiler/lib --libsubdir=$abi/$libname --docdir=/nix/store/c3wlvp65ypvkb08q9pcr7hq7wygmm4g4-pathway-compat-filepath-0.0.1.0-doc/share/doc/pathway-compat-filepath-0.0.1.0 --with-gcc=gcc --package-db=/build/tmp.biVzhidzsF/package.conf.d --ghc-option=-j16 --ghc-option=+RTS --ghc-option=-A64M --ghc-option=-RTS --enable-library-profiling --profiling-detail=exported-functions --disable-profiling --enable-shared --disable-coverage --enable-static --disable-executable-dynamic --enable-tests --disable-benchmarks --enable-library-vanilla --disable-library-for-ghci --enable-split-sections --enable-library-stripping --enable-executable-stripping --ghc-option=-haddock --ghc-options=-Werror --extra-lib-dirs=/nix/store/pndhkk0l649lm1sj0mxk7cbwq26qd1ra-ncurses-6.6/lib --extra-lib-dirs=/nix/store/0djlg4g0b81w94k3vcaqsxsc2hh4kism-libffi-3.5.2/lib --extra-lib-dirs=/nix/store/md4paia7riiggyrj8p24c7a6vf8w7jz8-elfutils-0.194/lib --extra-lib-dirs=/nix/store/39vv2pf64gd8li48a4hpbhw2crzd8z5p-gmp-with-cxx-6.3.0/lib --extra-lib-dirs=/nix/store/7wwvald8lapkrsr72qanlw8blyn55ifx-numactl-2.0.18/lib --extra-lib-dirs=/nix/store/7r9b0bl984hdgd70nf5p8raa55kml491-ghc-9.8.4/lib
  869. 28.54 s > Using Parsec parser
  870. 28.54 s > Configuring pathway-compat-filepath-0.0.1.0...
  871. 28.54 s > Flags chosen: noisy-deprecations=True, verify-no-recursion=False
  872. 28.54 s > Dependency base >=4.14.0 && <4.15 || >=4.15.0 && <4.16 || >=4.16.0 && <4.17 ||
  873. 28.54 s > >=4.17.0 && <4.18 || >=4.18.0 && <4.19 || >=4.19.0 && <4.20 || >=4.20.0 &&
  874. 28.54 s > <4.21 || >=4.21.0 && <4.22 || >=4.22.0 && <4.23: using base-4.19.2.0
  875. 28.54 s > Dependency extra: using extra-1.8.1
  876. 28.54 s > Dependency filepath >=1.4.2 && <1.5 || >=1.5.0 && <1.6: using
  877. 28.54 s > filepath-1.4.301.0
  878. 28.54 s > Dependency megaparsec >=9.0.1 && <9.1 || >=9.2.1 && <9.3 || >=9.5.0 && <9.6 ||
  879. 28.54 s > >=9.7.0 && <9.8: using megaparsec-9.7.0
  880. 28.54 s > Dependency os-string: using os-string-2.0.10
  881. 28.54 s > Dependency pathway >=0.0.1 && <0.1: using pathway-0.0.1.0
  882. 28.54 s > Dependency pathway-compat-base >=0.0.1 && <0.1: using
  883. 28.54 s > pathway-compat-base-0.0.1.0
  884. 28.54 s > Dependency pathway-internal >=0.0.1 && <0.1: using pathway-internal-0.0.1.0
  885. 28.54 s > Dependency base >=4.14.0 && <4.15 || >=4.15.0 && <4.16 || >=4.16.0 && <4.17 ||
  886. 28.54 s > >=4.17.0 && <4.18 || >=4.18.0 && <4.19 || >=4.19.0 && <4.20 || >=4.20.0 &&
  887. 28.54 s > <4.21 || >=4.21.0 && <4.22 || >=4.22.0 && <4.23: using base-4.19.2.0
  888. 28.54 s > Dependency doctest >=0.16.3 && <0.17 || >=0.18.1 && <0.19 || >=0.20.1 && <0.21
  889. 28.54 s > || >=0.21.1 && <0.22 || >=0.22.2 && <0.23 || >=0.24.2 && <0.25: using
  890. 28.54 s > doctest-0.24.3
  891. 28.54 s > Dependency pathway-compat-filepath: using pathway-compat-filepath-0.0.1.0
  892. 28.54 s > Source component graph:
  893. 28.54 s > component lib
  894. 28.54 s > component test:doctests dependency lib
  895. 28.54 s > Configured component graph:
  896. 28.54 s > component pathway-compat-filepath-0.0.1.0-6KN1Vlb8yPeBopmlZtXyrR
  897. 28.54 s > include base-4.19.2.0-934f
  898. 28.54 s > include extra-1.8.1-F4oHgTKCper3ZiIUPZjGPK
  899. 28.54 s > include filepath-1.4.301.0-6e15
  900. 28.54 s > include megaparsec-9.7.0-10vHZAF1maw9O8p2gXs66N
  901. 28.54 s > include os-string-2.0.10-HbyG8qgShpTHKXL8bZ3UK8
  902. 28.54 s > include pathway-0.0.1.0-H5uD0SRA9755UrSqFBaCYE
  903. 28.54 s > include pathway-compat-base-0.0.1.0-8ldj6SPXbxq2Shd8yFeOpr
  904. 28.54 s > include pathway-internal-0.0.1.0-Lnjdb2M8cxN196wSdsfQUK
  905. 28.54 s > component pathway-compat-filepath-0.0.1.0-LoaDJ8tbb2m5kfHmaP2B9c-doctests
  906. 28.54 s > include base-4.19.2.0-934f
  907. 28.54 s > include doctest-0.24.3-1aDs7zEYV5r7raSsXr9TQC
  908. 28.54 s > include pathway-compat-filepath-0.0.1.0-6KN1Vlb8yPeBopmlZtXyrR
  909. 28.54 s > Linked component graph:
  910. 28.54 s > unit pathway-compat-filepath-0.0.1.0-6KN1Vlb8yPeBopmlZtXyrR
  911. 28.54 s > include base-4.19.2.0-934f
  912. 28.54 s > include extra-1.8.1-F4oHgTKCper3ZiIUPZjGPK
  913. 28.54 s > include filepath-1.4.301.0-6e15
  914. 28.54 s > include megaparsec-9.7.0-10vHZAF1maw9O8p2gXs66N
  915. 28.54 s > include os-string-2.0.10-HbyG8qgShpTHKXL8bZ3UK8
  916. 28.54 s > include pathway-0.0.1.0-H5uD0SRA9755UrSqFBaCYE
  917. 28.54 s > include pathway-compat-base-0.0.1.0-8ldj6SPXbxq2Shd8yFeOpr
  918. 28.54 s > include pathway-internal-0.0.1.0-Lnjdb2M8cxN196wSdsfQUK
  919. 28.54 s > Common.FilePath=pathway-compat-filepath-0.0.1.0-6KN1Vlb8yPeBopmlZtXyrR:Common.FilePath,Common.OsPath=pathway-compat-filepath-0.0.1.0-6KN1Vlb8yPeBopmlZtXyrR:Common.OsPath,System.FilePath=pathway-compat-filepath-0.0.1.0-6KN1Vlb8yPeBopmlZtXyrR:System.FilePath,System.FilePath.Overlay=pathway-compat-filepath-0.0.1.0-6KN1Vlb8yPeBopmlZtXyrR:System.FilePath.Overlay,System.FilePath.Pathway=pathway-compat-filepath-0.0.1.0-6KN1Vlb8yPeBopmlZtXyrR:System.FilePath.Pathway,System.FilePath.Thin=pathway-compat-filepath-0.0.1.0-6KN1Vlb8yPeBopmlZtXyrR:System.FilePath.Thin,System.OsPath=pathway-compat-filepath-0.0.1.0-6KN1Vlb8yPeBopmlZtXyrR:System.OsPath,System.OsPath.Overlay=pathway-compat-filepath-0.0.1.0-6KN1Vlb8yPeBopmlZtXyrR:System.OsPath.Overlay,System.OsPath.Pathway=pathway-compat-filepath-0.0.1.0-6KN1Vlb8yPeBopmlZtXyrR:System.OsPath.Pathway,System.OsPath.Thin=pathway-compat-filepath-0.0.1.0-6KN1Vlb8yPeBopmlZtXyrR:System.OsPath.Thin
  920. 28.54 s > unit pathway-compat-filepath-0.0.1.0-LoaDJ8tbb2m5kfHmaP2B9c-doctests
  921. 28.54 s > include base-4.19.2.0-934f
  922. 28.54 s > include doctest-0.24.3-1aDs7zEYV5r7raSsXr9TQC
  923. 28.54 s > include pathway-compat-filepath-0.0.1.0-6KN1Vlb8yPeBopmlZtXyrR
  924. 28.54 s > Ready component graph:
  925. 28.54 s > definite pathway-compat-filepath-0.0.1.0-6KN1Vlb8yPeBopmlZtXyrR
  926. 28.54 s > depends base-4.19.2.0-934f
  927. 28.54 s > depends extra-1.8.1-F4oHgTKCper3ZiIUPZjGPK
  928. 28.54 s > depends filepath-1.4.301.0-6e15
  929. 28.54 s > depends megaparsec-9.7.0-10vHZAF1maw9O8p2gXs66N
  930. 28.54 s > depends os-string-2.0.10-HbyG8qgShpTHKXL8bZ3UK8
  931. 28.54 s > depends pathway-0.0.1.0-H5uD0SRA9755UrSqFBaCYE
  932. 28.54 s > depends pathway-compat-base-0.0.1.0-8ldj6SPXbxq2Shd8yFeOpr
  933. 28.54 s > depends pathway-internal-0.0.1.0-Lnjdb2M8cxN196wSdsfQUK
  934. 28.54 s > definite pathway-compat-filepath-0.0.1.0-LoaDJ8tbb2m5kfHmaP2B9c-doctests
  935. 28.54 s > depends base-4.19.2.0-934f
  936. 28.54 s > depends doctest-0.24.3-1aDs7zEYV5r7raSsXr9TQC
  937. 28.54 s > depends pathway-compat-filepath-0.0.1.0-6KN1Vlb8yPeBopmlZtXyrR
  938. 28.54 s > Using Cabal-3.10.3.0 compiled by ghc-9.8
  939. 28.54 s > Using compiler: ghc-9.8.4
  940. 28.54 s > Using install prefix:
  941. 28.54 s > /nix/store/xghx2j0inbha0jqrcxmvc3ljvvx1i77g-pathway-compat-filepath-0.0.1.0
  942. 28.54 s > Executables installed in:
  943. 28.54 s > /nix/store/xghx2j0inbha0jqrcxmvc3ljvvx1i77g-pathway-compat-filepath-0.0.1.0/bin
  944. 28.54 s > Libraries installed in:
  945. 28.54 s > /nix/store/xghx2j0inbha0jqrcxmvc3ljvvx1i77g-pathway-compat-filepath-0.0.1.0/lib/ghc-9.8.4/lib/x86_64-linux-ghc-9.8.4/pathway-compat-filepath-0.0.1.0-6KN1Vlb8yPeBopmlZtXyrR
  946. 28.54 s > Dynamic Libraries installed in:
  947. 28.54 s > /nix/store/xghx2j0inbha0jqrcxmvc3ljvvx1i77g-pathway-compat-filepath-0.0.1.0/lib/ghc-9.8.4/lib/x86_64-linux-ghc-9.8.4
  948. 28.54 s > Private executables installed in:
  949. 28.54 s > /nix/store/xghx2j0inbha0jqrcxmvc3ljvvx1i77g-pathway-compat-filepath-0.0.1.0/libexec/x86_64-linux-ghc-9.8.4/pathway-compat-filepath-0.0.1.0
  950. 28.54 s > Data files installed in:
  951. 28.54 s > /nix/store/xghx2j0inbha0jqrcxmvc3ljvvx1i77g-pathway-compat-filepath-0.0.1.0/share/x86_64-linux-ghc-9.8.4/pathway-compat-filepath-0.0.1.0
  952. 28.54 s > Documentation installed in:
  953. 28.54 s > /nix/store/c3wlvp65ypvkb08q9pcr7hq7wygmm4g4-pathway-compat-filepath-0.0.1.0-doc/share/doc/pathway-compat-filepath-0.0.1.0
  954. 28.54 s > Configuration files installed in:
  955. 28.54 s > /nix/store/xghx2j0inbha0jqrcxmvc3ljvvx1i77g-pathway-compat-filepath-0.0.1.0/etc
  956. 28.54 s > No alex found
  957. 28.54 s > Using ar found on system at:
  958. 28.54 s > /nix/store/zjraf40s86y3iwhp626b934r5y6ldkbb-binutils-wrapper-2.46/bin/ar
  959. 28.54 s > No c2hs found
  960. 28.54 s > No cpphs found
  961. 28.54 s > Using doctest version 0.24.3 found on system at:
  962. 28.54 s > /nix/store/2y183b1vsybv0157vfr59yhdwjkpqfkn-doctest-0.24.3/bin/doctest
  963. 28.54 s > Using gcc version 15.2.0 given by user at:
  964. 28.54 s > /nix/store/29qjlshvklnyr67nhpprzgb9igmsfsjj-gcc-wrapper-15.2.0/bin/gcc
  965. 28.54 s > Using ghc version 9.8.4 found on system at:
  966. 28.54 s > /nix/store/7r9b0bl984hdgd70nf5p8raa55kml491-ghc-9.8.4/bin/ghc
  967. 28.54 s > Using ghc-pkg version 9.8.4 found on system at:
  968. 28.54 s > /nix/store/7r9b0bl984hdgd70nf5p8raa55kml491-ghc-9.8.4/bin/ghc-pkg-9.8.4
  969. 28.54 s > No ghcjs found
  970. 28.54 s > No ghcjs-pkg found
  971. 28.54 s > No greencard found
  972. 28.54 s > Using haddock version 2.30.0 found on system at:
  973. 28.54 s > /nix/store/7r9b0bl984hdgd70nf5p8raa55kml491-ghc-9.8.4/bin/haddock-ghc-9.8.4
  974. 28.54 s > No happy found
  975. 28.54 s > Using haskell-suite found on system at: haskell-suite-dummy-location
  976. 28.54 s > Using haskell-suite-pkg found on system at: haskell-suite-pkg-dummy-location
  977. 28.54 s > No hmake found
  978. 28.54 s > Using hpc version 0.69 found on system at:
  979. 28.54 s > /nix/store/7r9b0bl984hdgd70nf5p8raa55kml491-ghc-9.8.4/bin/hpc-ghc-9.8.4
  980. 28.54 s > Using hsc2hs version 0.68.10 found on system at:
  981. 28.54 s > /nix/store/7r9b0bl984hdgd70nf5p8raa55kml491-ghc-9.8.4/bin/hsc2hs-ghc-9.8.4
  982. 28.54 s > Using hscolour version 1.25 found on system at:
  983. 28.54 s > /nix/store/awnxn98rlw62rrjwli6d2lb4d27mrzzw-hscolour-1.25/bin/HsColour
  984. 28.54 s > No jhc found
  985. 28.54 s > Using ld found on system at:
  986. 28.54 s > /nix/store/zjraf40s86y3iwhp626b934r5y6ldkbb-binutils-wrapper-2.46/bin/ld.gold
  987. 28.54 s > No pkg-config found
  988. 28.54 s > Using runghc version 9.8.4 found on system at:
  989. 28.54 s > /nix/store/7r9b0bl984hdgd70nf5p8raa55kml491-ghc-9.8.4/bin/runghc-9.8.4
  990. 28.54 s > Using strip version 2.46 found on system at:
  991. 28.54 s > /nix/store/29qjlshvklnyr67nhpprzgb9igmsfsjj-gcc-wrapper-15.2.0/bin/strip
  992. 28.54 s > Using tar found on system at:
  993. 28.54 s > /nix/store/z5mq2sam4484prf3kv6v6vjw1m0i7j24-gnutar-1.35/bin/tar
  994. 28.54 s > No uhc found
  995. 28.54 s > Running phase: buildPhase
  996. 28.54 s > Preprocessing library for pathway-compat-filepath-0.0.1.0..
  997. 28.54 s > Building library for pathway-compat-filepath-0.0.1.0..
  998. 28.54 s > [ 1 of 10] Compiling Common.FilePath ( src/Common/FilePath.hs, dist/build/Common/FilePath.o, dist/build/Common/FilePath.dyn_o )
  999. 28.54 s > [ 2 of 10] Compiling Common.OsPath ( src/Common/OsPath.hs, dist/build/Common/OsPath.o, dist/build/Common/OsPath.dyn_o )
  1000. 28.54 s >
  1001. 28.54 s > src/Common/OsPath.hs:90:23: error: [GHC-83865]
  1002. 28.54 s > • Couldn't match type ‘OSS.OsString’ with ‘OsString’
  1003. 28.54 s > Expected: OsPath
  1004. 28.54 s > Actual: OSS.OsString
  1005. 28.54 s > NB: ‘OsString’
  1006. 28.54 s > is defined in ‘System.OsString.Internal.Types.Hidden’
  1007. 28.54 s > in package ‘filepath-1.4.301.0’
  1008. 28.54 s > ‘OSS.OsString’
  1009. 28.54 s > is defined in ‘System.OsString.Internal.Types’
  1010. 28.54 s > in package ‘os-string-2.0.10’
  1011. 28.54 s > • In the ‘parent’ field of a record
  1012. 28.54 s > In the expression:
  1013. 28.54 s > Format
  1014. 28.54 s > {root = O.pack . pure $ O.pathSeparator, current = mempty,
  1015. 28.54 s > parent = OSS.unsafeEncodeUtf "..",
  1016. 28.54 s > separator = O.pack . pure $ O.pathSeparator,
  1017. 28.54 s > substitutions = mempty}
  1018. 28.54 s > In an equation for ‘localFormat’:
  1019. 28.54 s > localFormat
  1020. 28.54 s > = Format
  1021. 28.54 s > {root = O.pack . pure $ O.pathSeparator, current = mempty,
  1022. 28.54 s > parent = OSS.unsafeEncodeUtf "..",
  1023. 28.54 s > separator = O.pack . pure $ O.pathSeparator,
  1024. 28.54 s > substitutions = mempty}
  1025. 28.54 s > |
  1026. 28.54 s > 90 | Format.parent = OSS.unsafeEncodeUtf "..",
  1027. 28.54 s > | ^^^^^^^^^^^^^^^^^^^^^^^^
  1028. 28.54 s > [ 3 of 10] Compiling System.FilePath.Thin ( src/System/FilePath/Thin.hs, dist/build/System/FilePath/Thin.o, dist/build/System/FilePath/Thin.dyn_o )
  1029. 28.54 s > [ 4 of 10] Compiling System.FilePath.Pathway ( src/System/FilePath/Pathway.hs, dist/build/System/FilePath/Pathway.o, dist/build/System/FilePath/Pathway.dyn_o )
  1030. 28.54 s > [ 5 of 10] Compiling System.FilePath.Overlay ( src/System/FilePath/Overlay.hs, dist/build/System/FilePath/Overlay.o, dist/build/System/FilePath/Overlay.dyn_o )
  1031. 28.54 s > [ 6 of 10] Compiling System.FilePath ( src/System/FilePath.hs, dist/build/System/FilePath.o, dist/build/System/FilePath.dyn_o )
  1032. 28.54 s For full logs, run:
  1033. 28.54 s nix log /nix/store/psj7qq98d0nc1x3mcxvgminpvlszfrfm-pathway-compat-filepath-0.0.1.0.drv
  1034. 28.54 s error: Cannot build '/nix/store/mdvhamhmncfil55by5mc62fj69n99c1w-ghc-9.8.4-with-packages.drv'.
  1035. 28.54 s Reason: 1 dependency failed.
  1036. 28.54 s Output paths:
  1037. 28.54 s /nix/store/1vvvayslravlsnbd962y9bsp4c7jiah4-ghc-9.8.4-with-packages
  1038. 28.54 s error: Cannot build '/nix/store/gcbdv7d9xmvf3jabhv7lbf50a4k5v0fr-pathway-compat-directory-0.0.1.0.drv'.
  1039. 28.54 s Reason: 1 dependency failed.
  1040. 28.54 s Output paths:
  1041. 28.54 s /nix/store/lvz4jclqs4hqq1k7fi74rl20419aaqmb-pathway-compat-directory-0.0.1.0-doc
  1042. 28.54 s /nix/store/prcri98x3bq55i3pffsm2c0z5bzjivpn-pathway-compat-directory-0.0.1.0
  1043. 28.54 s error: Cannot build '/nix/store/9a7ba0q649sjp2fjr2p7yi6l6nv7byak-pathway-compat-file-io-0.0.1.0.drv'.
  1044. 28.54 s Reason: 1 dependency failed.
  1045. 28.54 s Output paths:
  1046. 28.54 s /nix/store/hdd4f2is9svyj3zx5czk0mblia6i8w1a-pathway-compat-file-io-0.0.1.0
  1047. 28.54 s /nix/store/j2d5178hlcgldkj6jcq2cv6q83ny0rrf-pathway-compat-file-io-0.0.1.0-doc
  1048. 28.54 s error: Cannot build '/nix/store/q4yq83in56ixb5fi8pprb2xbkwr7kr8k-pathway-compat-temporary-0.0.1.0.drv'.
  1049. 28.54 s Reason: 1 dependency failed.
  1050. 28.54 s Output paths:
  1051. 28.54 s /nix/store/lklwgvwpcq480fqmdc66fzc45nj1iphl-pathway-compat-temporary-0.0.1.0-doc
  1052. 28.54 s /nix/store/zvmf2y70q878a2fgdpk9mqznfca8j5nl-pathway-compat-temporary-0.0.1.0
  1053. 28.54 s error: Cannot build '/nix/store/b8ay2gw1cg8jpdkd4j5nnn95zrmnypv8-pathway-system-0.0.1.0.drv'.
  1054. 28.54 s Reason: 1 dependency failed.
  1055. 28.54 s Output paths:
  1056. 28.54 s /nix/store/chy1q398chqybipav6k9l04drrrmg2ks-pathway-system-0.0.1.0
  1057. 28.54 s /nix/store/k1vv04ssh3mky3f4y6s9m92vh0ia5sxq-pathway-system-0.0.1.0-doc
  1058. 28.54 s error: Build failed due to failed dependency
  1059. 28.54 s error: Cannot build '/nix/store/45nwy0mckisgy5fbckfqw9v5qjaqj1pk-all-packages.drv'.
  1060. 28.54 s Reason: 1 dependency failed.
  1061. 28.54 s Output paths:
  1062. 28.54 s /nix/store/j5jvn7qhq6j0j8hjffc4b4zlrk8kz60j-all-packages
  1063. 28.54 s Build failed due to failed dependency
  1064. 28.57 s Build failed.