0.19 s
$ /nix/store/9ypz3flqsrl5xl495mm8h645gadjsxi1-coreutils-9.11/bin/timeout --kill-after=15s 7200s /nix/store/23zk8sgzamrbmj1fday15szf7f2279s8-nix-2.34.7/bin/nix --extra-experimental-features nix-command --extra-experimental-features flakes --log-format internal-json build --no-link --print-out-paths git+https://github.com/sellout/pathway?ref=more-system&rev=1ea193cbc6593071794981ca0dcd055e8eb42609&shallow=1#packages.x86_64-linux.ghc984_all --print-build-logs
0.77 s
warning: ignoring untrusted flake configuration setting 'allow-import-from-derivation'.
0.77 s
Pass '--accept-flake-config' to trust it
0.77 s
warning: ignoring untrusted flake configuration setting 'extra-experimental-features'.
0.77 s
Pass '--accept-flake-config' to trust it
0.77 s
warning: ignoring untrusted flake configuration setting 'extra-substituters'.
0.77 s
Pass '--accept-flake-config' to trust it
0.77 s
warning: ignoring untrusted flake configuration setting 'extra-trusted-public-keys'.
0.77 s
Pass '--accept-flake-config' to trust it
0.77 s
warning: ignoring untrusted flake configuration setting 'sandbox'.
0.77 s
Pass '--accept-flake-config' to trust it
0.77 s
warning: ignoring untrusted flake configuration setting 'use-registries'.
0.77 s
Pass '--accept-flake-config' to trust it
0.77 s
error (ignored): SQLite database '/var/cache/nix-ci-worker/eval-cache-v6/7e8cef9f9a584f12750e4112f9919eb203f4dd515b08e08f130fffcf31865d0a.sqlite ' is busy
1.53 s
2.41 s
Downloading cached pathway-compat-base-0.0.1.0-doc from https://cache.nix-ci.com
2.43 s
Downloaded cached pathway-compat-base-0.0.1.0-doc (1.9 MiB) in 15ms
2.43 s
Progress: 0 of 14 built, 1 of 2 downloaded from cache
2.43 s
Downloading cached pathway-compat-base from https://cache.nix-ci.com
2.45 s
Downloaded cached pathway-compat-base (2 MiB) in 18ms
2.45 s
Progress: 0 of 13 built, 2 of 2 downloaded from cache
2.55 s
Building /nix/store/psj7qq98d0nc1x3mcxvgminpvlszfrfm-pathway-compat-filepath-0.0.1.0.drv
2.75 s
[pathway-compat-filepath] Phase: setupCompilerEnvironmentPhase
2.76 s
[pathway-compat-filepath] Build with /nix/store/7r9b0bl984hdgd70nf5p8raa55kml491-ghc-9.8.4.
3.09 s
[pathway-compat-filepath] Phase: unpackPhase
3.09 s
[pathway-compat-filepath] unpacking source archive /nix/store/5z4x7vzkb1m65ccyx19wn7vcxdl9gmbf-filepath
3.10 s
[pathway-compat-filepath] source root is filepath
3.12 s
[pathway-compat-filepath] Phase: patchPhase
3.13 s
[pathway-compat-filepath] Phase: compileBuildDriverPhase
3.13 s
[pathway-compat-filepath] setupCompileFlags: -package-db=/build/tmp.afIePam3tQ/setup-package.conf.d -threaded
3.18 s
[pathway-compat-filepath] [1 of 2] Compiling Main ( Setup.hs, /build/tmp.afIePam3tQ/Main.o )
3.23 s
[pathway-compat-filepath] [2 of 2] Linking Setup
4.48 s
[pathway-compat-filepath] Phase: updateAutotoolsGnuConfigScriptsPhase
4.49 s
[pathway-compat-filepath] Phase: configurePhase
4.50 s
[pathway-compat-filepath] configureFlags: --verbose --prefix=/nix/store/xghx2j0inbha0jqrcxmvc3ljvvx1i77g-pathway-compat-filepath-0.0.1.0 --libdir=$prefix/lib/$compiler/lib --libsubdir=$abi/$libname --docdir=/nix/store/c3wlvp65ypvkb08q9pcr7hq7wygmm4g4-pathway-compat-filepath-0.0.1.0-doc/share/doc/pathway-compat-filepath-0.0.1.0 --with-gcc=gcc --package-db=/build/tmp.afIePam3tQ/package.conf.d --ghc-option=-j16 --ghc-option=+RTS --ghc-option=-A64M --ghc-option=-RTS --enable-library-profiling --profiling-detail=exported-functions --disable-profiling --enable-shared --disable-coverage --enable-static --disable-executable-dynamic --enable-tests --disable-benchmarks --enable-library-vanilla --disable-library-for-ghci --enable-split-sections --enable-library-stripping --enable-executable-stripping --ghc-option=-haddock --ghc-options=-Werror --extra-lib-dirs=/nix/store/pndhkk0l649lm1sj0mxk7cbwq26qd1ra-ncurses-6.6/lib --extra-lib-dirs=/nix/store/0djlg4g0b81w94k3vcaqsxsc2hh4kism-libffi-3.5.2/lib --extra-lib-dirs=/nix/store/md4paia7riiggyrj8p24c7a6vf8w7jz8-elfutils-0.194/lib --extra-lib-dirs=/nix/store/39vv2pf64gd8li48a4hpbhw2crzd8z5p-gmp-with-cxx-6.3.0/lib --extra-lib-dirs=/nix/store/7wwvald8lapkrsr72qanlw8blyn55ifx-numactl-2.0.18/lib --extra-lib-dirs=/nix/store/7r9b0bl984hdgd70nf5p8raa55kml491-ghc-9.8.4/lib
4.51 s
[pathway-compat-filepath] Using Parsec parser
4.51 s
[pathway-compat-filepath] Configuring pathway-compat-filepath-0.0.1.0...
4.84 s
[pathway-compat-filepath] Flags chosen: noisy-deprecations=True, verify-no-recursion=False
4.84 s
[pathway-compat-filepath] Dependency base >=4.14.0 && <4.15 || >=4.15.0 && <4.16 || >=4.16.0 && <4.17 ||
4.84 s
[pathway-compat-filepath] >=4.17.0 && <4.18 || >=4.18.0 && <4.19 || >=4.19.0 && <4.20 || >=4.20.0 &&
4.84 s
[pathway-compat-filepath] <4.21 || >=4.21.0 && <4.22 || >=4.22.0 && <4.23: using base-4.19.2.0
4.84 s
[pathway-compat-filepath] Dependency extra: using extra-1.8.1
4.84 s
[pathway-compat-filepath] Dependency filepath >=1.4.2 && <1.5 || >=1.5.0 && <1.6: using
4.84 s
[pathway-compat-filepath] filepath-1.4.301.0
4.84 s
[pathway-compat-filepath] Dependency megaparsec >=9.0.1 && <9.1 || >=9.2.1 && <9.3 || >=9.5.0 && <9.6 ||
4.84 s
[pathway-compat-filepath] >=9.7.0 && <9.8: using megaparsec-9.7.0
4.84 s
[pathway-compat-filepath] Dependency os-string: using os-string-2.0.10
4.84 s
[pathway-compat-filepath] Dependency pathway >=0.0.1 && <0.1: using pathway-0.0.1.0
4.84 s
[pathway-compat-filepath] Dependency pathway-compat-base >=0.0.1 && <0.1: using
4.84 s
[pathway-compat-filepath] pathway-compat-base-0.0.1.0
4.84 s
[pathway-compat-filepath] Dependency pathway-internal >=0.0.1 && <0.1: using pathway-internal-0.0.1.0
4.84 s
[pathway-compat-filepath] Dependency base >=4.14.0 && <4.15 || >=4.15.0 && <4.16 || >=4.16.0 && <4.17 ||
4.84 s
[pathway-compat-filepath] >=4.17.0 && <4.18 || >=4.18.0 && <4.19 || >=4.19.0 && <4.20 || >=4.20.0 &&
4.84 s
[pathway-compat-filepath] <4.21 || >=4.21.0 && <4.22 || >=4.22.0 && <4.23: using base-4.19.2.0
4.84 s
[pathway-compat-filepath] Dependency doctest >=0.16.3 && <0.17 || >=0.18.1 && <0.19 || >=0.20.1 && <0.21
4.84 s
[pathway-compat-filepath] || >=0.21.1 && <0.22 || >=0.22.2 && <0.23 || >=0.24.2 && <0.25: using
4.84 s
[pathway-compat-filepath] doctest-0.24.3
4.84 s
[pathway-compat-filepath] Dependency pathway-compat-filepath: using pathway-compat-filepath-0.0.1.0
5.18 s
[pathway-compat-filepath] Source component graph:
5.18 s
[pathway-compat-filepath] component lib
5.18 s
[pathway-compat-filepath] component test:doctests dependency lib
5.18 s
[pathway-compat-filepath] Configured component graph:
5.18 s
[pathway-compat-filepath] component pathway-compat-filepath-0.0.1.0-6KN1Vlb8yPeBopmlZtXyrR
5.18 s
[pathway-compat-filepath] include base-4.19.2.0-934f
5.18 s
[pathway-compat-filepath] include extra-1.8.1-F4oHgTKCper3ZiIUPZjGPK
5.18 s
[pathway-compat-filepath] include filepath-1.4.301.0-6e15
5.18 s
[pathway-compat-filepath] include megaparsec-9.7.0-10vHZAF1maw9O8p2gXs66N
5.18 s
[pathway-compat-filepath] include os-string-2.0.10-HbyG8qgShpTHKXL8bZ3UK8
5.18 s
[pathway-compat-filepath] include pathway-0.0.1.0-H5uD0SRA9755UrSqFBaCYE
5.18 s
[pathway-compat-filepath] include pathway-compat-base-0.0.1.0-8ldj6SPXbxq2Shd8yFeOpr
5.18 s
[pathway-compat-filepath] include pathway-internal-0.0.1.0-Lnjdb2M8cxN196wSdsfQUK
5.18 s
[pathway-compat-filepath] component pathway-compat-filepath-0.0.1.0-LoaDJ8tbb2m5kfHmaP2B9c-doctests
5.18 s
[pathway-compat-filepath] include base-4.19.2.0-934f
5.18 s
[pathway-compat-filepath] include doctest-0.24.3-1aDs7zEYV5r7raSsXr9TQC
5.18 s
[pathway-compat-filepath] include pathway-compat-filepath-0.0.1.0-6KN1Vlb8yPeBopmlZtXyrR
5.18 s
[pathway-compat-filepath] Linked component graph:
5.18 s
[pathway-compat-filepath] unit pathway-compat-filepath-0.0.1.0-6KN1Vlb8yPeBopmlZtXyrR
5.18 s
[pathway-compat-filepath] include base-4.19.2.0-934f
5.18 s
[pathway-compat-filepath] include extra-1.8.1-F4oHgTKCper3ZiIUPZjGPK
5.18 s
[pathway-compat-filepath] include filepath-1.4.301.0-6e15
5.18 s
[pathway-compat-filepath] include megaparsec-9.7.0-10vHZAF1maw9O8p2gXs66N
5.18 s
[pathway-compat-filepath] include os-string-2.0.10-HbyG8qgShpTHKXL8bZ3UK8
5.18 s
[pathway-compat-filepath] include pathway-0.0.1.0-H5uD0SRA9755UrSqFBaCYE
5.18 s
[pathway-compat-filepath] include pathway-compat-base-0.0.1.0-8ldj6SPXbxq2Shd8yFeOpr
5.18 s
[pathway-compat-filepath] include pathway-internal-0.0.1.0-Lnjdb2M8cxN196wSdsfQUK
5.18 s
[pathway-compat-filepath] Common.FilePath=pathway-compat-filepath-0.0.1.0-6KN1Vlb8yPeBopmlZtXyrR:Common.FilePath,Common.OsPath=pathway-compat-filepath-0.0.1.0-6KN1Vlb8yPeBopmlZtXyrR:Common.OsPath,System.FilePath=pathway-compat-filepath-0.0.1.0-6KN1Vlb8yPeBopmlZtXyrR:System.FilePath,System.FilePath.Overlay=pathway-compat-filepath-0.0.1.0-6KN1Vlb8yPeBopmlZtXyrR:System.FilePath.Overlay,System.FilePath.Pathway=pathway-compat-filepath-0.0.1.0-6KN1Vlb8yPeBopmlZtXyrR:System.FilePath.Pathway,System.FilePath.Thin=pathway-compat-filepath-0.0.1.0-6KN1Vlb8yPeBopmlZtXyrR:System.FilePath.Thin,System.OsPath=pathway-compat-filepath-0.0.1.0-6KN1Vlb8yPeBopmlZtXyrR:System.OsPath,System.OsPath.Overlay=pathway-compat-filepath-0.0.1.0-6KN1Vlb8yPeBopmlZtXyrR:System.OsPath.Overlay,System.OsPath.Pathway=pathway-compat-filepath-0.0.1.0-6KN1Vlb8yPeBopmlZtXyrR:System.OsPath.Pathway,System.OsPath.Thin=pathway-compat-filepath-0.0.1.0-6KN1Vlb8yPeBopmlZtXyrR:System.OsPath.Thin
5.18 s
[pathway-compat-filepath] unit pathway-compat-filepath-0.0.1.0-LoaDJ8tbb2m5kfHmaP2B9c-doctests
5.18 s
[pathway-compat-filepath] include base-4.19.2.0-934f
5.18 s
[pathway-compat-filepath] include doctest-0.24.3-1aDs7zEYV5r7raSsXr9TQC
5.18 s
[pathway-compat-filepath] include pathway-compat-filepath-0.0.1.0-6KN1Vlb8yPeBopmlZtXyrR
5.18 s
[pathway-compat-filepath] Ready component graph:
5.18 s
[pathway-compat-filepath] definite pathway-compat-filepath-0.0.1.0-6KN1Vlb8yPeBopmlZtXyrR
5.18 s
[pathway-compat-filepath] depends base-4.19.2.0-934f
5.18 s
[pathway-compat-filepath] depends extra-1.8.1-F4oHgTKCper3ZiIUPZjGPK
5.18 s
[pathway-compat-filepath] depends filepath-1.4.301.0-6e15
5.18 s
[pathway-compat-filepath] depends megaparsec-9.7.0-10vHZAF1maw9O8p2gXs66N
5.18 s
[pathway-compat-filepath] depends os-string-2.0.10-HbyG8qgShpTHKXL8bZ3UK8
5.18 s
[pathway-compat-filepath] depends pathway-0.0.1.0-H5uD0SRA9755UrSqFBaCYE
5.18 s
[pathway-compat-filepath] depends pathway-compat-base-0.0.1.0-8ldj6SPXbxq2Shd8yFeOpr
5.18 s
[pathway-compat-filepath] depends pathway-internal-0.0.1.0-Lnjdb2M8cxN196wSdsfQUK
5.18 s
[pathway-compat-filepath] definite pathway-compat-filepath-0.0.1.0-LoaDJ8tbb2m5kfHmaP2B9c-doctests
5.18 s
[pathway-compat-filepath] depends base-4.19.2.0-934f
5.18 s
[pathway-compat-filepath] depends doctest-0.24.3-1aDs7zEYV5r7raSsXr9TQC
5.18 s
[pathway-compat-filepath] depends pathway-compat-filepath-0.0.1.0-6KN1Vlb8yPeBopmlZtXyrR
5.18 s
[pathway-compat-filepath] Using Cabal-3.10.3.0 compiled by ghc-9.8
5.18 s
[pathway-compat-filepath] Using compiler: ghc-9.8.4
5.18 s
[pathway-compat-filepath] Using install prefix:
5.18 s
[pathway-compat-filepath] /nix/store/xghx2j0inbha0jqrcxmvc3ljvvx1i77g-pathway-compat-filepath-0.0.1.0
5.18 s
[pathway-compat-filepath] Executables installed in:
5.18 s
[pathway-compat-filepath] /nix/store/xghx2j0inbha0jqrcxmvc3ljvvx1i77g-pathway-compat-filepath-0.0.1.0/bin
5.18 s
[pathway-compat-filepath] Libraries installed in:
5.18 s
[pathway-compat-filepath] /nix/store/xghx2j0inbha0jqrcxmvc3ljvvx1i77g-pathway-compat-filepath-0.0.1.0/lib/ghc-9.8.4/lib/x86_64-linux-ghc-9.8.4/pathway-compat-filepath-0.0.1.0-6KN1Vlb8yPeBopmlZtXyrR
5.18 s
[pathway-compat-filepath] Dynamic Libraries installed in:
5.18 s
[pathway-compat-filepath] /nix/store/xghx2j0inbha0jqrcxmvc3ljvvx1i77g-pathway-compat-filepath-0.0.1.0/lib/ghc-9.8.4/lib/x86_64-linux-ghc-9.8.4
5.18 s
[pathway-compat-filepath] Private executables installed in:
5.18 s
[pathway-compat-filepath] /nix/store/xghx2j0inbha0jqrcxmvc3ljvvx1i77g-pathway-compat-filepath-0.0.1.0/libexec/x86_64-linux-ghc-9.8.4/pathway-compat-filepath-0.0.1.0
5.18 s
[pathway-compat-filepath] Data files installed in:
5.18 s
[pathway-compat-filepath] /nix/store/xghx2j0inbha0jqrcxmvc3ljvvx1i77g-pathway-compat-filepath-0.0.1.0/share/x86_64-linux-ghc-9.8.4/pathway-compat-filepath-0.0.1.0
5.18 s
[pathway-compat-filepath] Documentation installed in:
5.18 s
[pathway-compat-filepath] /nix/store/c3wlvp65ypvkb08q9pcr7hq7wygmm4g4-pathway-compat-filepath-0.0.1.0-doc/share/doc/pathway-compat-filepath-0.0.1.0
5.18 s
[pathway-compat-filepath] Configuration files installed in:
5.18 s
[pathway-compat-filepath] /nix/store/xghx2j0inbha0jqrcxmvc3ljvvx1i77g-pathway-compat-filepath-0.0.1.0/etc
5.18 s
[pathway-compat-filepath] No alex found
5.18 s
[pathway-compat-filepath] Using ar found on system at:
5.18 s
[pathway-compat-filepath] /nix/store/zjraf40s86y3iwhp626b934r5y6ldkbb-binutils-wrapper-2.46/bin/ar
5.18 s
[pathway-compat-filepath] No c2hs found
5.18 s
[pathway-compat-filepath] No cpphs found
5.18 s
[pathway-compat-filepath] Using doctest version 0.24.3 found on system at:
5.18 s
[pathway-compat-filepath] /nix/store/2y183b1vsybv0157vfr59yhdwjkpqfkn-doctest-0.24.3/bin/doctest
5.18 s
[pathway-compat-filepath] Using gcc version 15.2.0 given by user at:
5.18 s
[pathway-compat-filepath] /nix/store/29qjlshvklnyr67nhpprzgb9igmsfsjj-gcc-wrapper-15.2.0/bin/gcc
5.18 s
[pathway-compat-filepath] Using ghc version 9.8.4 found on system at:
5.18 s
[pathway-compat-filepath] /nix/store/7r9b0bl984hdgd70nf5p8raa55kml491-ghc-9.8.4/bin/ghc
5.18 s
[pathway-compat-filepath] Using ghc-pkg version 9.8.4 found on system at:
5.18 s
[pathway-compat-filepath] /nix/store/7r9b0bl984hdgd70nf5p8raa55kml491-ghc-9.8.4/bin/ghc-pkg-9.8.4
5.18 s
[pathway-compat-filepath] No ghcjs found
5.18 s
[pathway-compat-filepath] No ghcjs-pkg found
5.18 s
[pathway-compat-filepath] No greencard found
5.18 s
[pathway-compat-filepath] Using haddock version 2.30.0 found on system at:
5.18 s
[pathway-compat-filepath] /nix/store/7r9b0bl984hdgd70nf5p8raa55kml491-ghc-9.8.4/bin/haddock-ghc-9.8.4
5.18 s
[pathway-compat-filepath] No happy found
5.18 s
[pathway-compat-filepath] Using haskell-suite found on system at: haskell-suite-dummy-location
5.18 s
[pathway-compat-filepath] Using haskell-suite-pkg found on system at: haskell-suite-pkg-dummy-location
5.18 s
[pathway-compat-filepath] No hmake found
5.18 s
[pathway-compat-filepath] Using hpc version 0.69 found on system at:
5.18 s
[pathway-compat-filepath] /nix/store/7r9b0bl984hdgd70nf5p8raa55kml491-ghc-9.8.4/bin/hpc-ghc-9.8.4
5.18 s
[pathway-compat-filepath] Using hsc2hs version 0.68.10 found on system at:
5.18 s
[pathway-compat-filepath] /nix/store/7r9b0bl984hdgd70nf5p8raa55kml491-ghc-9.8.4/bin/hsc2hs-ghc-9.8.4
5.18 s
[pathway-compat-filepath] Using hscolour version 1.25 found on system at:
5.18 s
[pathway-compat-filepath] /nix/store/awnxn98rlw62rrjwli6d2lb4d27mrzzw-hscolour-1.25/bin/HsColour
5.18 s
[pathway-compat-filepath] No jhc found
5.18 s
[pathway-compat-filepath] Using ld found on system at:
5.18 s
[pathway-compat-filepath] /nix/store/zjraf40s86y3iwhp626b934r5y6ldkbb-binutils-wrapper-2.46/bin/ld.gold
5.18 s
[pathway-compat-filepath] No pkg-config found
5.18 s
[pathway-compat-filepath] Using runghc version 9.8.4 found on system at:
5.18 s
[pathway-compat-filepath] /nix/store/7r9b0bl984hdgd70nf5p8raa55kml491-ghc-9.8.4/bin/runghc-9.8.4
5.18 s
[pathway-compat-filepath] Using strip version 2.46 found on system at:
5.18 s
[pathway-compat-filepath] /nix/store/29qjlshvklnyr67nhpprzgb9igmsfsjj-gcc-wrapper-15.2.0/bin/strip
5.18 s
[pathway-compat-filepath] Using tar found on system at:
5.18 s
[pathway-compat-filepath] /nix/store/z5mq2sam4484prf3kv6v6vjw1m0i7j24-gnutar-1.35/bin/tar
5.18 s
[pathway-compat-filepath] No uhc found
5.61 s
[pathway-compat-filepath] Phase: buildPhase
5.67 s
[pathway-compat-filepath] Preprocessing library for pathway-compat-filepath-0.0.1.0..
5.70 s
[pathway-compat-filepath] Building library for pathway-compat-filepath-0.0.1.0..
5.76 s
[pathway-compat-filepath] [ 1 of 10] Compiling Common.FilePath ( src/Common/FilePath.hs, dist/build/Common/FilePath.o, dist/build/Common/FilePath.dyn_o )
6.07 s
[pathway-compat-filepath] [ 2 of 10] Compiling Common.OsPath ( src/Common/OsPath.hs, dist/build/Common/OsPath.o, dist/build/Common/OsPath.dyn_o )
6.07 s
[pathway-compat-filepath]
6.07 s
[pathway-compat-filepath] src/Common/OsPath.hs:90:23: error : [ GHC-83865 ]
6.07 s
[pathway-compat-filepath] • Couldn't match type ‘OSS.OsString’ with ‘OsString’
6.07 s
[pathway-compat-filepath] Expected: OsPath
6.07 s
[pathway-compat-filepath] Actual: OSS.OsString
6.07 s
[pathway-compat-filepath] NB: ‘OsString’
6.07 s
[pathway-compat-filepath] is defined in ‘System.OsString.Internal.Types.Hidden’
6.07 s
[pathway-compat-filepath] in package ‘filepath-1.4.301.0’
6.07 s
[pathway-compat-filepath] ‘OSS.OsString’
6.07 s
[pathway-compat-filepath] is defined in ‘System.OsString.Internal.Types’
6.07 s
[pathway-compat-filepath] in package ‘os-string-2.0.10’
6.07 s
[pathway-compat-filepath] • In the ‘parent’ field of a record
6.07 s
[pathway-compat-filepath] In the expression:
6.07 s
[pathway-compat-filepath] Format
6.07 s
[pathway-compat-filepath] {root = O.pack . pure $ O.pathSeparator, current = mempty,
6.07 s
[pathway-compat-filepath] parent = OSS.unsafeEncodeUtf "..",
6.07 s
[pathway-compat-filepath] separator = O.pack . pure $ O.pathSeparator,
6.07 s
[pathway-compat-filepath] substitutions = mempty}
6.07 s
[pathway-compat-filepath] In an equation for ‘localFormat’:
6.07 s
[pathway-compat-filepath] localFormat
6.07 s
[pathway-compat-filepath] = Format
6.07 s
[pathway-compat-filepath] {root = O.pack . pure $ O.pathSeparator, current = mempty,
6.07 s
[pathway-compat-filepath] parent = OSS.unsafeEncodeUtf "..",
6.07 s
[pathway-compat-filepath] separator = O.pack . pure $ O.pathSeparator,
6.07 s
[pathway-compat-filepath] substitutions = mempty}
6.07 s
[pathway-compat-filepath] |
6.07 s
[pathway-compat-filepath] 90 | Format.parent = OSS.unsafeEncodeUtf ".." ,
6.07 s
[pathway-compat-filepath] | ^^^^^^^^^^^^^^^^^^^^^^^^
6.07 s
[pathway-compat-filepath] [ 3 of 10] Compiling System.FilePath.Thin ( src/System/FilePath/Thin.hs, dist/build/System/FilePath/Thin.o, dist/build/System/FilePath/Thin.dyn_o )
6.17 s
[pathway-compat-filepath] [ 4 of 10] Compiling System.FilePath.Pathway ( src/System/FilePath/Pathway.hs, dist/build/System/FilePath/Pathway.o, dist/build/System/FilePath/Pathway.dyn_o )
6.20 s
[pathway-compat-filepath] [ 5 of 10] Compiling System.FilePath.Overlay ( src/System/FilePath/Overlay.hs, dist/build/System/FilePath/Overlay.o, dist/build/System/FilePath/Overlay.dyn_o )
6.22 s
[pathway-compat-filepath] [ 6 of 10] Compiling System.FilePath ( src/System/FilePath.hs, dist/build/System/FilePath.o, dist/build/System/FilePath.dyn_o )
6.34 s
Progress: 0 of 12 built (1 failed), 2 of 2 downloaded from cache
6.34 s
Failed to build pathway-compat-filepath after 3.7s
6.34 s
error: Cannot build '/nix/store/psj7qq98d0nc1x3mcxvgminpvlszfrfm-pathway-compat-filepath-0.0.1.0.drv '.
6.34 s
Reason: builder failed with exit code 1 .
6.34 s
Output paths:
6.34 s
/nix/store/c3wlvp65ypvkb08q9pcr7hq7wygmm4g4-pathway-compat-filepath-0.0.1.0-doc
6.34 s
/nix/store/xghx2j0inbha0jqrcxmvc3ljvvx1i77g-pathway-compat-filepath-0.0.1.0
6.34 s
Last 176 log lines:
6.34 s
> Running phase: setupCompilerEnvironmentPhase
6.34 s
> Build with /nix/store/7r9b0bl984hdgd70nf5p8raa55kml491-ghc-9.8.4.
6.34 s
> Running phase: unpackPhase
6.34 s
> unpacking source archive /nix/store/5z4x7vzkb1m65ccyx19wn7vcxdl9gmbf-filepath
6.34 s
> source root is filepath
6.34 s
> Running phase: patchPhase
6.34 s
> Running phase: compileBuildDriverPhase
6.34 s
> setupCompileFlags: -package-db=/build/tmp.afIePam3tQ/setup-package.conf.d -threaded
6.34 s
> [1 of 2] Compiling Main ( Setup.hs, /build/tmp.afIePam3tQ/Main.o )
6.34 s
> [2 of 2] Linking Setup
6.34 s
> Running phase: updateAutotoolsGnuConfigScriptsPhase
6.34 s
> Running phase: configurePhase
6.34 s
> configureFlags: --verbose --prefix=/nix/store/xghx2j0inbha0jqrcxmvc3ljvvx1i77g-pathway-compat-filepath-0.0.1.0 --libdir=$prefix/lib/$compiler/lib --libsubdir=$abi/$libname --docdir=/nix/store/c3wlvp65ypvkb08q9pcr7hq7wygmm4g4-pathway-compat-filepath-0.0.1.0-doc/share/doc/pathway-compat-filepath-0.0.1.0 --with-gcc=gcc --package-db=/build/tmp.afIePam3tQ/package.conf.d --ghc-option=-j16 --ghc-option=+RTS --ghc-option=-A64M --ghc-option=-RTS --enable-library-profiling --profiling-detail=exported-functions --disable-profiling --enable-shared --disable-coverage --enable-static --disable-executable-dynamic --enable-tests --disable-benchmarks --enable-library-vanilla --disable-library-for-ghci --enable-split-sections --enable-library-stripping --enable-executable-stripping --ghc-option=-haddock --ghc-options=-Werror --extra-lib-dirs=/nix/store/pndhkk0l649lm1sj0mxk7cbwq26qd1ra-ncurses-6.6/lib --extra-lib-dirs=/nix/store/0djlg4g0b81w94k3vcaqsxsc2hh4kism-libffi-3.5.2/lib --extra-lib-dirs=/nix/store/md4paia7riiggyrj8p24c7a6vf8w7jz8-elfutils-0.194/lib --extra-lib-dirs=/nix/store/39vv2pf64gd8li48a4hpbhw2crzd8z5p-gmp-with-cxx-6.3.0/lib --extra-lib-dirs=/nix/store/7wwvald8lapkrsr72qanlw8blyn55ifx-numactl-2.0.18/lib --extra-lib-dirs=/nix/store/7r9b0bl984hdgd70nf5p8raa55kml491-ghc-9.8.4/lib
6.34 s
> Using Parsec parser
6.34 s
> Configuring pathway-compat-filepath-0.0.1.0...
6.34 s
> Flags chosen: noisy-deprecations=True, verify-no-recursion=False
6.34 s
> Dependency base >=4.14.0 && <4.15 || >=4.15.0 && <4.16 || >=4.16.0 && <4.17 ||
6.34 s
> >=4.17.0 && <4.18 || >=4.18.0 && <4.19 || >=4.19.0 && <4.20 || >=4.20.0 &&
6.34 s
> <4.21 || >=4.21.0 && <4.22 || >=4.22.0 && <4.23: using base-4.19.2.0
6.34 s
> Dependency extra: using extra-1.8.1
6.34 s
> Dependency filepath >=1.4.2 && <1.5 || >=1.5.0 && <1.6: using
6.34 s
> filepath-1.4.301.0
6.34 s
> Dependency megaparsec >=9.0.1 && <9.1 || >=9.2.1 && <9.3 || >=9.5.0 && <9.6 ||
6.34 s
> >=9.7.0 && <9.8: using megaparsec-9.7.0
6.34 s
> Dependency os-string: using os-string-2.0.10
6.34 s
> Dependency pathway >=0.0.1 && <0.1: using pathway-0.0.1.0
6.34 s
> Dependency pathway-compat-base >=0.0.1 && <0.1: using
6.34 s
> pathway-compat-base-0.0.1.0
6.34 s
> Dependency pathway-internal >=0.0.1 && <0.1: using pathway-internal-0.0.1.0
6.34 s
> Dependency base >=4.14.0 && <4.15 || >=4.15.0 && <4.16 || >=4.16.0 && <4.17 ||
6.34 s
> >=4.17.0 && <4.18 || >=4.18.0 && <4.19 || >=4.19.0 && <4.20 || >=4.20.0 &&
6.34 s
> <4.21 || >=4.21.0 && <4.22 || >=4.22.0 && <4.23: using base-4.19.2.0
6.34 s
> Dependency doctest >=0.16.3 && <0.17 || >=0.18.1 && <0.19 || >=0.20.1 && <0.21
6.34 s
> || >=0.21.1 && <0.22 || >=0.22.2 && <0.23 || >=0.24.2 && <0.25: using
6.34 s
> doctest-0.24.3
6.34 s
> Dependency pathway-compat-filepath: using pathway-compat-filepath-0.0.1.0
6.34 s
> Source component graph:
6.34 s
> component lib
6.34 s
> component test:doctests dependency lib
6.34 s
> Configured component graph:
6.34 s
> component pathway-compat-filepath-0.0.1.0-6KN1Vlb8yPeBopmlZtXyrR
6.34 s
> include base-4.19.2.0-934f
6.34 s
> include extra-1.8.1-F4oHgTKCper3ZiIUPZjGPK
6.34 s
> include filepath-1.4.301.0-6e15
6.34 s
> include megaparsec-9.7.0-10vHZAF1maw9O8p2gXs66N
6.34 s
> include os-string-2.0.10-HbyG8qgShpTHKXL8bZ3UK8
6.34 s
> include pathway-0.0.1.0-H5uD0SRA9755UrSqFBaCYE
6.34 s
> include pathway-compat-base-0.0.1.0-8ldj6SPXbxq2Shd8yFeOpr
6.34 s
> include pathway-internal-0.0.1.0-Lnjdb2M8cxN196wSdsfQUK
6.34 s
> component pathway-compat-filepath-0.0.1.0-LoaDJ8tbb2m5kfHmaP2B9c-doctests
6.34 s
> include base-4.19.2.0-934f
6.34 s
> include doctest-0.24.3-1aDs7zEYV5r7raSsXr9TQC
6.34 s
> include pathway-compat-filepath-0.0.1.0-6KN1Vlb8yPeBopmlZtXyrR
6.34 s
> Linked component graph:
6.34 s
> unit pathway-compat-filepath-0.0.1.0-6KN1Vlb8yPeBopmlZtXyrR
6.34 s
> include base-4.19.2.0-934f
6.34 s
> include extra-1.8.1-F4oHgTKCper3ZiIUPZjGPK
6.34 s
> include filepath-1.4.301.0-6e15
6.34 s
> include megaparsec-9.7.0-10vHZAF1maw9O8p2gXs66N
6.34 s
> include os-string-2.0.10-HbyG8qgShpTHKXL8bZ3UK8
6.34 s
> include pathway-0.0.1.0-H5uD0SRA9755UrSqFBaCYE
6.34 s
> include pathway-compat-base-0.0.1.0-8ldj6SPXbxq2Shd8yFeOpr
6.34 s
> include pathway-internal-0.0.1.0-Lnjdb2M8cxN196wSdsfQUK
6.34 s
> Common.FilePath=pathway-compat-filepath-0.0.1.0-6KN1Vlb8yPeBopmlZtXyrR:Common.FilePath,Common.OsPath=pathway-compat-filepath-0.0.1.0-6KN1Vlb8yPeBopmlZtXyrR:Common.OsPath,System.FilePath=pathway-compat-filepath-0.0.1.0-6KN1Vlb8yPeBopmlZtXyrR:System.FilePath,System.FilePath.Overlay=pathway-compat-filepath-0.0.1.0-6KN1Vlb8yPeBopmlZtXyrR:System.FilePath.Overlay,System.FilePath.Pathway=pathway-compat-filepath-0.0.1.0-6KN1Vlb8yPeBopmlZtXyrR:System.FilePath.Pathway,System.FilePath.Thin=pathway-compat-filepath-0.0.1.0-6KN1Vlb8yPeBopmlZtXyrR:System.FilePath.Thin,System.OsPath=pathway-compat-filepath-0.0.1.0-6KN1Vlb8yPeBopmlZtXyrR:System.OsPath,System.OsPath.Overlay=pathway-compat-filepath-0.0.1.0-6KN1Vlb8yPeBopmlZtXyrR:System.OsPath.Overlay,System.OsPath.Pathway=pathway-compat-filepath-0.0.1.0-6KN1Vlb8yPeBopmlZtXyrR:System.OsPath.Pathway,System.OsPath.Thin=pathway-compat-filepath-0.0.1.0-6KN1Vlb8yPeBopmlZtXyrR:System.OsPath.Thin
6.34 s
> unit pathway-compat-filepath-0.0.1.0-LoaDJ8tbb2m5kfHmaP2B9c-doctests
6.34 s
> include base-4.19.2.0-934f
6.34 s
> include doctest-0.24.3-1aDs7zEYV5r7raSsXr9TQC
6.34 s
> include pathway-compat-filepath-0.0.1.0-6KN1Vlb8yPeBopmlZtXyrR
6.34 s
> Ready component graph:
6.34 s
> definite pathway-compat-filepath-0.0.1.0-6KN1Vlb8yPeBopmlZtXyrR
6.34 s
> depends base-4.19.2.0-934f
6.34 s
> depends extra-1.8.1-F4oHgTKCper3ZiIUPZjGPK
6.34 s
> depends filepath-1.4.301.0-6e15
6.34 s
> depends megaparsec-9.7.0-10vHZAF1maw9O8p2gXs66N
6.34 s
> depends os-string-2.0.10-HbyG8qgShpTHKXL8bZ3UK8
6.34 s
> depends pathway-0.0.1.0-H5uD0SRA9755UrSqFBaCYE
6.34 s
> depends pathway-compat-base-0.0.1.0-8ldj6SPXbxq2Shd8yFeOpr
6.34 s
> depends pathway-internal-0.0.1.0-Lnjdb2M8cxN196wSdsfQUK
6.34 s
> definite pathway-compat-filepath-0.0.1.0-LoaDJ8tbb2m5kfHmaP2B9c-doctests
6.34 s
> depends base-4.19.2.0-934f
6.34 s
> depends doctest-0.24.3-1aDs7zEYV5r7raSsXr9TQC
6.34 s
> depends pathway-compat-filepath-0.0.1.0-6KN1Vlb8yPeBopmlZtXyrR
6.34 s
> Using Cabal-3.10.3.0 compiled by ghc-9.8
6.34 s
> Using compiler: ghc-9.8.4
6.34 s
> Using install prefix:
6.34 s
> /nix/store/xghx2j0inbha0jqrcxmvc3ljvvx1i77g-pathway-compat-filepath-0.0.1.0
6.34 s
> Executables installed in:
6.34 s
> /nix/store/xghx2j0inbha0jqrcxmvc3ljvvx1i77g-pathway-compat-filepath-0.0.1.0/bin
6.34 s
> Libraries installed in:
6.34 s
> /nix/store/xghx2j0inbha0jqrcxmvc3ljvvx1i77g-pathway-compat-filepath-0.0.1.0/lib/ghc-9.8.4/lib/x86_64-linux-ghc-9.8.4/pathway-compat-filepath-0.0.1.0-6KN1Vlb8yPeBopmlZtXyrR
6.34 s
> Dynamic Libraries installed in:
6.34 s
> /nix/store/xghx2j0inbha0jqrcxmvc3ljvvx1i77g-pathway-compat-filepath-0.0.1.0/lib/ghc-9.8.4/lib/x86_64-linux-ghc-9.8.4
6.34 s
> Private executables installed in:
6.34 s
> /nix/store/xghx2j0inbha0jqrcxmvc3ljvvx1i77g-pathway-compat-filepath-0.0.1.0/libexec/x86_64-linux-ghc-9.8.4/pathway-compat-filepath-0.0.1.0
6.34 s
> Data files installed in:
6.34 s
> /nix/store/xghx2j0inbha0jqrcxmvc3ljvvx1i77g-pathway-compat-filepath-0.0.1.0/share/x86_64-linux-ghc-9.8.4/pathway-compat-filepath-0.0.1.0
6.34 s
> Documentation installed in:
6.34 s
> /nix/store/c3wlvp65ypvkb08q9pcr7hq7wygmm4g4-pathway-compat-filepath-0.0.1.0-doc/share/doc/pathway-compat-filepath-0.0.1.0
6.34 s
> Configuration files installed in:
6.34 s
> /nix/store/xghx2j0inbha0jqrcxmvc3ljvvx1i77g-pathway-compat-filepath-0.0.1.0/etc
6.34 s
> No alex found
6.34 s
> Using ar found on system at:
6.34 s
> /nix/store/zjraf40s86y3iwhp626b934r5y6ldkbb-binutils-wrapper-2.46/bin/ar
6.34 s
> No c2hs found
6.34 s
> No cpphs found
6.34 s
> Using doctest version 0.24.3 found on system at:
6.34 s
> /nix/store/2y183b1vsybv0157vfr59yhdwjkpqfkn-doctest-0.24.3/bin/doctest
6.34 s
> Using gcc version 15.2.0 given by user at:
6.34 s
> /nix/store/29qjlshvklnyr67nhpprzgb9igmsfsjj-gcc-wrapper-15.2.0/bin/gcc
6.34 s
> Using ghc version 9.8.4 found on system at:
6.34 s
> /nix/store/7r9b0bl984hdgd70nf5p8raa55kml491-ghc-9.8.4/bin/ghc
6.34 s
> Using ghc-pkg version 9.8.4 found on system at:
6.34 s
> /nix/store/7r9b0bl984hdgd70nf5p8raa55kml491-ghc-9.8.4/bin/ghc-pkg-9.8.4
6.34 s
> No ghcjs found
6.34 s
> No ghcjs-pkg found
6.34 s
> No greencard found
6.34 s
> Using haddock version 2.30.0 found on system at:
6.34 s
> /nix/store/7r9b0bl984hdgd70nf5p8raa55kml491-ghc-9.8.4/bin/haddock-ghc-9.8.4
6.34 s
> No happy found
6.34 s
> Using haskell-suite found on system at: haskell-suite-dummy-location
6.34 s
> Using haskell-suite-pkg found on system at: haskell-suite-pkg-dummy-location
6.34 s
> No hmake found
6.34 s
> Using hpc version 0.69 found on system at:
6.34 s
> /nix/store/7r9b0bl984hdgd70nf5p8raa55kml491-ghc-9.8.4/bin/hpc-ghc-9.8.4
6.34 s
> Using hsc2hs version 0.68.10 found on system at:
6.34 s
> /nix/store/7r9b0bl984hdgd70nf5p8raa55kml491-ghc-9.8.4/bin/hsc2hs-ghc-9.8.4
6.34 s
> Using hscolour version 1.25 found on system at:
6.34 s
> /nix/store/awnxn98rlw62rrjwli6d2lb4d27mrzzw-hscolour-1.25/bin/HsColour
6.34 s
> No jhc found
6.34 s
> Using ld found on system at:
6.34 s
> /nix/store/zjraf40s86y3iwhp626b934r5y6ldkbb-binutils-wrapper-2.46/bin/ld.gold
6.34 s
> No pkg-config found
6.34 s
> Using runghc version 9.8.4 found on system at:
6.34 s
> /nix/store/7r9b0bl984hdgd70nf5p8raa55kml491-ghc-9.8.4/bin/runghc-9.8.4
6.34 s
> Using strip version 2.46 found on system at:
6.34 s
> /nix/store/29qjlshvklnyr67nhpprzgb9igmsfsjj-gcc-wrapper-15.2.0/bin/strip
6.34 s
> Using tar found on system at:
6.34 s
> /nix/store/z5mq2sam4484prf3kv6v6vjw1m0i7j24-gnutar-1.35/bin/tar
6.34 s
> No uhc found
6.34 s
> Running phase: buildPhase
6.34 s
> Preprocessing library for pathway-compat-filepath-0.0.1.0..
6.34 s
> Building library for pathway-compat-filepath-0.0.1.0..
6.34 s
> [ 1 of 10] Compiling Common.FilePath ( src/Common/FilePath.hs, dist/build/Common/FilePath.o, dist/build/Common/FilePath.dyn_o )
6.34 s
> [ 2 of 10] Compiling Common.OsPath ( src/Common/OsPath.hs, dist/build/Common/OsPath.o, dist/build/Common/OsPath.dyn_o )
6.34 s
>
6.34 s
> src/Common/OsPath.hs:90:23: error : [ GHC-83865 ]
6.34 s
> • Couldn't match type ‘OSS.OsString’ with ‘OsString’
6.34 s
> Expected: OsPath
6.34 s
> Actual: OSS.OsString
6.34 s
> NB: ‘OsString’
6.34 s
> is defined in ‘System.OsString.Internal.Types.Hidden’
6.34 s
> in package ‘filepath-1.4.301.0’
6.34 s
> ‘OSS.OsString’
6.34 s
> is defined in ‘System.OsString.Internal.Types’
6.34 s
> in package ‘os-string-2.0.10’
6.34 s
> • In the ‘parent’ field of a record
6.34 s
> In the expression:
6.34 s
> Format
6.34 s
> {root = O.pack . pure $ O.pathSeparator, current = mempty,
6.34 s
> parent = OSS.unsafeEncodeUtf "..",
6.34 s
> separator = O.pack . pure $ O.pathSeparator,
6.34 s
> substitutions = mempty}
6.34 s
> In an equation for ‘localFormat’:
6.34 s
> localFormat
6.34 s
> = Format
6.34 s
> {root = O.pack . pure $ O.pathSeparator, current = mempty,
6.34 s
> parent = OSS.unsafeEncodeUtf "..",
6.34 s
> separator = O.pack . pure $ O.pathSeparator,
6.34 s
> substitutions = mempty}
6.34 s
> |
6.34 s
> 90 | Format.parent = OSS.unsafeEncodeUtf ".." ,
6.34 s
> | ^^^^^^^^^^^^^^^^^^^^^^^^
6.34 s
> [ 3 of 10] Compiling System.FilePath.Thin ( src/System/FilePath/Thin.hs, dist/build/System/FilePath/Thin.o, dist/build/System/FilePath/Thin.dyn_o )
6.34 s
> [ 4 of 10] Compiling System.FilePath.Pathway ( src/System/FilePath/Pathway.hs, dist/build/System/FilePath/Pathway.o, dist/build/System/FilePath/Pathway.dyn_o )
6.34 s
> [ 5 of 10] Compiling System.FilePath.Overlay ( src/System/FilePath/Overlay.hs, dist/build/System/FilePath/Overlay.o, dist/build/System/FilePath/Overlay.dyn_o )
6.34 s
> [ 6 of 10] Compiling System.FilePath ( src/System/FilePath.hs, dist/build/System/FilePath.o, dist/build/System/FilePath.dyn_o )
6.34 s
For full logs, run:
6.34 s
nix log /nix/store/psj7qq98d0nc1x3mcxvgminpvlszfrfm-pathway-compat-filepath-0.0.1.0.drv
6.35 s
error: Cannot build '/nix/store/psj7qq98d0nc1x3mcxvgminpvlszfrfm-pathway-compat-filepath-0.0.1.0.drv '.
6.35 s
Reason: builder failed with exit code 1 .
6.35 s
Output paths:
6.35 s
/nix/store/c3wlvp65ypvkb08q9pcr7hq7wygmm4g4-pathway-compat-filepath-0.0.1.0-doc
6.35 s
/nix/store/xghx2j0inbha0jqrcxmvc3ljvvx1i77g-pathway-compat-filepath-0.0.1.0
6.35 s
Last 176 log lines:
6.35 s
> Running phase: setupCompilerEnvironmentPhase
6.35 s
> Build with /nix/store/7r9b0bl984hdgd70nf5p8raa55kml491-ghc-9.8.4.
6.35 s
> Running phase: unpackPhase
6.35 s
> unpacking source archive /nix/store/5z4x7vzkb1m65ccyx19wn7vcxdl9gmbf-filepath
6.35 s
> source root is filepath
6.35 s
> Running phase: patchPhase
6.35 s
> Running phase: compileBuildDriverPhase
6.35 s
> setupCompileFlags: -package-db=/build/tmp.afIePam3tQ/setup-package.conf.d -threaded
6.35 s
> [1 of 2] Compiling Main ( Setup.hs, /build/tmp.afIePam3tQ/Main.o )
6.35 s
> [2 of 2] Linking Setup
6.35 s
> Running phase: updateAutotoolsGnuConfigScriptsPhase
6.35 s
> Running phase: configurePhase
6.35 s
> configureFlags: --verbose --prefix=/nix/store/xghx2j0inbha0jqrcxmvc3ljvvx1i77g-pathway-compat-filepath-0.0.1.0 --libdir=$prefix/lib/$compiler/lib --libsubdir=$abi/$libname --docdir=/nix/store/c3wlvp65ypvkb08q9pcr7hq7wygmm4g4-pathway-compat-filepath-0.0.1.0-doc/share/doc/pathway-compat-filepath-0.0.1.0 --with-gcc=gcc --package-db=/build/tmp.afIePam3tQ/package.conf.d --ghc-option=-j16 --ghc-option=+RTS --ghc-option=-A64M --ghc-option=-RTS --enable-library-profiling --profiling-detail=exported-functions --disable-profiling --enable-shared --disable-coverage --enable-static --disable-executable-dynamic --enable-tests --disable-benchmarks --enable-library-vanilla --disable-library-for-ghci --enable-split-sections --enable-library-stripping --enable-executable-stripping --ghc-option=-haddock --ghc-options=-Werror --extra-lib-dirs=/nix/store/pndhkk0l649lm1sj0mxk7cbwq26qd1ra-ncurses-6.6/lib --extra-lib-dirs=/nix/store/0djlg4g0b81w94k3vcaqsxsc2hh4kism-libffi-3.5.2/lib --extra-lib-dirs=/nix/store/md4paia7riiggyrj8p24c7a6vf8w7jz8-elfutils-0.194/lib --extra-lib-dirs=/nix/store/39vv2pf64gd8li48a4hpbhw2crzd8z5p-gmp-with-cxx-6.3.0/lib --extra-lib-dirs=/nix/store/7wwvald8lapkrsr72qanlw8blyn55ifx-numactl-2.0.18/lib --extra-lib-dirs=/nix/store/7r9b0bl984hdgd70nf5p8raa55kml491-ghc-9.8.4/lib
6.35 s
> Using Parsec parser
6.35 s
> Configuring pathway-compat-filepath-0.0.1.0...
6.35 s
> Flags chosen: noisy-deprecations=True, verify-no-recursion=False
6.35 s
> Dependency base >=4.14.0 && <4.15 || >=4.15.0 && <4.16 || >=4.16.0 && <4.17 ||
6.35 s
> >=4.17.0 && <4.18 || >=4.18.0 && <4.19 || >=4.19.0 && <4.20 || >=4.20.0 &&
6.35 s
> <4.21 || >=4.21.0 && <4.22 || >=4.22.0 && <4.23: using base-4.19.2.0
6.35 s
> Dependency extra: using extra-1.8.1
6.35 s
> Dependency filepath >=1.4.2 && <1.5 || >=1.5.0 && <1.6: using
6.35 s
> filepath-1.4.301.0
6.35 s
> Dependency megaparsec >=9.0.1 && <9.1 || >=9.2.1 && <9.3 || >=9.5.0 && <9.6 ||
6.35 s
> >=9.7.0 && <9.8: using megaparsec-9.7.0
6.35 s
> Dependency os-string: using os-string-2.0.10
6.35 s
> Dependency pathway >=0.0.1 && <0.1: using pathway-0.0.1.0
6.35 s
> Dependency pathway-compat-base >=0.0.1 && <0.1: using
6.35 s
> pathway-compat-base-0.0.1.0
6.35 s
> Dependency pathway-internal >=0.0.1 && <0.1: using pathway-internal-0.0.1.0
6.35 s
> Dependency base >=4.14.0 && <4.15 || >=4.15.0 && <4.16 || >=4.16.0 && <4.17 ||
6.35 s
> >=4.17.0 && <4.18 || >=4.18.0 && <4.19 || >=4.19.0 && <4.20 || >=4.20.0 &&
6.35 s
> <4.21 || >=4.21.0 && <4.22 || >=4.22.0 && <4.23: using base-4.19.2.0
6.35 s
> Dependency doctest >=0.16.3 && <0.17 || >=0.18.1 && <0.19 || >=0.20.1 && <0.21
6.35 s
> || >=0.21.1 && <0.22 || >=0.22.2 && <0.23 || >=0.24.2 && <0.25: using
6.35 s
> doctest-0.24.3
6.35 s
> Dependency pathway-compat-filepath: using pathway-compat-filepath-0.0.1.0
6.35 s
> Source component graph:
6.35 s
> component lib
6.35 s
> component test:doctests dependency lib
6.35 s
> Configured component graph:
6.35 s
> component pathway-compat-filepath-0.0.1.0-6KN1Vlb8yPeBopmlZtXyrR
6.35 s
> include base-4.19.2.0-934f
6.35 s
> include extra-1.8.1-F4oHgTKCper3ZiIUPZjGPK
6.35 s
> include filepath-1.4.301.0-6e15
6.35 s
> include megaparsec-9.7.0-10vHZAF1maw9O8p2gXs66N
6.35 s
> include os-string-2.0.10-HbyG8qgShpTHKXL8bZ3UK8
6.35 s
> include pathway-0.0.1.0-H5uD0SRA9755UrSqFBaCYE
6.35 s
> include pathway-compat-base-0.0.1.0-8ldj6SPXbxq2Shd8yFeOpr
6.35 s
> include pathway-internal-0.0.1.0-Lnjdb2M8cxN196wSdsfQUK
6.35 s
> component pathway-compat-filepath-0.0.1.0-LoaDJ8tbb2m5kfHmaP2B9c-doctests
6.35 s
> include base-4.19.2.0-934f
6.35 s
> include doctest-0.24.3-1aDs7zEYV5r7raSsXr9TQC
6.35 s
> include pathway-compat-filepath-0.0.1.0-6KN1Vlb8yPeBopmlZtXyrR
6.35 s
> Linked component graph:
6.35 s
> unit pathway-compat-filepath-0.0.1.0-6KN1Vlb8yPeBopmlZtXyrR
6.35 s
> include base-4.19.2.0-934f
6.35 s
> include extra-1.8.1-F4oHgTKCper3ZiIUPZjGPK
6.35 s
> include filepath-1.4.301.0-6e15
6.35 s
> include megaparsec-9.7.0-10vHZAF1maw9O8p2gXs66N
6.35 s
> include os-string-2.0.10-HbyG8qgShpTHKXL8bZ3UK8
6.35 s
> include pathway-0.0.1.0-H5uD0SRA9755UrSqFBaCYE
6.35 s
> include pathway-compat-base-0.0.1.0-8ldj6SPXbxq2Shd8yFeOpr
6.35 s
> include pathway-internal-0.0.1.0-Lnjdb2M8cxN196wSdsfQUK
6.35 s
> Common.FilePath=pathway-compat-filepath-0.0.1.0-6KN1Vlb8yPeBopmlZtXyrR:Common.FilePath,Common.OsPath=pathway-compat-filepath-0.0.1.0-6KN1Vlb8yPeBopmlZtXyrR:Common.OsPath,System.FilePath=pathway-compat-filepath-0.0.1.0-6KN1Vlb8yPeBopmlZtXyrR:System.FilePath,System.FilePath.Overlay=pathway-compat-filepath-0.0.1.0-6KN1Vlb8yPeBopmlZtXyrR:System.FilePath.Overlay,System.FilePath.Pathway=pathway-compat-filepath-0.0.1.0-6KN1Vlb8yPeBopmlZtXyrR:System.FilePath.Pathway,System.FilePath.Thin=pathway-compat-filepath-0.0.1.0-6KN1Vlb8yPeBopmlZtXyrR:System.FilePath.Thin,System.OsPath=pathway-compat-filepath-0.0.1.0-6KN1Vlb8yPeBopmlZtXyrR:System.OsPath,System.OsPath.Overlay=pathway-compat-filepath-0.0.1.0-6KN1Vlb8yPeBopmlZtXyrR:System.OsPath.Overlay,System.OsPath.Pathway=pathway-compat-filepath-0.0.1.0-6KN1Vlb8yPeBopmlZtXyrR:System.OsPath.Pathway,System.OsPath.Thin=pathway-compat-filepath-0.0.1.0-6KN1Vlb8yPeBopmlZtXyrR:System.OsPath.Thin
6.35 s
> unit pathway-compat-filepath-0.0.1.0-LoaDJ8tbb2m5kfHmaP2B9c-doctests
6.35 s
> include base-4.19.2.0-934f
6.35 s
> include doctest-0.24.3-1aDs7zEYV5r7raSsXr9TQC
6.35 s
> include pathway-compat-filepath-0.0.1.0-6KN1Vlb8yPeBopmlZtXyrR
6.35 s
> Ready component graph:
6.35 s
> definite pathway-compat-filepath-0.0.1.0-6KN1Vlb8yPeBopmlZtXyrR
6.35 s
> depends base-4.19.2.0-934f
6.35 s
> depends extra-1.8.1-F4oHgTKCper3ZiIUPZjGPK
6.35 s
> depends filepath-1.4.301.0-6e15
6.35 s
> depends megaparsec-9.7.0-10vHZAF1maw9O8p2gXs66N
6.35 s
> depends os-string-2.0.10-HbyG8qgShpTHKXL8bZ3UK8
6.35 s
> depends pathway-0.0.1.0-H5uD0SRA9755UrSqFBaCYE
6.35 s
> depends pathway-compat-base-0.0.1.0-8ldj6SPXbxq2Shd8yFeOpr
6.35 s
> depends pathway-internal-0.0.1.0-Lnjdb2M8cxN196wSdsfQUK
6.35 s
> definite pathway-compat-filepath-0.0.1.0-LoaDJ8tbb2m5kfHmaP2B9c-doctests
6.35 s
> depends base-4.19.2.0-934f
6.35 s
> depends doctest-0.24.3-1aDs7zEYV5r7raSsXr9TQC
6.35 s
> depends pathway-compat-filepath-0.0.1.0-6KN1Vlb8yPeBopmlZtXyrR
6.35 s
> Using Cabal-3.10.3.0 compiled by ghc-9.8
6.35 s
> Using compiler: ghc-9.8.4
6.35 s
> Using install prefix:
6.35 s
> /nix/store/xghx2j0inbha0jqrcxmvc3ljvvx1i77g-pathway-compat-filepath-0.0.1.0
6.35 s
> Executables installed in:
6.35 s
> /nix/store/xghx2j0inbha0jqrcxmvc3ljvvx1i77g-pathway-compat-filepath-0.0.1.0/bin
6.35 s
> Libraries installed in:
6.35 s
> /nix/store/xghx2j0inbha0jqrcxmvc3ljvvx1i77g-pathway-compat-filepath-0.0.1.0/lib/ghc-9.8.4/lib/x86_64-linux-ghc-9.8.4/pathway-compat-filepath-0.0.1.0-6KN1Vlb8yPeBopmlZtXyrR
6.35 s
> Dynamic Libraries installed in:
6.35 s
> /nix/store/xghx2j0inbha0jqrcxmvc3ljvvx1i77g-pathway-compat-filepath-0.0.1.0/lib/ghc-9.8.4/lib/x86_64-linux-ghc-9.8.4
6.35 s
> Private executables installed in:
6.35 s
> /nix/store/xghx2j0inbha0jqrcxmvc3ljvvx1i77g-pathway-compat-filepath-0.0.1.0/libexec/x86_64-linux-ghc-9.8.4/pathway-compat-filepath-0.0.1.0
6.35 s
> Data files installed in:
6.35 s
> /nix/store/xghx2j0inbha0jqrcxmvc3ljvvx1i77g-pathway-compat-filepath-0.0.1.0/share/x86_64-linux-ghc-9.8.4/pathway-compat-filepath-0.0.1.0
6.35 s
> Documentation installed in:
6.35 s
> /nix/store/c3wlvp65ypvkb08q9pcr7hq7wygmm4g4-pathway-compat-filepath-0.0.1.0-doc/share/doc/pathway-compat-filepath-0.0.1.0
6.35 s
> Configuration files installed in:
6.35 s
> /nix/store/xghx2j0inbha0jqrcxmvc3ljvvx1i77g-pathway-compat-filepath-0.0.1.0/etc
6.35 s
> No alex found
6.35 s
> Using ar found on system at:
6.35 s
> /nix/store/zjraf40s86y3iwhp626b934r5y6ldkbb-binutils-wrapper-2.46/bin/ar
6.35 s
> No c2hs found
6.35 s
> No cpphs found
6.35 s
> Using doctest version 0.24.3 found on system at:
6.35 s
> /nix/store/2y183b1vsybv0157vfr59yhdwjkpqfkn-doctest-0.24.3/bin/doctest
6.35 s
> Using gcc version 15.2.0 given by user at:
6.35 s
> /nix/store/29qjlshvklnyr67nhpprzgb9igmsfsjj-gcc-wrapper-15.2.0/bin/gcc
6.35 s
> Using ghc version 9.8.4 found on system at:
6.35 s
> /nix/store/7r9b0bl984hdgd70nf5p8raa55kml491-ghc-9.8.4/bin/ghc
6.35 s
> Using ghc-pkg version 9.8.4 found on system at:
6.35 s
> /nix/store/7r9b0bl984hdgd70nf5p8raa55kml491-ghc-9.8.4/bin/ghc-pkg-9.8.4
6.35 s
> No ghcjs found
6.35 s
> No ghcjs-pkg found
6.35 s
> No greencard found
6.35 s
> Using haddock version 2.30.0 found on system at:
6.35 s
> /nix/store/7r9b0bl984hdgd70nf5p8raa55kml491-ghc-9.8.4/bin/haddock-ghc-9.8.4
6.35 s
> No happy found
6.35 s
> Using haskell-suite found on system at: haskell-suite-dummy-location
6.35 s
> Using haskell-suite-pkg found on system at: haskell-suite-pkg-dummy-location
6.35 s
> No hmake found
6.35 s
> Using hpc version 0.69 found on system at:
6.35 s
> /nix/store/7r9b0bl984hdgd70nf5p8raa55kml491-ghc-9.8.4/bin/hpc-ghc-9.8.4
6.35 s
> Using hsc2hs version 0.68.10 found on system at:
6.35 s
> /nix/store/7r9b0bl984hdgd70nf5p8raa55kml491-ghc-9.8.4/bin/hsc2hs-ghc-9.8.4
6.35 s
> Using hscolour version 1.25 found on system at:
6.35 s
> /nix/store/awnxn98rlw62rrjwli6d2lb4d27mrzzw-hscolour-1.25/bin/HsColour
6.35 s
> No jhc found
6.35 s
> Using ld found on system at:
6.35 s
> /nix/store/zjraf40s86y3iwhp626b934r5y6ldkbb-binutils-wrapper-2.46/bin/ld.gold
6.35 s
> No pkg-config found
6.35 s
> Using runghc version 9.8.4 found on system at:
6.35 s
> /nix/store/7r9b0bl984hdgd70nf5p8raa55kml491-ghc-9.8.4/bin/runghc-9.8.4
6.35 s
> Using strip version 2.46 found on system at:
6.35 s
> /nix/store/29qjlshvklnyr67nhpprzgb9igmsfsjj-gcc-wrapper-15.2.0/bin/strip
6.35 s
> Using tar found on system at:
6.35 s
> /nix/store/z5mq2sam4484prf3kv6v6vjw1m0i7j24-gnutar-1.35/bin/tar
6.35 s
> No uhc found
6.35 s
> Running phase: buildPhase
6.35 s
> Preprocessing library for pathway-compat-filepath-0.0.1.0..
6.35 s
> Building library for pathway-compat-filepath-0.0.1.0..
6.35 s
> [ 1 of 10] Compiling Common.FilePath ( src/Common/FilePath.hs, dist/build/Common/FilePath.o, dist/build/Common/FilePath.dyn_o )
6.35 s
> [ 2 of 10] Compiling Common.OsPath ( src/Common/OsPath.hs, dist/build/Common/OsPath.o, dist/build/Common/OsPath.dyn_o )
6.35 s
>
6.35 s
> src/Common/OsPath.hs:90:23: error : [ GHC-83865 ]
6.35 s
> • Couldn't match type ‘OSS.OsString’ with ‘OsString’
6.35 s
> Expected: OsPath
6.35 s
> Actual: OSS.OsString
6.35 s
> NB: ‘OsString’
6.35 s
> is defined in ‘System.OsString.Internal.Types.Hidden’
6.35 s
> in package ‘filepath-1.4.301.0’
6.35 s
> ‘OSS.OsString’
6.35 s
> is defined in ‘System.OsString.Internal.Types’
6.35 s
> in package ‘os-string-2.0.10’
6.35 s
> • In the ‘parent’ field of a record
6.35 s
> In the expression:
6.35 s
> Format
6.35 s
> {root = O.pack . pure $ O.pathSeparator, current = mempty,
6.35 s
> parent = OSS.unsafeEncodeUtf "..",
6.35 s
> separator = O.pack . pure $ O.pathSeparator,
6.35 s
> substitutions = mempty}
6.35 s
> In an equation for ‘localFormat’:
6.35 s
> localFormat
6.35 s
> = Format
6.35 s
> {root = O.pack . pure $ O.pathSeparator, current = mempty,
6.35 s
> parent = OSS.unsafeEncodeUtf "..",
6.35 s
> separator = O.pack . pure $ O.pathSeparator,
6.35 s
> substitutions = mempty}
6.35 s
> |
6.35 s
> 90 | Format.parent = OSS.unsafeEncodeUtf ".." ,
6.35 s
> | ^^^^^^^^^^^^^^^^^^^^^^^^
6.35 s
> [ 3 of 10] Compiling System.FilePath.Thin ( src/System/FilePath/Thin.hs, dist/build/System/FilePath/Thin.o, dist/build/System/FilePath/Thin.dyn_o )
6.35 s
> [ 4 of 10] Compiling System.FilePath.Pathway ( src/System/FilePath/Pathway.hs, dist/build/System/FilePath/Pathway.o, dist/build/System/FilePath/Pathway.dyn_o )
6.35 s
> [ 5 of 10] Compiling System.FilePath.Overlay ( src/System/FilePath/Overlay.hs, dist/build/System/FilePath/Overlay.o, dist/build/System/FilePath/Overlay.dyn_o )
6.35 s
> [ 6 of 10] Compiling System.FilePath ( src/System/FilePath.hs, dist/build/System/FilePath.o, dist/build/System/FilePath.dyn_o )
6.35 s
For full logs, run:
6.35 s
nix log /nix/store/psj7qq98d0nc1x3mcxvgminpvlszfrfm-pathway-compat-filepath-0.0.1.0.drv
6.35 s
error: Cannot build '/nix/store/mdvhamhmncfil55by5mc62fj69n99c1w-ghc-9.8.4-with-packages.drv '.
6.35 s
Reason: 1 dependency failed .
6.35 s
Output paths:
6.35 s
/nix/store/1vvvayslravlsnbd962y9bsp4c7jiah4-ghc-9.8.4-with-packages
6.35 s
error: Cannot build '/nix/store/gcbdv7d9xmvf3jabhv7lbf50a4k5v0fr-pathway-compat-directory-0.0.1.0.drv '.
6.35 s
Reason: 1 dependency failed .
6.35 s
Output paths:
6.35 s
/nix/store/lvz4jclqs4hqq1k7fi74rl20419aaqmb-pathway-compat-directory-0.0.1.0-doc
6.35 s
/nix/store/prcri98x3bq55i3pffsm2c0z5bzjivpn-pathway-compat-directory-0.0.1.0
6.35 s
error: Cannot build '/nix/store/9a7ba0q649sjp2fjr2p7yi6l6nv7byak-pathway-compat-file-io-0.0.1.0.drv '.
6.35 s
Reason: 1 dependency failed .
6.35 s
Output paths:
6.35 s
/nix/store/hdd4f2is9svyj3zx5czk0mblia6i8w1a-pathway-compat-file-io-0.0.1.0
6.35 s
/nix/store/j2d5178hlcgldkj6jcq2cv6q83ny0rrf-pathway-compat-file-io-0.0.1.0-doc
6.35 s
error: Cannot build '/nix/store/q4yq83in56ixb5fi8pprb2xbkwr7kr8k-pathway-compat-temporary-0.0.1.0.drv '.
6.35 s
Reason: 1 dependency failed .
6.35 s
Output paths:
6.35 s
/nix/store/lklwgvwpcq480fqmdc66fzc45nj1iphl-pathway-compat-temporary-0.0.1.0-doc
6.35 s
/nix/store/zvmf2y70q878a2fgdpk9mqznfca8j5nl-pathway-compat-temporary-0.0.1.0
6.35 s
error: Cannot build '/nix/store/b8ay2gw1cg8jpdkd4j5nnn95zrmnypv8-pathway-system-0.0.1.0.drv '.
6.35 s
Reason: 1 dependency failed .
6.35 s
Output paths:
6.35 s
/nix/store/chy1q398chqybipav6k9l04drrrmg2ks-pathway-system-0.0.1.0
6.35 s
/nix/store/k1vv04ssh3mky3f4y6s9m92vh0ia5sxq-pathway-system-0.0.1.0-doc
6.35 s
error: Build failed due to failed dependency
6.35 s
error: Cannot build '/nix/store/45nwy0mckisgy5fbckfqw9v5qjaqj1pk-all-packages.drv '.
6.35 s
Reason: 1 dependency failed .
6.35 s
Output paths:
6.35 s
/nix/store/j5jvn7qhq6j0j8hjffc4b4zlrk8kz60j-all-packages
6.35 s
Build failed due to failed dependency
6.38 s
Build failed.