build packages.x86_64-linux.ghc984_all

Reproduce this run
Original Run
  1. 0.19 s $ /nix/store/9ypz3flqsrl5xl495mm8h645gadjsxi1-coreutils-9.11/bin/timeout --kill-after=15s 7200s /nix/store/23zk8sgzamrbmj1fday15szf7f2279s8-nix-2.34.7/bin/nix --extra-experimental-features nix-command --extra-experimental-features flakes --log-format internal-json build --no-link --print-out-paths git+https://github.com/sellout/pathway?ref=more-system&rev=1ea193cbc6593071794981ca0dcd055e8eb42609&shallow=1#packages.x86_64-linux.ghc984_all --print-build-logs
  2. 0.77 s warning: ignoring untrusted flake configuration setting 'allow-import-from-derivation'.
  3. 0.77 s Pass '--accept-flake-config' to trust it
  4. 0.77 s warning: ignoring untrusted flake configuration setting 'extra-experimental-features'.
  5. 0.77 s Pass '--accept-flake-config' to trust it
  6. 0.77 s warning: ignoring untrusted flake configuration setting 'extra-substituters'.
  7. 0.77 s Pass '--accept-flake-config' to trust it
  8. 0.77 s warning: ignoring untrusted flake configuration setting 'extra-trusted-public-keys'.
  9. 0.77 s Pass '--accept-flake-config' to trust it
  10. 0.77 s warning: ignoring untrusted flake configuration setting 'sandbox'.
  11. 0.77 s Pass '--accept-flake-config' to trust it
  12. 0.77 s warning: ignoring untrusted flake configuration setting 'use-registries'.
  13. 0.77 s Pass '--accept-flake-config' to trust it
  14. 0.77 s error (ignored): SQLite database '/var/cache/nix-ci-worker/eval-cache-v6/7e8cef9f9a584f12750e4112f9919eb203f4dd515b08e08f130fffcf31865d0a.sqlite' is busy
  15. 1.53 s
  16. 2.41 s Downloading cached pathway-compat-base-0.0.1.0-doc from https://cache.nix-ci.com
  17. 2.43 s Downloaded cached pathway-compat-base-0.0.1.0-doc (1.9 MiB) in 15ms
  18. 2.43 s Progress: 0 of 14 built, 1 of 2 downloaded from cache
  19. 2.43 s Downloading cached pathway-compat-base from https://cache.nix-ci.com
  20. 2.45 s Downloaded cached pathway-compat-base (2 MiB) in 18ms
  21. 2.45 s Progress: 0 of 13 built, 2 of 2 downloaded from cache
  22. 2.55 s Building /nix/store/psj7qq98d0nc1x3mcxvgminpvlszfrfm-pathway-compat-filepath-0.0.1.0.drv
  23. 2.75 s [pathway-compat-filepath] Phase: setupCompilerEnvironmentPhase
  24. 2.76 s [pathway-compat-filepath] Build with /nix/store/7r9b0bl984hdgd70nf5p8raa55kml491-ghc-9.8.4.
  25. 3.09 s [pathway-compat-filepath] Phase: unpackPhase
  26. 3.09 s [pathway-compat-filepath] unpacking source archive /nix/store/5z4x7vzkb1m65ccyx19wn7vcxdl9gmbf-filepath
  27. 3.10 s [pathway-compat-filepath] source root is filepath
  28. 3.12 s [pathway-compat-filepath] Phase: patchPhase
  29. 3.13 s [pathway-compat-filepath] Phase: compileBuildDriverPhase
  30. 3.13 s [pathway-compat-filepath] setupCompileFlags: -package-db=/build/tmp.afIePam3tQ/setup-package.conf.d -threaded
  31. 3.18 s [pathway-compat-filepath] [1 of 2] Compiling Main ( Setup.hs, /build/tmp.afIePam3tQ/Main.o )
  32. 3.23 s [pathway-compat-filepath] [2 of 2] Linking Setup
  33. 4.48 s [pathway-compat-filepath] Phase: updateAutotoolsGnuConfigScriptsPhase
  34. 4.49 s [pathway-compat-filepath] Phase: configurePhase
  35. 4.50 s [pathway-compat-filepath] configureFlags: --verbose --prefix=/nix/store/xghx2j0inbha0jqrcxmvc3ljvvx1i77g-pathway-compat-filepath-0.0.1.0 --libdir=$prefix/lib/$compiler/lib --libsubdir=$abi/$libname --docdir=/nix/store/c3wlvp65ypvkb08q9pcr7hq7wygmm4g4-pathway-compat-filepath-0.0.1.0-doc/share/doc/pathway-compat-filepath-0.0.1.0 --with-gcc=gcc --package-db=/build/tmp.afIePam3tQ/package.conf.d --ghc-option=-j16 --ghc-option=+RTS --ghc-option=-A64M --ghc-option=-RTS --enable-library-profiling --profiling-detail=exported-functions --disable-profiling --enable-shared --disable-coverage --enable-static --disable-executable-dynamic --enable-tests --disable-benchmarks --enable-library-vanilla --disable-library-for-ghci --enable-split-sections --enable-library-stripping --enable-executable-stripping --ghc-option=-haddock --ghc-options=-Werror --extra-lib-dirs=/nix/store/pndhkk0l649lm1sj0mxk7cbwq26qd1ra-ncurses-6.6/lib --extra-lib-dirs=/nix/store/0djlg4g0b81w94k3vcaqsxsc2hh4kism-libffi-3.5.2/lib --extra-lib-dirs=/nix/store/md4paia7riiggyrj8p24c7a6vf8w7jz8-elfutils-0.194/lib --extra-lib-dirs=/nix/store/39vv2pf64gd8li48a4hpbhw2crzd8z5p-gmp-with-cxx-6.3.0/lib --extra-lib-dirs=/nix/store/7wwvald8lapkrsr72qanlw8blyn55ifx-numactl-2.0.18/lib --extra-lib-dirs=/nix/store/7r9b0bl984hdgd70nf5p8raa55kml491-ghc-9.8.4/lib
  36. 4.51 s [pathway-compat-filepath] Using Parsec parser
  37. 4.51 s [pathway-compat-filepath] Configuring pathway-compat-filepath-0.0.1.0...
  38. 4.84 s [pathway-compat-filepath] Flags chosen: noisy-deprecations=True, verify-no-recursion=False
  39. 4.84 s [pathway-compat-filepath] Dependency base >=4.14.0 && <4.15 || >=4.15.0 && <4.16 || >=4.16.0 && <4.17 ||
  40. 4.84 s [pathway-compat-filepath] >=4.17.0 && <4.18 || >=4.18.0 && <4.19 || >=4.19.0 && <4.20 || >=4.20.0 &&
  41. 4.84 s [pathway-compat-filepath] <4.21 || >=4.21.0 && <4.22 || >=4.22.0 && <4.23: using base-4.19.2.0
  42. 4.84 s [pathway-compat-filepath] Dependency extra: using extra-1.8.1
  43. 4.84 s [pathway-compat-filepath] Dependency filepath >=1.4.2 && <1.5 || >=1.5.0 && <1.6: using
  44. 4.84 s [pathway-compat-filepath] filepath-1.4.301.0
  45. 4.84 s [pathway-compat-filepath] Dependency megaparsec >=9.0.1 && <9.1 || >=9.2.1 && <9.3 || >=9.5.0 && <9.6 ||
  46. 4.84 s [pathway-compat-filepath] >=9.7.0 && <9.8: using megaparsec-9.7.0
  47. 4.84 s [pathway-compat-filepath] Dependency os-string: using os-string-2.0.10
  48. 4.84 s [pathway-compat-filepath] Dependency pathway >=0.0.1 && <0.1: using pathway-0.0.1.0
  49. 4.84 s [pathway-compat-filepath] Dependency pathway-compat-base >=0.0.1 && <0.1: using
  50. 4.84 s [pathway-compat-filepath] pathway-compat-base-0.0.1.0
  51. 4.84 s [pathway-compat-filepath] Dependency pathway-internal >=0.0.1 && <0.1: using pathway-internal-0.0.1.0
  52. 4.84 s [pathway-compat-filepath] Dependency base >=4.14.0 && <4.15 || >=4.15.0 && <4.16 || >=4.16.0 && <4.17 ||
  53. 4.84 s [pathway-compat-filepath] >=4.17.0 && <4.18 || >=4.18.0 && <4.19 || >=4.19.0 && <4.20 || >=4.20.0 &&
  54. 4.84 s [pathway-compat-filepath] <4.21 || >=4.21.0 && <4.22 || >=4.22.0 && <4.23: using base-4.19.2.0
  55. 4.84 s [pathway-compat-filepath] Dependency doctest >=0.16.3 && <0.17 || >=0.18.1 && <0.19 || >=0.20.1 && <0.21
  56. 4.84 s [pathway-compat-filepath] || >=0.21.1 && <0.22 || >=0.22.2 && <0.23 || >=0.24.2 && <0.25: using
  57. 4.84 s [pathway-compat-filepath] doctest-0.24.3
  58. 4.84 s [pathway-compat-filepath] Dependency pathway-compat-filepath: using pathway-compat-filepath-0.0.1.0
  59. 5.18 s [pathway-compat-filepath] Source component graph:
  60. 5.18 s [pathway-compat-filepath] component lib
  61. 5.18 s [pathway-compat-filepath] component test:doctests dependency lib
  62. 5.18 s [pathway-compat-filepath] Configured component graph:
  63. 5.18 s [pathway-compat-filepath] component pathway-compat-filepath-0.0.1.0-6KN1Vlb8yPeBopmlZtXyrR
  64. 5.18 s [pathway-compat-filepath] include base-4.19.2.0-934f
  65. 5.18 s [pathway-compat-filepath] include extra-1.8.1-F4oHgTKCper3ZiIUPZjGPK
  66. 5.18 s [pathway-compat-filepath] include filepath-1.4.301.0-6e15
  67. 5.18 s [pathway-compat-filepath] include megaparsec-9.7.0-10vHZAF1maw9O8p2gXs66N
  68. 5.18 s [pathway-compat-filepath] include os-string-2.0.10-HbyG8qgShpTHKXL8bZ3UK8
  69. 5.18 s [pathway-compat-filepath] include pathway-0.0.1.0-H5uD0SRA9755UrSqFBaCYE
  70. 5.18 s [pathway-compat-filepath] include pathway-compat-base-0.0.1.0-8ldj6SPXbxq2Shd8yFeOpr
  71. 5.18 s [pathway-compat-filepath] include pathway-internal-0.0.1.0-Lnjdb2M8cxN196wSdsfQUK
  72. 5.18 s [pathway-compat-filepath] component pathway-compat-filepath-0.0.1.0-LoaDJ8tbb2m5kfHmaP2B9c-doctests
  73. 5.18 s [pathway-compat-filepath] include base-4.19.2.0-934f
  74. 5.18 s [pathway-compat-filepath] include doctest-0.24.3-1aDs7zEYV5r7raSsXr9TQC
  75. 5.18 s [pathway-compat-filepath] include pathway-compat-filepath-0.0.1.0-6KN1Vlb8yPeBopmlZtXyrR
  76. 5.18 s [pathway-compat-filepath] Linked component graph:
  77. 5.18 s [pathway-compat-filepath] unit pathway-compat-filepath-0.0.1.0-6KN1Vlb8yPeBopmlZtXyrR
  78. 5.18 s [pathway-compat-filepath] include base-4.19.2.0-934f
  79. 5.18 s [pathway-compat-filepath] include extra-1.8.1-F4oHgTKCper3ZiIUPZjGPK
  80. 5.18 s [pathway-compat-filepath] include filepath-1.4.301.0-6e15
  81. 5.18 s [pathway-compat-filepath] include megaparsec-9.7.0-10vHZAF1maw9O8p2gXs66N
  82. 5.18 s [pathway-compat-filepath] include os-string-2.0.10-HbyG8qgShpTHKXL8bZ3UK8
  83. 5.18 s [pathway-compat-filepath] include pathway-0.0.1.0-H5uD0SRA9755UrSqFBaCYE
  84. 5.18 s [pathway-compat-filepath] include pathway-compat-base-0.0.1.0-8ldj6SPXbxq2Shd8yFeOpr
  85. 5.18 s [pathway-compat-filepath] include pathway-internal-0.0.1.0-Lnjdb2M8cxN196wSdsfQUK
  86. 5.18 s [pathway-compat-filepath] Common.FilePath=pathway-compat-filepath-0.0.1.0-6KN1Vlb8yPeBopmlZtXyrR:Common.FilePath,Common.OsPath=pathway-compat-filepath-0.0.1.0-6KN1Vlb8yPeBopmlZtXyrR:Common.OsPath,System.FilePath=pathway-compat-filepath-0.0.1.0-6KN1Vlb8yPeBopmlZtXyrR:System.FilePath,System.FilePath.Overlay=pathway-compat-filepath-0.0.1.0-6KN1Vlb8yPeBopmlZtXyrR:System.FilePath.Overlay,System.FilePath.Pathway=pathway-compat-filepath-0.0.1.0-6KN1Vlb8yPeBopmlZtXyrR:System.FilePath.Pathway,System.FilePath.Thin=pathway-compat-filepath-0.0.1.0-6KN1Vlb8yPeBopmlZtXyrR:System.FilePath.Thin,System.OsPath=pathway-compat-filepath-0.0.1.0-6KN1Vlb8yPeBopmlZtXyrR:System.OsPath,System.OsPath.Overlay=pathway-compat-filepath-0.0.1.0-6KN1Vlb8yPeBopmlZtXyrR:System.OsPath.Overlay,System.OsPath.Pathway=pathway-compat-filepath-0.0.1.0-6KN1Vlb8yPeBopmlZtXyrR:System.OsPath.Pathway,System.OsPath.Thin=pathway-compat-filepath-0.0.1.0-6KN1Vlb8yPeBopmlZtXyrR:System.OsPath.Thin
  87. 5.18 s [pathway-compat-filepath] unit pathway-compat-filepath-0.0.1.0-LoaDJ8tbb2m5kfHmaP2B9c-doctests
  88. 5.18 s [pathway-compat-filepath] include base-4.19.2.0-934f
  89. 5.18 s [pathway-compat-filepath] include doctest-0.24.3-1aDs7zEYV5r7raSsXr9TQC
  90. 5.18 s [pathway-compat-filepath] include pathway-compat-filepath-0.0.1.0-6KN1Vlb8yPeBopmlZtXyrR
  91. 5.18 s [pathway-compat-filepath] Ready component graph:
  92. 5.18 s [pathway-compat-filepath] definite pathway-compat-filepath-0.0.1.0-6KN1Vlb8yPeBopmlZtXyrR
  93. 5.18 s [pathway-compat-filepath] depends base-4.19.2.0-934f
  94. 5.18 s [pathway-compat-filepath] depends extra-1.8.1-F4oHgTKCper3ZiIUPZjGPK
  95. 5.18 s [pathway-compat-filepath] depends filepath-1.4.301.0-6e15
  96. 5.18 s [pathway-compat-filepath] depends megaparsec-9.7.0-10vHZAF1maw9O8p2gXs66N
  97. 5.18 s [pathway-compat-filepath] depends os-string-2.0.10-HbyG8qgShpTHKXL8bZ3UK8
  98. 5.18 s [pathway-compat-filepath] depends pathway-0.0.1.0-H5uD0SRA9755UrSqFBaCYE
  99. 5.18 s [pathway-compat-filepath] depends pathway-compat-base-0.0.1.0-8ldj6SPXbxq2Shd8yFeOpr
  100. 5.18 s [pathway-compat-filepath] depends pathway-internal-0.0.1.0-Lnjdb2M8cxN196wSdsfQUK
  101. 5.18 s [pathway-compat-filepath] definite pathway-compat-filepath-0.0.1.0-LoaDJ8tbb2m5kfHmaP2B9c-doctests
  102. 5.18 s [pathway-compat-filepath] depends base-4.19.2.0-934f
  103. 5.18 s [pathway-compat-filepath] depends doctest-0.24.3-1aDs7zEYV5r7raSsXr9TQC
  104. 5.18 s [pathway-compat-filepath] depends pathway-compat-filepath-0.0.1.0-6KN1Vlb8yPeBopmlZtXyrR
  105. 5.18 s [pathway-compat-filepath] Using Cabal-3.10.3.0 compiled by ghc-9.8
  106. 5.18 s [pathway-compat-filepath] Using compiler: ghc-9.8.4
  107. 5.18 s [pathway-compat-filepath] Using install prefix:
  108. 5.18 s [pathway-compat-filepath] /nix/store/xghx2j0inbha0jqrcxmvc3ljvvx1i77g-pathway-compat-filepath-0.0.1.0
  109. 5.18 s [pathway-compat-filepath] Executables installed in:
  110. 5.18 s [pathway-compat-filepath] /nix/store/xghx2j0inbha0jqrcxmvc3ljvvx1i77g-pathway-compat-filepath-0.0.1.0/bin
  111. 5.18 s [pathway-compat-filepath] Libraries installed in:
  112. 5.18 s [pathway-compat-filepath] /nix/store/xghx2j0inbha0jqrcxmvc3ljvvx1i77g-pathway-compat-filepath-0.0.1.0/lib/ghc-9.8.4/lib/x86_64-linux-ghc-9.8.4/pathway-compat-filepath-0.0.1.0-6KN1Vlb8yPeBopmlZtXyrR
  113. 5.18 s [pathway-compat-filepath] Dynamic Libraries installed in:
  114. 5.18 s [pathway-compat-filepath] /nix/store/xghx2j0inbha0jqrcxmvc3ljvvx1i77g-pathway-compat-filepath-0.0.1.0/lib/ghc-9.8.4/lib/x86_64-linux-ghc-9.8.4
  115. 5.18 s [pathway-compat-filepath] Private executables installed in:
  116. 5.18 s [pathway-compat-filepath] /nix/store/xghx2j0inbha0jqrcxmvc3ljvvx1i77g-pathway-compat-filepath-0.0.1.0/libexec/x86_64-linux-ghc-9.8.4/pathway-compat-filepath-0.0.1.0
  117. 5.18 s [pathway-compat-filepath] Data files installed in:
  118. 5.18 s [pathway-compat-filepath] /nix/store/xghx2j0inbha0jqrcxmvc3ljvvx1i77g-pathway-compat-filepath-0.0.1.0/share/x86_64-linux-ghc-9.8.4/pathway-compat-filepath-0.0.1.0
  119. 5.18 s [pathway-compat-filepath] Documentation installed in:
  120. 5.18 s [pathway-compat-filepath] /nix/store/c3wlvp65ypvkb08q9pcr7hq7wygmm4g4-pathway-compat-filepath-0.0.1.0-doc/share/doc/pathway-compat-filepath-0.0.1.0
  121. 5.18 s [pathway-compat-filepath] Configuration files installed in:
  122. 5.18 s [pathway-compat-filepath] /nix/store/xghx2j0inbha0jqrcxmvc3ljvvx1i77g-pathway-compat-filepath-0.0.1.0/etc
  123. 5.18 s [pathway-compat-filepath] No alex found
  124. 5.18 s [pathway-compat-filepath] Using ar found on system at:
  125. 5.18 s [pathway-compat-filepath] /nix/store/zjraf40s86y3iwhp626b934r5y6ldkbb-binutils-wrapper-2.46/bin/ar
  126. 5.18 s [pathway-compat-filepath] No c2hs found
  127. 5.18 s [pathway-compat-filepath] No cpphs found
  128. 5.18 s [pathway-compat-filepath] Using doctest version 0.24.3 found on system at:
  129. 5.18 s [pathway-compat-filepath] /nix/store/2y183b1vsybv0157vfr59yhdwjkpqfkn-doctest-0.24.3/bin/doctest
  130. 5.18 s [pathway-compat-filepath] Using gcc version 15.2.0 given by user at:
  131. 5.18 s [pathway-compat-filepath] /nix/store/29qjlshvklnyr67nhpprzgb9igmsfsjj-gcc-wrapper-15.2.0/bin/gcc
  132. 5.18 s [pathway-compat-filepath] Using ghc version 9.8.4 found on system at:
  133. 5.18 s [pathway-compat-filepath] /nix/store/7r9b0bl984hdgd70nf5p8raa55kml491-ghc-9.8.4/bin/ghc
  134. 5.18 s [pathway-compat-filepath] Using ghc-pkg version 9.8.4 found on system at:
  135. 5.18 s [pathway-compat-filepath] /nix/store/7r9b0bl984hdgd70nf5p8raa55kml491-ghc-9.8.4/bin/ghc-pkg-9.8.4
  136. 5.18 s [pathway-compat-filepath] No ghcjs found
  137. 5.18 s [pathway-compat-filepath] No ghcjs-pkg found
  138. 5.18 s [pathway-compat-filepath] No greencard found
  139. 5.18 s [pathway-compat-filepath] Using haddock version 2.30.0 found on system at:
  140. 5.18 s [pathway-compat-filepath] /nix/store/7r9b0bl984hdgd70nf5p8raa55kml491-ghc-9.8.4/bin/haddock-ghc-9.8.4
  141. 5.18 s [pathway-compat-filepath] No happy found
  142. 5.18 s [pathway-compat-filepath] Using haskell-suite found on system at: haskell-suite-dummy-location
  143. 5.18 s [pathway-compat-filepath] Using haskell-suite-pkg found on system at: haskell-suite-pkg-dummy-location
  144. 5.18 s [pathway-compat-filepath] No hmake found
  145. 5.18 s [pathway-compat-filepath] Using hpc version 0.69 found on system at:
  146. 5.18 s [pathway-compat-filepath] /nix/store/7r9b0bl984hdgd70nf5p8raa55kml491-ghc-9.8.4/bin/hpc-ghc-9.8.4
  147. 5.18 s [pathway-compat-filepath] Using hsc2hs version 0.68.10 found on system at:
  148. 5.18 s [pathway-compat-filepath] /nix/store/7r9b0bl984hdgd70nf5p8raa55kml491-ghc-9.8.4/bin/hsc2hs-ghc-9.8.4
  149. 5.18 s [pathway-compat-filepath] Using hscolour version 1.25 found on system at:
  150. 5.18 s [pathway-compat-filepath] /nix/store/awnxn98rlw62rrjwli6d2lb4d27mrzzw-hscolour-1.25/bin/HsColour
  151. 5.18 s [pathway-compat-filepath] No jhc found
  152. 5.18 s [pathway-compat-filepath] Using ld found on system at:
  153. 5.18 s [pathway-compat-filepath] /nix/store/zjraf40s86y3iwhp626b934r5y6ldkbb-binutils-wrapper-2.46/bin/ld.gold
  154. 5.18 s [pathway-compat-filepath] No pkg-config found
  155. 5.18 s [pathway-compat-filepath] Using runghc version 9.8.4 found on system at:
  156. 5.18 s [pathway-compat-filepath] /nix/store/7r9b0bl984hdgd70nf5p8raa55kml491-ghc-9.8.4/bin/runghc-9.8.4
  157. 5.18 s [pathway-compat-filepath] Using strip version 2.46 found on system at:
  158. 5.18 s [pathway-compat-filepath] /nix/store/29qjlshvklnyr67nhpprzgb9igmsfsjj-gcc-wrapper-15.2.0/bin/strip
  159. 5.18 s [pathway-compat-filepath] Using tar found on system at:
  160. 5.18 s [pathway-compat-filepath] /nix/store/z5mq2sam4484prf3kv6v6vjw1m0i7j24-gnutar-1.35/bin/tar
  161. 5.18 s [pathway-compat-filepath] No uhc found
  162. 5.61 s [pathway-compat-filepath] Phase: buildPhase
  163. 5.67 s [pathway-compat-filepath] Preprocessing library for pathway-compat-filepath-0.0.1.0..
  164. 5.70 s [pathway-compat-filepath] Building library for pathway-compat-filepath-0.0.1.0..
  165. 5.76 s [pathway-compat-filepath] [ 1 of 10] Compiling Common.FilePath ( src/Common/FilePath.hs, dist/build/Common/FilePath.o, dist/build/Common/FilePath.dyn_o )
  166. 6.07 s [pathway-compat-filepath] [ 2 of 10] Compiling Common.OsPath ( src/Common/OsPath.hs, dist/build/Common/OsPath.o, dist/build/Common/OsPath.dyn_o )
  167. 6.07 s [pathway-compat-filepath]
  168. 6.07 s [pathway-compat-filepath] src/Common/OsPath.hs:90:23: error: [GHC-83865]
  169. 6.07 s [pathway-compat-filepath] • Couldn't match type ‘OSS.OsString’ with ‘OsString’
  170. 6.07 s [pathway-compat-filepath] Expected: OsPath
  171. 6.07 s [pathway-compat-filepath] Actual: OSS.OsString
  172. 6.07 s [pathway-compat-filepath] NB: ‘OsString’
  173. 6.07 s [pathway-compat-filepath] is defined in ‘System.OsString.Internal.Types.Hidden’
  174. 6.07 s [pathway-compat-filepath] in package ‘filepath-1.4.301.0’
  175. 6.07 s [pathway-compat-filepath] ‘OSS.OsString’
  176. 6.07 s [pathway-compat-filepath] is defined in ‘System.OsString.Internal.Types’
  177. 6.07 s [pathway-compat-filepath] in package ‘os-string-2.0.10’
  178. 6.07 s [pathway-compat-filepath] • In the ‘parent’ field of a record
  179. 6.07 s [pathway-compat-filepath] In the expression:
  180. 6.07 s [pathway-compat-filepath] Format
  181. 6.07 s [pathway-compat-filepath] {root = O.pack . pure $ O.pathSeparator, current = mempty,
  182. 6.07 s [pathway-compat-filepath] parent = OSS.unsafeEncodeUtf "..",
  183. 6.07 s [pathway-compat-filepath] separator = O.pack . pure $ O.pathSeparator,
  184. 6.07 s [pathway-compat-filepath] substitutions = mempty}
  185. 6.07 s [pathway-compat-filepath] In an equation for ‘localFormat’:
  186. 6.07 s [pathway-compat-filepath] localFormat
  187. 6.07 s [pathway-compat-filepath] = Format
  188. 6.07 s [pathway-compat-filepath] {root = O.pack . pure $ O.pathSeparator, current = mempty,
  189. 6.07 s [pathway-compat-filepath] parent = OSS.unsafeEncodeUtf "..",
  190. 6.07 s [pathway-compat-filepath] separator = O.pack . pure $ O.pathSeparator,
  191. 6.07 s [pathway-compat-filepath] substitutions = mempty}
  192. 6.07 s [pathway-compat-filepath] |
  193. 6.07 s [pathway-compat-filepath] 90 | Format.parent = OSS.unsafeEncodeUtf "..",
  194. 6.07 s [pathway-compat-filepath] | ^^^^^^^^^^^^^^^^^^^^^^^^
  195. 6.07 s [pathway-compat-filepath] [ 3 of 10] Compiling System.FilePath.Thin ( src/System/FilePath/Thin.hs, dist/build/System/FilePath/Thin.o, dist/build/System/FilePath/Thin.dyn_o )
  196. 6.17 s [pathway-compat-filepath] [ 4 of 10] Compiling System.FilePath.Pathway ( src/System/FilePath/Pathway.hs, dist/build/System/FilePath/Pathway.o, dist/build/System/FilePath/Pathway.dyn_o )
  197. 6.20 s [pathway-compat-filepath] [ 5 of 10] Compiling System.FilePath.Overlay ( src/System/FilePath/Overlay.hs, dist/build/System/FilePath/Overlay.o, dist/build/System/FilePath/Overlay.dyn_o )
  198. 6.22 s [pathway-compat-filepath] [ 6 of 10] Compiling System.FilePath ( src/System/FilePath.hs, dist/build/System/FilePath.o, dist/build/System/FilePath.dyn_o )
  199. 6.34 s Progress: 0 of 12 built (1 failed), 2 of 2 downloaded from cache
  200. 6.34 s Failed to build pathway-compat-filepath after 3.7s
  201. 6.34 s error: Cannot build '/nix/store/psj7qq98d0nc1x3mcxvgminpvlszfrfm-pathway-compat-filepath-0.0.1.0.drv'.
  202. 6.34 s Reason: builder failed with exit code 1.
  203. 6.34 s Output paths:
  204. 6.34 s /nix/store/c3wlvp65ypvkb08q9pcr7hq7wygmm4g4-pathway-compat-filepath-0.0.1.0-doc
  205. 6.34 s /nix/store/xghx2j0inbha0jqrcxmvc3ljvvx1i77g-pathway-compat-filepath-0.0.1.0
  206. 6.34 s Last 176 log lines:
  207. 6.34 s > Running phase: setupCompilerEnvironmentPhase
  208. 6.34 s > Build with /nix/store/7r9b0bl984hdgd70nf5p8raa55kml491-ghc-9.8.4.
  209. 6.34 s > Running phase: unpackPhase
  210. 6.34 s > unpacking source archive /nix/store/5z4x7vzkb1m65ccyx19wn7vcxdl9gmbf-filepath
  211. 6.34 s > source root is filepath
  212. 6.34 s > Running phase: patchPhase
  213. 6.34 s > Running phase: compileBuildDriverPhase
  214. 6.34 s > setupCompileFlags: -package-db=/build/tmp.afIePam3tQ/setup-package.conf.d -threaded
  215. 6.34 s > [1 of 2] Compiling Main ( Setup.hs, /build/tmp.afIePam3tQ/Main.o )
  216. 6.34 s > [2 of 2] Linking Setup
  217. 6.34 s > Running phase: updateAutotoolsGnuConfigScriptsPhase
  218. 6.34 s > Running phase: configurePhase
  219. 6.34 s > configureFlags: --verbose --prefix=/nix/store/xghx2j0inbha0jqrcxmvc3ljvvx1i77g-pathway-compat-filepath-0.0.1.0 --libdir=$prefix/lib/$compiler/lib --libsubdir=$abi/$libname --docdir=/nix/store/c3wlvp65ypvkb08q9pcr7hq7wygmm4g4-pathway-compat-filepath-0.0.1.0-doc/share/doc/pathway-compat-filepath-0.0.1.0 --with-gcc=gcc --package-db=/build/tmp.afIePam3tQ/package.conf.d --ghc-option=-j16 --ghc-option=+RTS --ghc-option=-A64M --ghc-option=-RTS --enable-library-profiling --profiling-detail=exported-functions --disable-profiling --enable-shared --disable-coverage --enable-static --disable-executable-dynamic --enable-tests --disable-benchmarks --enable-library-vanilla --disable-library-for-ghci --enable-split-sections --enable-library-stripping --enable-executable-stripping --ghc-option=-haddock --ghc-options=-Werror --extra-lib-dirs=/nix/store/pndhkk0l649lm1sj0mxk7cbwq26qd1ra-ncurses-6.6/lib --extra-lib-dirs=/nix/store/0djlg4g0b81w94k3vcaqsxsc2hh4kism-libffi-3.5.2/lib --extra-lib-dirs=/nix/store/md4paia7riiggyrj8p24c7a6vf8w7jz8-elfutils-0.194/lib --extra-lib-dirs=/nix/store/39vv2pf64gd8li48a4hpbhw2crzd8z5p-gmp-with-cxx-6.3.0/lib --extra-lib-dirs=/nix/store/7wwvald8lapkrsr72qanlw8blyn55ifx-numactl-2.0.18/lib --extra-lib-dirs=/nix/store/7r9b0bl984hdgd70nf5p8raa55kml491-ghc-9.8.4/lib
  220. 6.34 s > Using Parsec parser
  221. 6.34 s > Configuring pathway-compat-filepath-0.0.1.0...
  222. 6.34 s > Flags chosen: noisy-deprecations=True, verify-no-recursion=False
  223. 6.34 s > Dependency base >=4.14.0 && <4.15 || >=4.15.0 && <4.16 || >=4.16.0 && <4.17 ||
  224. 6.34 s > >=4.17.0 && <4.18 || >=4.18.0 && <4.19 || >=4.19.0 && <4.20 || >=4.20.0 &&
  225. 6.34 s > <4.21 || >=4.21.0 && <4.22 || >=4.22.0 && <4.23: using base-4.19.2.0
  226. 6.34 s > Dependency extra: using extra-1.8.1
  227. 6.34 s > Dependency filepath >=1.4.2 && <1.5 || >=1.5.0 && <1.6: using
  228. 6.34 s > filepath-1.4.301.0
  229. 6.34 s > Dependency megaparsec >=9.0.1 && <9.1 || >=9.2.1 && <9.3 || >=9.5.0 && <9.6 ||
  230. 6.34 s > >=9.7.0 && <9.8: using megaparsec-9.7.0
  231. 6.34 s > Dependency os-string: using os-string-2.0.10
  232. 6.34 s > Dependency pathway >=0.0.1 && <0.1: using pathway-0.0.1.0
  233. 6.34 s > Dependency pathway-compat-base >=0.0.1 && <0.1: using
  234. 6.34 s > pathway-compat-base-0.0.1.0
  235. 6.34 s > Dependency pathway-internal >=0.0.1 && <0.1: using pathway-internal-0.0.1.0
  236. 6.34 s > Dependency base >=4.14.0 && <4.15 || >=4.15.0 && <4.16 || >=4.16.0 && <4.17 ||
  237. 6.34 s > >=4.17.0 && <4.18 || >=4.18.0 && <4.19 || >=4.19.0 && <4.20 || >=4.20.0 &&
  238. 6.34 s > <4.21 || >=4.21.0 && <4.22 || >=4.22.0 && <4.23: using base-4.19.2.0
  239. 6.34 s > Dependency doctest >=0.16.3 && <0.17 || >=0.18.1 && <0.19 || >=0.20.1 && <0.21
  240. 6.34 s > || >=0.21.1 && <0.22 || >=0.22.2 && <0.23 || >=0.24.2 && <0.25: using
  241. 6.34 s > doctest-0.24.3
  242. 6.34 s > Dependency pathway-compat-filepath: using pathway-compat-filepath-0.0.1.0
  243. 6.34 s > Source component graph:
  244. 6.34 s > component lib
  245. 6.34 s > component test:doctests dependency lib
  246. 6.34 s > Configured component graph:
  247. 6.34 s > component pathway-compat-filepath-0.0.1.0-6KN1Vlb8yPeBopmlZtXyrR
  248. 6.34 s > include base-4.19.2.0-934f
  249. 6.34 s > include extra-1.8.1-F4oHgTKCper3ZiIUPZjGPK
  250. 6.34 s > include filepath-1.4.301.0-6e15
  251. 6.34 s > include megaparsec-9.7.0-10vHZAF1maw9O8p2gXs66N
  252. 6.34 s > include os-string-2.0.10-HbyG8qgShpTHKXL8bZ3UK8
  253. 6.34 s > include pathway-0.0.1.0-H5uD0SRA9755UrSqFBaCYE
  254. 6.34 s > include pathway-compat-base-0.0.1.0-8ldj6SPXbxq2Shd8yFeOpr
  255. 6.34 s > include pathway-internal-0.0.1.0-Lnjdb2M8cxN196wSdsfQUK
  256. 6.34 s > component pathway-compat-filepath-0.0.1.0-LoaDJ8tbb2m5kfHmaP2B9c-doctests
  257. 6.34 s > include base-4.19.2.0-934f
  258. 6.34 s > include doctest-0.24.3-1aDs7zEYV5r7raSsXr9TQC
  259. 6.34 s > include pathway-compat-filepath-0.0.1.0-6KN1Vlb8yPeBopmlZtXyrR
  260. 6.34 s > Linked component graph:
  261. 6.34 s > unit pathway-compat-filepath-0.0.1.0-6KN1Vlb8yPeBopmlZtXyrR
  262. 6.34 s > include base-4.19.2.0-934f
  263. 6.34 s > include extra-1.8.1-F4oHgTKCper3ZiIUPZjGPK
  264. 6.34 s > include filepath-1.4.301.0-6e15
  265. 6.34 s > include megaparsec-9.7.0-10vHZAF1maw9O8p2gXs66N
  266. 6.34 s > include os-string-2.0.10-HbyG8qgShpTHKXL8bZ3UK8
  267. 6.34 s > include pathway-0.0.1.0-H5uD0SRA9755UrSqFBaCYE
  268. 6.34 s > include pathway-compat-base-0.0.1.0-8ldj6SPXbxq2Shd8yFeOpr
  269. 6.34 s > include pathway-internal-0.0.1.0-Lnjdb2M8cxN196wSdsfQUK
  270. 6.34 s > Common.FilePath=pathway-compat-filepath-0.0.1.0-6KN1Vlb8yPeBopmlZtXyrR:Common.FilePath,Common.OsPath=pathway-compat-filepath-0.0.1.0-6KN1Vlb8yPeBopmlZtXyrR:Common.OsPath,System.FilePath=pathway-compat-filepath-0.0.1.0-6KN1Vlb8yPeBopmlZtXyrR:System.FilePath,System.FilePath.Overlay=pathway-compat-filepath-0.0.1.0-6KN1Vlb8yPeBopmlZtXyrR:System.FilePath.Overlay,System.FilePath.Pathway=pathway-compat-filepath-0.0.1.0-6KN1Vlb8yPeBopmlZtXyrR:System.FilePath.Pathway,System.FilePath.Thin=pathway-compat-filepath-0.0.1.0-6KN1Vlb8yPeBopmlZtXyrR:System.FilePath.Thin,System.OsPath=pathway-compat-filepath-0.0.1.0-6KN1Vlb8yPeBopmlZtXyrR:System.OsPath,System.OsPath.Overlay=pathway-compat-filepath-0.0.1.0-6KN1Vlb8yPeBopmlZtXyrR:System.OsPath.Overlay,System.OsPath.Pathway=pathway-compat-filepath-0.0.1.0-6KN1Vlb8yPeBopmlZtXyrR:System.OsPath.Pathway,System.OsPath.Thin=pathway-compat-filepath-0.0.1.0-6KN1Vlb8yPeBopmlZtXyrR:System.OsPath.Thin
  271. 6.34 s > unit pathway-compat-filepath-0.0.1.0-LoaDJ8tbb2m5kfHmaP2B9c-doctests
  272. 6.34 s > include base-4.19.2.0-934f
  273. 6.34 s > include doctest-0.24.3-1aDs7zEYV5r7raSsXr9TQC
  274. 6.34 s > include pathway-compat-filepath-0.0.1.0-6KN1Vlb8yPeBopmlZtXyrR
  275. 6.34 s > Ready component graph:
  276. 6.34 s > definite pathway-compat-filepath-0.0.1.0-6KN1Vlb8yPeBopmlZtXyrR
  277. 6.34 s > depends base-4.19.2.0-934f
  278. 6.34 s > depends extra-1.8.1-F4oHgTKCper3ZiIUPZjGPK
  279. 6.34 s > depends filepath-1.4.301.0-6e15
  280. 6.34 s > depends megaparsec-9.7.0-10vHZAF1maw9O8p2gXs66N
  281. 6.34 s > depends os-string-2.0.10-HbyG8qgShpTHKXL8bZ3UK8
  282. 6.34 s > depends pathway-0.0.1.0-H5uD0SRA9755UrSqFBaCYE
  283. 6.34 s > depends pathway-compat-base-0.0.1.0-8ldj6SPXbxq2Shd8yFeOpr
  284. 6.34 s > depends pathway-internal-0.0.1.0-Lnjdb2M8cxN196wSdsfQUK
  285. 6.34 s > definite pathway-compat-filepath-0.0.1.0-LoaDJ8tbb2m5kfHmaP2B9c-doctests
  286. 6.34 s > depends base-4.19.2.0-934f
  287. 6.34 s > depends doctest-0.24.3-1aDs7zEYV5r7raSsXr9TQC
  288. 6.34 s > depends pathway-compat-filepath-0.0.1.0-6KN1Vlb8yPeBopmlZtXyrR
  289. 6.34 s > Using Cabal-3.10.3.0 compiled by ghc-9.8
  290. 6.34 s > Using compiler: ghc-9.8.4
  291. 6.34 s > Using install prefix:
  292. 6.34 s > /nix/store/xghx2j0inbha0jqrcxmvc3ljvvx1i77g-pathway-compat-filepath-0.0.1.0
  293. 6.34 s > Executables installed in:
  294. 6.34 s > /nix/store/xghx2j0inbha0jqrcxmvc3ljvvx1i77g-pathway-compat-filepath-0.0.1.0/bin
  295. 6.34 s > Libraries installed in:
  296. 6.34 s > /nix/store/xghx2j0inbha0jqrcxmvc3ljvvx1i77g-pathway-compat-filepath-0.0.1.0/lib/ghc-9.8.4/lib/x86_64-linux-ghc-9.8.4/pathway-compat-filepath-0.0.1.0-6KN1Vlb8yPeBopmlZtXyrR
  297. 6.34 s > Dynamic Libraries installed in:
  298. 6.34 s > /nix/store/xghx2j0inbha0jqrcxmvc3ljvvx1i77g-pathway-compat-filepath-0.0.1.0/lib/ghc-9.8.4/lib/x86_64-linux-ghc-9.8.4
  299. 6.34 s > Private executables installed in:
  300. 6.34 s > /nix/store/xghx2j0inbha0jqrcxmvc3ljvvx1i77g-pathway-compat-filepath-0.0.1.0/libexec/x86_64-linux-ghc-9.8.4/pathway-compat-filepath-0.0.1.0
  301. 6.34 s > Data files installed in:
  302. 6.34 s > /nix/store/xghx2j0inbha0jqrcxmvc3ljvvx1i77g-pathway-compat-filepath-0.0.1.0/share/x86_64-linux-ghc-9.8.4/pathway-compat-filepath-0.0.1.0
  303. 6.34 s > Documentation installed in:
  304. 6.34 s > /nix/store/c3wlvp65ypvkb08q9pcr7hq7wygmm4g4-pathway-compat-filepath-0.0.1.0-doc/share/doc/pathway-compat-filepath-0.0.1.0
  305. 6.34 s > Configuration files installed in:
  306. 6.34 s > /nix/store/xghx2j0inbha0jqrcxmvc3ljvvx1i77g-pathway-compat-filepath-0.0.1.0/etc
  307. 6.34 s > No alex found
  308. 6.34 s > Using ar found on system at:
  309. 6.34 s > /nix/store/zjraf40s86y3iwhp626b934r5y6ldkbb-binutils-wrapper-2.46/bin/ar
  310. 6.34 s > No c2hs found
  311. 6.34 s > No cpphs found
  312. 6.34 s > Using doctest version 0.24.3 found on system at:
  313. 6.34 s > /nix/store/2y183b1vsybv0157vfr59yhdwjkpqfkn-doctest-0.24.3/bin/doctest
  314. 6.34 s > Using gcc version 15.2.0 given by user at:
  315. 6.34 s > /nix/store/29qjlshvklnyr67nhpprzgb9igmsfsjj-gcc-wrapper-15.2.0/bin/gcc
  316. 6.34 s > Using ghc version 9.8.4 found on system at:
  317. 6.34 s > /nix/store/7r9b0bl984hdgd70nf5p8raa55kml491-ghc-9.8.4/bin/ghc
  318. 6.34 s > Using ghc-pkg version 9.8.4 found on system at:
  319. 6.34 s > /nix/store/7r9b0bl984hdgd70nf5p8raa55kml491-ghc-9.8.4/bin/ghc-pkg-9.8.4
  320. 6.34 s > No ghcjs found
  321. 6.34 s > No ghcjs-pkg found
  322. 6.34 s > No greencard found
  323. 6.34 s > Using haddock version 2.30.0 found on system at:
  324. 6.34 s > /nix/store/7r9b0bl984hdgd70nf5p8raa55kml491-ghc-9.8.4/bin/haddock-ghc-9.8.4
  325. 6.34 s > No happy found
  326. 6.34 s > Using haskell-suite found on system at: haskell-suite-dummy-location
  327. 6.34 s > Using haskell-suite-pkg found on system at: haskell-suite-pkg-dummy-location
  328. 6.34 s > No hmake found
  329. 6.34 s > Using hpc version 0.69 found on system at:
  330. 6.34 s > /nix/store/7r9b0bl984hdgd70nf5p8raa55kml491-ghc-9.8.4/bin/hpc-ghc-9.8.4
  331. 6.34 s > Using hsc2hs version 0.68.10 found on system at:
  332. 6.34 s > /nix/store/7r9b0bl984hdgd70nf5p8raa55kml491-ghc-9.8.4/bin/hsc2hs-ghc-9.8.4
  333. 6.34 s > Using hscolour version 1.25 found on system at:
  334. 6.34 s > /nix/store/awnxn98rlw62rrjwli6d2lb4d27mrzzw-hscolour-1.25/bin/HsColour
  335. 6.34 s > No jhc found
  336. 6.34 s > Using ld found on system at:
  337. 6.34 s > /nix/store/zjraf40s86y3iwhp626b934r5y6ldkbb-binutils-wrapper-2.46/bin/ld.gold
  338. 6.34 s > No pkg-config found
  339. 6.34 s > Using runghc version 9.8.4 found on system at:
  340. 6.34 s > /nix/store/7r9b0bl984hdgd70nf5p8raa55kml491-ghc-9.8.4/bin/runghc-9.8.4
  341. 6.34 s > Using strip version 2.46 found on system at:
  342. 6.34 s > /nix/store/29qjlshvklnyr67nhpprzgb9igmsfsjj-gcc-wrapper-15.2.0/bin/strip
  343. 6.34 s > Using tar found on system at:
  344. 6.34 s > /nix/store/z5mq2sam4484prf3kv6v6vjw1m0i7j24-gnutar-1.35/bin/tar
  345. 6.34 s > No uhc found
  346. 6.34 s > Running phase: buildPhase
  347. 6.34 s > Preprocessing library for pathway-compat-filepath-0.0.1.0..
  348. 6.34 s > Building library for pathway-compat-filepath-0.0.1.0..
  349. 6.34 s > [ 1 of 10] Compiling Common.FilePath ( src/Common/FilePath.hs, dist/build/Common/FilePath.o, dist/build/Common/FilePath.dyn_o )
  350. 6.34 s > [ 2 of 10] Compiling Common.OsPath ( src/Common/OsPath.hs, dist/build/Common/OsPath.o, dist/build/Common/OsPath.dyn_o )
  351. 6.34 s >
  352. 6.34 s > src/Common/OsPath.hs:90:23: error: [GHC-83865]
  353. 6.34 s > • Couldn't match type ‘OSS.OsString’ with ‘OsString’
  354. 6.34 s > Expected: OsPath
  355. 6.34 s > Actual: OSS.OsString
  356. 6.34 s > NB: ‘OsString’
  357. 6.34 s > is defined in ‘System.OsString.Internal.Types.Hidden’
  358. 6.34 s > in package ‘filepath-1.4.301.0’
  359. 6.34 s > ‘OSS.OsString’
  360. 6.34 s > is defined in ‘System.OsString.Internal.Types’
  361. 6.34 s > in package ‘os-string-2.0.10’
  362. 6.34 s > • In the ‘parent’ field of a record
  363. 6.34 s > In the expression:
  364. 6.34 s > Format
  365. 6.34 s > {root = O.pack . pure $ O.pathSeparator, current = mempty,
  366. 6.34 s > parent = OSS.unsafeEncodeUtf "..",
  367. 6.34 s > separator = O.pack . pure $ O.pathSeparator,
  368. 6.34 s > substitutions = mempty}
  369. 6.34 s > In an equation for ‘localFormat’:
  370. 6.34 s > localFormat
  371. 6.34 s > = Format
  372. 6.34 s > {root = O.pack . pure $ O.pathSeparator, current = mempty,
  373. 6.34 s > parent = OSS.unsafeEncodeUtf "..",
  374. 6.34 s > separator = O.pack . pure $ O.pathSeparator,
  375. 6.34 s > substitutions = mempty}
  376. 6.34 s > |
  377. 6.34 s > 90 | Format.parent = OSS.unsafeEncodeUtf "..",
  378. 6.34 s > | ^^^^^^^^^^^^^^^^^^^^^^^^
  379. 6.34 s > [ 3 of 10] Compiling System.FilePath.Thin ( src/System/FilePath/Thin.hs, dist/build/System/FilePath/Thin.o, dist/build/System/FilePath/Thin.dyn_o )
  380. 6.34 s > [ 4 of 10] Compiling System.FilePath.Pathway ( src/System/FilePath/Pathway.hs, dist/build/System/FilePath/Pathway.o, dist/build/System/FilePath/Pathway.dyn_o )
  381. 6.34 s > [ 5 of 10] Compiling System.FilePath.Overlay ( src/System/FilePath/Overlay.hs, dist/build/System/FilePath/Overlay.o, dist/build/System/FilePath/Overlay.dyn_o )
  382. 6.34 s > [ 6 of 10] Compiling System.FilePath ( src/System/FilePath.hs, dist/build/System/FilePath.o, dist/build/System/FilePath.dyn_o )
  383. 6.34 s For full logs, run:
  384. 6.34 s nix log /nix/store/psj7qq98d0nc1x3mcxvgminpvlszfrfm-pathway-compat-filepath-0.0.1.0.drv
  385. 6.35 s error: Cannot build '/nix/store/psj7qq98d0nc1x3mcxvgminpvlszfrfm-pathway-compat-filepath-0.0.1.0.drv'.
  386. 6.35 s Reason: builder failed with exit code 1.
  387. 6.35 s Output paths:
  388. 6.35 s /nix/store/c3wlvp65ypvkb08q9pcr7hq7wygmm4g4-pathway-compat-filepath-0.0.1.0-doc
  389. 6.35 s /nix/store/xghx2j0inbha0jqrcxmvc3ljvvx1i77g-pathway-compat-filepath-0.0.1.0
  390. 6.35 s Last 176 log lines:
  391. 6.35 s > Running phase: setupCompilerEnvironmentPhase
  392. 6.35 s > Build with /nix/store/7r9b0bl984hdgd70nf5p8raa55kml491-ghc-9.8.4.
  393. 6.35 s > Running phase: unpackPhase
  394. 6.35 s > unpacking source archive /nix/store/5z4x7vzkb1m65ccyx19wn7vcxdl9gmbf-filepath
  395. 6.35 s > source root is filepath
  396. 6.35 s > Running phase: patchPhase
  397. 6.35 s > Running phase: compileBuildDriverPhase
  398. 6.35 s > setupCompileFlags: -package-db=/build/tmp.afIePam3tQ/setup-package.conf.d -threaded
  399. 6.35 s > [1 of 2] Compiling Main ( Setup.hs, /build/tmp.afIePam3tQ/Main.o )
  400. 6.35 s > [2 of 2] Linking Setup
  401. 6.35 s > Running phase: updateAutotoolsGnuConfigScriptsPhase
  402. 6.35 s > Running phase: configurePhase
  403. 6.35 s > configureFlags: --verbose --prefix=/nix/store/xghx2j0inbha0jqrcxmvc3ljvvx1i77g-pathway-compat-filepath-0.0.1.0 --libdir=$prefix/lib/$compiler/lib --libsubdir=$abi/$libname --docdir=/nix/store/c3wlvp65ypvkb08q9pcr7hq7wygmm4g4-pathway-compat-filepath-0.0.1.0-doc/share/doc/pathway-compat-filepath-0.0.1.0 --with-gcc=gcc --package-db=/build/tmp.afIePam3tQ/package.conf.d --ghc-option=-j16 --ghc-option=+RTS --ghc-option=-A64M --ghc-option=-RTS --enable-library-profiling --profiling-detail=exported-functions --disable-profiling --enable-shared --disable-coverage --enable-static --disable-executable-dynamic --enable-tests --disable-benchmarks --enable-library-vanilla --disable-library-for-ghci --enable-split-sections --enable-library-stripping --enable-executable-stripping --ghc-option=-haddock --ghc-options=-Werror --extra-lib-dirs=/nix/store/pndhkk0l649lm1sj0mxk7cbwq26qd1ra-ncurses-6.6/lib --extra-lib-dirs=/nix/store/0djlg4g0b81w94k3vcaqsxsc2hh4kism-libffi-3.5.2/lib --extra-lib-dirs=/nix/store/md4paia7riiggyrj8p24c7a6vf8w7jz8-elfutils-0.194/lib --extra-lib-dirs=/nix/store/39vv2pf64gd8li48a4hpbhw2crzd8z5p-gmp-with-cxx-6.3.0/lib --extra-lib-dirs=/nix/store/7wwvald8lapkrsr72qanlw8blyn55ifx-numactl-2.0.18/lib --extra-lib-dirs=/nix/store/7r9b0bl984hdgd70nf5p8raa55kml491-ghc-9.8.4/lib
  404. 6.35 s > Using Parsec parser
  405. 6.35 s > Configuring pathway-compat-filepath-0.0.1.0...
  406. 6.35 s > Flags chosen: noisy-deprecations=True, verify-no-recursion=False
  407. 6.35 s > Dependency base >=4.14.0 && <4.15 || >=4.15.0 && <4.16 || >=4.16.0 && <4.17 ||
  408. 6.35 s > >=4.17.0 && <4.18 || >=4.18.0 && <4.19 || >=4.19.0 && <4.20 || >=4.20.0 &&
  409. 6.35 s > <4.21 || >=4.21.0 && <4.22 || >=4.22.0 && <4.23: using base-4.19.2.0
  410. 6.35 s > Dependency extra: using extra-1.8.1
  411. 6.35 s > Dependency filepath >=1.4.2 && <1.5 || >=1.5.0 && <1.6: using
  412. 6.35 s > filepath-1.4.301.0
  413. 6.35 s > Dependency megaparsec >=9.0.1 && <9.1 || >=9.2.1 && <9.3 || >=9.5.0 && <9.6 ||
  414. 6.35 s > >=9.7.0 && <9.8: using megaparsec-9.7.0
  415. 6.35 s > Dependency os-string: using os-string-2.0.10
  416. 6.35 s > Dependency pathway >=0.0.1 && <0.1: using pathway-0.0.1.0
  417. 6.35 s > Dependency pathway-compat-base >=0.0.1 && <0.1: using
  418. 6.35 s > pathway-compat-base-0.0.1.0
  419. 6.35 s > Dependency pathway-internal >=0.0.1 && <0.1: using pathway-internal-0.0.1.0
  420. 6.35 s > Dependency base >=4.14.0 && <4.15 || >=4.15.0 && <4.16 || >=4.16.0 && <4.17 ||
  421. 6.35 s > >=4.17.0 && <4.18 || >=4.18.0 && <4.19 || >=4.19.0 && <4.20 || >=4.20.0 &&
  422. 6.35 s > <4.21 || >=4.21.0 && <4.22 || >=4.22.0 && <4.23: using base-4.19.2.0
  423. 6.35 s > Dependency doctest >=0.16.3 && <0.17 || >=0.18.1 && <0.19 || >=0.20.1 && <0.21
  424. 6.35 s > || >=0.21.1 && <0.22 || >=0.22.2 && <0.23 || >=0.24.2 && <0.25: using
  425. 6.35 s > doctest-0.24.3
  426. 6.35 s > Dependency pathway-compat-filepath: using pathway-compat-filepath-0.0.1.0
  427. 6.35 s > Source component graph:
  428. 6.35 s > component lib
  429. 6.35 s > component test:doctests dependency lib
  430. 6.35 s > Configured component graph:
  431. 6.35 s > component pathway-compat-filepath-0.0.1.0-6KN1Vlb8yPeBopmlZtXyrR
  432. 6.35 s > include base-4.19.2.0-934f
  433. 6.35 s > include extra-1.8.1-F4oHgTKCper3ZiIUPZjGPK
  434. 6.35 s > include filepath-1.4.301.0-6e15
  435. 6.35 s > include megaparsec-9.7.0-10vHZAF1maw9O8p2gXs66N
  436. 6.35 s > include os-string-2.0.10-HbyG8qgShpTHKXL8bZ3UK8
  437. 6.35 s > include pathway-0.0.1.0-H5uD0SRA9755UrSqFBaCYE
  438. 6.35 s > include pathway-compat-base-0.0.1.0-8ldj6SPXbxq2Shd8yFeOpr
  439. 6.35 s > include pathway-internal-0.0.1.0-Lnjdb2M8cxN196wSdsfQUK
  440. 6.35 s > component pathway-compat-filepath-0.0.1.0-LoaDJ8tbb2m5kfHmaP2B9c-doctests
  441. 6.35 s > include base-4.19.2.0-934f
  442. 6.35 s > include doctest-0.24.3-1aDs7zEYV5r7raSsXr9TQC
  443. 6.35 s > include pathway-compat-filepath-0.0.1.0-6KN1Vlb8yPeBopmlZtXyrR
  444. 6.35 s > Linked component graph:
  445. 6.35 s > unit pathway-compat-filepath-0.0.1.0-6KN1Vlb8yPeBopmlZtXyrR
  446. 6.35 s > include base-4.19.2.0-934f
  447. 6.35 s > include extra-1.8.1-F4oHgTKCper3ZiIUPZjGPK
  448. 6.35 s > include filepath-1.4.301.0-6e15
  449. 6.35 s > include megaparsec-9.7.0-10vHZAF1maw9O8p2gXs66N
  450. 6.35 s > include os-string-2.0.10-HbyG8qgShpTHKXL8bZ3UK8
  451. 6.35 s > include pathway-0.0.1.0-H5uD0SRA9755UrSqFBaCYE
  452. 6.35 s > include pathway-compat-base-0.0.1.0-8ldj6SPXbxq2Shd8yFeOpr
  453. 6.35 s > include pathway-internal-0.0.1.0-Lnjdb2M8cxN196wSdsfQUK
  454. 6.35 s > Common.FilePath=pathway-compat-filepath-0.0.1.0-6KN1Vlb8yPeBopmlZtXyrR:Common.FilePath,Common.OsPath=pathway-compat-filepath-0.0.1.0-6KN1Vlb8yPeBopmlZtXyrR:Common.OsPath,System.FilePath=pathway-compat-filepath-0.0.1.0-6KN1Vlb8yPeBopmlZtXyrR:System.FilePath,System.FilePath.Overlay=pathway-compat-filepath-0.0.1.0-6KN1Vlb8yPeBopmlZtXyrR:System.FilePath.Overlay,System.FilePath.Pathway=pathway-compat-filepath-0.0.1.0-6KN1Vlb8yPeBopmlZtXyrR:System.FilePath.Pathway,System.FilePath.Thin=pathway-compat-filepath-0.0.1.0-6KN1Vlb8yPeBopmlZtXyrR:System.FilePath.Thin,System.OsPath=pathway-compat-filepath-0.0.1.0-6KN1Vlb8yPeBopmlZtXyrR:System.OsPath,System.OsPath.Overlay=pathway-compat-filepath-0.0.1.0-6KN1Vlb8yPeBopmlZtXyrR:System.OsPath.Overlay,System.OsPath.Pathway=pathway-compat-filepath-0.0.1.0-6KN1Vlb8yPeBopmlZtXyrR:System.OsPath.Pathway,System.OsPath.Thin=pathway-compat-filepath-0.0.1.0-6KN1Vlb8yPeBopmlZtXyrR:System.OsPath.Thin
  455. 6.35 s > unit pathway-compat-filepath-0.0.1.0-LoaDJ8tbb2m5kfHmaP2B9c-doctests
  456. 6.35 s > include base-4.19.2.0-934f
  457. 6.35 s > include doctest-0.24.3-1aDs7zEYV5r7raSsXr9TQC
  458. 6.35 s > include pathway-compat-filepath-0.0.1.0-6KN1Vlb8yPeBopmlZtXyrR
  459. 6.35 s > Ready component graph:
  460. 6.35 s > definite pathway-compat-filepath-0.0.1.0-6KN1Vlb8yPeBopmlZtXyrR
  461. 6.35 s > depends base-4.19.2.0-934f
  462. 6.35 s > depends extra-1.8.1-F4oHgTKCper3ZiIUPZjGPK
  463. 6.35 s > depends filepath-1.4.301.0-6e15
  464. 6.35 s > depends megaparsec-9.7.0-10vHZAF1maw9O8p2gXs66N
  465. 6.35 s > depends os-string-2.0.10-HbyG8qgShpTHKXL8bZ3UK8
  466. 6.35 s > depends pathway-0.0.1.0-H5uD0SRA9755UrSqFBaCYE
  467. 6.35 s > depends pathway-compat-base-0.0.1.0-8ldj6SPXbxq2Shd8yFeOpr
  468. 6.35 s > depends pathway-internal-0.0.1.0-Lnjdb2M8cxN196wSdsfQUK
  469. 6.35 s > definite pathway-compat-filepath-0.0.1.0-LoaDJ8tbb2m5kfHmaP2B9c-doctests
  470. 6.35 s > depends base-4.19.2.0-934f
  471. 6.35 s > depends doctest-0.24.3-1aDs7zEYV5r7raSsXr9TQC
  472. 6.35 s > depends pathway-compat-filepath-0.0.1.0-6KN1Vlb8yPeBopmlZtXyrR
  473. 6.35 s > Using Cabal-3.10.3.0 compiled by ghc-9.8
  474. 6.35 s > Using compiler: ghc-9.8.4
  475. 6.35 s > Using install prefix:
  476. 6.35 s > /nix/store/xghx2j0inbha0jqrcxmvc3ljvvx1i77g-pathway-compat-filepath-0.0.1.0
  477. 6.35 s > Executables installed in:
  478. 6.35 s > /nix/store/xghx2j0inbha0jqrcxmvc3ljvvx1i77g-pathway-compat-filepath-0.0.1.0/bin
  479. 6.35 s > Libraries installed in:
  480. 6.35 s > /nix/store/xghx2j0inbha0jqrcxmvc3ljvvx1i77g-pathway-compat-filepath-0.0.1.0/lib/ghc-9.8.4/lib/x86_64-linux-ghc-9.8.4/pathway-compat-filepath-0.0.1.0-6KN1Vlb8yPeBopmlZtXyrR
  481. 6.35 s > Dynamic Libraries installed in:
  482. 6.35 s > /nix/store/xghx2j0inbha0jqrcxmvc3ljvvx1i77g-pathway-compat-filepath-0.0.1.0/lib/ghc-9.8.4/lib/x86_64-linux-ghc-9.8.4
  483. 6.35 s > Private executables installed in:
  484. 6.35 s > /nix/store/xghx2j0inbha0jqrcxmvc3ljvvx1i77g-pathway-compat-filepath-0.0.1.0/libexec/x86_64-linux-ghc-9.8.4/pathway-compat-filepath-0.0.1.0
  485. 6.35 s > Data files installed in:
  486. 6.35 s > /nix/store/xghx2j0inbha0jqrcxmvc3ljvvx1i77g-pathway-compat-filepath-0.0.1.0/share/x86_64-linux-ghc-9.8.4/pathway-compat-filepath-0.0.1.0
  487. 6.35 s > Documentation installed in:
  488. 6.35 s > /nix/store/c3wlvp65ypvkb08q9pcr7hq7wygmm4g4-pathway-compat-filepath-0.0.1.0-doc/share/doc/pathway-compat-filepath-0.0.1.0
  489. 6.35 s > Configuration files installed in:
  490. 6.35 s > /nix/store/xghx2j0inbha0jqrcxmvc3ljvvx1i77g-pathway-compat-filepath-0.0.1.0/etc
  491. 6.35 s > No alex found
  492. 6.35 s > Using ar found on system at:
  493. 6.35 s > /nix/store/zjraf40s86y3iwhp626b934r5y6ldkbb-binutils-wrapper-2.46/bin/ar
  494. 6.35 s > No c2hs found
  495. 6.35 s > No cpphs found
  496. 6.35 s > Using doctest version 0.24.3 found on system at:
  497. 6.35 s > /nix/store/2y183b1vsybv0157vfr59yhdwjkpqfkn-doctest-0.24.3/bin/doctest
  498. 6.35 s > Using gcc version 15.2.0 given by user at:
  499. 6.35 s > /nix/store/29qjlshvklnyr67nhpprzgb9igmsfsjj-gcc-wrapper-15.2.0/bin/gcc
  500. 6.35 s > Using ghc version 9.8.4 found on system at:
  501. 6.35 s > /nix/store/7r9b0bl984hdgd70nf5p8raa55kml491-ghc-9.8.4/bin/ghc
  502. 6.35 s > Using ghc-pkg version 9.8.4 found on system at:
  503. 6.35 s > /nix/store/7r9b0bl984hdgd70nf5p8raa55kml491-ghc-9.8.4/bin/ghc-pkg-9.8.4
  504. 6.35 s > No ghcjs found
  505. 6.35 s > No ghcjs-pkg found
  506. 6.35 s > No greencard found
  507. 6.35 s > Using haddock version 2.30.0 found on system at:
  508. 6.35 s > /nix/store/7r9b0bl984hdgd70nf5p8raa55kml491-ghc-9.8.4/bin/haddock-ghc-9.8.4
  509. 6.35 s > No happy found
  510. 6.35 s > Using haskell-suite found on system at: haskell-suite-dummy-location
  511. 6.35 s > Using haskell-suite-pkg found on system at: haskell-suite-pkg-dummy-location
  512. 6.35 s > No hmake found
  513. 6.35 s > Using hpc version 0.69 found on system at:
  514. 6.35 s > /nix/store/7r9b0bl984hdgd70nf5p8raa55kml491-ghc-9.8.4/bin/hpc-ghc-9.8.4
  515. 6.35 s > Using hsc2hs version 0.68.10 found on system at:
  516. 6.35 s > /nix/store/7r9b0bl984hdgd70nf5p8raa55kml491-ghc-9.8.4/bin/hsc2hs-ghc-9.8.4
  517. 6.35 s > Using hscolour version 1.25 found on system at:
  518. 6.35 s > /nix/store/awnxn98rlw62rrjwli6d2lb4d27mrzzw-hscolour-1.25/bin/HsColour
  519. 6.35 s > No jhc found
  520. 6.35 s > Using ld found on system at:
  521. 6.35 s > /nix/store/zjraf40s86y3iwhp626b934r5y6ldkbb-binutils-wrapper-2.46/bin/ld.gold
  522. 6.35 s > No pkg-config found
  523. 6.35 s > Using runghc version 9.8.4 found on system at:
  524. 6.35 s > /nix/store/7r9b0bl984hdgd70nf5p8raa55kml491-ghc-9.8.4/bin/runghc-9.8.4
  525. 6.35 s > Using strip version 2.46 found on system at:
  526. 6.35 s > /nix/store/29qjlshvklnyr67nhpprzgb9igmsfsjj-gcc-wrapper-15.2.0/bin/strip
  527. 6.35 s > Using tar found on system at:
  528. 6.35 s > /nix/store/z5mq2sam4484prf3kv6v6vjw1m0i7j24-gnutar-1.35/bin/tar
  529. 6.35 s > No uhc found
  530. 6.35 s > Running phase: buildPhase
  531. 6.35 s > Preprocessing library for pathway-compat-filepath-0.0.1.0..
  532. 6.35 s > Building library for pathway-compat-filepath-0.0.1.0..
  533. 6.35 s > [ 1 of 10] Compiling Common.FilePath ( src/Common/FilePath.hs, dist/build/Common/FilePath.o, dist/build/Common/FilePath.dyn_o )
  534. 6.35 s > [ 2 of 10] Compiling Common.OsPath ( src/Common/OsPath.hs, dist/build/Common/OsPath.o, dist/build/Common/OsPath.dyn_o )
  535. 6.35 s >
  536. 6.35 s > src/Common/OsPath.hs:90:23: error: [GHC-83865]
  537. 6.35 s > • Couldn't match type ‘OSS.OsString’ with ‘OsString’
  538. 6.35 s > Expected: OsPath
  539. 6.35 s > Actual: OSS.OsString
  540. 6.35 s > NB: ‘OsString’
  541. 6.35 s > is defined in ‘System.OsString.Internal.Types.Hidden’
  542. 6.35 s > in package ‘filepath-1.4.301.0’
  543. 6.35 s > ‘OSS.OsString’
  544. 6.35 s > is defined in ‘System.OsString.Internal.Types’
  545. 6.35 s > in package ‘os-string-2.0.10’
  546. 6.35 s > • In the ‘parent’ field of a record
  547. 6.35 s > In the expression:
  548. 6.35 s > Format
  549. 6.35 s > {root = O.pack . pure $ O.pathSeparator, current = mempty,
  550. 6.35 s > parent = OSS.unsafeEncodeUtf "..",
  551. 6.35 s > separator = O.pack . pure $ O.pathSeparator,
  552. 6.35 s > substitutions = mempty}
  553. 6.35 s > In an equation for ‘localFormat’:
  554. 6.35 s > localFormat
  555. 6.35 s > = Format
  556. 6.35 s > {root = O.pack . pure $ O.pathSeparator, current = mempty,
  557. 6.35 s > parent = OSS.unsafeEncodeUtf "..",
  558. 6.35 s > separator = O.pack . pure $ O.pathSeparator,
  559. 6.35 s > substitutions = mempty}
  560. 6.35 s > |
  561. 6.35 s > 90 | Format.parent = OSS.unsafeEncodeUtf "..",
  562. 6.35 s > | ^^^^^^^^^^^^^^^^^^^^^^^^
  563. 6.35 s > [ 3 of 10] Compiling System.FilePath.Thin ( src/System/FilePath/Thin.hs, dist/build/System/FilePath/Thin.o, dist/build/System/FilePath/Thin.dyn_o )
  564. 6.35 s > [ 4 of 10] Compiling System.FilePath.Pathway ( src/System/FilePath/Pathway.hs, dist/build/System/FilePath/Pathway.o, dist/build/System/FilePath/Pathway.dyn_o )
  565. 6.35 s > [ 5 of 10] Compiling System.FilePath.Overlay ( src/System/FilePath/Overlay.hs, dist/build/System/FilePath/Overlay.o, dist/build/System/FilePath/Overlay.dyn_o )
  566. 6.35 s > [ 6 of 10] Compiling System.FilePath ( src/System/FilePath.hs, dist/build/System/FilePath.o, dist/build/System/FilePath.dyn_o )
  567. 6.35 s For full logs, run:
  568. 6.35 s nix log /nix/store/psj7qq98d0nc1x3mcxvgminpvlszfrfm-pathway-compat-filepath-0.0.1.0.drv
  569. 6.35 s error: Cannot build '/nix/store/mdvhamhmncfil55by5mc62fj69n99c1w-ghc-9.8.4-with-packages.drv'.
  570. 6.35 s Reason: 1 dependency failed.
  571. 6.35 s Output paths:
  572. 6.35 s /nix/store/1vvvayslravlsnbd962y9bsp4c7jiah4-ghc-9.8.4-with-packages
  573. 6.35 s error: Cannot build '/nix/store/gcbdv7d9xmvf3jabhv7lbf50a4k5v0fr-pathway-compat-directory-0.0.1.0.drv'.
  574. 6.35 s Reason: 1 dependency failed.
  575. 6.35 s Output paths:
  576. 6.35 s /nix/store/lvz4jclqs4hqq1k7fi74rl20419aaqmb-pathway-compat-directory-0.0.1.0-doc
  577. 6.35 s /nix/store/prcri98x3bq55i3pffsm2c0z5bzjivpn-pathway-compat-directory-0.0.1.0
  578. 6.35 s error: Cannot build '/nix/store/9a7ba0q649sjp2fjr2p7yi6l6nv7byak-pathway-compat-file-io-0.0.1.0.drv'.
  579. 6.35 s Reason: 1 dependency failed.
  580. 6.35 s Output paths:
  581. 6.35 s /nix/store/hdd4f2is9svyj3zx5czk0mblia6i8w1a-pathway-compat-file-io-0.0.1.0
  582. 6.35 s /nix/store/j2d5178hlcgldkj6jcq2cv6q83ny0rrf-pathway-compat-file-io-0.0.1.0-doc
  583. 6.35 s error: Cannot build '/nix/store/q4yq83in56ixb5fi8pprb2xbkwr7kr8k-pathway-compat-temporary-0.0.1.0.drv'.
  584. 6.35 s Reason: 1 dependency failed.
  585. 6.35 s Output paths:
  586. 6.35 s /nix/store/lklwgvwpcq480fqmdc66fzc45nj1iphl-pathway-compat-temporary-0.0.1.0-doc
  587. 6.35 s /nix/store/zvmf2y70q878a2fgdpk9mqznfca8j5nl-pathway-compat-temporary-0.0.1.0
  588. 6.35 s error: Cannot build '/nix/store/b8ay2gw1cg8jpdkd4j5nnn95zrmnypv8-pathway-system-0.0.1.0.drv'.
  589. 6.35 s Reason: 1 dependency failed.
  590. 6.35 s Output paths:
  591. 6.35 s /nix/store/chy1q398chqybipav6k9l04drrrmg2ks-pathway-system-0.0.1.0
  592. 6.35 s /nix/store/k1vv04ssh3mky3f4y6s9m92vh0ia5sxq-pathway-system-0.0.1.0-doc
  593. 6.35 s error: Build failed due to failed dependency
  594. 6.35 s error: Cannot build '/nix/store/45nwy0mckisgy5fbckfqw9v5qjaqj1pk-all-packages.drv'.
  595. 6.35 s Reason: 1 dependency failed.
  596. 6.35 s Output paths:
  597. 6.35 s /nix/store/j5jvn7qhq6j0j8hjffc4b4zlrk8kz60j-all-packages
  598. 6.35 s Build failed due to failed dependency
  599. 6.38 s Build failed.