build packages.x86_64-linux.ghc984_all
0.65 s
$ /nix/store/9ypz3flqsrl5xl495mm8h645gadjsxi1-coreutils-9.11/bin/timeout --kill-after=15s 7200s /nix/store/23zk8sgzamrbmj1fday15szf7f2279s8-nix-2.34.7/bin/nix --extra-experimental-features nix-command --extra-experimental-features flakes --log-format internal-json build --no-link --print-out-paths git+https://github.com/sellout/pathway?ref=more-system&rev=315332dbcaa9f1016fc658995abc767abdaec679&shallow=1#packages.x86_64-linux.ghc984_all --print-build-logs
0.70 s
warning: ignoring untrusted flake configuration setting 'allow-import-from-derivation'.
0.70 s
Pass '--accept-flake-config' to trust it
0.70 s
warning: ignoring untrusted flake configuration setting 'extra-experimental-features'.
0.70 s
Pass '--accept-flake-config' to trust it
0.70 s
warning: ignoring untrusted flake configuration setting 'extra-substituters'.
0.70 s
Pass '--accept-flake-config' to trust it
0.70 s
warning: ignoring untrusted flake configuration setting 'extra-trusted-public-keys'.
0.70 s
Pass '--accept-flake-config' to trust it
0.70 s
warning: ignoring untrusted flake configuration setting 'sandbox'.
0.70 s
Pass '--accept-flake-config' to trust it
0.70 s
warning: ignoring untrusted flake configuration setting 'use-registries'.
0.70 s
Pass '--accept-flake-config' to trust it
1.32 s
1.35 s
Building /nix/store/siarl9knqf5iavgr8f3fk89dmn0c8rzd-cabal2nix-pathway.drv
1.41 s
[cabal2nix-pathway:post-build] Uploading to cachix cache "sellout": /nix/store/nlg0d1nga760psy9zh3b4ddaf5g2wc3p-cabal2nix-pathway
1.76 s
[cabal2nix-pathway:post-build] Nothing to push - all store paths are already on Cachix.
1.78 s
[cabal2nix-pathway:post-build] Uploading to the NixCI cache: /nix/store/nlg0d1nga760psy9zh3b4ddaf5g2wc3p-cabal2nix-pathway
1.81 s
[cabal2nix-pathway:post-build] warning: 'warn-short-path-literals' is deprecated, use 'lint-short-path-literals = ignore' instead
1.88 s
[cabal2nix-pathway:post-build] copying 0 paths...
1.93 s
[cabal2nix-pathway:post-build] warning: 'warn-short-path-literals' is deprecated, use 'lint-short-path-literals = ignore' instead
2.02 s
[cabal2nix-pathway:post-build] copying 0 paths...
2.04 s
Uploaded cabal2nix-pathway in 638ms
2.04 s
Progress: 1 of 2 built
2.04 s
Built cabal2nix-pathway in 688ms
2.04 s
Progress: 2 of 2 built
2.04 s
2.06 s
Building /nix/store/ii2myyssg9vj1dq27bkfifzrfwyfh7z1-cabal2nix-pathway-compat-base.drv
2.12 s
[cabal2nix-pathway-compat-base:post-build] Uploading to cachix cache "sellout": /nix/store/a808rk6gds80sbgb23p9v9mqn58msax9-cabal2nix-pathway-compat-base
2.56 s
[cabal2nix-pathway-compat-base:post-build] Nothing to push - all store paths are already on Cachix.
2.57 s
[cabal2nix-pathway-compat-base:post-build] Uploading to the NixCI cache: /nix/store/a808rk6gds80sbgb23p9v9mqn58msax9-cabal2nix-pathway-compat-base
2.62 s
[cabal2nix-pathway-compat-base:post-build] warning: 'warn-short-path-literals' is deprecated, use 'lint-short-path-literals = ignore' instead
2.65 s
[cabal2nix-pathway-compat-base:post-build] copying 0 paths...
2.70 s
[cabal2nix-pathway-compat-base:post-build] warning: 'warn-short-path-literals' is deprecated, use 'lint-short-path-literals = ignore' instead
2.78 s
[cabal2nix-pathway-compat-base:post-build] copying 0 paths...
2.79 s
Uploaded cabal2nix-pathway-compat-base in 679ms
2.79 s
Progress: 1 of 2 built
2.79 s
Built cabal2nix-pathway-compat-base in 729ms
2.79 s
Progress: 2 of 2 built
2.80 s
2.82 s
Building /nix/store/fvi474dd0z1hy4frkp608a05qjsvhhsm-cabal2nix-pathway-compat-directory.drv
2.87 s
[cabal2nix-pathway-compat-directory:post-build] Uploading to cachix cache "sellout": /nix/store/8rwpw52s4c6hbqa87r6wncqccgyvbsxq-cabal2nix-pathway-compat-directory
3.27 s
[cabal2nix-pathway-compat-directory:post-build] Nothing to push - all store paths are already on Cachix.
3.28 s
[cabal2nix-pathway-compat-directory:post-build] Uploading to the NixCI cache: /nix/store/8rwpw52s4c6hbqa87r6wncqccgyvbsxq-cabal2nix-pathway-compat-directory
3.32 s
[cabal2nix-pathway-compat-directory:post-build] warning: 'warn-short-path-literals' is deprecated, use 'lint-short-path-literals = ignore' instead
3.35 s
[cabal2nix-pathway-compat-directory:post-build] copying 0 paths...
3.40 s
[cabal2nix-pathway-compat-directory:post-build] warning: 'warn-short-path-literals' is deprecated, use 'lint-short-path-literals = ignore' instead
3.48 s
[cabal2nix-pathway-compat-directory:post-build] copying 0 paths...
3.50 s
Uploaded cabal2nix-pathway-compat-directory in 630ms
3.50 s
Progress: 1 of 2 built
3.50 s
Built cabal2nix-pathway-compat-directory in 679ms
3.50 s
Progress: 2 of 2 built
3.50 s
3.52 s
Building /nix/store/ngk9584k1amxsjr7gs5y0rjaabhrwvxm-cabal2nix-pathway-compat-file-io.drv
3.59 s
[cabal2nix-pathway-compat-file-io:post-build] Uploading to cachix cache "sellout": /nix/store/ykz91wq5cyx9j16v0b7jvy6ibdj46942-cabal2nix-pathway-compat-file-io
3.94 s
[cabal2nix-pathway-compat-file-io:post-build] Nothing to push - all store paths are already on Cachix.
3.95 s
[cabal2nix-pathway-compat-file-io:post-build] Uploading to the NixCI cache: /nix/store/ykz91wq5cyx9j16v0b7jvy6ibdj46942-cabal2nix-pathway-compat-file-io
3.99 s
[cabal2nix-pathway-compat-file-io:post-build] warning: 'warn-short-path-literals' is deprecated, use 'lint-short-path-literals = ignore' instead
4.02 s
[cabal2nix-pathway-compat-file-io:post-build] copying 0 paths...
4.08 s
[cabal2nix-pathway-compat-file-io:post-build] warning: 'warn-short-path-literals' is deprecated, use 'lint-short-path-literals = ignore' instead
4.17 s
[cabal2nix-pathway-compat-file-io:post-build] copying 0 paths...
4.18 s
Uploaded cabal2nix-pathway-compat-file-io in 604ms
4.18 s
Progress: 1 of 2 built
4.18 s
Built cabal2nix-pathway-compat-file-io in 660ms
4.18 s
Progress: 2 of 2 built
4.19 s
4.21 s
Building /nix/store/6wwqzr2va1anbl52gnqsi9b3iyn35bxv-cabal2nix-pathway-compat-filepath.drv
4.28 s
[cabal2nix-pathway-compat-filepath:post-build] Uploading to cachix cache "sellout": /nix/store/psg6xvbcmsxz513a806y0zrb2jhdnbh5-cabal2nix-pathway-compat-filepath
4.71 s
[cabal2nix-pathway-compat-filepath:post-build] Nothing to push - all store paths are already on Cachix.
4.72 s
[cabal2nix-pathway-compat-filepath:post-build] Uploading to the NixCI cache: /nix/store/psg6xvbcmsxz513a806y0zrb2jhdnbh5-cabal2nix-pathway-compat-filepath
4.77 s
[cabal2nix-pathway-compat-filepath:post-build] warning: 'warn-short-path-literals' is deprecated, use 'lint-short-path-literals = ignore' instead
4.80 s
[cabal2nix-pathway-compat-filepath:post-build] copying 0 paths...
4.85 s
[cabal2nix-pathway-compat-filepath:post-build] warning: 'warn-short-path-literals' is deprecated, use 'lint-short-path-literals = ignore' instead
4.93 s
[cabal2nix-pathway-compat-filepath:post-build] copying 0 paths...
4.94 s
Uploaded cabal2nix-pathway-compat-filepath in 680ms
4.94 s
Progress: 1 of 2 built
4.94 s
Built cabal2nix-pathway-compat-filepath in 732ms
4.94 s
Progress: 2 of 2 built
4.95 s
4.97 s
Building /nix/store/114rsbsdf4q55dg71csls3p1kcg5rji8-cabal2nix-pathway-compat-temporary.drv
5.04 s
[cabal2nix-pathway-compat-temporary:post-build] Uploading to cachix cache "sellout": /nix/store/k3icd1h30w92yvb47bcf25gnlp25nxg1-cabal2nix-pathway-compat-temporary
5.48 s
[cabal2nix-pathway-compat-temporary:post-build] Nothing to push - all store paths are already on Cachix.
5.50 s
[cabal2nix-pathway-compat-temporary:post-build] Uploading to the NixCI cache: /nix/store/k3icd1h30w92yvb47bcf25gnlp25nxg1-cabal2nix-pathway-compat-temporary
5.54 s
[cabal2nix-pathway-compat-temporary:post-build] warning: 'warn-short-path-literals' is deprecated, use 'lint-short-path-literals = ignore' instead
5.57 s
[cabal2nix-pathway-compat-temporary:post-build] copying 0 paths...
5.62 s
[cabal2nix-pathway-compat-temporary:post-build] warning: 'warn-short-path-literals' is deprecated, use 'lint-short-path-literals = ignore' instead
5.70 s
[cabal2nix-pathway-compat-temporary:post-build] copying 0 paths...
5.72 s
Uploaded cabal2nix-pathway-compat-temporary in 693ms
5.72 s
Progress: 1 of 2 built
5.77 s
Built cabal2nix-pathway-compat-temporary in 793ms
5.77 s
Progress: 2 of 2 built
5.77 s
5.77 s
Building /nix/store/qq3pmj6smgpf71bc0sm1bvs4bkr6p638-cabal2nix-pathway-internal.drv
5.81 s
[cabal2nix-pathway-internal:post-build] Uploading to cachix cache "sellout": /nix/store/gpfj1h1nmmgylzb44dxnb5ikz701l1iv-cabal2nix-pathway-internal
6.17 s
[cabal2nix-pathway-internal:post-build] Nothing to push - all store paths are already on Cachix.
6.19 s
[cabal2nix-pathway-internal:post-build] Uploading to the NixCI cache: /nix/store/gpfj1h1nmmgylzb44dxnb5ikz701l1iv-cabal2nix-pathway-internal
6.23 s
[cabal2nix-pathway-internal:post-build] warning: 'warn-short-path-literals' is deprecated, use 'lint-short-path-literals = ignore' instead
6.26 s
[cabal2nix-pathway-internal:post-build] copying 0 paths...
6.31 s
[cabal2nix-pathway-internal:post-build] warning: 'warn-short-path-literals' is deprecated, use 'lint-short-path-literals = ignore' instead
6.40 s
[cabal2nix-pathway-internal:post-build] copying 0 paths...
6.42 s
Uploaded cabal2nix-pathway-internal in 614ms
6.42 s
Progress: 1 of 2 built
6.42 s
Built cabal2nix-pathway-internal in 649ms
6.42 s
Progress: 2 of 2 built
6.42 s
6.45 s
Building /nix/store/app972f1cwdsvm6pqhk5sms7nha1ilh6-cabal2nix-pathway-path.drv
6.51 s
[cabal2nix-pathway-path:post-build] Uploading to cachix cache "sellout": /nix/store/p8r223n18p4xqh840q0sdcpp6r2czfdl-cabal2nix-pathway-path
6.87 s
[cabal2nix-pathway-path:post-build] Nothing to push - all store paths are already on Cachix.
6.89 s
[cabal2nix-pathway-path:post-build] Uploading to the NixCI cache: /nix/store/p8r223n18p4xqh840q0sdcpp6r2czfdl-cabal2nix-pathway-path
6.94 s
[cabal2nix-pathway-path:post-build] warning: 'warn-short-path-literals' is deprecated, use 'lint-short-path-literals = ignore' instead
6.97 s
[cabal2nix-pathway-path:post-build] copying 0 paths...
7.02 s
[cabal2nix-pathway-path:post-build] warning: 'warn-short-path-literals' is deprecated, use 'lint-short-path-literals = ignore' instead
7.10 s
[cabal2nix-pathway-path:post-build] copying 0 paths...
7.11 s
Uploaded cabal2nix-pathway-path in 613ms
7.11 s
Progress: 1 of 2 built
7.11 s
Built cabal2nix-pathway-path in 663ms
7.11 s
Progress: 2 of 2 built
7.12 s
7.14 s
Building /nix/store/xh53xszfx3b121b5lzd6rmmnc4df4a0y-cabal2nix-pathway-quickcheck.drv
7.21 s
[cabal2nix-pathway-quickcheck:post-build] Uploading to cachix cache "sellout": /nix/store/8s9mf029vqnss6jqa78jawa5p47cac9n-cabal2nix-pathway-quickcheck
7.57 s
[cabal2nix-pathway-quickcheck:post-build] Nothing to push - all store paths are already on Cachix.
7.59 s
[cabal2nix-pathway-quickcheck:post-build] Uploading to the NixCI cache: /nix/store/8s9mf029vqnss6jqa78jawa5p47cac9n-cabal2nix-pathway-quickcheck
7.64 s
[cabal2nix-pathway-quickcheck:post-build] warning: 'warn-short-path-literals' is deprecated, use 'lint-short-path-literals = ignore' instead
7.67 s
[cabal2nix-pathway-quickcheck:post-build] copying 0 paths...
7.73 s
[cabal2nix-pathway-quickcheck:post-build] warning: 'warn-short-path-literals' is deprecated, use 'lint-short-path-literals = ignore' instead
7.83 s
[cabal2nix-pathway-quickcheck:post-build] copying 0 paths...
7.85 s
Uploaded cabal2nix-pathway-quickcheck in 650ms
7.85 s
Progress: 1 of 2 built
7.85 s
Built cabal2nix-pathway-quickcheck in 707ms
7.85 s
Progress: 2 of 2 built
7.85 s
7.88 s
Building /nix/store/ligrfjv580qqxjr4d2yvsf9c6fkkvwk4-cabal2nix-pathway-system.drv
7.94 s
[cabal2nix-pathway-system:post-build] Uploading to cachix cache "sellout": /nix/store/w30xk8y0xnaj3placw3vd4aghw4hfbwb-cabal2nix-pathway-system
8.32 s
[cabal2nix-pathway-system:post-build] Nothing to push - all store paths are already on Cachix.
8.34 s
[cabal2nix-pathway-system:post-build] Uploading to the NixCI cache: /nix/store/w30xk8y0xnaj3placw3vd4aghw4hfbwb-cabal2nix-pathway-system
8.39 s
[cabal2nix-pathway-system:post-build] warning: 'warn-short-path-literals' is deprecated, use 'lint-short-path-literals = ignore' instead
8.42 s
[cabal2nix-pathway-system:post-build] copying 0 paths...
8.48 s
[cabal2nix-pathway-system:post-build] warning: 'warn-short-path-literals' is deprecated, use 'lint-short-path-literals = ignore' instead
8.57 s
[cabal2nix-pathway-system:post-build] copying 0 paths...
8.59 s
Uploaded cabal2nix-pathway-system in 657ms
8.59 s
Progress: 1 of 2 built
8.59 s
Built cabal2nix-pathway-system in 709ms
8.59 s
Progress: 2 of 2 built
8.69 s
10.25 s
Downloading cached colour-2.3.6-data from https://cache.nix-ci.com
10.25 s
Downloading cached ghc-9.8.4-doc from https://cache.nix-ci.com
10.26 s
Downloading cached hscolour from https://cache.nix-ci.com
10.28 s
Downloaded cached colour-2.3.6-data (2536 B) in 22ms
10.28 s
Progress: 0 of 106 built, 1 of 180 downloaded from cache (2 downloading)
10.35 s
Downloaded cached hscolour (2.5 MiB) in 90ms
10.35 s
Progress: 0 of 106 built, 2 of 180 downloaded from cache (1 downloading)
16.27 s
Downloaded cached ghc-9.8.4-doc (687.1 MiB) in 6.0s
16.27 s
Progress: 0 of 105 built, 3 of 180 downloaded from cache
16.27 s
Downloading cached OneTuple-0.4.2-doc from https://cache.nix-ci.com
16.31 s
Downloading cached StateVar-1.2.2-doc from https://cache.nix-ci.com
16.31 s
Downloading cached assoc-1.1.1-doc from https://cache.nix-ci.com
16.31 s
Downloading cached base-orphans-0.9.3-doc from https://cache.nix-ci.com
16.31 s
Downloading cached cabal-doctest-1.0.12-doc from https://sellout.cachix.org
16.31 s
Downloading cached call-stack-0.4.0-doc from https://cache.nix-ci.com
16.31 s
Downloading cached character-ps-0.1-doc from https://cache.nix-ci.com
16.31 s
Downloading cached clock-0.8.4-doc from https://cache.nix-ci.com
16.31 s
Downloading cached code-page-0.2.1-doc from https://cache.nix-ci.com
16.31 s
Downloading cached colour-2.3.6-doc from https://cache.nix-ci.com
16.31 s
Downloading cached dlist-1.0-doc from https://cache.nix-ci.com
16.31 s
Downloading cached file-io-0.1.5-doc from https://cache.nix-ci.com
16.31 s
Downloading cached generically-0.1.1-doc from https://cache.nix-ci.com
16.31 s
Downloading cached ghc from https://cache.nix-ci.com
16.31 s
Downloading cached ghc-paths-0.1.0.12-doc from https://cache.nix-ci.com
16.31 s
Downloading cached indexed-traversable-0.1.4-doc from https://cache.nix-ci.com
16.32 s
Downloaded cached OneTuple-0.4.2-doc (270 KiB) in 49ms
16.32 s
Progress: 0 of 104 built, 4 of 180 downloaded from cache (15 downloading)
16.32 s
Downloading cached integer-logarithms-1.0.4-doc from https://cache.nix-ci.com
16.32 s
Downloaded cached clock-0.8.4-doc (517 KiB) in 3ms
16.32 s
Progress: 0 of 104 built, 5 of 180 downloaded from cache (15 downloading)
16.32 s
Downloading cached old-locale-1.0.0.7-doc from https://cache.nix-ci.com
16.32 s
Downloaded cached code-page-0.2.1-doc (276 KiB) in 11ms
16.32 s
Progress: 0 of 104 built, 6 of 180 downloaded from cache (15 downloading)
16.32 s
Downloading cached extra-1.8.1-doc from https://cache.nix-ci.com
16.32 s
Downloaded cached assoc-1.1.1-doc (192 KiB) in 12ms
16.32 s
Progress: 0 of 104 built, 7 of 180 downloaded from cache (15 downloading)
16.33 s
Downloading cached os-string-2.0.8-doc from https://cache.nix-ci.com
16.33 s
Downloaded cached base-orphans-0.9.3-doc (1.1 MiB) in 12ms
16.33 s
Progress: 0 of 104 built, 8 of 180 downloaded from cache (15 downloading)
16.33 s
Downloading cached parallel-3.2.2.0-doc from https://cache.nix-ci.com
16.33 s
Downloaded cached StateVar-1.2.2-doc (299 KiB) in 12ms
16.33 s
Progress: 0 of 104 built, 9 of 180 downloaded from cache (15 downloading)
16.33 s
Downloading cached parser-combinators-1.3.0-doc from https://cache.nix-ci.com
16.33 s
Downloaded cached colour-2.3.6-doc (2 MiB) in 14ms
16.33 s
Progress: 0 of 104 built, 10 of 180 downloaded from cache (15 downloading)
16.33 s
Downloading cached contravariant-1.5.5-doc from https://cache.nix-ci.com
16.33 s
Downloaded cached old-locale-1.0.0.7-doc (164 KiB) in 15ms
16.33 s
Progress: 0 of 104 built, 11 of 180 downloaded from cache (15 downloading)
16.33 s
Downloaded cached integer-logarithms-1.0.4-doc (354 KiB) in 16ms
16.33 s
Progress: 0 of 104 built, 12 of 180 downloaded from cache (15 downloading)
16.33 s
Downloading cached ansi-terminal-types-1.1.3-doc from https://cache.nix-ci.com
16.33 s
Downloading cached old-time-1.1.0.4-doc from https://cache.nix-ci.com
16.33 s
Downloaded cached file-io-0.1.5-doc (676 KiB) in 21ms
16.33 s
Downloaded cached ghc-paths-0.1.0.12-doc (121 KiB) in 21ms
16.33 s
Progress: 0 of 104 built, 13 of 180 downloaded from cache (15 downloading)
16.33 s
Downloaded cached dlist-1.0-doc (532 KiB) in 21ms
16.33 s
Downloading cached prettyprinter-1.7.1-doc from https://cache.nix-ci.com
16.34 s
Downloaded cached generically-0.1.1-doc (180 KiB) in 21ms
16.34 s
Progress: 0 of 104 built, 14 of 180 downloaded from cache (15 downloading)
16.34 s
Progress: 0 of 104 built, 15 of 180 downloaded from cache (14 downloading)
16.34 s
Downloaded cached call-stack-0.4.0-doc (203 KiB) in 22ms
16.34 s
Downloading cached primitive-0.9.1.0-doc from https://cache.nix-ci.com
16.34 s
Downloading cached reflection-2.1.9-doc from https://cache.nix-ci.com
16.34 s
Progress: 0 of 104 built, 16 of 180 downloaded from cache (15 downloading)
16.34 s
Progress: 0 of 104 built, 17 of 180 downloaded from cache (14 downloading)
16.34 s
Downloading cached semigroups-0.20-doc from https://cache.nix-ci.com
16.34 s
Downloading cached splitmix-0.1.3.1-doc from https://cache.nix-ci.com
16.34 s
Downloaded cached character-ps-0.1-doc (1 MiB) in 23ms
16.34 s
Progress: 0 of 104 built, 18 of 180 downloaded from cache (15 downloading)
16.34 s
Downloading cached syb-0.7.2.4-doc from https://cache.nix-ci.com
16.34 s
Downloaded cached indexed-traversable-0.1.4-doc (1.1 MiB) in 23ms
16.34 s
Progress: 0 of 104 built, 19 of 180 downloaded from cache (15 downloading)
16.34 s
Downloading cached tagged-0.8.9-doc from https://cache.nix-ci.com
16.36 s
Downloaded cached parallel-3.2.2.0-doc (1 MiB) in 31ms
16.36 s
Downloaded cached contravariant-1.5.5-doc (949 KiB) in 29ms
16.36 s
Progress: 0 of 104 built, 20 of 180 downloaded from cache (15 downloading)
16.36 s
Progress: 0 of 104 built, 21 of 180 downloaded from cache (15 downloading)
16.36 s
Downloading cached th-abstraction-0.7.1.0-doc from https://cache.nix-ci.com
16.36 s
Downloading cached th-compat-0.1.6-doc from https://cache.nix-ci.com
16.36 s
Downloaded cached parser-combinators-1.3.0-doc (900 KiB) in 33ms
16.36 s
Progress: 0 of 104 built, 22 of 180 downloaded from cache (15 downloading)
16.36 s
Downloading cached transformers-base-0.4.6-doc from https://cache.nix-ci.com
16.36 s
Downloaded cached ansi-terminal-types-1.1.3-doc (661 KiB) in 28ms
16.36 s
Progress: 0 of 104 built, 23 of 180 downloaded from cache (15 downloading)
16.36 s
Downloading cached transformers-compat-0.7.2-doc from https://cache.nix-ci.com
16.37 s
Downloaded cached extra-1.8.1-doc (3.1 MiB) in 45ms
16.37 s
Progress: 0 of 104 built, 24 of 180 downloaded from cache (15 downloading)
16.37 s
Downloading cached ansi-terminal-1.1.3-doc from https://cache.nix-ci.com
16.37 s
Downloaded cached os-string-2.0.8-doc (3.6 MiB) in 47ms
16.37 s
Progress: 0 of 104 built, 25 of 180 downloaded from cache (15 downloading)
16.37 s
Downloading cached unliftio-core-0.2.1.0-doc from https://cache.nix-ci.com
16.37 s
Downloaded cached semigroups-0.20-doc (189 KiB) in 38ms
16.37 s
Progress: 0 of 104 built, 26 of 180 downloaded from cache (15 downloading)
16.37 s
Downloading cached hashable-1.5.0.0-doc from https://cache.nix-ci.com
16.38 s
Downloaded cached old-time-1.1.0.4-doc (533 KiB) in 45ms
16.38 s
Downloaded cached reflection-2.1.9-doc (570 KiB) in 43ms
16.38 s
Progress: 0 of 104 built, 27 of 180 downloaded from cache (15 downloading)
16.38 s
Downloading cached vector-stream-0.1.0.1-doc from https://cache.nix-ci.com
16.38 s
Progress: 0 of 104 built, 28 of 180 downloaded from cache (15 downloading)
16.38 s
Downloading cached void-0.7.3-doc from https://cache.nix-ci.com
16.38 s
Downloaded cached splitmix-0.1.3.1-doc (553 KiB) in 44ms
16.38 s
Progress: 0 of 104 built, 29 of 180 downloaded from cache (15 downloading)
16.38 s
Downloading cached random-1.2.1.3-doc from https://cache.nix-ci.com
16.38 s
Downloaded cached prettyprinter-1.7.1-doc (3.1 MiB) in 45ms
16.38 s
Progress: 0 of 104 built, 30 of 180 downloaded from cache (15 downloading)
16.38 s
Downloaded cached tagged-0.8.9-doc (612 KiB) in 46ms
16.38 s
Progress: 0 of 104 built, 31 of 180 downloaded from cache (14 downloading)
16.38 s
Downloading cached distributive-0.6.2.1-doc from https://cache.nix-ci.com
16.39 s
Downloaded cached transformers-base-0.4.6-doc (182 KiB) in 27ms
16.39 s
Progress: 0 of 104 built, 32 of 180 downloaded from cache (14 downloading)
16.39 s
Downloaded cached primitive-0.9.1.0-doc (5.4 MiB) in 52ms
16.39 s
Progress: 0 of 104 built, 33 of 180 downloaded from cache (13 downloading)
16.39 s
Downloaded cached syb-0.7.2.4-doc (1.2 MiB) in 51ms
16.39 s
Downloading cached integer-conversion-0.1.1-doc from https://cache.nix-ci.com
16.39 s
Progress: 0 of 104 built, 34 of 180 downloaded from cache (13 downloading)
16.39 s
Downloaded cached th-compat-0.1.6-doc (515 KiB) in 30ms
16.39 s
Progress: 0 of 104 built, 35 of 180 downloaded from cache (12 downloading)
16.39 s
Downloading cached network-uri-2.6.4.2-doc from https://cache.nix-ci.com
16.39 s
Downloaded cached transformers-compat-0.7.2-doc (1.9 MiB) in 29ms
16.39 s
Progress: 0 of 104 built, 36 of 180 downloaded from cache (12 downloading)
16.39 s
Downloaded cached th-abstraction-0.7.1.0-doc (2.1 MiB) in 34ms
16.39 s
Progress: 0 of 104 built, 37 of 180 downloaded from cache (11 downloading)
16.39 s
Downloaded cached unliftio-core-0.2.1.0-doc (270 KiB) in 21ms
16.39 s
Progress: 0 of 104 built, 38 of 180 downloaded from cache (10 downloading)
16.39 s
Downloaded cached ansi-terminal-1.1.3-doc (866 KiB) in 23ms
16.39 s
Progress: 0 of 104 built, 39 of 180 downloaded from cache (9 downloading)
16.39 s
Downloading cached prettyprinter-ansi-terminal-1.1.3-doc from https://cache.nix-ci.com
16.40 s
Downloaded cached hashable-1.5.0.0-doc (1.2 MiB) in 23ms
16.40 s
Progress: 0 of 104 built, 40 of 180 downloaded from cache (9 downloading)
16.40 s
Downloading cached case-insensitive-1.2.1.0-doc from https://cache.nix-ci.com
16.40 s
Downloading cached data-fix-0.3.4-doc from https://cache.nix-ci.com
16.40 s
Downloading cached scientific-0.3.8.0-doc from https://cache.nix-ci.com
16.40 s
Downloading cached text-short-0.1.6-doc from https://cache.nix-ci.com
16.40 s
Downloading cached these-1.2.1-doc from https://cache.nix-ci.com
16.40 s
Downloading cached time-compat-1.9.8-doc from https://cache.nix-ci.com
16.40 s
Downloading cached unordered-containers-0.2.20.1-doc from https://cache.nix-ci.com
16.40 s
Downloaded cached void-0.7.3-doc (118 KiB) in 21ms
16.40 s
Progress: 0 of 104 built, 41 of 180 downloaded from cache (15 downloading)
16.41 s
Downloaded cached vector-stream-0.1.0.1-doc (1.5 MiB) in 26ms
16.41 s
Progress: 0 of 104 built, 42 of 180 downloaded from cache (14 downloading)
16.41 s
Downloaded cached distributive-0.6.2.1-doc (490 KiB) in 23ms
16.41 s
Progress: 0 of 104 built, 43 of 180 downloaded from cache (13 downloading)
16.41 s
Downloading cached comonad-5.0.9-doc from https://cache.nix-ci.com
16.41 s
Downloaded cached integer-conversion-0.1.1-doc (241 KiB) in 23ms
16.41 s
Progress: 0 of 104 built, 44 of 180 downloaded from cache (13 downloading)
16.41 s
Downloaded cached random-1.2.1.3-doc (2.5 MiB) in 33ms
16.41 s
Progress: 0 of 104 built, 45 of 180 downloaded from cache (12 downloading)
16.41 s
Downloading cached QuickCheck-2.15.0.1-doc from https://cache.nix-ci.com
16.41 s
Downloading cached temporary-1.3-doc from https://cache.nix-ci.com
16.41 s
Downloading cached uuid-types-1.0.6-doc from https://cache.nix-ci.com
16.42 s
Downloaded cached network-uri-2.6.4.2-doc (1 MiB) in 28ms
16.42 s
Progress: 0 of 104 built, 46 of 180 downloaded from cache (14 downloading)
16.42 s
Downloaded cached prettyprinter-ansi-terminal-1.1.3-doc (518 KiB) in 26ms
16.42 s
Progress: 0 of 104 built, 47 of 180 downloaded from cache (13 downloading)
16.42 s
Downloading cached optparse-applicative-0.18.1.0-doc from https://cache.nix-ci.com
16.42 s
Downloaded cached case-insensitive-1.2.1.0-doc (270 KiB) in 24ms
16.42 s
Progress: 0 of 104 built, 48 of 180 downloaded from cache (13 downloading)
16.43 s
Downloaded cached data-fix-0.3.4-doc (426 KiB) in 29ms
16.43 s
Progress: 0 of 104 built, 49 of 180 downloaded from cache (12 downloading)
16.43 s
Downloaded cached scientific-0.3.8.0-doc (988 KiB) in 31ms
16.43 s
Progress: 0 of 104 built, 50 of 180 downloaded from cache (11 downloading)
16.43 s
Downloading cached megaparsec-9.7.0-doc from https://cache.nix-ci.com
16.43 s
Downloaded cached text-short-0.1.6-doc (1.1 MiB) in 33ms
16.43 s
Progress: 0 of 104 built, 51 of 180 downloaded from cache (11 downloading)
16.43 s
Downloaded cached these-1.2.1-doc (1 MiB) in 33ms
16.43 s
Progress: 0 of 104 built, 52 of 180 downloaded from cache (10 downloading)
16.43 s
Downloading cached strict-0.5.1-doc from https://cache.nix-ci.com
16.44 s
Downloaded cached comonad-5.0.9-doc (1.5 MiB) in 30ms
16.44 s
Progress: 0 of 104 built, 53 of 180 downloaded from cache (10 downloading)
16.44 s
Downloading cached bifunctors-5.6.2-doc from https://cache.nix-ci.com
16.44 s
Downloaded cached temporary-1.3-doc (238 KiB) in 24ms
16.44 s
Progress: 0 of 104 built, 54 of 180 downloaded from cache (10 downloading)
16.44 s
Downloading cached doctest-0.24.2-doc from https://cache.nix-ci.com
16.44 s
Downloaded cached uuid-types-1.0.6-doc (596 KiB) in 26ms
16.44 s
Progress: 0 of 104 built, 55 of 180 downloaded from cache (10 downloading)
16.44 s
Downloaded cached time-compat-1.9.8-doc (2.4 MiB) in 43ms
16.44 s
Progress: 0 of 104 built, 56 of 180 downloaded from cache (9 downloading)
16.44 s
Downloading cached text-iso8601-0.1.1-doc from https://cache.nix-ci.com
16.44 s
Downloaded cached unordered-containers-0.2.20.1-doc (4.5 MiB) in 44ms
16.44 s
Progress: 0 of 104 built, 57 of 180 downloaded from cache (9 downloading)
16.44 s
Downloading cached indexed-traversable-instances-0.1.2-doc from https://cache.nix-ci.com
16.45 s
Downloaded cached QuickCheck-2.15.0.1-doc (6.2 MiB) in 40ms
16.46 s
Progress: 0 of 104 built, 58 of 180 downloaded from cache (9 downloading)
16.46 s
Downloaded cached optparse-applicative-0.18.1.0-doc (3.9 MiB) in 34ms
16.46 s
Progress: 0 of 104 built, 59 of 180 downloaded from cache (8 downloading)
16.46 s
Downloading cached tasty-1.5.3-doc from https://cache.nix-ci.com
16.46 s
Downloaded cached strict-0.5.1-doc (1.5 MiB) in 24ms
16.46 s
Progress: 0 of 104 built, 60 of 180 downloaded from cache (8 downloading)
16.46 s
Downloading cached quickcheck-instances-0.3.33-doc from https://cache.nix-ci.com
16.47 s
Downloaded cached text-iso8601-0.1.1-doc (573 KiB) in 22ms
16.47 s
Progress: 0 of 104 built, 61 of 180 downloaded from cache (8 downloading)
16.47 s
Downloaded cached indexed-traversable-instances-0.1.2-doc (186 KiB) in 21ms
16.47 s
Progress: 0 of 104 built, 62 of 180 downloaded from cache (7 downloading)
16.47 s
Downloading cached witherable-0.5-doc from https://cache.nix-ci.com
16.47 s
Downloaded cached doctest-0.24.2-doc (1.6 MiB) in 28ms
16.47 s
Progress: 0 of 104 built, 63 of 180 downloaded from cache (7 downloading)
16.47 s
Downloaded cached megaparsec-9.7.0-doc (5.2 MiB) in 36ms
16.47 s
Progress: 0 of 104 built, 64 of 180 downloaded from cache (6 downloading)
16.47 s
Downloaded cached bifunctors-5.6.2-doc (3.5 MiB) in 33ms
16.47 s
Progress: 0 of 104 built, 65 of 180 downloaded from cache (5 downloading)
16.47 s
Downloading cached profunctors-5.6.3-doc from https://cache.nix-ci.com
16.47 s
Downloading cached semigroupoids-6.0.1-doc from https://cache.nix-ci.com
16.48 s
Downloaded cached cabal-doctest-1.0.12-doc (358 KiB) in 162ms
16.48 s
Progress: 0 of 104 built, 66 of 180 downloaded from cache (6 downloading)
16.49 s
Downloaded cached quickcheck-instances-0.3.33-doc (1.5 MiB) in 27ms
16.49 s
Progress: 0 of 104 built, 67 of 180 downloaded from cache (5 downloading)
16.49 s
Downloaded cached tasty-1.5.3-doc (3.2 MiB) in 33ms
16.49 s
Progress: 0 of 104 built, 68 of 180 downloaded from cache (4 downloading)
16.49 s
Downloaded cached witherable-0.5-doc (1.1 MiB) in 25ms
16.49 s
Progress: 0 of 104 built, 69 of 180 downloaded from cache (3 downloading)
16.51 s
Downloaded cached profunctors-5.6.3-doc (5.2 MiB) in 38ms
16.51 s
Progress: 0 of 104 built, 70 of 180 downloaded from cache (2 downloading)
16.51 s
Downloading cached invariant-0.6.4-doc from https://cache.nix-ci.com
16.51 s
Downloaded cached semigroupoids-6.0.1-doc (5.7 MiB) in 39ms
16.51 s
Progress: 0 of 104 built, 71 of 180 downloaded from cache (2 downloading)
16.51 s
Downloading cached free-5.2-doc from https://cache.nix-ci.com
16.51 s
Downloading cached either-5.0.3-doc from https://cache.nix-ci.com
16.51 s
Downloading cached semialign-1.3.1-doc from https://cache.nix-ci.com
16.54 s
Downloaded cached either-5.0.3-doc (453 KiB) in 27ms
16.54 s
Progress: 0 of 104 built, 72 of 180 downloaded from cache (4 downloading)
16.54 s
Downloaded cached semialign-1.3.1-doc (1.3 MiB) in 28ms
16.54 s
Progress: 0 of 104 built, 73 of 180 downloaded from cache (3 downloading)
16.54 s
Downloading cached aeson-2.2.3.0-doc from https://cache.nix-ci.com
16.54 s
Downloaded cached invariant-0.6.4-doc (2.1 MiB) in 30ms
16.54 s
Progress: 0 of 104 built, 74 of 180 downloaded from cache (3 downloading)
16.55 s
Downloaded cached free-5.2-doc (6 MiB) in 41ms
16.55 s
Progress: 0 of 104 built, 75 of 180 downloaded from cache (2 downloading)
16.55 s
Downloading cached adjunctions-4.4.3-doc from https://cache.nix-ci.com
16.55 s
Downloading cached recursion-schemes-5.2.3-doc from https://cache.nix-ci.com
16.57 s
Downloaded cached recursion-schemes-5.2.3-doc (2 MiB) in 14ms
16.57 s
Progress: 0 of 104 built, 76 of 180 downloaded from cache (3 downloading)
16.57 s
Downloading cached variant-1.0.1-doc from https://cache.nix-ci.com
16.58 s
Downloaded cached adjunctions-4.4.3-doc (2 MiB) in 29ms
16.58 s
Progress: 0 of 104 built, 77 of 180 downloaded from cache (3 downloading)
16.58 s
Downloading cached kan-extensions-5.2.7-doc from https://cache.nix-ci.com
16.59 s
Downloaded cached variant-1.0.1-doc (4.8 MiB) in 23ms
16.59 s
Progress: 0 of 104 built, 78 of 180 downloaded from cache (3 downloading)
16.60 s
Downloaded cached aeson-2.2.3.0-doc (14 MiB) in 64ms
16.60 s
Progress: 0 of 104 built, 79 of 180 downloaded from cache (2 downloading)
16.61 s
Downloaded cached kan-extensions-5.2.7-doc (2.3 MiB) in 29ms
16.61 s
Progress: 0 of 104 built, 80 of 180 downloaded from cache (1 downloading)
16.61 s
Downloading cached lens-5.3.5-doc from https://cache.nix-ci.com
16.76 s
Downloaded cached lens-5.3.5-doc (34.8 MiB) in 146ms
16.76 s
Progress: 0 of 104 built, 81 of 180 downloaded from cache (1 downloading)
16.76 s
Downloading cached yaya-0.6.2.3-doc from https://cache.nix-ci.com
16.78 s
Downloaded cached yaya-0.6.2.3-doc (2.7 MiB) in 16ms
16.78 s
Progress: 0 of 104 built, 82 of 180 downloaded from cache (1 downloading)
16.78 s
Downloading cached pathway-internal-0.0.1.0-doc from https://cache.nix-ci.com
16.78 s
Downloading cached yaya-containers-0.1.2.2-doc from https://cache.nix-ci.com
16.78 s
Downloading cached yaya-quickcheck-0.2.0.3-doc from https://cache.nix-ci.com
16.78 s
Downloading cached yaya-unsafe-0.4.1.4-doc from https://cache.nix-ci.com
16.79 s
Downloaded cached yaya-quickcheck-0.2.0.3-doc (269 KiB) in 9ms
16.79 s
Progress: 0 of 104 built, 83 of 180 downloaded from cache (4 downloading)
16.79 s
Downloaded cached yaya-unsafe-0.4.1.4-doc (661 KiB) in 12ms
16.79 s
Progress: 0 of 104 built, 84 of 180 downloaded from cache (3 downloading)
16.79 s
Downloaded cached pathway-internal-0.0.1.0-doc (612 KiB) in 12ms
16.79 s
Progress: 0 of 104 built, 85 of 180 downloaded from cache (2 downloading)
16.79 s
Downloading cached pathway-quickcheck-0.0.1.0-doc from https://cache.nix-ci.com
16.79 s
Downloaded cached yaya-containers-0.1.2.2-doc (1.1 MiB) in 13ms
16.79 s
Progress: 0 of 103 built, 86 of 180 downloaded from cache (2 downloading)
16.79 s
Downloading cached pathway-0.0.1.0-doc from https://cache.nix-ci.com
16.80 s
Downloaded cached pathway-quickcheck-0.0.1.0-doc (217 KiB) in 6ms
16.80 s
Progress: 0 of 103 built, 87 of 180 downloaded from cache (2 downloading)
16.80 s
Downloaded cached pathway-0.0.1.0-doc (1.3 MiB) in 10ms
16.80 s
Progress: 0 of 102 built, 88 of 180 downloaded from cache (1 downloading)
16.80 s
Downloading cached pathway-compat-base-0.0.1.0-doc from https://cache.nix-ci.com
16.80 s
Downloading cached pathway-path-0.0.1.0-doc from https://cache.nix-ci.com
16.81 s
Downloaded cached pathway-path-0.0.1.0-doc (263 KiB) in 8ms
16.81 s
Progress: 0 of 101 built, 89 of 180 downloaded from cache (2 downloading)
16.82 s
Downloaded cached pathway-compat-base-0.0.1.0-doc (1.9 MiB) in 14ms
16.82 s
Progress: 0 of 100 built, 90 of 180 downloaded from cache (1 downloading)
31.07 s
Downloaded cached ghc (1.8 GiB) in 14.7s
31.07 s
Progress: 0 of 99 built, 91 of 180 downloaded from cache
31.08 s
Downloading cached OneTuple from https://cache.nix-ci.com
31.17 s
Downloading cached StateVar from https://cache.nix-ci.com
31.17 s
Downloading cached assoc from https://cache.nix-ci.com
31.17 s
Downloading cached base-orphans from https://cache.nix-ci.com
31.17 s
Downloading cached cabal-doctest from https://sellout.cachix.org
31.17 s
Downloading cached call-stack from https://cache.nix-ci.com
31.17 s
Downloading cached character-ps from https://cache.nix-ci.com
31.17 s
Downloading cached clock from https://cache.nix-ci.com
31.17 s
Downloading cached code-page from https://cache.nix-ci.com
31.17 s
Downloading cached colour from https://cache.nix-ci.com
31.17 s
Downloading cached dlist from https://cache.nix-ci.com
31.17 s
Downloading cached file-io from https://cache.nix-ci.com
31.17 s
Downloading cached generically from https://cache.nix-ci.com
31.17 s
Downloading cached ghc-paths from https://cache.nix-ci.com
31.17 s
Downloading cached indexed-traversable from https://cache.nix-ci.com
31.17 s
Downloading cached integer-logarithms from https://cache.nix-ci.com
31.18 s
Downloaded cached OneTuple (74 KiB) in 106ms
31.18 s
Downloaded cached StateVar (380 KiB) in 15ms
31.18 s
Progress: 0 of 98 built, 92 of 180 downloaded from cache (15 downloading)
31.18 s
Downloaded cached assoc (169 KiB) in 15ms
31.18 s
Downloading cached old-locale from https://cache.nix-ci.com
31.18 s
Progress: 0 of 97 built, 93 of 180 downloaded from cache (15 downloading)
31.18 s
Progress: 0 of 97 built, 94 of 180 downloaded from cache (14 downloading)
31.18 s
Downloading cached os-string from https://cache.nix-ci.com
31.18 s
Downloading cached parallel from https://cache.nix-ci.com
31.19 s
Downloaded cached clock (1.8 MiB) in 26ms
31.19 s
Progress: 0 of 95 built, 95 of 180 downloaded from cache (15 downloading)
31.19 s
Downloading cached contravariant from https://cache.nix-ci.com
31.20 s
Downloaded cached ghc-paths (101 KiB) in 27ms
31.20 s
Progress: 0 of 94 built, 96 of 180 downloaded from cache (15 downloading)
31.20 s
Downloading cached extra from https://cache.nix-ci.com
31.20 s
Downloaded cached generically (31 KiB) in 28ms
31.20 s
Progress: 0 of 94 built, 97 of 180 downloaded from cache (15 downloading)
31.20 s
Downloading cached parser-combinators from https://cache.nix-ci.com
31.20 s
Downloaded cached call-stack (280 KiB) in 30ms
31.20 s
Progress: 0 of 93 built, 98 of 180 downloaded from cache (15 downloading)
31.20 s
Downloading cached prettyprinter from https://cache.nix-ci.com
31.20 s
Downloaded cached code-page (365 KiB) in 31ms
31.20 s
Progress: 0 of 92 built, 99 of 180 downloaded from cache (15 downloading)
31.20 s
Downloaded cached old-locale (531 KiB) in 17ms
31.20 s
Downloading cached primitive from https://cache.nix-ci.com
31.20 s
Progress: 0 of 92 built, 100 of 180 downloaded from cache (15 downloading)
31.20 s
Downloading cached reflection from https://cache.nix-ci.com
31.20 s
Downloaded cached colour (5.3 MiB) in 33ms
31.20 s
Progress: 0 of 91 built, 101 of 180 downloaded from cache (15 downloading)
31.20 s
Downloading cached old-time from https://cache.nix-ci.com
31.20 s
Downloaded cached integer-logarithms (898 KiB) in 34ms
31.20 s
Progress: 0 of 90 built, 102 of 180 downloaded from cache (15 downloading)
31.20 s
Downloading cached ansi-terminal-types from https://cache.nix-ci.com
31.20 s
Downloaded cached file-io (1.1 MiB) in 35ms
31.20 s
Progress: 0 of 89 built, 103 of 180 downloaded from cache (15 downloading)
31.20 s
Downloading cached semigroups from https://cache.nix-ci.com
31.20 s
Downloaded cached dlist (1.4 MiB) in 36ms
31.20 s
Progress: 0 of 88 built, 104 of 180 downloaded from cache (15 downloading)
31.20 s
Downloaded cached parallel (1.4 MiB) in 21ms
31.20 s
Downloading cached splitmix from https://cache.nix-ci.com
31.20 s
Progress: 0 of 87 built, 105 of 180 downloaded from cache (15 downloading)
31.20 s
Downloading cached syb from https://cache.nix-ci.com
31.21 s
Downloaded cached base-orphans (1.8 MiB) in 37ms
31.21 s
Progress: 0 of 86 built, 106 of 180 downloaded from cache (15 downloading)
31.21 s
Downloading cached tagged from https://cache.nix-ci.com
31.21 s
Downloaded cached character-ps (2.2 MiB) in 38ms
31.21 s
Progress: 0 of 85 built, 107 of 180 downloaded from cache (15 downloading)
31.21 s
Downloading cached th-abstraction from https://cache.nix-ci.com
31.21 s
Downloaded cached indexed-traversable (3.8 MiB) in 42ms
31.21 s
Progress: 0 of 84 built, 108 of 180 downloaded from cache (15 downloading)
31.21 s
Downloading cached th-compat from https://cache.nix-ci.com
31.22 s
Downloaded cached contravariant (1.9 MiB) in 23ms
31.22 s
Progress: 0 of 83 built, 109 of 180 downloaded from cache (15 downloading)
31.22 s
Downloading cached transformers-compat from https://cache.nix-ci.com
31.22 s
Downloaded cached os-string (5.9 MiB) in 36ms
31.22 s
Progress: 0 of 82 built, 110 of 180 downloaded from cache (15 downloading)
31.22 s
Downloading cached unliftio-core from https://cache.nix-ci.com
31.22 s
Downloaded cached parser-combinators (1.9 MiB) in 27ms
31.22 s
Progress: 0 of 81 built, 111 of 180 downloaded from cache (15 downloading)
31.22 s
Downloading cached hashable from https://cache.nix-ci.com
31.23 s
Downloaded cached semigroups (258 KiB) in 22ms
31.23 s
Progress: 0 of 80 built, 112 of 180 downloaded from cache (15 downloading)
31.23 s
Downloading cached vector-stream from https://cache.nix-ci.com
31.23 s
Downloaded cached splitmix (893 KiB) in 26ms
31.23 s
Progress: 0 of 79 built, 113 of 180 downloaded from cache (15 downloading)
31.23 s
Downloading cached void from https://cache.nix-ci.com
31.23 s
Downloaded cached th-compat (565 KiB) in 21ms
31.23 s
Progress: 0 of 78 built, 114 of 180 downloaded from cache (15 downloading)
31.23 s
Downloading cached random from https://cache.nix-ci.com
31.24 s
Downloaded cached tagged (1.6 MiB) in 32ms
31.24 s
Progress: 0 of 77 built, 115 of 180 downloaded from cache (15 downloading)
31.24 s
Downloading cached network-uri from https://cache.nix-ci.com
31.24 s
Downloaded cached old-time (2.3 MiB) in 38ms
31.24 s
Progress: 0 of 76 built, 116 of 180 downloaded from cache (15 downloading)
31.24 s
Downloading cached distributive from https://cache.nix-ci.com
31.25 s
Downloaded cached unliftio-core (390 KiB) in 26ms
31.25 s
Progress: 0 of 75 built, 117 of 180 downloaded from cache (15 downloading)
31.25 s
Downloaded cached extra (4.1 MiB) in 53ms
31.25 s
Progress: 0 of 74 built, 118 of 180 downloaded from cache (14 downloading)
31.25 s
Downloaded cached ansi-terminal-types (3.3 MiB) in 47ms
31.25 s
Progress: 0 of 73 built, 119 of 180 downloaded from cache (13 downloading)
31.25 s
Downloaded cached syb (2.8 MiB) in 45ms
31.25 s
Downloading cached ansi-terminal from https://cache.nix-ci.com
31.25 s
Progress: 0 of 72 built, 120 of 180 downloaded from cache (13 downloading)
31.25 s
Downloaded cached void (44 KiB) in 20ms
31.25 s
Progress: 0 of 72 built, 121 of 180 downloaded from cache (12 downloading)
31.26 s
Downloaded cached reflection (6 MiB) in 58ms
31.26 s
Progress: 0 of 71 built, 122 of 180 downloaded from cache (11 downloading)
31.27 s
Downloaded cached transformers-compat (3.4 MiB) in 47ms
31.27 s
Progress: 0 of 70 built, 123 of 180 downloaded from cache (10 downloading)
31.27 s
Downloaded cached th-abstraction (5.6 MiB) in 59ms
31.27 s
Downloading cached transformers-base from https://cache.nix-ci.com
31.27 s
Progress: 0 of 69 built, 124 of 180 downloaded from cache (10 downloading)
31.27 s
Downloaded cached vector-stream (3.1 MiB) in 42ms
31.27 s
Progress: 0 of 68 built, 125 of 180 downloaded from cache (9 downloading)
31.27 s
Downloaded cached distributive (1.2 MiB) in 31ms
31.27 s
Progress: 0 of 67 built, 126 of 180 downloaded from cache (8 downloading)
31.27 s
Downloaded cached hashable (3.3 MiB) in 47ms
31.27 s
Downloading cached comonad from https://cache.nix-ci.com
31.27 s
Progress: 0 of 66 built, 127 of 180 downloaded from cache (8 downloading)
31.27 s
Downloading cached case-insensitive from https://cache.nix-ci.com
31.27 s
Downloading cached data-fix from https://cache.nix-ci.com
31.27 s
Downloading cached text-short from https://cache.nix-ci.com
31.27 s
Downloading cached these from https://cache.nix-ci.com
31.27 s
Downloading cached time-compat from https://cache.nix-ci.com
31.27 s
Downloading cached unordered-containers from https://cache.nix-ci.com
31.28 s
Downloaded cached primitive (8.7 MiB) in 77ms
31.28 s
Progress: 0 of 65 built, 128 of 180 downloaded from cache (13 downloading)
31.28 s
Downloaded cached prettyprinter (8.7 MiB) in 78ms
31.28 s
Downloading cached integer-conversion from https://cache.nix-ci.com
31.28 s
Downloading cached scientific from https://cache.nix-ci.com
31.28 s
Progress: 0 of 64 built, 129 of 180 downloaded from cache (14 downloading)
31.28 s
Downloaded cached ansi-terminal (1.2 MiB) in 27ms
31.28 s
Progress: 0 of 63 built, 130 of 180 downloaded from cache (13 downloading)
31.28 s
Downloading cached prettyprinter-ansi-terminal from https://cache.nix-ci.com
31.28 s
Downloaded cached network-uri (5.2 MiB) in 44ms
31.28 s
Progress: 0 of 62 built, 131 of 180 downloaded from cache (13 downloading)
31.29 s
Downloaded cached transformers-base (585 KiB) in 21ms
31.29 s
Progress: 0 of 61 built, 132 of 180 downloaded from cache (12 downloading)
31.29 s
Downloaded cached random (8.8 MiB) in 61ms
31.29 s
Progress: 0 of 60 built, 133 of 180 downloaded from cache (11 downloading)
31.30 s
Downloading cached QuickCheck from https://cache.nix-ci.com
31.30 s
Downloading cached temporary from https://cache.nix-ci.com
31.30 s
Downloading cached uuid-types from https://cache.nix-ci.com
31.30 s
Downloaded cached data-fix (1.1 MiB) in 27ms
31.30 s
Progress: 0 of 59 built, 134 of 180 downloaded from cache (13 downloading)
31.30 s
Downloaded cached case-insensitive (944 KiB) in 29ms
31.30 s
Progress: 0 of 58 built, 135 of 180 downloaded from cache (12 downloading)
31.31 s
Downloaded cached integer-conversion (193 KiB) in 35ms
31.31 s
Progress: 0 of 57 built, 136 of 180 downloaded from cache (11 downloading)
31.31 s
Downloaded cached text-short (1.7 MiB) in 40ms
31.31 s
Progress: 0 of 56 built, 137 of 180 downloaded from cache (10 downloading)
31.31 s
Downloaded cached comonad (3.1 MiB) in 41ms
31.31 s
Progress: 0 of 55 built, 138 of 180 downloaded from cache (9 downloading)
31.32 s
Downloading cached bifunctors from https://cache.nix-ci.com
31.32 s
Downloaded cached these (3.1 MiB) in 45ms
31.32 s
Progress: 0 of 54 built, 139 of 180 downloaded from cache (9 downloading)
31.32 s
Downloading cached strict from https://cache.nix-ci.com
31.32 s
Downloaded cached prettyprinter-ansi-terminal (1.4 MiB) in 42ms
31.32 s
Progress: 0 of 53 built, 140 of 180 downloaded from cache (9 downloading)
31.32 s
Downloading cached optparse-applicative from https://cache.nix-ci.com
31.33 s
Downloaded cached temporary (305 KiB) in 32ms
31.33 s
Downloaded cached time-compat (2.4 MiB) in 54ms
31.33 s
Progress: 0 of 52 built, 141 of 180 downloaded from cache (9 downloading)
31.33 s
Downloaded cached scientific (2.9 MiB) in 50ms
31.33 s
Downloading cached doctest from https://cache.nix-ci.com
31.33 s
Progress: 0 of 51 built, 142 of 180 downloaded from cache (9 downloading)
31.33 s
Progress: 0 of 51 built, 143 of 180 downloaded from cache (8 downloading)
31.33 s
Downloading cached megaparsec from https://cache.nix-ci.com
31.33 s
Downloading cached text-iso8601 from https://cache.nix-ci.com
31.33 s
Downloaded cached uuid-types (1.6 MiB) in 33ms
31.33 s
Progress: 0 of 49 built, 144 of 180 downloaded from cache (9 downloading)
31.37 s
Downloaded cached unordered-containers (9.3 MiB) in 91ms
31.37 s
Progress: 0 of 48 built, 145 of 180 downloaded from cache (8 downloading)
31.38 s
Downloaded cached text-iso8601 (3 MiB) in 49ms
31.38 s
Progress: 0 of 47 built, 146 of 180 downloaded from cache (7 downloading)
31.38 s
Downloaded cached strict (5.2 MiB) in 62ms
31.38 s
Progress: 0 of 46 built, 147 of 180 downloaded from cache (6 downloading)
31.40 s
Downloaded cached optparse-applicative (8.7 MiB) in 80ms
31.40 s
Progress: 0 of 45 built, 148 of 180 downloaded from cache (5 downloading)
31.40 s
Downloading cached tasty from https://cache.nix-ci.com
31.42 s
Downloaded cached bifunctors (15.7 MiB) in 108ms
31.42 s
Progress: 0 of 44 built, 149 of 180 downloaded from cache (5 downloading)
31.42 s
Downloading cached profunctors from https://cache.nix-ci.com
31.42 s
Downloading cached semigroupoids from https://cache.nix-ci.com
31.43 s
Downloaded cached QuickCheck (19.9 MiB) in 133ms
31.43 s
Progress: 0 of 43 built, 150 of 180 downloaded from cache (6 downloading)
31.45 s
Downloaded cached megaparsec (15.6 MiB) in 116ms
31.45 s
Progress: 0 of 42 built, 151 of 180 downloaded from cache (5 downloading)
31.47 s
Downloaded cached tasty (9.3 MiB) in 68ms
31.47 s
Progress: 0 of 41 built, 152 of 180 downloaded from cache (4 downloading)
31.47 s
Downloading cached vector from https://cache.nix-ci.com
31.49 s
Downloaded cached profunctors (10.5 MiB) in 61ms
31.49 s
Progress: 0 of 40 built, 153 of 180 downloaded from cache (4 downloading)
31.49 s
Downloading cached invariant from https://cache.nix-ci.com
31.50 s
Downloaded cached semigroupoids (11.9 MiB) in 76ms
31.50 s
Progress: 0 of 39 built, 154 of 180 downloaded from cache (4 downloading)
31.50 s
Downloading cached either from https://cache.nix-ci.com
31.50 s
Downloading cached free from https://cache.nix-ci.com
31.53 s
Downloaded cached either (890 KiB) in 28ms
31.53 s
Progress: 0 of 38 built, 155 of 180 downloaded from cache (5 downloading)
31.54 s
Downloaded cached invariant (5.4 MiB) in 50ms
31.54 s
Progress: 0 of 37 built, 156 of 180 downloaded from cache (4 downloading)
31.69 s
Downloaded cached free (22.4 MiB) in 184ms
31.69 s
Progress: 0 of 36 built, 157 of 180 downloaded from cache (3 downloading)
31.69 s
Downloading cached adjunctions from https://cache.nix-ci.com
31.69 s
Downloading cached recursion-schemes from https://cache.nix-ci.com
31.73 s
Downloaded cached recursion-schemes (6.7 MiB) in 40ms
31.73 s
Progress: 0 of 35 built, 158 of 180 downloaded from cache (4 downloading)
31.73 s
Downloading cached variant from https://cache.nix-ci.com
31.73 s
Downloaded cached adjunctions (6 MiB) in 45ms
31.73 s
Progress: 0 of 34 built, 159 of 180 downloaded from cache (4 downloading)
31.73 s
Downloading cached kan-extensions from https://cache.nix-ci.com
31.77 s
Downloaded cached variant (10.8 MiB) in 44ms
31.77 s
Progress: 0 of 33 built, 160 of 180 downloaded from cache (4 downloading)
31.79 s
Downloaded cached kan-extensions (7 MiB) in 52ms
31.79 s
Progress: 0 of 32 built, 161 of 180 downloaded from cache (3 downloading)
31.83 s
Downloaded cached vector (57.1 MiB) in 354ms
31.83 s
Progress: 0 of 31 built, 162 of 180 downloaded from cache (2 downloading)
31.83 s
Downloading cached indexed-traversable-instances from https://cache.nix-ci.com
31.83 s
Downloading cached quickcheck-instances from https://cache.nix-ci.com
31.85 s
Downloaded cached indexed-traversable-instances (358 KiB) in 27ms
31.85 s
Progress: 0 of 30 built, 163 of 180 downloaded from cache (3 downloading)
31.86 s
Downloading cached lens from https://cache.nix-ci.com
31.86 s
Downloading cached semialign from https://cache.nix-ci.com
31.86 s
Downloading cached witherable from https://cache.nix-ci.com
31.87 s
Downloaded cached quickcheck-instances (5.5 MiB) in 46ms
31.87 s
Progress: 0 of 29 built, 164 of 180 downloaded from cache (5 downloading)
31.89 s
Downloaded cached witherable (4.4 MiB) in 38ms
31.89 s
Progress: 0 of 28 built, 165 of 180 downloaded from cache (4 downloading)
31.90 s
Downloaded cached semialign (3.7 MiB) in 44ms
31.90 s
Progress: 0 of 27 built, 166 of 180 downloaded from cache (3 downloading)
31.90 s
Downloading cached aeson from https://cache.nix-ci.com
32.15 s
Downloaded cached doctest (68.8 MiB) in 824ms
32.15 s
Progress: 0 of 26 built, 167 of 180 downloaded from cache (3 downloading)
32.19 s
Downloaded cached lens (59.1 MiB) in 337ms
32.19 s
Progress: 0 of 25 built, 168 of 180 downloaded from cache (2 downloading)
32.19 s
Downloading cached yaya from https://cache.nix-ci.com
32.23 s
Downloaded cached yaya (5.3 MiB) in 33ms
32.23 s
Progress: 0 of 24 built, 169 of 180 downloaded from cache (2 downloading)
32.23 s
Downloading cached pathway-internal from https://cache.nix-ci.com
32.23 s
Downloading cached yaya-containers from https://cache.nix-ci.com
32.23 s
Downloading cached yaya-quickcheck from https://cache.nix-ci.com
32.23 s
Downloading cached yaya-unsafe from https://cache.nix-ci.com
32.24 s
Downloaded cached yaya-quickcheck (349 KiB) in 13ms
32.24 s
Progress: 0 of 23 built, 170 of 180 downloaded from cache (5 downloading)
32.24 s
Downloaded cached yaya-unsafe (1 MiB) in 14ms
32.24 s
Progress: 0 of 22 built, 171 of 180 downloaded from cache (4 downloading)
32.25 s
Downloaded cached pathway-internal (2 MiB) in 18ms
32.25 s
Progress: 0 of 21 built, 172 of 180 downloaded from cache (3 downloading)
32.25 s
Downloading cached pathway-quickcheck from https://cache.nix-ci.com
32.25 s
Downloaded cached yaya-containers (3.5 MiB) in 23ms
32.25 s
Progress: 0 of 20 built, 173 of 180 downloaded from cache (3 downloading)
32.25 s
Downloading cached pathway from https://cache.nix-ci.com
32.25 s
Downloaded cached pathway-quickcheck (180 KiB) in 6ms
32.25 s
Progress: 0 of 19 built, 174 of 180 downloaded from cache (3 downloading)
32.27 s
Downloaded cached pathway (2.7 MiB) in 19ms
32.27 s
Progress: 0 of 18 built, 175 of 180 downloaded from cache (2 downloading)
32.27 s
Downloading cached pathway-compat-base from https://cache.nix-ci.com
32.29 s
Downloaded cached pathway-compat-base (2 MiB) in 15ms
32.29 s
Progress: 0 of 17 built, 176 of 180 downloaded from cache (2 downloading)
32.38 s
Downloaded cached aeson (47.8 MiB) in 484ms
32.38 s
Progress: 0 of 16 built, 177 of 180 downloaded from cache (1 downloading)
32.39 s
Downloading cached path from https://cache.nix-ci.com
32.45 s
Downloaded cached path (10.1 MiB) in 63ms
32.45 s
Progress: 0 of 15 built, 178 of 180 downloaded from cache (1 downloading)
32.45 s
Downloading cached pathway-path from https://cache.nix-ci.com
32.46 s
Downloaded cached pathway-path (217 KiB) in 6ms
32.46 s
Progress: 0 of 14 built, 179 of 180 downloaded from cache (1 downloading)
33.93 s
Downloaded cached cabal-doctest (770 KiB) in 2.7s
33.93 s
Progress: 0 of 13 built, 180 of 180 downloaded from cache
34.05 s
Building /nix/store/a7kn8c1mldf3bb70zbglbid9cdnfr0m8-pathway-compat-filepath-0.0.1.0.drv
34.27 s
[pathway-compat-filepath] Phase: setupCompilerEnvironmentPhase
34.29 s
[pathway-compat-filepath] Build with /nix/store/4yvzsc21abkayqx2bzncnj5fpx57hb6z-ghc-9.8.4.
34.55 s
[pathway-compat-filepath] Phase: unpackPhase
34.55 s
[pathway-compat-filepath] unpacking source archive /nix/store/723m6sjvk66iiqzpvcfdd74xi6id5zqq-zjizyqf4pafgh9rycgxd507dhvpisdy1-source/./compat/filepath
34.56 s
[pathway-compat-filepath] source root is filepath
34.57 s
[pathway-compat-filepath] Phase: patchPhase
34.58 s
[pathway-compat-filepath] Phase: compileBuildDriverPhase
34.58 s
[pathway-compat-filepath] setupCompileFlags: -package-db=/build/tmp.BSqAylm3Ud/setup-package.conf.d -threaded
34.64 s
[pathway-compat-filepath] [1 of 2] Compiling Main ( Setup.hs, /build/tmp.BSqAylm3Ud/Main.o )
34.69 s
[pathway-compat-filepath] [2 of 2] Linking Setup
35.89 s
[pathway-compat-filepath] Phase: updateAutotoolsGnuConfigScriptsPhase
35.90 s
[pathway-compat-filepath] Phase: configurePhase
35.90 s
[pathway-compat-filepath] configureFlags: --verbose --prefix=/nix/store/8f1mfxn0kr70aq65d42dval09amwcmyg-pathway-compat-filepath-0.0.1.0 --libdir=$prefix/lib/$compiler/lib --libsubdir=$abi/$libname --docdir=/nix/store/sq6j1k7axnqkgy9n1f5x1z3j6fc0kdn9-pathway-compat-filepath-0.0.1.0-doc/share/doc/pathway-compat-filepath-0.0.1.0 --with-gcc=gcc --package-db=/build/tmp.BSqAylm3Ud/package.conf.d --ghc-option=-j16 --ghc-option=+RTS --ghc-option=-A64M --ghc-option=-RTS --enable-library-profiling --profiling-detail=exported-functions --disable-profiling --enable-shared --disable-coverage --enable-static --disable-executable-dynamic --enable-tests --disable-benchmarks --enable-library-vanilla --disable-library-for-ghci --enable-split-sections --enable-library-stripping --enable-executable-stripping --ghc-option=-haddock --ghc-options=-Werror --extra-lib-dirs=/nix/store/ffyzkisqs4vc4mg28bwwlyqjf8i9ph6b-ncurses-6.5/lib --extra-lib-dirs=/nix/store/n28qgdj8c1q41kf7n4y1jxa6ckp85m3c-libffi-3.5.2/lib --extra-lib-dirs=/nix/store/1b6h99dw7bk4wbn77kbalih42zbc67m1-elfutils-0.194/lib --extra-lib-dirs=/nix/store/hi0ar880110k6jsmmili7dh1gq3cg2a9-gmp-with-cxx-6.3.0/lib --extra-lib-dirs=/nix/store/g09cflpnp4g80q56sj9dng1qzv4v4ybc-numactl-2.0.18/lib --extra-lib-dirs=/nix/store/4yvzsc21abkayqx2bzncnj5fpx57hb6z-ghc-9.8.4/lib
35.91 s
[pathway-compat-filepath] Using Parsec parser
35.91 s
[pathway-compat-filepath] Configuring pathway-compat-filepath-0.0.1.0...
36.22 s
[pathway-compat-filepath] Flags chosen: noisy-deprecations=True, verify-no-recursion=False
36.31 s
[pathway-compat-filepath] Dependency base >=4.14.0 && <4.15 || >=4.15.0 && <4.16 || >=4.16.0 && <4.17 ||
36.32 s
[pathway-compat-filepath] >=4.17.0 && <4.18 || >=4.18.0 && <4.19 || >=4.19.0 && <4.20 || >=4.20.0 &&
36.32 s
[pathway-compat-filepath] <4.21 || >=4.21.0 && <4.22 || >=4.22.0 && <4.23: using base-4.19.2.0
36.32 s
[pathway-compat-filepath] Dependency extra: using extra-1.8.1
36.32 s
[pathway-compat-filepath] Dependency filepath >=1.4.2 && <1.5 || >=1.5.0 && <1.6: using
36.32 s
[pathway-compat-filepath] filepath-1.4.301.0
36.32 s
[pathway-compat-filepath] Dependency megaparsec >=9.0.1 && <9.1 || >=9.2.1 && <9.3 || >=9.5.0 && <9.6 ||
36.32 s
[pathway-compat-filepath] >=9.7.0 && <9.8: using megaparsec-9.7.0
36.32 s
[pathway-compat-filepath] Dependency pathway >=0.0.1 && <0.1: using pathway-0.0.1.0
36.32 s
[pathway-compat-filepath] Dependency pathway-compat-base >=0.0.1 && <0.1: using
36.32 s
[pathway-compat-filepath] pathway-compat-base-0.0.1.0
36.32 s
[pathway-compat-filepath] Dependency pathway-internal >=0.0.1 && <0.1: using pathway-internal-0.0.1.0
36.32 s
[pathway-compat-filepath] Dependency base >=4.14.0 && <4.15 || >=4.15.0 && <4.16 || >=4.16.0 && <4.17 ||
36.32 s
[pathway-compat-filepath] >=4.17.0 && <4.18 || >=4.18.0 && <4.19 || >=4.19.0 && <4.20 || >=4.20.0 &&
36.32 s
[pathway-compat-filepath] <4.21 || >=4.21.0 && <4.22 || >=4.22.0 && <4.23: using base-4.19.2.0
36.32 s
[pathway-compat-filepath] Dependency doctest >=0.16.3 && <0.17 || >=0.18.1 && <0.19 || >=0.20.1 && <0.21
36.32 s
[pathway-compat-filepath] || >=0.21.1 && <0.22 || >=0.22.2 && <0.23 || >=0.24.2 && <0.25: using
36.32 s
[pathway-compat-filepath] doctest-0.24.2
36.32 s
[pathway-compat-filepath] Dependency pathway-compat-filepath: using pathway-compat-filepath-0.0.1.0
36.48 s
[pathway-compat-filepath] Source component graph:
36.48 s
[pathway-compat-filepath] component lib
36.48 s
[pathway-compat-filepath] component test:doctests dependency lib
36.48 s
[pathway-compat-filepath] Configured component graph:
36.48 s
[pathway-compat-filepath] component pathway-compat-filepath-0.0.1.0-IRur2AkqsMdDEUYM0d6HNv
36.48 s
[pathway-compat-filepath] include base-4.19.2.0-8274
36.48 s
[pathway-compat-filepath] include extra-1.8.1-EssMUQCsBco9gsyBCwwe73
36.48 s
[pathway-compat-filepath] include filepath-1.4.301.0-9527
36.48 s
[pathway-compat-filepath] include megaparsec-9.7.0-HGZe2UnGqRgF6D6IR9jAPL
36.48 s
[pathway-compat-filepath] include pathway-0.0.1.0-IloKB8qrk9OLBhIjlawLWM
36.48 s
[pathway-compat-filepath] include pathway-compat-base-0.0.1.0-9LwOiYzUq1SHjg9jvEQyqL
36.48 s
[pathway-compat-filepath] include pathway-internal-0.0.1.0-BTurcxZAYjHHOlL1rvpIiQ
36.48 s
[pathway-compat-filepath] component pathway-compat-filepath-0.0.1.0-LgIlxVMMZcr79s2T7PofOx-doctests
36.48 s
[pathway-compat-filepath] include base-4.19.2.0-8274
36.48 s
[pathway-compat-filepath] include doctest-0.24.2-HOk70bisutnFZuBXgSC0HK
36.48 s
[pathway-compat-filepath] include pathway-compat-filepath-0.0.1.0-IRur2AkqsMdDEUYM0d6HNv
36.48 s
[pathway-compat-filepath] Linked component graph:
36.48 s
[pathway-compat-filepath] unit pathway-compat-filepath-0.0.1.0-IRur2AkqsMdDEUYM0d6HNv
36.48 s
[pathway-compat-filepath] include base-4.19.2.0-8274
36.48 s
[pathway-compat-filepath] include extra-1.8.1-EssMUQCsBco9gsyBCwwe73
36.48 s
[pathway-compat-filepath] include filepath-1.4.301.0-9527
36.48 s
[pathway-compat-filepath] include megaparsec-9.7.0-HGZe2UnGqRgF6D6IR9jAPL
36.48 s
[pathway-compat-filepath] include pathway-0.0.1.0-IloKB8qrk9OLBhIjlawLWM
36.48 s
[pathway-compat-filepath] include pathway-compat-base-0.0.1.0-9LwOiYzUq1SHjg9jvEQyqL
36.48 s
[pathway-compat-filepath] include pathway-internal-0.0.1.0-BTurcxZAYjHHOlL1rvpIiQ
36.48 s
[pathway-compat-filepath] Common.FilePath=pathway-compat-filepath-0.0.1.0-IRur2AkqsMdDEUYM0d6HNv:Common.FilePath,Common.OsPath=pathway-compat-filepath-0.0.1.0-IRur2AkqsMdDEUYM0d6HNv:Common.OsPath,System.FilePath=pathway-compat-filepath-0.0.1.0-IRur2AkqsMdDEUYM0d6HNv:System.FilePath,System.FilePath.Overlay=pathway-compat-filepath-0.0.1.0-IRur2AkqsMdDEUYM0d6HNv:System.FilePath.Overlay,System.FilePath.Pathway=pathway-compat-filepath-0.0.1.0-IRur2AkqsMdDEUYM0d6HNv:System.FilePath.Pathway,System.FilePath.Thin=pathway-compat-filepath-0.0.1.0-IRur2AkqsMdDEUYM0d6HNv:System.FilePath.Thin,System.OsPath=pathway-compat-filepath-0.0.1.0-IRur2AkqsMdDEUYM0d6HNv:System.OsPath,System.OsPath.Overlay=pathway-compat-filepath-0.0.1.0-IRur2AkqsMdDEUYM0d6HNv:System.OsPath.Overlay,System.OsPath.Pathway=pathway-compat-filepath-0.0.1.0-IRur2AkqsMdDEUYM0d6HNv:System.OsPath.Pathway,System.OsPath.Thin=pathway-compat-filepath-0.0.1.0-IRur2AkqsMdDEUYM0d6HNv:System.OsPath.Thin
36.48 s
[pathway-compat-filepath] unit pathway-compat-filepath-0.0.1.0-LgIlxVMMZcr79s2T7PofOx-doctests
36.48 s
[pathway-compat-filepath] include base-4.19.2.0-8274
36.48 s
[pathway-compat-filepath] include doctest-0.24.2-HOk70bisutnFZuBXgSC0HK
36.48 s
[pathway-compat-filepath] include pathway-compat-filepath-0.0.1.0-IRur2AkqsMdDEUYM0d6HNv
36.48 s
[pathway-compat-filepath] Ready component graph:
36.48 s
[pathway-compat-filepath] definite pathway-compat-filepath-0.0.1.0-IRur2AkqsMdDEUYM0d6HNv
36.48 s
[pathway-compat-filepath] depends base-4.19.2.0-8274
36.48 s
[pathway-compat-filepath] depends extra-1.8.1-EssMUQCsBco9gsyBCwwe73
36.48 s
[pathway-compat-filepath] depends filepath-1.4.301.0-9527
36.48 s
[pathway-compat-filepath] depends megaparsec-9.7.0-HGZe2UnGqRgF6D6IR9jAPL
36.48 s
[pathway-compat-filepath] depends pathway-0.0.1.0-IloKB8qrk9OLBhIjlawLWM
36.48 s
[pathway-compat-filepath] depends pathway-compat-base-0.0.1.0-9LwOiYzUq1SHjg9jvEQyqL
36.48 s
[pathway-compat-filepath] depends pathway-internal-0.0.1.0-BTurcxZAYjHHOlL1rvpIiQ
36.48 s
[pathway-compat-filepath] definite pathway-compat-filepath-0.0.1.0-LgIlxVMMZcr79s2T7PofOx-doctests
36.48 s
[pathway-compat-filepath] depends base-4.19.2.0-8274
36.48 s
[pathway-compat-filepath] depends doctest-0.24.2-HOk70bisutnFZuBXgSC0HK
36.48 s
[pathway-compat-filepath] depends pathway-compat-filepath-0.0.1.0-IRur2AkqsMdDEUYM0d6HNv
36.48 s
[pathway-compat-filepath] Using Cabal-3.10.3.0 compiled by ghc-9.8
36.48 s
[pathway-compat-filepath] Using compiler: ghc-9.8.4
36.48 s
[pathway-compat-filepath] Using install prefix:
36.48 s
[pathway-compat-filepath] /nix/store/8f1mfxn0kr70aq65d42dval09amwcmyg-pathway-compat-filepath-0.0.1.0
36.48 s
[pathway-compat-filepath] Executables installed in:
36.48 s
[pathway-compat-filepath] /nix/store/8f1mfxn0kr70aq65d42dval09amwcmyg-pathway-compat-filepath-0.0.1.0/bin
36.48 s
[pathway-compat-filepath] Libraries installed in:
36.48 s
[pathway-compat-filepath] /nix/store/8f1mfxn0kr70aq65d42dval09amwcmyg-pathway-compat-filepath-0.0.1.0/lib/ghc-9.8.4/lib/x86_64-linux-ghc-9.8.4/pathway-compat-filepath-0.0.1.0-IRur2AkqsMdDEUYM0d6HNv
36.48 s
[pathway-compat-filepath] Dynamic Libraries installed in:
36.48 s
[pathway-compat-filepath] /nix/store/8f1mfxn0kr70aq65d42dval09amwcmyg-pathway-compat-filepath-0.0.1.0/lib/ghc-9.8.4/lib/x86_64-linux-ghc-9.8.4
36.48 s
[pathway-compat-filepath] Private executables installed in:
36.48 s
[pathway-compat-filepath] /nix/store/8f1mfxn0kr70aq65d42dval09amwcmyg-pathway-compat-filepath-0.0.1.0/libexec/x86_64-linux-ghc-9.8.4/pathway-compat-filepath-0.0.1.0
36.48 s
[pathway-compat-filepath] Data files installed in:
36.48 s
[pathway-compat-filepath] /nix/store/8f1mfxn0kr70aq65d42dval09amwcmyg-pathway-compat-filepath-0.0.1.0/share/x86_64-linux-ghc-9.8.4/pathway-compat-filepath-0.0.1.0
36.48 s
[pathway-compat-filepath] Documentation installed in:
36.48 s
[pathway-compat-filepath] /nix/store/sq6j1k7axnqkgy9n1f5x1z3j6fc0kdn9-pathway-compat-filepath-0.0.1.0-doc/share/doc/pathway-compat-filepath-0.0.1.0
36.48 s
[pathway-compat-filepath] Configuration files installed in:
36.48 s
[pathway-compat-filepath] /nix/store/8f1mfxn0kr70aq65d42dval09amwcmyg-pathway-compat-filepath-0.0.1.0/etc
36.48 s
[pathway-compat-filepath] No alex found
36.48 s
[pathway-compat-filepath] Using ar found on system at:
36.48 s
[pathway-compat-filepath] /nix/store/iz5lckcsg66r223si2gck7csk2hihj0m-binutils-wrapper-2.44/bin/ar
36.48 s
[pathway-compat-filepath] No c2hs found
36.48 s
[pathway-compat-filepath] No cpphs found
36.48 s
[pathway-compat-filepath] Using doctest version 0.24.2 found on system at:
36.48 s
[pathway-compat-filepath] /nix/store/ipqa88qiasixywmsikcnq7nhq6340lg5-doctest-0.24.2/bin/doctest
36.48 s
[pathway-compat-filepath] Using gcc version 14.3.0 given by user at:
36.48 s
[pathway-compat-filepath] /nix/store/8v97ngkcpfzgghwnnr7fsz33p2x22gy9-gcc-wrapper-14.3.0/bin/gcc
36.48 s
[pathway-compat-filepath] Using ghc version 9.8.4 found on system at:
36.48 s
[pathway-compat-filepath] /nix/store/4yvzsc21abkayqx2bzncnj5fpx57hb6z-ghc-9.8.4/bin/ghc
36.48 s
[pathway-compat-filepath] Using ghc-pkg version 9.8.4 found on system at:
36.48 s
[pathway-compat-filepath] /nix/store/4yvzsc21abkayqx2bzncnj5fpx57hb6z-ghc-9.8.4/bin/ghc-pkg-9.8.4
36.48 s
[pathway-compat-filepath] No ghcjs found
36.48 s
[pathway-compat-filepath] No ghcjs-pkg found
36.48 s
[pathway-compat-filepath] No greencard found
36.48 s
[pathway-compat-filepath] Using haddock version 2.30.0 found on system at:
36.48 s
[pathway-compat-filepath] /nix/store/4yvzsc21abkayqx2bzncnj5fpx57hb6z-ghc-9.8.4/bin/haddock-ghc-9.8.4
36.48 s
[pathway-compat-filepath] No happy found
36.48 s
[pathway-compat-filepath] Using haskell-suite found on system at: haskell-suite-dummy-location
36.48 s
[pathway-compat-filepath] Using haskell-suite-pkg found on system at: haskell-suite-pkg-dummy-location
36.48 s
[pathway-compat-filepath] No hmake found
36.48 s
[pathway-compat-filepath] Using hpc version 0.69 found on system at:
36.48 s
[pathway-compat-filepath] /nix/store/4yvzsc21abkayqx2bzncnj5fpx57hb6z-ghc-9.8.4/bin/hpc-ghc-9.8.4
36.48 s
[pathway-compat-filepath] Using hsc2hs version 0.68.10 found on system at:
36.48 s
[pathway-compat-filepath] /nix/store/4yvzsc21abkayqx2bzncnj5fpx57hb6z-ghc-9.8.4/bin/hsc2hs-ghc-9.8.4
36.48 s
[pathway-compat-filepath] Using hscolour version 1.25 found on system at:
36.48 s
[pathway-compat-filepath] /nix/store/palqpb4p9k5rqxhxjdgqrak8n91p6c4z-hscolour-1.25/bin/HsColour
36.48 s
[pathway-compat-filepath] No jhc found
36.48 s
[pathway-compat-filepath] Using ld found on system at:
36.48 s
[pathway-compat-filepath] /nix/store/iz5lckcsg66r223si2gck7csk2hihj0m-binutils-wrapper-2.44/bin/ld.gold
36.48 s
[pathway-compat-filepath] No pkg-config found
36.48 s
[pathway-compat-filepath] Using runghc version 9.8.4 found on system at:
36.48 s
[pathway-compat-filepath] /nix/store/4yvzsc21abkayqx2bzncnj5fpx57hb6z-ghc-9.8.4/bin/runghc-9.8.4
36.48 s
[pathway-compat-filepath] Using strip version 2.44 found on system at:
36.48 s
[pathway-compat-filepath] /nix/store/8v97ngkcpfzgghwnnr7fsz33p2x22gy9-gcc-wrapper-14.3.0/bin/strip
36.48 s
[pathway-compat-filepath] Using tar found on system at:
36.48 s
[pathway-compat-filepath] /nix/store/xl6pd2spjajwcpq09fnmnjv5psqmlmma-gnutar-1.35/bin/tar
36.48 s
[pathway-compat-filepath] No uhc found
36.76 s
[pathway-compat-filepath] Phase: buildPhase
36.83 s
[pathway-compat-filepath] Preprocessing library for pathway-compat-filepath-0.0.1.0..
36.83 s
[pathway-compat-filepath] Building library for pathway-compat-filepath-0.0.1.0..
36.92 s
[pathway-compat-filepath] [ 1 of 10] Compiling Common.FilePath ( src/Common/FilePath.hs, dist/build/Common/FilePath.o, dist/build/Common/FilePath.dyn_o )
37.20 s
[pathway-compat-filepath] [ 2 of 10] Compiling Common.OsPath ( src/Common/OsPath.hs, dist/build/Common/OsPath.o, dist/build/Common/OsPath.dyn_o )
37.20 s
[pathway-compat-filepath]
37.20 s
[pathway-compat-filepath] src/Common/OsPath.hs:87:23: error : [ GHC-76037 ]
37.20 s
[pathway-compat-filepath] Not in scope: ‘O.unsafeEncodeUtf’
37.20 s
[pathway-compat-filepath] NB: the module ‘System.OsPath’ does not export ‘unsafeEncodeUtf’.
37.20 s
[pathway-compat-filepath] |
37.20 s
[pathway-compat-filepath] 87 | Format.parent = O.unsafeEncodeUtf "..",
37.20 s
[pathway-compat-filepath] | ^^^^^^^^^^^^^^^^^
37.20 s
[pathway-compat-filepath] [ 3 of 10] Compiling System.FilePath.Thin ( src/System/FilePath/Thin.hs, dist/build/System/FilePath/Thin.o, dist/build/System/FilePath/Thin.dyn_o )
37.36 s
[pathway-compat-filepath] [ 4 of 10] Compiling System.FilePath.Pathway ( src/System/FilePath/Pathway.hs, dist/build/System/FilePath/Pathway.o, dist/build/System/FilePath/Pathway.dyn_o )
37.38 s
[pathway-compat-filepath] [ 5 of 10] Compiling System.FilePath.Overlay ( src/System/FilePath/Overlay.hs, dist/build/System/FilePath/Overlay.o, dist/build/System/FilePath/Overlay.dyn_o )
37.41 s
[pathway-compat-filepath] [ 6 of 10] Compiling System.FilePath ( src/System/FilePath.hs, dist/build/System/FilePath.o, dist/build/System/FilePath.dyn_o )
37.52 s
Progress: 0 of 12 built (1 failed), 180 of 180 downloaded from cache
37.52 s
Failed to build pathway-compat-filepath after 3.4s
37.52 s
error: Cannot build '/nix/store/a7kn8c1mldf3bb70zbglbid9cdnfr0m8-pathway-compat-filepath-0.0.1.0.drv '.
37.52 s
Reason: builder failed with exit code 1 .
37.52 s
Output paths:
37.52 s
/nix/store/8f1mfxn0kr70aq65d42dval09amwcmyg-pathway-compat-filepath-0.0.1.0
37.52 s
/nix/store/sq6j1k7axnqkgy9n1f5x1z3j6fc0kdn9-pathway-compat-filepath-0.0.1.0-doc
37.52 s
Last 151 log lines:
37.52 s
> Running phase: setupCompilerEnvironmentPhase
37.52 s
> Build with /nix/store/4yvzsc21abkayqx2bzncnj5fpx57hb6z-ghc-9.8.4.
37.52 s
> Running phase: unpackPhase
37.52 s
> unpacking source archive /nix/store/723m6sjvk66iiqzpvcfdd74xi6id5zqq-zjizyqf4pafgh9rycgxd507dhvpisdy1-source/./compat/filepath
37.52 s
> source root is filepath
37.52 s
> Running phase: patchPhase
37.52 s
> Running phase: compileBuildDriverPhase
37.52 s
> setupCompileFlags: -package-db=/build/tmp.BSqAylm3Ud/setup-package.conf.d -threaded
37.52 s
> [1 of 2] Compiling Main ( Setup.hs, /build/tmp.BSqAylm3Ud/Main.o )
37.52 s
> [2 of 2] Linking Setup
37.52 s
> Running phase: updateAutotoolsGnuConfigScriptsPhase
37.52 s
> Running phase: configurePhase
37.52 s
> configureFlags: --verbose --prefix=/nix/store/8f1mfxn0kr70aq65d42dval09amwcmyg-pathway-compat-filepath-0.0.1.0 --libdir=$prefix/lib/$compiler/lib --libsubdir=$abi/$libname --docdir=/nix/store/sq6j1k7axnqkgy9n1f5x1z3j6fc0kdn9-pathway-compat-filepath-0.0.1.0-doc/share/doc/pathway-compat-filepath-0.0.1.0 --with-gcc=gcc --package-db=/build/tmp.BSqAylm3Ud/package.conf.d --ghc-option=-j16 --ghc-option=+RTS --ghc-option=-A64M --ghc-option=-RTS --enable-library-profiling --profiling-detail=exported-functions --disable-profiling --enable-shared --disable-coverage --enable-static --disable-executable-dynamic --enable-tests --disable-benchmarks --enable-library-vanilla --disable-library-for-ghci --enable-split-sections --enable-library-stripping --enable-executable-stripping --ghc-option=-haddock --ghc-options=-Werror --extra-lib-dirs=/nix/store/ffyzkisqs4vc4mg28bwwlyqjf8i9ph6b-ncurses-6.5/lib --extra-lib-dirs=/nix/store/n28qgdj8c1q41kf7n4y1jxa6ckp85m3c-libffi-3.5.2/lib --extra-lib-dirs=/nix/store/1b6h99dw7bk4wbn77kbalih42zbc67m1-elfutils-0.194/lib --extra-lib-dirs=/nix/store/hi0ar880110k6jsmmili7dh1gq3cg2a9-gmp-with-cxx-6.3.0/lib --extra-lib-dirs=/nix/store/g09cflpnp4g80q56sj9dng1qzv4v4ybc-numactl-2.0.18/lib --extra-lib-dirs=/nix/store/4yvzsc21abkayqx2bzncnj5fpx57hb6z-ghc-9.8.4/lib
37.52 s
> Using Parsec parser
37.52 s
> Configuring pathway-compat-filepath-0.0.1.0...
37.52 s
> Flags chosen: noisy-deprecations=True, verify-no-recursion=False
37.52 s
> Dependency base >=4.14.0 && <4.15 || >=4.15.0 && <4.16 || >=4.16.0 && <4.17 ||
37.52 s
> >=4.17.0 && <4.18 || >=4.18.0 && <4.19 || >=4.19.0 && <4.20 || >=4.20.0 &&
37.52 s
> <4.21 || >=4.21.0 && <4.22 || >=4.22.0 && <4.23: using base-4.19.2.0
37.52 s
> Dependency extra: using extra-1.8.1
37.52 s
> Dependency filepath >=1.4.2 && <1.5 || >=1.5.0 && <1.6: using
37.52 s
> filepath-1.4.301.0
37.52 s
> Dependency megaparsec >=9.0.1 && <9.1 || >=9.2.1 && <9.3 || >=9.5.0 && <9.6 ||
37.52 s
> >=9.7.0 && <9.8: using megaparsec-9.7.0
37.52 s
> Dependency pathway >=0.0.1 && <0.1: using pathway-0.0.1.0
37.52 s
> Dependency pathway-compat-base >=0.0.1 && <0.1: using
37.52 s
> pathway-compat-base-0.0.1.0
37.52 s
> Dependency pathway-internal >=0.0.1 && <0.1: using pathway-internal-0.0.1.0
37.52 s
> Dependency base >=4.14.0 && <4.15 || >=4.15.0 && <4.16 || >=4.16.0 && <4.17 ||
37.52 s
> >=4.17.0 && <4.18 || >=4.18.0 && <4.19 || >=4.19.0 && <4.20 || >=4.20.0 &&
37.52 s
> <4.21 || >=4.21.0 && <4.22 || >=4.22.0 && <4.23: using base-4.19.2.0
37.52 s
> Dependency doctest >=0.16.3 && <0.17 || >=0.18.1 && <0.19 || >=0.20.1 && <0.21
37.52 s
> || >=0.21.1 && <0.22 || >=0.22.2 && <0.23 || >=0.24.2 && <0.25: using
37.52 s
> doctest-0.24.2
37.52 s
> Dependency pathway-compat-filepath: using pathway-compat-filepath-0.0.1.0
37.52 s
> Source component graph:
37.52 s
> component lib
37.52 s
> component test:doctests dependency lib
37.52 s
> Configured component graph:
37.52 s
> component pathway-compat-filepath-0.0.1.0-IRur2AkqsMdDEUYM0d6HNv
37.52 s
> include base-4.19.2.0-8274
37.52 s
> include extra-1.8.1-EssMUQCsBco9gsyBCwwe73
37.52 s
> include filepath-1.4.301.0-9527
37.52 s
> include megaparsec-9.7.0-HGZe2UnGqRgF6D6IR9jAPL
37.52 s
> include pathway-0.0.1.0-IloKB8qrk9OLBhIjlawLWM
37.52 s
> include pathway-compat-base-0.0.1.0-9LwOiYzUq1SHjg9jvEQyqL
37.52 s
> include pathway-internal-0.0.1.0-BTurcxZAYjHHOlL1rvpIiQ
37.52 s
> component pathway-compat-filepath-0.0.1.0-LgIlxVMMZcr79s2T7PofOx-doctests
37.52 s
> include base-4.19.2.0-8274
37.52 s
> include doctest-0.24.2-HOk70bisutnFZuBXgSC0HK
37.52 s
> include pathway-compat-filepath-0.0.1.0-IRur2AkqsMdDEUYM0d6HNv
37.52 s
> Linked component graph:
37.52 s
> unit pathway-compat-filepath-0.0.1.0-IRur2AkqsMdDEUYM0d6HNv
37.52 s
> include base-4.19.2.0-8274
37.52 s
> include extra-1.8.1-EssMUQCsBco9gsyBCwwe73
37.52 s
> include filepath-1.4.301.0-9527
37.52 s
> include megaparsec-9.7.0-HGZe2UnGqRgF6D6IR9jAPL
37.52 s
> include pathway-0.0.1.0-IloKB8qrk9OLBhIjlawLWM
37.52 s
> include pathway-compat-base-0.0.1.0-9LwOiYzUq1SHjg9jvEQyqL
37.52 s
> include pathway-internal-0.0.1.0-BTurcxZAYjHHOlL1rvpIiQ
37.52 s
> Common.FilePath=pathway-compat-filepath-0.0.1.0-IRur2AkqsMdDEUYM0d6HNv:Common.FilePath,Common.OsPath=pathway-compat-filepath-0.0.1.0-IRur2AkqsMdDEUYM0d6HNv:Common.OsPath,System.FilePath=pathway-compat-filepath-0.0.1.0-IRur2AkqsMdDEUYM0d6HNv:System.FilePath,System.FilePath.Overlay=pathway-compat-filepath-0.0.1.0-IRur2AkqsMdDEUYM0d6HNv:System.FilePath.Overlay,System.FilePath.Pathway=pathway-compat-filepath-0.0.1.0-IRur2AkqsMdDEUYM0d6HNv:System.FilePath.Pathway,System.FilePath.Thin=pathway-compat-filepath-0.0.1.0-IRur2AkqsMdDEUYM0d6HNv:System.FilePath.Thin,System.OsPath=pathway-compat-filepath-0.0.1.0-IRur2AkqsMdDEUYM0d6HNv:System.OsPath,System.OsPath.Overlay=pathway-compat-filepath-0.0.1.0-IRur2AkqsMdDEUYM0d6HNv:System.OsPath.Overlay,System.OsPath.Pathway=pathway-compat-filepath-0.0.1.0-IRur2AkqsMdDEUYM0d6HNv:System.OsPath.Pathway,System.OsPath.Thin=pathway-compat-filepath-0.0.1.0-IRur2AkqsMdDEUYM0d6HNv:System.OsPath.Thin
37.52 s
> unit pathway-compat-filepath-0.0.1.0-LgIlxVMMZcr79s2T7PofOx-doctests
37.52 s
> include base-4.19.2.0-8274
37.52 s
> include doctest-0.24.2-HOk70bisutnFZuBXgSC0HK
37.52 s
> include pathway-compat-filepath-0.0.1.0-IRur2AkqsMdDEUYM0d6HNv
37.52 s
> Ready component graph:
37.52 s
> definite pathway-compat-filepath-0.0.1.0-IRur2AkqsMdDEUYM0d6HNv
37.52 s
> depends base-4.19.2.0-8274
37.52 s
> depends extra-1.8.1-EssMUQCsBco9gsyBCwwe73
37.52 s
> depends filepath-1.4.301.0-9527
37.52 s
> depends megaparsec-9.7.0-HGZe2UnGqRgF6D6IR9jAPL
37.52 s
> depends pathway-0.0.1.0-IloKB8qrk9OLBhIjlawLWM
37.52 s
> depends pathway-compat-base-0.0.1.0-9LwOiYzUq1SHjg9jvEQyqL
37.52 s
> depends pathway-internal-0.0.1.0-BTurcxZAYjHHOlL1rvpIiQ
37.52 s
> definite pathway-compat-filepath-0.0.1.0-LgIlxVMMZcr79s2T7PofOx-doctests
37.52 s
> depends base-4.19.2.0-8274
37.52 s
> depends doctest-0.24.2-HOk70bisutnFZuBXgSC0HK
37.52 s
> depends pathway-compat-filepath-0.0.1.0-IRur2AkqsMdDEUYM0d6HNv
37.52 s
> Using Cabal-3.10.3.0 compiled by ghc-9.8
37.52 s
> Using compiler: ghc-9.8.4
37.52 s
> Using install prefix:
37.52 s
> /nix/store/8f1mfxn0kr70aq65d42dval09amwcmyg-pathway-compat-filepath-0.0.1.0
37.52 s
> Executables installed in:
37.52 s
> /nix/store/8f1mfxn0kr70aq65d42dval09amwcmyg-pathway-compat-filepath-0.0.1.0/bin
37.52 s
> Libraries installed in:
37.52 s
> /nix/store/8f1mfxn0kr70aq65d42dval09amwcmyg-pathway-compat-filepath-0.0.1.0/lib/ghc-9.8.4/lib/x86_64-linux-ghc-9.8.4/pathway-compat-filepath-0.0.1.0-IRur2AkqsMdDEUYM0d6HNv
37.52 s
> Dynamic Libraries installed in:
37.52 s
> /nix/store/8f1mfxn0kr70aq65d42dval09amwcmyg-pathway-compat-filepath-0.0.1.0/lib/ghc-9.8.4/lib/x86_64-linux-ghc-9.8.4
37.52 s
> Private executables installed in:
37.52 s
> /nix/store/8f1mfxn0kr70aq65d42dval09amwcmyg-pathway-compat-filepath-0.0.1.0/libexec/x86_64-linux-ghc-9.8.4/pathway-compat-filepath-0.0.1.0
37.52 s
> Data files installed in:
37.52 s
> /nix/store/8f1mfxn0kr70aq65d42dval09amwcmyg-pathway-compat-filepath-0.0.1.0/share/x86_64-linux-ghc-9.8.4/pathway-compat-filepath-0.0.1.0
37.52 s
> Documentation installed in:
37.52 s
> /nix/store/sq6j1k7axnqkgy9n1f5x1z3j6fc0kdn9-pathway-compat-filepath-0.0.1.0-doc/share/doc/pathway-compat-filepath-0.0.1.0
37.52 s
> Configuration files installed in:
37.52 s
> /nix/store/8f1mfxn0kr70aq65d42dval09amwcmyg-pathway-compat-filepath-0.0.1.0/etc
37.52 s
> No alex found
37.52 s
> Using ar found on system at:
37.52 s
> /nix/store/iz5lckcsg66r223si2gck7csk2hihj0m-binutils-wrapper-2.44/bin/ar
37.52 s
> No c2hs found
37.52 s
> No cpphs found
37.52 s
> Using doctest version 0.24.2 found on system at:
37.52 s
> /nix/store/ipqa88qiasixywmsikcnq7nhq6340lg5-doctest-0.24.2/bin/doctest
37.52 s
> Using gcc version 14.3.0 given by user at:
37.52 s
> /nix/store/8v97ngkcpfzgghwnnr7fsz33p2x22gy9-gcc-wrapper-14.3.0/bin/gcc
37.52 s
> Using ghc version 9.8.4 found on system at:
37.52 s
> /nix/store/4yvzsc21abkayqx2bzncnj5fpx57hb6z-ghc-9.8.4/bin/ghc
37.52 s
> Using ghc-pkg version 9.8.4 found on system at:
37.52 s
> /nix/store/4yvzsc21abkayqx2bzncnj5fpx57hb6z-ghc-9.8.4/bin/ghc-pkg-9.8.4
37.52 s
> No ghcjs found
37.52 s
> No ghcjs-pkg found
37.52 s
> No greencard found
37.52 s
> Using haddock version 2.30.0 found on system at:
37.52 s
> /nix/store/4yvzsc21abkayqx2bzncnj5fpx57hb6z-ghc-9.8.4/bin/haddock-ghc-9.8.4
37.52 s
> No happy found
37.52 s
> Using haskell-suite found on system at: haskell-suite-dummy-location
37.52 s
> Using haskell-suite-pkg found on system at: haskell-suite-pkg-dummy-location
37.52 s
> No hmake found
37.52 s
> Using hpc version 0.69 found on system at:
37.52 s
> /nix/store/4yvzsc21abkayqx2bzncnj5fpx57hb6z-ghc-9.8.4/bin/hpc-ghc-9.8.4
37.52 s
> Using hsc2hs version 0.68.10 found on system at:
37.52 s
> /nix/store/4yvzsc21abkayqx2bzncnj5fpx57hb6z-ghc-9.8.4/bin/hsc2hs-ghc-9.8.4
37.52 s
> Using hscolour version 1.25 found on system at:
37.52 s
> /nix/store/palqpb4p9k5rqxhxjdgqrak8n91p6c4z-hscolour-1.25/bin/HsColour
37.52 s
> No jhc found
37.52 s
> Using ld found on system at:
37.52 s
> /nix/store/iz5lckcsg66r223si2gck7csk2hihj0m-binutils-wrapper-2.44/bin/ld.gold
37.52 s
> No pkg-config found
37.52 s
> Using runghc version 9.8.4 found on system at:
37.52 s
> /nix/store/4yvzsc21abkayqx2bzncnj5fpx57hb6z-ghc-9.8.4/bin/runghc-9.8.4
37.52 s
> Using strip version 2.44 found on system at:
37.52 s
> /nix/store/8v97ngkcpfzgghwnnr7fsz33p2x22gy9-gcc-wrapper-14.3.0/bin/strip
37.52 s
> Using tar found on system at:
37.52 s
> /nix/store/xl6pd2spjajwcpq09fnmnjv5psqmlmma-gnutar-1.35/bin/tar
37.52 s
> No uhc found
37.52 s
> Running phase: buildPhase
37.52 s
> Preprocessing library for pathway-compat-filepath-0.0.1.0..
37.52 s
> Building library for pathway-compat-filepath-0.0.1.0..
37.52 s
> [ 1 of 10] Compiling Common.FilePath ( src/Common/FilePath.hs, dist/build/Common/FilePath.o, dist/build/Common/FilePath.dyn_o )
37.52 s
> [ 2 of 10] Compiling Common.OsPath ( src/Common/OsPath.hs, dist/build/Common/OsPath.o, dist/build/Common/OsPath.dyn_o )
37.52 s
>
37.52 s
> src/Common/OsPath.hs:87:23: error : [ GHC-76037 ]
37.52 s
> Not in scope: ‘O.unsafeEncodeUtf’
37.52 s
> NB: the module ‘System.OsPath’ does not export ‘unsafeEncodeUtf’.
37.52 s
> |
37.52 s
> 87 | Format.parent = O.unsafeEncodeUtf "..",
37.52 s
> | ^^^^^^^^^^^^^^^^^
37.52 s
> [ 3 of 10] Compiling System.FilePath.Thin ( src/System/FilePath/Thin.hs, dist/build/System/FilePath/Thin.o, dist/build/System/FilePath/Thin.dyn_o )
37.52 s
> [ 4 of 10] Compiling System.FilePath.Pathway ( src/System/FilePath/Pathway.hs, dist/build/System/FilePath/Pathway.o, dist/build/System/FilePath/Pathway.dyn_o )
37.52 s
> [ 5 of 10] Compiling System.FilePath.Overlay ( src/System/FilePath/Overlay.hs, dist/build/System/FilePath/Overlay.o, dist/build/System/FilePath/Overlay.dyn_o )
37.52 s
> [ 6 of 10] Compiling System.FilePath ( src/System/FilePath.hs, dist/build/System/FilePath.o, dist/build/System/FilePath.dyn_o )
37.52 s
For full logs, run:
37.52 s
nix log /nix/store/a7kn8c1mldf3bb70zbglbid9cdnfr0m8-pathway-compat-filepath-0.0.1.0.drv
37.52 s
error: Cannot build '/nix/store/a7kn8c1mldf3bb70zbglbid9cdnfr0m8-pathway-compat-filepath-0.0.1.0.drv '.
37.52 s
Reason: builder failed with exit code 1 .
37.52 s
Output paths:
37.52 s
/nix/store/8f1mfxn0kr70aq65d42dval09amwcmyg-pathway-compat-filepath-0.0.1.0
37.52 s
/nix/store/sq6j1k7axnqkgy9n1f5x1z3j6fc0kdn9-pathway-compat-filepath-0.0.1.0-doc
37.52 s
Last 151 log lines:
37.52 s
> Running phase: setupCompilerEnvironmentPhase
37.52 s
> Build with /nix/store/4yvzsc21abkayqx2bzncnj5fpx57hb6z-ghc-9.8.4.
37.52 s
> Running phase: unpackPhase
37.52 s
> unpacking source archive /nix/store/723m6sjvk66iiqzpvcfdd74xi6id5zqq-zjizyqf4pafgh9rycgxd507dhvpisdy1-source/./compat/filepath
37.52 s
> source root is filepath
37.52 s
> Running phase: patchPhase
37.52 s
> Running phase: compileBuildDriverPhase
37.52 s
> setupCompileFlags: -package-db=/build/tmp.BSqAylm3Ud/setup-package.conf.d -threaded
37.52 s
> [1 of 2] Compiling Main ( Setup.hs, /build/tmp.BSqAylm3Ud/Main.o )
37.52 s
> [2 of 2] Linking Setup
37.52 s
> Running phase: updateAutotoolsGnuConfigScriptsPhase
37.52 s
> Running phase: configurePhase
37.52 s
> configureFlags: --verbose --prefix=/nix/store/8f1mfxn0kr70aq65d42dval09amwcmyg-pathway-compat-filepath-0.0.1.0 --libdir=$prefix/lib/$compiler/lib --libsubdir=$abi/$libname --docdir=/nix/store/sq6j1k7axnqkgy9n1f5x1z3j6fc0kdn9-pathway-compat-filepath-0.0.1.0-doc/share/doc/pathway-compat-filepath-0.0.1.0 --with-gcc=gcc --package-db=/build/tmp.BSqAylm3Ud/package.conf.d --ghc-option=-j16 --ghc-option=+RTS --ghc-option=-A64M --ghc-option=-RTS --enable-library-profiling --profiling-detail=exported-functions --disable-profiling --enable-shared --disable-coverage --enable-static --disable-executable-dynamic --enable-tests --disable-benchmarks --enable-library-vanilla --disable-library-for-ghci --enable-split-sections --enable-library-stripping --enable-executable-stripping --ghc-option=-haddock --ghc-options=-Werror --extra-lib-dirs=/nix/store/ffyzkisqs4vc4mg28bwwlyqjf8i9ph6b-ncurses-6.5/lib --extra-lib-dirs=/nix/store/n28qgdj8c1q41kf7n4y1jxa6ckp85m3c-libffi-3.5.2/lib --extra-lib-dirs=/nix/store/1b6h99dw7bk4wbn77kbalih42zbc67m1-elfutils-0.194/lib --extra-lib-dirs=/nix/store/hi0ar880110k6jsmmili7dh1gq3cg2a9-gmp-with-cxx-6.3.0/lib --extra-lib-dirs=/nix/store/g09cflpnp4g80q56sj9dng1qzv4v4ybc-numactl-2.0.18/lib --extra-lib-dirs=/nix/store/4yvzsc21abkayqx2bzncnj5fpx57hb6z-ghc-9.8.4/lib
37.52 s
> Using Parsec parser
37.52 s
> Configuring pathway-compat-filepath-0.0.1.0...
37.52 s
> Flags chosen: noisy-deprecations=True, verify-no-recursion=False
37.52 s
> Dependency base >=4.14.0 && <4.15 || >=4.15.0 && <4.16 || >=4.16.0 && <4.17 ||
37.52 s
> >=4.17.0 && <4.18 || >=4.18.0 && <4.19 || >=4.19.0 && <4.20 || >=4.20.0 &&
37.52 s
> <4.21 || >=4.21.0 && <4.22 || >=4.22.0 && <4.23: using base-4.19.2.0
37.52 s
> Dependency extra: using extra-1.8.1
37.52 s
> Dependency filepath >=1.4.2 && <1.5 || >=1.5.0 && <1.6: using
37.52 s
> filepath-1.4.301.0
37.52 s
> Dependency megaparsec >=9.0.1 && <9.1 || >=9.2.1 && <9.3 || >=9.5.0 && <9.6 ||
37.52 s
> >=9.7.0 && <9.8: using megaparsec-9.7.0
37.52 s
> Dependency pathway >=0.0.1 && <0.1: using pathway-0.0.1.0
37.52 s
> Dependency pathway-compat-base >=0.0.1 && <0.1: using
37.52 s
> pathway-compat-base-0.0.1.0
37.52 s
> Dependency pathway-internal >=0.0.1 && <0.1: using pathway-internal-0.0.1.0
37.52 s
> Dependency base >=4.14.0 && <4.15 || >=4.15.0 && <4.16 || >=4.16.0 && <4.17 ||
37.52 s
> >=4.17.0 && <4.18 || >=4.18.0 && <4.19 || >=4.19.0 && <4.20 || >=4.20.0 &&
37.52 s
> <4.21 || >=4.21.0 && <4.22 || >=4.22.0 && <4.23: using base-4.19.2.0
37.52 s
> Dependency doctest >=0.16.3 && <0.17 || >=0.18.1 && <0.19 || >=0.20.1 && <0.21
37.52 s
> || >=0.21.1 && <0.22 || >=0.22.2 && <0.23 || >=0.24.2 && <0.25: using
37.52 s
> doctest-0.24.2
37.52 s
> Dependency pathway-compat-filepath: using pathway-compat-filepath-0.0.1.0
37.52 s
> Source component graph:
37.52 s
> component lib
37.52 s
> component test:doctests dependency lib
37.52 s
> Configured component graph:
37.52 s
> component pathway-compat-filepath-0.0.1.0-IRur2AkqsMdDEUYM0d6HNv
37.52 s
> include base-4.19.2.0-8274
37.52 s
> include extra-1.8.1-EssMUQCsBco9gsyBCwwe73
37.52 s
> include filepath-1.4.301.0-9527
37.52 s
> include megaparsec-9.7.0-HGZe2UnGqRgF6D6IR9jAPL
37.52 s
> include pathway-0.0.1.0-IloKB8qrk9OLBhIjlawLWM
37.52 s
> include pathway-compat-base-0.0.1.0-9LwOiYzUq1SHjg9jvEQyqL
37.52 s
> include pathway-internal-0.0.1.0-BTurcxZAYjHHOlL1rvpIiQ
37.52 s
> component pathway-compat-filepath-0.0.1.0-LgIlxVMMZcr79s2T7PofOx-doctests
37.52 s
> include base-4.19.2.0-8274
37.52 s
> include doctest-0.24.2-HOk70bisutnFZuBXgSC0HK
37.52 s
> include pathway-compat-filepath-0.0.1.0-IRur2AkqsMdDEUYM0d6HNv
37.52 s
> Linked component graph:
37.52 s
> unit pathway-compat-filepath-0.0.1.0-IRur2AkqsMdDEUYM0d6HNv
37.52 s
> include base-4.19.2.0-8274
37.52 s
> include extra-1.8.1-EssMUQCsBco9gsyBCwwe73
37.52 s
> include filepath-1.4.301.0-9527
37.52 s
> include megaparsec-9.7.0-HGZe2UnGqRgF6D6IR9jAPL
37.52 s
> include pathway-0.0.1.0-IloKB8qrk9OLBhIjlawLWM
37.52 s
> include pathway-compat-base-0.0.1.0-9LwOiYzUq1SHjg9jvEQyqL
37.52 s
> include pathway-internal-0.0.1.0-BTurcxZAYjHHOlL1rvpIiQ
37.52 s
> Common.FilePath=pathway-compat-filepath-0.0.1.0-IRur2AkqsMdDEUYM0d6HNv:Common.FilePath,Common.OsPath=pathway-compat-filepath-0.0.1.0-IRur2AkqsMdDEUYM0d6HNv:Common.OsPath,System.FilePath=pathway-compat-filepath-0.0.1.0-IRur2AkqsMdDEUYM0d6HNv:System.FilePath,System.FilePath.Overlay=pathway-compat-filepath-0.0.1.0-IRur2AkqsMdDEUYM0d6HNv:System.FilePath.Overlay,System.FilePath.Pathway=pathway-compat-filepath-0.0.1.0-IRur2AkqsMdDEUYM0d6HNv:System.FilePath.Pathway,System.FilePath.Thin=pathway-compat-filepath-0.0.1.0-IRur2AkqsMdDEUYM0d6HNv:System.FilePath.Thin,System.OsPath=pathway-compat-filepath-0.0.1.0-IRur2AkqsMdDEUYM0d6HNv:System.OsPath,System.OsPath.Overlay=pathway-compat-filepath-0.0.1.0-IRur2AkqsMdDEUYM0d6HNv:System.OsPath.Overlay,System.OsPath.Pathway=pathway-compat-filepath-0.0.1.0-IRur2AkqsMdDEUYM0d6HNv:System.OsPath.Pathway,System.OsPath.Thin=pathway-compat-filepath-0.0.1.0-IRur2AkqsMdDEUYM0d6HNv:System.OsPath.Thin
37.52 s
> unit pathway-compat-filepath-0.0.1.0-LgIlxVMMZcr79s2T7PofOx-doctests
37.52 s
> include base-4.19.2.0-8274
37.52 s
> include doctest-0.24.2-HOk70bisutnFZuBXgSC0HK
37.52 s
> include pathway-compat-filepath-0.0.1.0-IRur2AkqsMdDEUYM0d6HNv
37.52 s
> Ready component graph:
37.52 s
> definite pathway-compat-filepath-0.0.1.0-IRur2AkqsMdDEUYM0d6HNv
37.52 s
> depends base-4.19.2.0-8274
37.52 s
> depends extra-1.8.1-EssMUQCsBco9gsyBCwwe73
37.52 s
> depends filepath-1.4.301.0-9527
37.52 s
> depends megaparsec-9.7.0-HGZe2UnGqRgF6D6IR9jAPL
37.52 s
> depends pathway-0.0.1.0-IloKB8qrk9OLBhIjlawLWM
37.52 s
> depends pathway-compat-base-0.0.1.0-9LwOiYzUq1SHjg9jvEQyqL
37.52 s
> depends pathway-internal-0.0.1.0-BTurcxZAYjHHOlL1rvpIiQ
37.52 s
> definite pathway-compat-filepath-0.0.1.0-LgIlxVMMZcr79s2T7PofOx-doctests
37.52 s
> depends base-4.19.2.0-8274
37.52 s
> depends doctest-0.24.2-HOk70bisutnFZuBXgSC0HK
37.52 s
> depends pathway-compat-filepath-0.0.1.0-IRur2AkqsMdDEUYM0d6HNv
37.52 s
> Using Cabal-3.10.3.0 compiled by ghc-9.8
37.52 s
> Using compiler: ghc-9.8.4
37.52 s
> Using install prefix:
37.52 s
> /nix/store/8f1mfxn0kr70aq65d42dval09amwcmyg-pathway-compat-filepath-0.0.1.0
37.52 s
> Executables installed in:
37.52 s
> /nix/store/8f1mfxn0kr70aq65d42dval09amwcmyg-pathway-compat-filepath-0.0.1.0/bin
37.52 s
> Libraries installed in:
37.52 s
> /nix/store/8f1mfxn0kr70aq65d42dval09amwcmyg-pathway-compat-filepath-0.0.1.0/lib/ghc-9.8.4/lib/x86_64-linux-ghc-9.8.4/pathway-compat-filepath-0.0.1.0-IRur2AkqsMdDEUYM0d6HNv
37.52 s
> Dynamic Libraries installed in:
37.52 s
> /nix/store/8f1mfxn0kr70aq65d42dval09amwcmyg-pathway-compat-filepath-0.0.1.0/lib/ghc-9.8.4/lib/x86_64-linux-ghc-9.8.4
37.52 s
> Private executables installed in:
37.52 s
> /nix/store/8f1mfxn0kr70aq65d42dval09amwcmyg-pathway-compat-filepath-0.0.1.0/libexec/x86_64-linux-ghc-9.8.4/pathway-compat-filepath-0.0.1.0
37.52 s
> Data files installed in:
37.52 s
> /nix/store/8f1mfxn0kr70aq65d42dval09amwcmyg-pathway-compat-filepath-0.0.1.0/share/x86_64-linux-ghc-9.8.4/pathway-compat-filepath-0.0.1.0
37.52 s
> Documentation installed in:
37.52 s
> /nix/store/sq6j1k7axnqkgy9n1f5x1z3j6fc0kdn9-pathway-compat-filepath-0.0.1.0-doc/share/doc/pathway-compat-filepath-0.0.1.0
37.52 s
> Configuration files installed in:
37.52 s
> /nix/store/8f1mfxn0kr70aq65d42dval09amwcmyg-pathway-compat-filepath-0.0.1.0/etc
37.52 s
> No alex found
37.52 s
> Using ar found on system at:
37.52 s
> /nix/store/iz5lckcsg66r223si2gck7csk2hihj0m-binutils-wrapper-2.44/bin/ar
37.52 s
> No c2hs found
37.52 s
> No cpphs found
37.52 s
> Using doctest version 0.24.2 found on system at:
37.52 s
> /nix/store/ipqa88qiasixywmsikcnq7nhq6340lg5-doctest-0.24.2/bin/doctest
37.52 s
> Using gcc version 14.3.0 given by user at:
37.52 s
> /nix/store/8v97ngkcpfzgghwnnr7fsz33p2x22gy9-gcc-wrapper-14.3.0/bin/gcc
37.52 s
> Using ghc version 9.8.4 found on system at:
37.52 s
> /nix/store/4yvzsc21abkayqx2bzncnj5fpx57hb6z-ghc-9.8.4/bin/ghc
37.52 s
> Using ghc-pkg version 9.8.4 found on system at:
37.52 s
> /nix/store/4yvzsc21abkayqx2bzncnj5fpx57hb6z-ghc-9.8.4/bin/ghc-pkg-9.8.4
37.52 s
> No ghcjs found
37.52 s
> No ghcjs-pkg found
37.52 s
> No greencard found
37.52 s
> Using haddock version 2.30.0 found on system at:
37.52 s
> /nix/store/4yvzsc21abkayqx2bzncnj5fpx57hb6z-ghc-9.8.4/bin/haddock-ghc-9.8.4
37.52 s
> No happy found
37.52 s
> Using haskell-suite found on system at: haskell-suite-dummy-location
37.52 s
> Using haskell-suite-pkg found on system at: haskell-suite-pkg-dummy-location
37.52 s
> No hmake found
37.52 s
> Using hpc version 0.69 found on system at:
37.52 s
> /nix/store/4yvzsc21abkayqx2bzncnj5fpx57hb6z-ghc-9.8.4/bin/hpc-ghc-9.8.4
37.52 s
> Using hsc2hs version 0.68.10 found on system at:
37.52 s
> /nix/store/4yvzsc21abkayqx2bzncnj5fpx57hb6z-ghc-9.8.4/bin/hsc2hs-ghc-9.8.4
37.52 s
> Using hscolour version 1.25 found on system at:
37.52 s
> /nix/store/palqpb4p9k5rqxhxjdgqrak8n91p6c4z-hscolour-1.25/bin/HsColour
37.52 s
> No jhc found
37.52 s
> Using ld found on system at:
37.52 s
> /nix/store/iz5lckcsg66r223si2gck7csk2hihj0m-binutils-wrapper-2.44/bin/ld.gold
37.52 s
> No pkg-config found
37.52 s
> Using runghc version 9.8.4 found on system at:
37.52 s
> /nix/store/4yvzsc21abkayqx2bzncnj5fpx57hb6z-ghc-9.8.4/bin/runghc-9.8.4
37.52 s
> Using strip version 2.44 found on system at:
37.52 s
> /nix/store/8v97ngkcpfzgghwnnr7fsz33p2x22gy9-gcc-wrapper-14.3.0/bin/strip
37.52 s
> Using tar found on system at:
37.52 s
> /nix/store/xl6pd2spjajwcpq09fnmnjv5psqmlmma-gnutar-1.35/bin/tar
37.52 s
> No uhc found
37.52 s
> Running phase: buildPhase
37.52 s
> Preprocessing library for pathway-compat-filepath-0.0.1.0..
37.52 s
> Building library for pathway-compat-filepath-0.0.1.0..
37.52 s
> [ 1 of 10] Compiling Common.FilePath ( src/Common/FilePath.hs, dist/build/Common/FilePath.o, dist/build/Common/FilePath.dyn_o )
37.52 s
> [ 2 of 10] Compiling Common.OsPath ( src/Common/OsPath.hs, dist/build/Common/OsPath.o, dist/build/Common/OsPath.dyn_o )
37.52 s
>
37.52 s
> src/Common/OsPath.hs:87:23: error : [ GHC-76037 ]
37.52 s
> Not in scope: ‘O.unsafeEncodeUtf’
37.52 s
> NB: the module ‘System.OsPath’ does not export ‘unsafeEncodeUtf’.
37.52 s
> |
37.52 s
> 87 | Format.parent = O.unsafeEncodeUtf "..",
37.52 s
> | ^^^^^^^^^^^^^^^^^
37.52 s
> [ 3 of 10] Compiling System.FilePath.Thin ( src/System/FilePath/Thin.hs, dist/build/System/FilePath/Thin.o, dist/build/System/FilePath/Thin.dyn_o )
37.52 s
> [ 4 of 10] Compiling System.FilePath.Pathway ( src/System/FilePath/Pathway.hs, dist/build/System/FilePath/Pathway.o, dist/build/System/FilePath/Pathway.dyn_o )
37.52 s
> [ 5 of 10] Compiling System.FilePath.Overlay ( src/System/FilePath/Overlay.hs, dist/build/System/FilePath/Overlay.o, dist/build/System/FilePath/Overlay.dyn_o )
37.52 s
> [ 6 of 10] Compiling System.FilePath ( src/System/FilePath.hs, dist/build/System/FilePath.o, dist/build/System/FilePath.dyn_o )
37.52 s
For full logs, run:
37.52 s
nix log /nix/store/a7kn8c1mldf3bb70zbglbid9cdnfr0m8-pathway-compat-filepath-0.0.1.0.drv
37.52 s
error: Cannot build '/nix/store/blkw723shcpbnfifd3fa6d8fnarlf55z-ghc-9.8.4-with-packages.drv '.
37.52 s
Reason: 1 dependency failed .
37.52 s
Output paths:
37.52 s
/nix/store/087v8475vkhjq5a81yfh0x1276474c14-ghc-9.8.4-with-packages
37.52 s
error: Cannot build '/nix/store/7xg1gsggfpl05235383k9na9yqqbnanz-pathway-compat-directory-0.0.1.0.drv '.
37.52 s
Reason: 1 dependency failed .
37.52 s
Output paths:
37.52 s
/nix/store/f2vqb9rl88rm2297as2v33y6nx9v6by3-pathway-compat-directory-0.0.1.0-doc
37.52 s
/nix/store/hkzlvycigjksgpl6bhfacglhsvy5zq30-pathway-compat-directory-0.0.1.0
37.52 s
error: Cannot build '/nix/store/q0nssswl35scyg2dnc6ny4s822dd86zp-pathway-compat-file-io-0.0.1.0.drv '.
37.52 s
Reason: 1 dependency failed .
37.52 s
Output paths:
37.52 s
/nix/store/a538c1sbf04xxlrly9wrwgwkmh0wp65z-pathway-compat-file-io-0.0.1.0-doc
37.52 s
/nix/store/iza5w2w92h4i64q6davpj6ddy209hzaq-pathway-compat-file-io-0.0.1.0
37.52 s
error: Cannot build '/nix/store/f0c4jgak407gsl4f0gsxrdlv0ksvcpir-pathway-compat-temporary-0.0.1.0.drv '.
37.52 s
Reason: 1 dependency failed .
37.52 s
Output paths:
37.52 s
/nix/store/bnxqi4h6vm3yzkhiwbdmc81smswzvivk-pathway-compat-temporary-0.0.1.0-doc
37.52 s
/nix/store/pzbvzsfll48py6yvyas4hrmvdv2l65sm-pathway-compat-temporary-0.0.1.0
37.52 s
error: Cannot build '/nix/store/ix9k5awwf5inpd0hgaghxbhj9wc43gx9-pathway-system-0.0.1.0.drv '.
37.52 s
Reason: 1 dependency failed .
37.52 s
Output paths:
37.52 s
/nix/store/i5d4wpjzqgrg2brh3cib653hcd8s43m4-pathway-system-0.0.1.0
37.52 s
/nix/store/jsz52hm01k5m5wl49pnk6mk2cn7wwnad-pathway-system-0.0.1.0-doc
37.52 s
error: Build failed due to failed dependency
37.52 s
error: Cannot build '/nix/store/qcp48sa8nmysda2b9cdcs4da4wvmbqs0-all-packages.drv '.
37.52 s
Reason: 1 dependency failed .
37.52 s
Output paths:
37.52 s
/nix/store/9ibfrdc9iwbp0hp5cyc5zqsz9yw5n5sc-all-packages
37.53 s
Build failed due to failed dependency
37.57 s
Build failed.