build packages.x86_64-linux.ghc984_all

Reproduce this run
Retry Run
  1. 0.79 s $ /nix/store/9ypz3flqsrl5xl495mm8h645gadjsxi1-coreutils-9.11/bin/timeout --kill-after=15s 7200s /nix/store/23zk8sgzamrbmj1fday15szf7f2279s8-nix-2.34.7/bin/nix --extra-experimental-features nix-command --extra-experimental-features flakes --log-format internal-json build --no-link --print-out-paths git+https://github.com/sellout/pathway?ref=more-system&rev=315332dbcaa9f1016fc658995abc767abdaec679&shallow=1#packages.x86_64-linux.ghc984_all --print-build-logs
  2. 0.89 s warning: ignoring untrusted flake configuration setting 'allow-import-from-derivation'.
  3. 0.89 s Pass '--accept-flake-config' to trust it
  4. 0.89 s warning: ignoring untrusted flake configuration setting 'extra-experimental-features'.
  5. 0.89 s Pass '--accept-flake-config' to trust it
  6. 0.89 s warning: ignoring untrusted flake configuration setting 'extra-substituters'.
  7. 0.89 s Pass '--accept-flake-config' to trust it
  8. 0.89 s warning: ignoring untrusted flake configuration setting 'extra-trusted-public-keys'.
  9. 0.89 s Pass '--accept-flake-config' to trust it
  10. 0.89 s warning: ignoring untrusted flake configuration setting 'sandbox'.
  11. 0.89 s Pass '--accept-flake-config' to trust it
  12. 0.89 s warning: ignoring untrusted flake configuration setting 'use-registries'.
  13. 0.89 s Pass '--accept-flake-config' to trust it
  14. 0.89 s error (ignored): SQLite database '/var/cache/nix-ci-worker/eval-cache-v6/966f93a0d0b73dcb8730c71854323896b63a453f918e6dbc5d822ce89957ed33.sqlite' is busy
  15. 1.08 s
  16. 1.11 s Building /nix/store/siarl9knqf5iavgr8f3fk89dmn0c8rzd-cabal2nix-pathway.drv
  17. 1.16 s [cabal2nix-pathway:post-build] Uploading to cachix cache "sellout": /nix/store/nlg0d1nga760psy9zh3b4ddaf5g2wc3p-cabal2nix-pathway
  18. 1.64 s [cabal2nix-pathway:post-build] Nothing to push - all store paths are already on Cachix.
  19. 1.66 s [cabal2nix-pathway:post-build] Uploading to the NixCI cache: /nix/store/nlg0d1nga760psy9zh3b4ddaf5g2wc3p-cabal2nix-pathway
  20. 1.69 s [cabal2nix-pathway:post-build] warning: 'warn-short-path-literals' is deprecated, use 'lint-short-path-literals = ignore' instead
  21. 1.98 s [cabal2nix-pathway:post-build] copying 1 paths...
  22. 1.98 s [cabal2nix-pathway:post-build] copying path '/nix/store/nlg0d1nga760psy9zh3b4ddaf5g2wc3p-cabal2nix-pathway' to 'https://cache.nix-ci.com'...
  23. 2.12 s [cabal2nix-pathway:post-build] warning: 'warn-short-path-literals' is deprecated, use 'lint-short-path-literals = ignore' instead
  24. 2.31 s [cabal2nix-pathway:post-build] copying 0 paths...
  25. 2.32 s Uploaded cabal2nix-pathway in 1.1s
  26. 2.32 s Progress: 1 of 2 built
  27. 2.32 s Built cabal2nix-pathway in 1.2s
  28. 2.32 s Progress: 2 of 2 built
  29. 2.32 s
  30. 2.35 s Building /nix/store/ii2myyssg9vj1dq27bkfifzrfwyfh7z1-cabal2nix-pathway-compat-base.drv
  31. 2.40 s [cabal2nix-pathway-compat-base:post-build] Uploading to cachix cache "sellout": /nix/store/a808rk6gds80sbgb23p9v9mqn58msax9-cabal2nix-pathway-compat-base
  32. 2.89 s [cabal2nix-pathway-compat-base:post-build] Nothing to push - all store paths are already on Cachix.
  33. 2.90 s [cabal2nix-pathway-compat-base:post-build] Uploading to the NixCI cache: /nix/store/a808rk6gds80sbgb23p9v9mqn58msax9-cabal2nix-pathway-compat-base
  34. 2.94 s [cabal2nix-pathway-compat-base:post-build] warning: 'warn-short-path-literals' is deprecated, use 'lint-short-path-literals = ignore' instead
  35. 3.18 s [cabal2nix-pathway-compat-base:post-build] copying 1 paths...
  36. 3.18 s [cabal2nix-pathway-compat-base:post-build] copying path '/nix/store/a808rk6gds80sbgb23p9v9mqn58msax9-cabal2nix-pathway-compat-base' to 'https://cache.nix-ci.com'...
  37. 3.61 s [cabal2nix-pathway-compat-base:post-build] warning: 'warn-short-path-literals' is deprecated, use 'lint-short-path-literals = ignore' instead
  38. 3.90 s [cabal2nix-pathway-compat-base:post-build] copying 0 paths...
  39. 3.91 s Uploaded cabal2nix-pathway-compat-base in 1.5s
  40. 3.91 s Progress: 1 of 2 built
  41. 3.91 s Built cabal2nix-pathway-compat-base in 1.5s
  42. 3.91 s Progress: 2 of 2 built
  43. 3.91 s
  44. 3.94 s Building /nix/store/fvi474dd0z1hy4frkp608a05qjsvhhsm-cabal2nix-pathway-compat-directory.drv
  45. 3.99 s [cabal2nix-pathway-compat-directory:post-build] Uploading to cachix cache "sellout": /nix/store/8rwpw52s4c6hbqa87r6wncqccgyvbsxq-cabal2nix-pathway-compat-directory
  46. 4.57 s [cabal2nix-pathway-compat-directory:post-build] Nothing to push - all store paths are already on Cachix.
  47. 4.59 s [cabal2nix-pathway-compat-directory:post-build] Uploading to the NixCI cache: /nix/store/8rwpw52s4c6hbqa87r6wncqccgyvbsxq-cabal2nix-pathway-compat-directory
  48. 4.63 s [cabal2nix-pathway-compat-directory:post-build] warning: 'warn-short-path-literals' is deprecated, use 'lint-short-path-literals = ignore' instead
  49. 4.91 s [cabal2nix-pathway-compat-directory:post-build] copying 1 paths...
  50. 4.91 s [cabal2nix-pathway-compat-directory:post-build] copying path '/nix/store/8rwpw52s4c6hbqa87r6wncqccgyvbsxq-cabal2nix-pathway-compat-directory' to 'https://cache.nix-ci.com'...
  51. 5.03 s [cabal2nix-pathway-compat-directory:post-build] warning: 'warn-short-path-literals' is deprecated, use 'lint-short-path-literals = ignore' instead
  52. 5.21 s [cabal2nix-pathway-compat-directory:post-build] copying 0 paths...
  53. 5.23 s Uploaded cabal2nix-pathway-compat-directory in 1.2s
  54. 5.23 s Progress: 1 of 2 built
  55. 5.23 s Built cabal2nix-pathway-compat-directory in 1.2s
  56. 5.23 s Progress: 2 of 2 built
  57. 5.23 s
  58. 5.26 s Building /nix/store/ngk9584k1amxsjr7gs5y0rjaabhrwvxm-cabal2nix-pathway-compat-file-io.drv
  59. 5.31 s [cabal2nix-pathway-compat-file-io:post-build] Uploading to cachix cache "sellout": /nix/store/ykz91wq5cyx9j16v0b7jvy6ibdj46942-cabal2nix-pathway-compat-file-io
  60. 5.83 s [cabal2nix-pathway-compat-file-io:post-build] Nothing to push - all store paths are already on Cachix.
  61. 5.85 s [cabal2nix-pathway-compat-file-io:post-build] Uploading to the NixCI cache: /nix/store/ykz91wq5cyx9j16v0b7jvy6ibdj46942-cabal2nix-pathway-compat-file-io
  62. 5.92 s [cabal2nix-pathway-compat-file-io:post-build] warning: 'warn-short-path-literals' is deprecated, use 'lint-short-path-literals = ignore' instead
  63. 6.13 s [cabal2nix-pathway-compat-file-io:post-build] copying 1 paths...
  64. 6.13 s [cabal2nix-pathway-compat-file-io:post-build] copying path '/nix/store/ykz91wq5cyx9j16v0b7jvy6ibdj46942-cabal2nix-pathway-compat-file-io' to 'https://cache.nix-ci.com'...
  65. 6.27 s [cabal2nix-pathway-compat-file-io:post-build] warning: 'warn-short-path-literals' is deprecated, use 'lint-short-path-literals = ignore' instead
  66. 6.44 s [cabal2nix-pathway-compat-file-io:post-build] copying 0 paths...
  67. 6.46 s Uploaded cabal2nix-pathway-compat-file-io in 1.1s
  68. 6.46 s Progress: 1 of 2 built
  69. 6.46 s Built cabal2nix-pathway-compat-file-io in 1.2s
  70. 6.46 s Progress: 2 of 2 built
  71. 6.47 s
  72. 6.49 s Building /nix/store/6wwqzr2va1anbl52gnqsi9b3iyn35bxv-cabal2nix-pathway-compat-filepath.drv
  73. 6.55 s [cabal2nix-pathway-compat-filepath:post-build] Uploading to cachix cache "sellout": /nix/store/psg6xvbcmsxz513a806y0zrb2jhdnbh5-cabal2nix-pathway-compat-filepath
  74. 7.06 s [cabal2nix-pathway-compat-filepath:post-build] Nothing to push - all store paths are already on Cachix.
  75. 7.07 s [cabal2nix-pathway-compat-filepath:post-build] Uploading to the NixCI cache: /nix/store/psg6xvbcmsxz513a806y0zrb2jhdnbh5-cabal2nix-pathway-compat-filepath
  76. 7.12 s [cabal2nix-pathway-compat-filepath:post-build] warning: 'warn-short-path-literals' is deprecated, use 'lint-short-path-literals = ignore' instead
  77. 7.37 s [cabal2nix-pathway-compat-filepath:post-build] copying 1 paths...
  78. 7.37 s [cabal2nix-pathway-compat-filepath:post-build] copying path '/nix/store/psg6xvbcmsxz513a806y0zrb2jhdnbh5-cabal2nix-pathway-compat-filepath' to 'https://cache.nix-ci.com'...
  79. 7.50 s [cabal2nix-pathway-compat-filepath:post-build] warning: 'warn-short-path-literals' is deprecated, use 'lint-short-path-literals = ignore' instead
  80. 7.66 s [cabal2nix-pathway-compat-filepath:post-build] copying 0 paths...
  81. 7.68 s Uploaded cabal2nix-pathway-compat-filepath in 1.1s
  82. 7.68 s Progress: 1 of 2 built
  83. 7.68 s Built cabal2nix-pathway-compat-filepath in 1.1s
  84. 7.68 s Progress: 2 of 2 built
  85. 7.68 s
  86. 7.71 s Building /nix/store/114rsbsdf4q55dg71csls3p1kcg5rji8-cabal2nix-pathway-compat-temporary.drv
  87. 7.77 s [cabal2nix-pathway-compat-temporary:post-build] Uploading to cachix cache "sellout": /nix/store/k3icd1h30w92yvb47bcf25gnlp25nxg1-cabal2nix-pathway-compat-temporary
  88. 8.20 s [cabal2nix-pathway-compat-temporary:post-build] Nothing to push - all store paths are already on Cachix.
  89. 8.21 s [cabal2nix-pathway-compat-temporary:post-build] Uploading to the NixCI cache: /nix/store/k3icd1h30w92yvb47bcf25gnlp25nxg1-cabal2nix-pathway-compat-temporary
  90. 8.25 s [cabal2nix-pathway-compat-temporary:post-build] warning: 'warn-short-path-literals' is deprecated, use 'lint-short-path-literals = ignore' instead
  91. 8.50 s [cabal2nix-pathway-compat-temporary:post-build] copying 1 paths...
  92. 8.50 s [cabal2nix-pathway-compat-temporary:post-build] copying path '/nix/store/k3icd1h30w92yvb47bcf25gnlp25nxg1-cabal2nix-pathway-compat-temporary' to 'https://cache.nix-ci.com'...
  93. 8.63 s [cabal2nix-pathway-compat-temporary:post-build] warning: 'warn-short-path-literals' is deprecated, use 'lint-short-path-literals = ignore' instead
  94. 8.80 s [cabal2nix-pathway-compat-temporary:post-build] copying 0 paths...
  95. 8.82 s Uploaded cabal2nix-pathway-compat-temporary in 1.0s
  96. 8.82 s Progress: 1 of 2 built
  97. 8.82 s Built cabal2nix-pathway-compat-temporary in 1.1s
  98. 8.82 s Progress: 2 of 2 built
  99. 8.82 s
  100. 8.85 s Building /nix/store/qq3pmj6smgpf71bc0sm1bvs4bkr6p638-cabal2nix-pathway-internal.drv
  101. 8.90 s [cabal2nix-pathway-internal:post-build] Uploading to cachix cache "sellout": /nix/store/gpfj1h1nmmgylzb44dxnb5ikz701l1iv-cabal2nix-pathway-internal
  102. 9.33 s [cabal2nix-pathway-internal:post-build] Nothing to push - all store paths are already on Cachix.
  103. 9.34 s [cabal2nix-pathway-internal:post-build] Uploading to the NixCI cache: /nix/store/gpfj1h1nmmgylzb44dxnb5ikz701l1iv-cabal2nix-pathway-internal
  104. 9.39 s [cabal2nix-pathway-internal:post-build] warning: 'warn-short-path-literals' is deprecated, use 'lint-short-path-literals = ignore' instead
  105. 9.64 s [cabal2nix-pathway-internal:post-build] copying 1 paths...
  106. 9.64 s [cabal2nix-pathway-internal:post-build] copying path '/nix/store/gpfj1h1nmmgylzb44dxnb5ikz701l1iv-cabal2nix-pathway-internal' to 'https://cache.nix-ci.com'...
  107. 9.77 s [cabal2nix-pathway-internal:post-build] warning: 'warn-short-path-literals' is deprecated, use 'lint-short-path-literals = ignore' instead
  108. 9.97 s [cabal2nix-pathway-internal:post-build] copying 0 paths...
  109. 9.98 s Uploaded cabal2nix-pathway-internal in 1.0s
  110. 9.98 s Progress: 1 of 2 built
  111. 9.98 s Built cabal2nix-pathway-internal in 1.1s
  112. 9.98 s Progress: 2 of 2 built
  113. 9.99 s
  114. 10.01 s Building /nix/store/app972f1cwdsvm6pqhk5sms7nha1ilh6-cabal2nix-pathway-path.drv
  115. 10.06 s [cabal2nix-pathway-path:post-build] Uploading to cachix cache "sellout": /nix/store/p8r223n18p4xqh840q0sdcpp6r2czfdl-cabal2nix-pathway-path
  116. 10.48 s [cabal2nix-pathway-path:post-build] Nothing to push - all store paths are already on Cachix.
  117. 10.49 s [cabal2nix-pathway-path:post-build] Uploading to the NixCI cache: /nix/store/p8r223n18p4xqh840q0sdcpp6r2czfdl-cabal2nix-pathway-path
  118. 10.53 s [cabal2nix-pathway-path:post-build] warning: 'warn-short-path-literals' is deprecated, use 'lint-short-path-literals = ignore' instead
  119. 10.78 s [cabal2nix-pathway-path:post-build] copying 1 paths...
  120. 10.78 s [cabal2nix-pathway-path:post-build] copying path '/nix/store/p8r223n18p4xqh840q0sdcpp6r2czfdl-cabal2nix-pathway-path' to 'https://cache.nix-ci.com'...
  121. 10.91 s [cabal2nix-pathway-path:post-build] warning: 'warn-short-path-literals' is deprecated, use 'lint-short-path-literals = ignore' instead
  122. 11.08 s [cabal2nix-pathway-path:post-build] copying 0 paths...
  123. 11.10 s Uploaded cabal2nix-pathway-path in 1.0s
  124. 11.10 s Progress: 1 of 2 built
  125. 11.10 s Built cabal2nix-pathway-path in 1.0s
  126. 11.10 s Progress: 2 of 2 built
  127. 11.10 s
  128. 11.13 s Building /nix/store/xh53xszfx3b121b5lzd6rmmnc4df4a0y-cabal2nix-pathway-quickcheck.drv
  129. 11.19 s [cabal2nix-pathway-quickcheck:post-build] Uploading to cachix cache "sellout": /nix/store/8s9mf029vqnss6jqa78jawa5p47cac9n-cabal2nix-pathway-quickcheck
  130. 11.82 s [cabal2nix-pathway-quickcheck:post-build] Nothing to push - all store paths are already on Cachix.
  131. 11.84 s [cabal2nix-pathway-quickcheck:post-build] Uploading to the NixCI cache: /nix/store/8s9mf029vqnss6jqa78jawa5p47cac9n-cabal2nix-pathway-quickcheck
  132. 11.88 s [cabal2nix-pathway-quickcheck:post-build] warning: 'warn-short-path-literals' is deprecated, use 'lint-short-path-literals = ignore' instead
  133. 12.11 s [cabal2nix-pathway-quickcheck:post-build] copying 1 paths...
  134. 12.11 s [cabal2nix-pathway-quickcheck:post-build] copying path '/nix/store/8s9mf029vqnss6jqa78jawa5p47cac9n-cabal2nix-pathway-quickcheck' to 'https://cache.nix-ci.com'...
  135. 12.24 s [cabal2nix-pathway-quickcheck:post-build] warning: 'warn-short-path-literals' is deprecated, use 'lint-short-path-literals = ignore' instead
  136. 12.44 s [cabal2nix-pathway-quickcheck:post-build] copying 0 paths...
  137. 12.45 s Uploaded cabal2nix-pathway-quickcheck in 1.2s
  138. 12.45 s Progress: 1 of 2 built
  139. 12.45 s Built cabal2nix-pathway-quickcheck in 1.3s
  140. 12.45 s Progress: 2 of 2 built
  141. 12.45 s
  142. 12.48 s Building /nix/store/ligrfjv580qqxjr4d2yvsf9c6fkkvwk4-cabal2nix-pathway-system.drv
  143. 12.54 s [cabal2nix-pathway-system:post-build] Uploading to cachix cache "sellout": /nix/store/w30xk8y0xnaj3placw3vd4aghw4hfbwb-cabal2nix-pathway-system
  144. 12.98 s [cabal2nix-pathway-system:post-build] Nothing to push - all store paths are already on Cachix.
  145. 13.00 s [cabal2nix-pathway-system:post-build] Uploading to the NixCI cache: /nix/store/w30xk8y0xnaj3placw3vd4aghw4hfbwb-cabal2nix-pathway-system
  146. 13.04 s [cabal2nix-pathway-system:post-build] warning: 'warn-short-path-literals' is deprecated, use 'lint-short-path-literals = ignore' instead
  147. 13.31 s [cabal2nix-pathway-system:post-build] copying 1 paths...
  148. 13.31 s [cabal2nix-pathway-system:post-build] copying path '/nix/store/w30xk8y0xnaj3placw3vd4aghw4hfbwb-cabal2nix-pathway-system' to 'https://cache.nix-ci.com'...
  149. 13.45 s [cabal2nix-pathway-system:post-build] warning: 'warn-short-path-literals' is deprecated, use 'lint-short-path-literals = ignore' instead
  150. 13.64 s [cabal2nix-pathway-system:post-build] copying 0 paths...
  151. 13.65 s Uploaded cabal2nix-pathway-system in 1.1s
  152. 13.66 s Progress: 1 of 2 built
  153. 13.66 s Built cabal2nix-pathway-system in 1.1s
  154. 13.66 s Progress: 2 of 2 built
  155. 13.75 s
  156. 17.36 s Downloading cached colour-2.3.6-data from https://cache.nix-ci.com
  157. 17.43 s Downloading cached ghc-9.8.4-doc from https://cache.nix-ci.com
  158. 17.43 s Downloading cached hscolour from https://cache.nix-ci.com
  159. 17.43 s Downloaded cached colour-2.3.6-data (2536 B) in 66ms
  160. 17.43 s Progress: 0 of 106 built, 1 of 170 downloaded from cache (2 downloading)
  161. 17.70 s Downloaded cached hscolour (2.5 MiB) in 274ms
  162. 17.70 s Progress: 0 of 106 built, 2 of 170 downloaded from cache (1 downloading)
  163. 29.83 s Downloaded cached ghc-9.8.4-doc (687.1 MiB) in 12.4s
  164. 29.83 s Progress: 0 of 105 built, 3 of 170 downloaded from cache
  165. 29.83 s Downloading cached OneTuple-0.4.2-doc from https://cache.nix-ci.com
  166. 30.17 s Downloading cached StateVar-1.2.2-doc from https://cache.nix-ci.com
  167. 30.17 s Downloading cached assoc-1.1.1-doc from https://cache.nix-ci.com
  168. 30.17 s Downloading cached base-orphans-0.9.3-doc from https://cache.nix-ci.com
  169. 30.17 s Downloading cached cabal-doctest-1.0.12-doc from https://sellout.cachix.org
  170. 30.17 s Downloading cached call-stack-0.4.0-doc from https://cache.nix-ci.com
  171. 30.17 s Downloading cached character-ps-0.1-doc from https://cache.nix-ci.com
  172. 30.17 s Downloading cached clock-0.8.4-doc from https://cache.nix-ci.com
  173. 30.17 s Downloading cached code-page-0.2.1-doc from https://cache.nix-ci.com
  174. 30.17 s Downloading cached colour-2.3.6-doc from https://cache.nix-ci.com
  175. 30.17 s Downloading cached dlist-1.0-doc from https://cache.nix-ci.com
  176. 30.17 s Downloading cached file-io-0.1.5-doc from https://cache.nix-ci.com
  177. 30.17 s Downloading cached generically-0.1.1-doc from https://cache.nix-ci.com
  178. 30.17 s Downloading cached ghc from https://cache.nix-ci.com
  179. 30.17 s Downloading cached ghc-paths-0.1.0.12-doc from https://cache.nix-ci.com
  180. 30.17 s Downloading cached indexed-traversable-0.1.4-doc from https://cache.nix-ci.com
  181. 30.18 s Downloaded cached OneTuple-0.4.2-doc (270 KiB) in 343ms
  182. 30.18 s Progress: 0 of 104 built, 4 of 170 downloaded from cache (15 downloading)
  183. 30.18 s Downloading cached integer-logarithms-1.0.4-doc from https://cache.nix-ci.com
  184. 30.18 s Downloaded cached call-stack-0.4.0-doc (203 KiB) in 9ms
  185. 30.18 s Progress: 0 of 104 built, 5 of 170 downloaded from cache (15 downloading)
  186. 30.18 s Downloading cached old-locale-1.0.0.7-doc from https://cache.nix-ci.com
  187. 30.18 s Downloaded cached StateVar-1.2.2-doc (299 KiB) in 10ms
  188. 30.18 s Progress: 0 of 104 built, 6 of 170 downloaded from cache (15 downloading)
  189. 30.18 s Downloading cached os-string-2.0.8-doc from https://cache.nix-ci.com
  190. 30.18 s Downloaded cached code-page-0.2.1-doc (276 KiB) in 11ms
  191. 30.18 s Progress: 0 of 104 built, 7 of 170 downloaded from cache (15 downloading)
  192. 30.18 s Downloading cached contravariant-1.5.5-doc from https://cache.nix-ci.com
  193. 30.18 s Downloaded cached character-ps-0.1-doc (1 MiB) in 13ms
  194. 30.18 s Progress: 0 of 104 built, 8 of 170 downloaded from cache (15 downloading)
  195. 30.18 s Downloading cached parallel-3.2.2.0-doc from https://cache.nix-ci.com
  196. 30.18 s Downloaded cached assoc-1.1.1-doc (192 KiB) in 14ms
  197. 30.18 s Progress: 0 of 104 built, 9 of 170 downloaded from cache (15 downloading)
  198. 30.18 s Downloading cached parser-combinators-1.3.0-doc from https://cache.nix-ci.com
  199. 30.20 s Downloaded cached ghc-paths-0.1.0.12-doc (121 KiB) in 26ms
  200. 30.20 s Progress: 0 of 104 built, 10 of 170 downloaded from cache (15 downloading)
  201. 30.20 s Downloading cached prettyprinter-1.7.1-doc from https://cache.nix-ci.com
  202. 30.20 s Downloaded cached clock-0.8.4-doc (517 KiB) in 27ms
  203. 30.20 s Progress: 0 of 104 built, 11 of 170 downloaded from cache (15 downloading)
  204. 30.20 s Downloading cached primitive-0.9.1.0-doc from https://cache.nix-ci.com
  205. 30.21 s Downloaded cached dlist-1.0-doc (532 KiB) in 37ms
  206. 30.21 s Progress: 0 of 104 built, 12 of 170 downloaded from cache (15 downloading)
  207. 30.21 s Downloading cached extra-1.8.1-doc from https://cache.nix-ci.com
  208. 30.23 s Downloaded cached base-orphans-0.9.3-doc (1.1 MiB) in 60ms
  209. 30.23 s Progress: 0 of 104 built, 13 of 170 downloaded from cache (15 downloading)
  210. 30.23 s Downloading cached reflection-2.1.9-doc from https://cache.nix-ci.com
  211. 30.23 s Downloaded cached colour-2.3.6-doc (2 MiB) in 63ms
  212. 30.23 s Progress: 0 of 104 built, 14 of 170 downloaded from cache (15 downloading)
  213. 30.23 s Downloading cached semigroups-0.20-doc from https://cache.nix-ci.com
  214. 30.24 s Downloaded cached cabal-doctest-1.0.12-doc (358 KiB) in 68ms
  215. 30.24 s Progress: 0 of 104 built, 15 of 170 downloaded from cache (15 downloading)
  216. 30.24 s Downloading cached ansi-terminal-types-1.1.3-doc from https://cache.nix-ci.com
  217. 30.25 s Downloaded cached indexed-traversable-0.1.4-doc (1.1 MiB) in 76ms
  218. 30.25 s Progress: 0 of 104 built, 16 of 170 downloaded from cache (15 downloading)
  219. 30.25 s Downloading cached splitmix-0.1.3.1-doc from https://cache.nix-ci.com
  220. 30.27 s Downloaded cached generically-0.1.1-doc (180 KiB) in 100ms
  221. 30.27 s Progress: 0 of 104 built, 17 of 170 downloaded from cache (15 downloading)
  222. 30.27 s Downloading cached syb-0.7.2.4-doc from https://cache.nix-ci.com
  223. 30.28 s Downloaded cached file-io-0.1.5-doc (676 KiB) in 110ms
  224. 30.28 s Progress: 0 of 104 built, 18 of 170 downloaded from cache (15 downloading)
  225. 30.28 s Downloading cached tagged-0.8.9-doc from https://cache.nix-ci.com
  226. 30.41 s Downloaded cached integer-logarithms-1.0.4-doc (354 KiB) in 234ms
  227. 30.41 s Progress: 0 of 104 built, 19 of 170 downloaded from cache (15 downloading)
  228. 30.41 s Downloading cached th-abstraction-0.7.1.0-doc from https://cache.nix-ci.com
  229. 30.42 s Downloaded cached old-locale-1.0.0.7-doc (164 KiB) in 243ms
  230. 30.42 s Progress: 0 of 104 built, 20 of 170 downloaded from cache (15 downloading)
  231. 30.42 s Downloading cached th-compat-0.1.6-doc from https://cache.nix-ci.com
  232. 30.47 s Downloaded cached parallel-3.2.2.0-doc (1 MiB) in 284ms
  233. 30.47 s Progress: 0 of 104 built, 21 of 170 downloaded from cache (15 downloading)
  234. 30.47 s Downloading cached old-time-1.1.0.4-doc from https://cache.nix-ci.com
  235. 30.49 s Downloaded cached primitive-0.9.1.0-doc (5.4 MiB) in 294ms
  236. 30.49 s Progress: 0 of 104 built, 22 of 170 downloaded from cache (15 downloading)
  237. 30.49 s Downloading cached transformers-base-0.4.6-doc from https://cache.nix-ci.com
  238. 30.49 s Downloaded cached contravariant-1.5.5-doc (949 KiB) in 314ms
  239. 30.49 s Progress: 0 of 104 built, 23 of 170 downloaded from cache (15 downloading)
  240. 30.49 s Downloading cached integer-conversion-0.1.1-doc from https://cache.nix-ci.com
  241. 30.52 s Downloaded cached os-string-2.0.8-doc (3.6 MiB) in 339ms
  242. 30.52 s Progress: 0 of 104 built, 24 of 170 downloaded from cache (15 downloading)
  243. 30.52 s Downloading cached transformers-compat-0.7.2-doc from https://cache.nix-ci.com
  244. 30.53 s Downloaded cached prettyprinter-1.7.1-doc (3.1 MiB) in 334ms
  245. 30.53 s Progress: 0 of 104 built, 25 of 170 downloaded from cache (15 downloading)
  246. 30.53 s Downloading cached hashable-1.5.0.0-doc from https://cache.nix-ci.com
  247. 30.53 s Downloaded cached semigroups-0.20-doc (189 KiB) in 299ms
  248. 30.53 s Progress: 0 of 104 built, 26 of 170 downloaded from cache (15 downloading)
  249. 30.53 s Downloading cached unliftio-core-0.2.1.0-doc from https://cache.nix-ci.com
  250. 30.54 s Downloaded cached parser-combinators-1.3.0-doc (900 KiB) in 359ms
  251. 30.54 s Progress: 0 of 104 built, 27 of 170 downloaded from cache (15 downloading)
  252. 30.54 s Downloading cached vector-stream-0.1.0.1-doc from https://cache.nix-ci.com
  253. 30.54 s Downloaded cached extra-1.8.1-doc (3.1 MiB) in 336ms
  254. 30.54 s Progress: 0 of 104 built, 28 of 170 downloaded from cache (15 downloading)
  255. 30.54 s Downloading cached void-0.7.3-doc from https://cache.nix-ci.com
  256. 30.56 s Downloaded cached ansi-terminal-types-1.1.3-doc (661 KiB) in 326ms
  257. 30.56 s Progress: 0 of 104 built, 29 of 170 downloaded from cache (15 downloading)
  258. 30.56 s Downloading cached ansi-terminal-1.1.3-doc from https://cache.nix-ci.com
  259. 30.58 s Downloaded cached reflection-2.1.9-doc (570 KiB) in 351ms
  260. 30.58 s Progress: 0 of 104 built, 30 of 170 downloaded from cache (15 downloading)
  261. 30.60 s Downloaded cached tagged-0.8.9-doc (612 KiB) in 318ms
  262. 30.60 s Progress: 0 of 104 built, 31 of 170 downloaded from cache (14 downloading)
  263. 30.60 s Downloading cached distributive-0.6.2.1-doc from https://cache.nix-ci.com
  264. 30.62 s Downloaded cached syb-0.7.2.4-doc (1.2 MiB) in 348ms
  265. 30.62 s Progress: 0 of 104 built, 32 of 170 downloaded from cache (14 downloading)
  266. 30.62 s Downloaded cached splitmix-0.1.3.1-doc (553 KiB) in 378ms
  267. 30.62 s Progress: 0 of 104 built, 33 of 170 downloaded from cache (13 downloading)
  268. 30.62 s Downloading cached random-1.2.1.3-doc from https://cache.nix-ci.com
  269. 30.73 s Downloaded cached th-abstraction-0.7.1.0-doc (2.1 MiB) in 316ms
  270. 30.73 s Progress: 0 of 104 built, 34 of 170 downloaded from cache (13 downloading)
  271. 30.74 s Downloaded cached th-compat-0.1.6-doc (515 KiB) in 316ms
  272. 30.74 s Progress: 0 of 104 built, 35 of 170 downloaded from cache (12 downloading)
  273. 30.74 s Downloading cached network-uri-2.6.4.2-doc from https://cache.nix-ci.com
  274. 30.76 s Downloaded cached old-time-1.1.0.4-doc (533 KiB) in 294ms
  275. 30.76 s Progress: 0 of 104 built, 36 of 170 downloaded from cache (12 downloading)
  276. 30.77 s Downloaded cached integer-conversion-0.1.1-doc (241 KiB) in 277ms
  277. 30.77 s Progress: 0 of 104 built, 37 of 170 downloaded from cache (11 downloading)
  278. 30.80 s Downloaded cached hashable-1.5.0.0-doc (1.2 MiB) in 270ms
  279. 30.80 s Progress: 0 of 104 built, 38 of 170 downloaded from cache (10 downloading)
  280. 30.80 s Downloading cached case-insensitive-1.2.1.0-doc from https://cache.nix-ci.com
  281. 30.80 s Downloading cached data-fix-0.3.4-doc from https://cache.nix-ci.com
  282. 30.80 s Downloading cached scientific-0.3.8.0-doc from https://cache.nix-ci.com
  283. 30.80 s Downloading cached text-short-0.1.6-doc from https://cache.nix-ci.com
  284. 30.80 s Downloading cached these-1.2.1-doc from https://cache.nix-ci.com
  285. 30.80 s Downloading cached time-compat-1.9.8-doc from https://cache.nix-ci.com
  286. 30.81 s Downloaded cached unliftio-core-0.2.1.0-doc (270 KiB) in 280ms
  287. 30.81 s Progress: 0 of 104 built, 39 of 170 downloaded from cache (15 downloading)
  288. 30.81 s Downloading cached unordered-containers-0.2.20.1-doc from https://cache.nix-ci.com
  289. 30.85 s Downloaded cached transformers-base-0.4.6-doc (182 KiB) in 353ms
  290. 30.85 s Progress: 0 of 104 built, 40 of 170 downloaded from cache (15 downloading)
  291. 30.86 s Downloaded cached void-0.7.3-doc (118 KiB) in 320ms
  292. 30.86 s Progress: 0 of 104 built, 41 of 170 downloaded from cache (14 downloading)
  293. 30.90 s Downloaded cached vector-stream-0.1.0.1-doc (1.5 MiB) in 354ms
  294. 30.90 s Progress: 0 of 104 built, 42 of 170 downloaded from cache (13 downloading)
  295. 30.90 s Downloaded cached distributive-0.6.2.1-doc (490 KiB) in 300ms
  296. 30.90 s Progress: 0 of 104 built, 43 of 170 downloaded from cache (12 downloading)
  297. 30.90 s Downloading cached comonad-5.0.9-doc from https://cache.nix-ci.com
  298. 30.90 s Downloaded cached transformers-compat-0.7.2-doc (1.9 MiB) in 380ms
  299. 30.90 s Progress: 0 of 104 built, 44 of 170 downloaded from cache (12 downloading)
  300. 30.91 s Downloaded cached ansi-terminal-1.1.3-doc (866 KiB) in 348ms
  301. 30.91 s Progress: 0 of 104 built, 45 of 170 downloaded from cache (11 downloading)
  302. 30.91 s Downloading cached prettyprinter-ansi-terminal-1.1.3-doc from https://cache.nix-ci.com
  303. 30.97 s Downloaded cached random-1.2.1.3-doc (2.5 MiB) in 342ms
  304. 30.97 s Progress: 0 of 104 built, 46 of 170 downloaded from cache (11 downloading)
  305. 30.97 s Downloading cached QuickCheck-2.15.0.1-doc from https://cache.nix-ci.com
  306. 30.97 s Downloading cached temporary-1.3-doc from https://cache.nix-ci.com
  307. 30.97 s Downloading cached uuid-types-1.0.6-doc from https://cache.nix-ci.com
  308. 31.08 s Downloaded cached network-uri-2.6.4.2-doc (1 MiB) in 344ms
  309. 31.08 s Progress: 0 of 104 built, 47 of 170 downloaded from cache (13 downloading)
  310. 31.10 s Downloaded cached data-fix-0.3.4-doc (426 KiB) in 298ms
  311. 31.10 s Progress: 0 of 104 built, 48 of 170 downloaded from cache (12 downloading)
  312. 31.13 s Downloaded cached text-short-0.1.6-doc (1.1 MiB) in 332ms
  313. 31.13 s Progress: 0 of 104 built, 49 of 170 downloaded from cache (11 downloading)
  314. 31.14 s Downloaded cached scientific-0.3.8.0-doc (988 KiB) in 333ms
  315. 31.14 s Progress: 0 of 104 built, 50 of 170 downloaded from cache (10 downloading)
  316. 31.15 s Downloaded cached these-1.2.1-doc (1 MiB) in 349ms
  317. 31.15 s Progress: 0 of 104 built, 51 of 170 downloaded from cache (9 downloading)
  318. 31.15 s Downloading cached strict-0.5.1-doc from https://cache.nix-ci.com
  319. 31.16 s Downloaded cached case-insensitive-1.2.1.0-doc (270 KiB) in 355ms
  320. 31.16 s Progress: 0 of 104 built, 52 of 170 downloaded from cache (9 downloading)
  321. 31.16 s Downloading cached megaparsec-9.7.0-doc from https://cache.nix-ci.com
  322. 31.16 s Downloaded cached time-compat-1.9.8-doc (2.4 MiB) in 357ms
  323. 31.16 s Progress: 0 of 104 built, 53 of 170 downloaded from cache (9 downloading)
  324. 31.16 s Downloading cached text-iso8601-0.1.1-doc from https://cache.nix-ci.com
  325. 31.18 s Downloaded cached unordered-containers-0.2.20.1-doc (4.5 MiB) in 363ms
  326. 31.18 s Progress: 0 of 104 built, 54 of 170 downloaded from cache (9 downloading)
  327. 31.18 s Downloading cached indexed-traversable-instances-0.1.2-doc from https://cache.nix-ci.com
  328. 31.23 s Downloaded cached prettyprinter-ansi-terminal-1.1.3-doc (518 KiB) in 315ms
  329. 31.23 s Progress: 0 of 104 built, 55 of 170 downloaded from cache (9 downloading)
  330. 31.23 s Downloading cached optparse-applicative-0.18.1.0-doc from https://cache.nix-ci.com
  331. 31.27 s Downloaded cached temporary-1.3-doc (238 KiB) in 305ms
  332. 31.27 s Progress: 0 of 104 built, 56 of 170 downloaded from cache (9 downloading)
  333. 31.27 s Downloading cached doctest-0.24.2-doc from https://cache.nix-ci.com
  334. 31.29 s Downloaded cached comonad-5.0.9-doc (1.5 MiB) in 393ms
  335. 31.29 s Progress: 0 of 104 built, 57 of 170 downloaded from cache (9 downloading)
  336. 31.29 s Downloading cached bifunctors-5.6.2-doc from https://cache.nix-ci.com
  337. 31.32 s Downloaded cached uuid-types-1.0.6-doc (596 KiB) in 349ms
  338. 31.32 s Progress: 0 of 104 built, 58 of 170 downloaded from cache (9 downloading)
  339. 31.32 s Downloaded cached QuickCheck-2.15.0.1-doc (6.2 MiB) in 355ms
  340. 31.32 s Progress: 0 of 104 built, 59 of 170 downloaded from cache (8 downloading)
  341. 31.46 s Downloaded cached strict-0.5.1-doc (1.5 MiB) in 311ms
  342. 31.46 s Progress: 0 of 104 built, 60 of 170 downloaded from cache (7 downloading)
  343. 31.46 s Downloading cached quickcheck-instances-0.3.33-doc from https://cache.nix-ci.com
  344. 31.48 s Downloaded cached text-iso8601-0.1.1-doc (573 KiB) in 316ms
  345. 31.48 s Progress: 0 of 104 built, 61 of 170 downloaded from cache (7 downloading)
  346. 31.48 s Downloaded cached megaparsec-9.7.0-doc (5.2 MiB) in 325ms
  347. 31.48 s Progress: 0 of 104 built, 62 of 170 downloaded from cache (6 downloading)
  348. 31.48 s Downloaded cached indexed-traversable-instances-0.1.2-doc (186 KiB) in 306ms
  349. 31.48 s Progress: 0 of 104 built, 63 of 170 downloaded from cache (5 downloading)
  350. 31.48 s Downloading cached witherable-0.5-doc from https://cache.nix-ci.com
  351. 31.53 s Downloaded cached optparse-applicative-0.18.1.0-doc (3.9 MiB) in 299ms
  352. 31.53 s Progress: 0 of 104 built, 64 of 170 downloaded from cache (5 downloading)
  353. 31.53 s Downloading cached tasty-1.5.3-doc from https://cache.nix-ci.com
  354. 31.62 s Downloaded cached bifunctors-5.6.2-doc (3.5 MiB) in 326ms
  355. 31.62 s Progress: 0 of 104 built, 65 of 170 downloaded from cache (5 downloading)
  356. 31.62 s Downloading cached profunctors-5.6.3-doc from https://cache.nix-ci.com
  357. 31.62 s Downloading cached semigroupoids-6.0.1-doc from https://cache.nix-ci.com
  358. 31.63 s Downloaded cached doctest-0.24.2-doc (1.6 MiB) in 352ms
  359. 31.63 s Progress: 0 of 104 built, 66 of 170 downloaded from cache (6 downloading)
  360. 31.78 s Downloaded cached quickcheck-instances-0.3.33-doc (1.5 MiB) in 321ms
  361. 31.78 s Progress: 0 of 104 built, 67 of 170 downloaded from cache (5 downloading)
  362. 31.81 s Downloaded cached witherable-0.5-doc (1.1 MiB) in 322ms
  363. 31.81 s Progress: 0 of 104 built, 68 of 170 downloaded from cache (4 downloading)
  364. 31.87 s Downloaded cached tasty-1.5.3-doc (3.2 MiB) in 336ms
  365. 31.87 s Progress: 0 of 104 built, 69 of 170 downloaded from cache (3 downloading)
  366. 31.95 s Downloaded cached profunctors-5.6.3-doc (5.2 MiB) in 334ms
  367. 31.95 s Progress: 0 of 104 built, 70 of 170 downloaded from cache (2 downloading)
  368. 31.95 s Downloading cached invariant-0.6.4-doc from https://cache.nix-ci.com
  369. 31.97 s Downloaded cached semigroupoids-6.0.1-doc (5.7 MiB) in 350ms
  370. 31.97 s Progress: 0 of 104 built, 71 of 170 downloaded from cache (2 downloading)
  371. 31.97 s Downloading cached either-5.0.3-doc from https://cache.nix-ci.com
  372. 31.97 s Downloading cached free-5.2-doc from https://cache.nix-ci.com
  373. 31.97 s Downloading cached semialign-1.3.1-doc from https://cache.nix-ci.com
  374. 32.28 s Downloaded cached semialign-1.3.1-doc (1.3 MiB) in 313ms
  375. 32.28 s Progress: 0 of 104 built, 72 of 170 downloaded from cache (4 downloading)
  376. 32.28 s Downloading cached aeson-2.2.3.0-doc from https://cache.nix-ci.com
  377. 32.29 s Downloaded cached invariant-0.6.4-doc (2.1 MiB) in 337ms
  378. 32.29 s Progress: 0 of 104 built, 73 of 170 downloaded from cache (4 downloading)
  379. 32.33 s Downloaded cached free-5.2-doc (6 MiB) in 356ms
  380. 32.33 s Progress: 0 of 104 built, 74 of 170 downloaded from cache (3 downloading)
  381. 32.33 s Downloading cached adjunctions-4.4.3-doc from https://cache.nix-ci.com
  382. 32.33 s Downloading cached recursion-schemes-5.2.3-doc from https://sellout.cachix.org
  383. 32.49 s Downloaded cached either-5.0.3-doc (453 KiB) in 525ms
  384. 32.49 s Progress: 0 of 104 built, 75 of 170 downloaded from cache (4 downloading)
  385. 32.60 s Downloaded cached aeson-2.2.3.0-doc (14 MiB) in 320ms
  386. 32.60 s Progress: 0 of 104 built, 76 of 170 downloaded from cache (3 downloading)
  387. 32.65 s Downloaded cached adjunctions-4.4.3-doc (2 MiB) in 320ms
  388. 32.65 s Progress: 0 of 104 built, 77 of 170 downloaded from cache (2 downloading)
  389. 32.65 s Downloading cached kan-extensions-5.2.7-doc from https://cache.nix-ci.com
  390. 32.88 s Downloaded cached recursion-schemes-5.2.3-doc (2 MiB) in 549ms
  391. 32.88 s Progress: 0 of 104 built, 78 of 170 downloaded from cache (2 downloading)
  392. 32.88 s Downloading cached variant-1.0.1-doc from https://sellout.cachix.org
  393. 32.95 s Downloaded cached kan-extensions-5.2.7-doc (2.3 MiB) in 307ms
  394. 32.95 s Progress: 0 of 104 built, 79 of 170 downloaded from cache (2 downloading)
  395. 32.95 s Downloading cached lens-5.3.5-doc from https://cache.nix-ci.com
  396. 33.31 s Downloaded cached variant-1.0.1-doc (4.8 MiB) in 437ms
  397. 33.31 s Progress: 0 of 104 built, 80 of 170 downloaded from cache (2 downloading)
  398. 33.47 s Downloaded cached lens-5.3.5-doc (34.8 MiB) in 514ms
  399. 33.47 s Progress: 0 of 104 built, 81 of 170 downloaded from cache (1 downloading)
  400. 33.47 s Downloading cached yaya-0.6.2.3-doc from https://cache.nix-ci.com
  401. 33.62 s Downloaded cached yaya-0.6.2.3-doc (2.7 MiB) in 154ms
  402. 33.62 s Progress: 0 of 104 built, 82 of 170 downloaded from cache (1 downloading)
  403. 33.62 s Downloading cached yaya-containers-0.1.2.2-doc from https://cache.nix-ci.com
  404. 33.62 s Downloading cached yaya-quickcheck-0.2.0.3-doc from https://cache.nix-ci.com
  405. 33.62 s Downloading cached yaya-unsafe-0.4.1.4-doc from https://cache.nix-ci.com
  406. 33.67 s Downloaded cached yaya-containers-0.1.2.2-doc (1.1 MiB) in 48ms
  407. 33.67 s Progress: 0 of 104 built, 83 of 170 downloaded from cache (3 downloading)
  408. 33.67 s Downloaded cached yaya-unsafe-0.4.1.4-doc (661 KiB) in 48ms
  409. 33.67 s Progress: 0 of 104 built, 84 of 170 downloaded from cache (2 downloading)
  410. 33.71 s Downloaded cached yaya-quickcheck-0.2.0.3-doc (269 KiB) in 81ms
  411. 33.71 s Progress: 0 of 104 built, 85 of 170 downloaded from cache (1 downloading)
  412. 58.36 s Downloaded cached ghc (1.8 GiB) in 28.1s
  413. 58.36 s Progress: 0 of 104 built, 86 of 170 downloaded from cache
  414. 58.36 s Downloading cached OneTuple from https://cache.nix-ci.com
  415. 58.51 s Downloading cached StateVar from https://cache.nix-ci.com
  416. 58.51 s Downloading cached assoc from https://cache.nix-ci.com
  417. 58.51 s Downloading cached base-orphans from https://cache.nix-ci.com
  418. 58.51 s Downloading cached cabal-doctest from https://sellout.cachix.org
  419. 58.51 s Downloading cached call-stack from https://cache.nix-ci.com
  420. 58.51 s Downloading cached character-ps from https://cache.nix-ci.com
  421. 58.51 s Downloading cached clock from https://cache.nix-ci.com
  422. 58.51 s Downloading cached code-page from https://cache.nix-ci.com
  423. 58.51 s Downloading cached colour from https://cache.nix-ci.com
  424. 58.51 s Downloading cached dlist from https://cache.nix-ci.com
  425. 58.51 s Downloading cached file-io from https://cache.nix-ci.com
  426. 58.51 s Downloading cached generically from https://cache.nix-ci.com
  427. 58.51 s Downloading cached ghc-paths from https://cache.nix-ci.com
  428. 58.51 s Downloading cached indexed-traversable from https://cache.nix-ci.com
  429. 58.51 s Downloading cached integer-logarithms from https://cache.nix-ci.com
  430. 58.63 s Downloaded cached OneTuple (74 KiB) in 271ms
  431. 58.63 s Progress: 0 of 103 built, 87 of 170 downloaded from cache (15 downloading)
  432. 58.63 s Downloading cached old-locale from https://cache.nix-ci.com
  433. 58.67 s Downloaded cached StateVar (380 KiB) in 166ms
  434. 58.67 s Progress: 0 of 102 built, 88 of 170 downloaded from cache (15 downloading)
  435. 58.67 s Downloading cached os-string from https://cache.nix-ci.com
  436. 58.67 s Downloaded cached code-page (365 KiB) in 166ms
  437. 58.67 s Progress: 0 of 101 built, 89 of 170 downloaded from cache (15 downloading)
  438. 58.67 s Downloading cached contravariant from https://cache.nix-ci.com
  439. 58.69 s Downloaded cached character-ps (2.2 MiB) in 181ms
  440. 58.69 s Progress: 0 of 101 built, 90 of 170 downloaded from cache (15 downloading)
  441. 58.69 s Downloaded cached assoc (169 KiB) in 181ms
  442. 58.69 s Downloading cached parallel from https://cache.nix-ci.com
  443. 58.69 s Progress: 0 of 100 built, 91 of 170 downloaded from cache (15 downloading)
  444. 58.69 s Downloading cached parser-combinators from https://cache.nix-ci.com
  445. 58.70 s Downloaded cached ghc-paths (101 KiB) in 191ms
  446. 58.70 s Progress: 0 of 99 built, 92 of 170 downloaded from cache (15 downloading)
  447. 58.70 s Downloading cached prettyprinter from https://cache.nix-ci.com
  448. 58.71 s Downloaded cached generically (31 KiB) in 201ms
  449. 58.71 s Progress: 0 of 99 built, 93 of 170 downloaded from cache (15 downloading)
  450. 58.71 s Downloading cached primitive from https://cache.nix-ci.com
  451. 58.74 s Downloaded cached file-io (1.1 MiB) in 229ms
  452. 58.74 s Progress: 0 of 98 built, 94 of 170 downloaded from cache (15 downloading)
  453. 58.74 s Downloading cached reflection from https://cache.nix-ci.com
  454. 58.74 s Downloaded cached base-orphans (1.8 MiB) in 230ms
  455. 58.74 s Progress: 0 of 97 built, 95 of 170 downloaded from cache (15 downloading)
  456. 58.74 s Downloading cached semigroups from https://cache.nix-ci.com
  457. 58.74 s Downloaded cached indexed-traversable (3.8 MiB) in 232ms
  458. 58.74 s Progress: 0 of 96 built, 96 of 170 downloaded from cache (15 downloading)
  459. 58.74 s Downloading cached splitmix from https://cache.nix-ci.com
  460. 58.75 s Downloaded cached call-stack (280 KiB) in 243ms
  461. 58.75 s Progress: 0 of 95 built, 97 of 170 downloaded from cache (15 downloading)
  462. 58.75 s Downloading cached syb from https://cache.nix-ci.com
  463. 58.75 s Downloaded cached colour (5.3 MiB) in 244ms
  464. 58.75 s Progress: 0 of 94 built, 98 of 170 downloaded from cache (15 downloading)
  465. 58.75 s Downloading cached tagged from https://cache.nix-ci.com
  466. 58.77 s Downloaded cached dlist (1.4 MiB) in 265ms
  467. 58.77 s Progress: 0 of 93 built, 99 of 170 downloaded from cache (15 downloading)
  468. 58.77 s Downloading cached ansi-terminal-types from https://cache.nix-ci.com
  469. 58.79 s Downloaded cached integer-logarithms (898 KiB) in 281ms
  470. 58.79 s Progress: 0 of 92 built, 100 of 170 downloaded from cache (15 downloading)
  471. 58.79 s Downloading cached th-abstraction from https://cache.nix-ci.com
  472. 58.79 s Downloaded cached clock (1.8 MiB) in 283ms
  473. 58.79 s Progress: 0 of 91 built, 101 of 170 downloaded from cache (15 downloading)
  474. 58.79 s Downloading cached th-compat from https://cache.nix-ci.com
  475. 58.83 s Downloaded cached cabal-doctest (770 KiB) in 321ms
  476. 58.83 s Progress: 0 of 90 built, 102 of 170 downloaded from cache (15 downloading)
  477. 58.83 s Downloading cached extra from https://cache.nix-ci.com
  478. 58.94 s Downloaded cached old-locale (531 KiB) in 301ms
  479. 58.94 s Progress: 0 of 89 built, 103 of 170 downloaded from cache (15 downloading)
  480. 58.94 s Downloading cached transformers-compat from https://cache.nix-ci.com
  481. 59.01 s Downloaded cached os-string (5.9 MiB) in 337ms
  482. 59.01 s Progress: 0 of 88 built, 104 of 170 downloaded from cache (15 downloading)
  483. 59.01 s Downloading cached old-time from https://cache.nix-ci.com
  484. 59.03 s Downloaded cached parser-combinators (1.9 MiB) in 337ms
  485. 59.03 s Progress: 0 of 87 built, 105 of 170 downloaded from cache (15 downloading)
  486. 59.03 s Downloading cached hashable from https://cache.nix-ci.com
  487. 59.03 s Downloaded cached syb (2.8 MiB) in 279ms
  488. 59.03 s Progress: 0 of 86 built, 106 of 170 downloaded from cache (15 downloading)
  489. 59.03 s Downloading cached unliftio-core from https://cache.nix-ci.com
  490. 59.03 s Downloaded cached semigroups (258 KiB) in 295ms
  491. 59.03 s Progress: 0 of 86 built, 107 of 170 downloaded from cache (15 downloading)
  492. 59.03 s Downloading cached vector-stream from https://cache.nix-ci.com
  493. 59.04 s Downloaded cached parallel (1.4 MiB) in 347ms
  494. 59.04 s Progress: 0 of 85 built, 108 of 170 downloaded from cache (15 downloading)
  495. 59.04 s Downloading cached void from https://cache.nix-ci.com
  496. 59.04 s Downloaded cached primitive (8.7 MiB) in 330ms
  497. 59.04 s Progress: 0 of 84 built, 109 of 170 downloaded from cache (15 downloading)
  498. 59.04 s Downloading cached integer-conversion from https://cache.nix-ci.com
  499. 59.05 s Downloaded cached prettyprinter (8.7 MiB) in 348ms
  500. 59.05 s Progress: 0 of 83 built, 110 of 170 downloaded from cache (15 downloading)
  501. 59.05 s Downloaded cached contravariant (1.9 MiB) in 378ms
  502. 59.05 s Progress: 0 of 82 built, 111 of 170 downloaded from cache (14 downloading)
  503. 59.07 s Downloaded cached splitmix (893 KiB) in 328ms
  504. 59.07 s Progress: 0 of 81 built, 112 of 170 downloaded from cache (13 downloading)
  505. 59.07 s Downloading cached random from https://cache.nix-ci.com
  506. 59.08 s Downloaded cached reflection (6 MiB) in 345ms
  507. 59.08 s Progress: 0 of 80 built, 113 of 170 downloaded from cache (13 downloading)
  508. 59.09 s Downloaded cached ansi-terminal-types (3.3 MiB) in 316ms
  509. 59.09 s Progress: 0 of 79 built, 114 of 170 downloaded from cache (12 downloading)
  510. 59.09 s Downloading cached ansi-terminal from https://cache.nix-ci.com
  511. 59.12 s Downloaded cached tagged (1.6 MiB) in 367ms
  512. 59.12 s Progress: 0 of 78 built, 115 of 170 downloaded from cache (12 downloading)
  513. 59.12 s Downloading cached distributive from https://cache.nix-ci.com
  514. 59.13 s Downloaded cached th-compat (565 KiB) in 337ms
  515. 59.13 s Progress: 0 of 77 built, 116 of 170 downloaded from cache (12 downloading)
  516. 59.13 s Downloading cached network-uri from https://cache.nix-ci.com
  517. 59.13 s Downloaded cached th-abstraction (5.6 MiB) in 342ms
  518. 59.13 s Progress: 0 of 76 built, 117 of 170 downloaded from cache (12 downloading)
  519. 59.19 s Downloaded cached extra (4.1 MiB) in 362ms
  520. 59.19 s Progress: 0 of 75 built, 118 of 170 downloaded from cache (11 downloading)
  521. 59.27 s Downloaded cached transformers-compat (3.4 MiB) in 331ms
  522. 59.27 s Progress: 0 of 74 built, 119 of 170 downloaded from cache (10 downloading)
  523. 59.27 s Downloading cached transformers-base from https://cache.nix-ci.com
  524. 59.31 s Downloaded cached hashable (3.3 MiB) in 283ms
  525. 59.31 s Progress: 0 of 73 built, 120 of 170 downloaded from cache (10 downloading)
  526. 59.31 s Downloading cached case-insensitive from https://cache.nix-ci.com
  527. 59.31 s Downloading cached data-fix from https://cache.nix-ci.com
  528. 59.31 s Downloading cached scientific from https://cache.nix-ci.com
  529. 59.31 s Downloading cached text-short from https://cache.nix-ci.com
  530. 59.31 s Downloading cached these from https://cache.nix-ci.com
  531. 59.31 s Downloading cached time-compat from https://cache.nix-ci.com
  532. 59.32 s Downloaded cached integer-conversion (193 KiB) in 283ms
  533. 59.32 s Progress: 0 of 72 built, 121 of 170 downloaded from cache (15 downloading)
  534. 59.32 s Downloading cached unordered-containers from https://cache.nix-ci.com
  535. 59.35 s Downloaded cached old-time (2.3 MiB) in 332ms
  536. 59.35 s Progress: 0 of 71 built, 122 of 170 downloaded from cache (15 downloading)
  537. 59.35 s Downloaded cached void (44 KiB) in 313ms
  538. 59.35 s Progress: 0 of 70 built, 123 of 170 downloaded from cache (14 downloading)
  539. 59.36 s Downloaded cached ansi-terminal (1.2 MiB) in 269ms
  540. 59.36 s Progress: 0 of 69 built, 124 of 170 downloaded from cache (13 downloading)
  541. 59.36 s Downloading cached prettyprinter-ansi-terminal from https://cache.nix-ci.com
  542. 59.37 s Downloaded cached unliftio-core (390 KiB) in 335ms
  543. 59.37 s Progress: 0 of 68 built, 125 of 170 downloaded from cache (13 downloading)
  544. 59.37 s Downloaded cached vector-stream (3.1 MiB) in 337ms
  545. 59.37 s Progress: 0 of 67 built, 126 of 170 downloaded from cache (12 downloading)
  546. 59.45 s Downloaded cached random (8.8 MiB) in 382ms
  547. 59.45 s Progress: 0 of 66 built, 127 of 170 downloaded from cache (11 downloading)
  548. 59.45 s Downloading cached QuickCheck from https://cache.nix-ci.com
  549. 59.45 s Downloading cached temporary from https://cache.nix-ci.com
  550. 59.45 s Downloading cached uuid-types from https://cache.nix-ci.com
  551. 59.46 s Downloaded cached distributive (1.2 MiB) in 338ms
  552. 59.46 s Progress: 0 of 65 built, 128 of 170 downloaded from cache (13 downloading)
  553. 59.46 s Downloading cached comonad from https://cache.nix-ci.com
  554. 59.48 s Downloaded cached network-uri (5.2 MiB) in 354ms
  555. 59.48 s Progress: 0 of 64 built, 129 of 170 downloaded from cache (13 downloading)
  556. 59.54 s Downloaded cached transformers-base (585 KiB) in 271ms
  557. 59.54 s Progress: 0 of 63 built, 130 of 170 downloaded from cache (12 downloading)
  558. 59.57 s Downloaded cached case-insensitive (944 KiB) in 255ms
  559. 59.57 s Progress: 0 of 62 built, 131 of 170 downloaded from cache (11 downloading)
  560. 59.61 s Downloaded cached scientific (2.9 MiB) in 294ms
  561. 59.61 s Progress: 0 of 61 built, 132 of 170 downloaded from cache (10 downloading)
  562. 59.61 s Downloading cached megaparsec from https://cache.nix-ci.com
  563. 59.61 s Downloaded cached data-fix (1.1 MiB) in 300ms
  564. 59.61 s Progress: 0 of 60 built, 133 of 170 downloaded from cache (10 downloading)
  565. 59.64 s Downloaded cached these (3.1 MiB) in 330ms
  566. 59.64 s Progress: 0 of 59 built, 134 of 170 downloaded from cache (9 downloading)
  567. 59.64 s Downloading cached strict from https://cache.nix-ci.com
  568. 59.64 s Downloaded cached text-short (1.7 MiB) in 332ms
  569. 59.64 s Progress: 0 of 58 built, 135 of 170 downloaded from cache (9 downloading)
  570. 59.65 s Downloaded cached prettyprinter-ansi-terminal (1.4 MiB) in 292ms
  571. 59.65 s Progress: 0 of 57 built, 136 of 170 downloaded from cache (8 downloading)
  572. 59.65 s Downloading cached optparse-applicative from https://cache.nix-ci.com
  573. 59.69 s Downloaded cached time-compat (2.4 MiB) in 373ms
  574. 59.69 s Progress: 0 of 56 built, 137 of 170 downloaded from cache (8 downloading)
  575. 59.69 s Downloading cached text-iso8601 from https://cache.nix-ci.com
  576. 59.74 s Downloaded cached unordered-containers (9.3 MiB) in 415ms
  577. 59.74 s Progress: 0 of 55 built, 138 of 170 downloaded from cache (8 downloading)
  578. 59.75 s Downloaded cached temporary (305 KiB) in 298ms
  579. 59.75 s Progress: 0 of 54 built, 139 of 170 downloaded from cache (7 downloading)
  580. 59.75 s Downloading cached doctest from https://cache.nix-ci.com
  581. 59.79 s Downloaded cached comonad (3.1 MiB) in 329ms
  582. 59.79 s Progress: 0 of 53 built, 140 of 170 downloaded from cache (7 downloading)
  583. 59.79 s Downloading cached bifunctors from https://cache.nix-ci.com
  584. 59.80 s Downloaded cached uuid-types (1.6 MiB) in 344ms
  585. 59.80 s Progress: 0 of 52 built, 141 of 170 downloaded from cache (7 downloading)
  586. 59.95 s Downloaded cached QuickCheck (19.9 MiB) in 494ms
  587. 59.95 s Progress: 0 of 51 built, 142 of 170 downloaded from cache (6 downloading)
  588. 59.98 s Downloaded cached strict (5.2 MiB) in 338ms
  589. 59.98 s Progress: 0 of 50 built, 143 of 170 downloaded from cache (5 downloading)
  590. 60.01 s Downloaded cached optparse-applicative (8.7 MiB) in 358ms
  591. 60.01 s Progress: 0 of 49 built, 144 of 170 downloaded from cache (4 downloading)
  592. 60.01 s Downloading cached tasty from https://cache.nix-ci.com
  593. 60.02 s Downloaded cached text-iso8601 (3 MiB) in 339ms
  594. 60.02 s Progress: 0 of 48 built, 145 of 170 downloaded from cache (4 downloading)
  595. 60.10 s Downloaded cached megaparsec (15.6 MiB) in 489ms
  596. 60.10 s Progress: 0 of 47 built, 146 of 170 downloaded from cache (3 downloading)
  597. 60.32 s Downloaded cached bifunctors (15.7 MiB) in 526ms
  598. 60.32 s Progress: 0 of 46 built, 147 of 170 downloaded from cache (2 downloading)
  599. 60.32 s Downloading cached profunctors from https://cache.nix-ci.com
  600. 60.32 s Downloading cached semigroupoids from https://cache.nix-ci.com
  601. 60.40 s Downloaded cached tasty (9.3 MiB) in 391ms
  602. 60.40 s Progress: 0 of 45 built, 148 of 170 downloaded from cache (3 downloading)
  603. 60.40 s Downloading cached vector from https://cache.nix-ci.com
  604. 60.68 s Downloaded cached profunctors (10.5 MiB) in 364ms
  605. 60.68 s Progress: 0 of 44 built, 149 of 170 downloaded from cache (3 downloading)
  606. 60.68 s Downloading cached invariant from https://cache.nix-ci.com
  607. 60.71 s Downloaded cached semigroupoids (11.9 MiB) in 394ms
  608. 60.71 s Progress: 0 of 43 built, 150 of 170 downloaded from cache (3 downloading)
  609. 60.71 s Downloading cached either from https://cache.nix-ci.com
  610. 60.71 s Downloading cached free from https://cache.nix-ci.com
  611. 61.07 s Downloaded cached invariant (5.4 MiB) in 392ms
  612. 61.08 s Progress: 0 of 42 built, 151 of 170 downloaded from cache (4 downloading)
  613. 61.11 s Downloaded cached either (890 KiB) in 402ms
  614. 61.11 s Progress: 0 of 41 built, 152 of 170 downloaded from cache (3 downloading)
  615. 61.36 s Downloaded cached vector (57.1 MiB) in 952ms
  616. 61.36 s Progress: 0 of 40 built, 153 of 170 downloaded from cache (2 downloading)
  617. 61.36 s Downloading cached indexed-traversable-instances from https://cache.nix-ci.com
  618. 61.36 s Downloading cached quickcheck-instances from https://cache.nix-ci.com
  619. 61.41 s Downloaded cached free (22.4 MiB) in 700ms
  620. 61.41 s Progress: 0 of 39 built, 154 of 170 downloaded from cache (3 downloading)
  621. 61.41 s Downloading cached adjunctions from https://cache.nix-ci.com
  622. 61.41 s Downloading cached recursion-schemes from https://sellout.cachix.org
  623. 61.66 s Downloaded cached indexed-traversable-instances (358 KiB) in 307ms
  624. 61.66 s Progress: 0 of 38 built, 155 of 170 downloaded from cache (4 downloading)
  625. 61.66 s Downloading cached semialign from https://cache.nix-ci.com
  626. 61.66 s Downloading cached witherable from https://cache.nix-ci.com
  627. 61.67 s Downloaded cached doctest (68.8 MiB) in 1.9s
  628. 61.67 s Progress: 0 of 37 built, 156 of 170 downloaded from cache (5 downloading)
  629. 61.72 s Downloaded cached quickcheck-instances (5.5 MiB) in 361ms
  630. 61.72 s Progress: 0 of 36 built, 157 of 170 downloaded from cache (4 downloading)
  631. 61.73 s Downloaded cached adjunctions (6 MiB) in 312ms
  632. 61.73 s Progress: 0 of 35 built, 158 of 170 downloaded from cache (3 downloading)
  633. 61.73 s Downloading cached kan-extensions from https://cache.nix-ci.com
  634. 61.99 s Downloaded cached semialign (3.7 MiB) in 329ms
  635. 61.99 s Progress: 0 of 34 built, 159 of 170 downloaded from cache (3 downloading)
  636. 62.00 s Downloaded cached witherable (4.4 MiB) in 332ms
  637. 62.00 s Progress: 0 of 33 built, 160 of 170 downloaded from cache (2 downloading)
  638. 62.00 s Downloading cached aeson from https://cache.nix-ci.com
  639. 62.08 s Downloaded cached recursion-schemes (6.7 MiB) in 669ms
  640. 62.08 s Progress: 0 of 32 built, 161 of 170 downloaded from cache (2 downloading)
  641. 62.08 s Downloading cached variant from https://sellout.cachix.org
  642. 62.11 s Downloaded cached kan-extensions (7 MiB) in 385ms
  643. 62.11 s Progress: 0 of 31 built, 162 of 170 downloaded from cache (2 downloading)
  644. 62.11 s Downloading cached lens from https://cache.nix-ci.com
  645. 62.64 s Downloaded cached variant (10.8 MiB) in 560ms
  646. 62.64 s Progress: 0 of 30 built, 163 of 170 downloaded from cache (2 downloading)
  647. 62.99 s Downloaded cached lens (59.1 MiB) in 876ms
  648. 62.99 s Progress: 0 of 29 built, 164 of 170 downloaded from cache (1 downloading)
  649. 62.99 s Downloading cached yaya from https://cache.nix-ci.com
  650. 63.21 s Downloaded cached yaya (5.3 MiB) in 225ms
  651. 63.21 s Progress: 0 of 28 built, 165 of 170 downloaded from cache (1 downloading)
  652. 63.22 s Downloading cached yaya-containers from https://cache.nix-ci.com
  653. 63.22 s Downloading cached yaya-quickcheck from https://cache.nix-ci.com
  654. 63.22 s Downloading cached yaya-unsafe from https://cache.nix-ci.com
  655. 63.27 s Downloaded cached yaya-quickcheck (349 KiB) in 50ms
  656. 63.27 s Downloaded cached yaya-unsafe (1 MiB) in 53ms
  657. 63.28 s Downloaded cached yaya-containers (3.5 MiB) in 59ms
  658. 63.31 s Building /nix/store/6zwpwkb8szxhcf1531x81q83naq1r52j-pathway-internal-0.0.1.0.drv
  659. 63.31 s Progress: 0 of 27 built (1 building), 166 of 170 downloaded from cache (3 downloading)
  660. 63.31 s Progress: 0 of 27 built (1 building), 167 of 170 downloaded from cache (2 downloading)
  661. 63.31 s Progress: 0 of 27 built (1 building), 168 of 170 downloaded from cache (1 downloading)
  662. 63.43 s Downloaded cached aeson (47.8 MiB) in 1.4s
  663. 63.43 s Progress: 0 of 24 built (1 building), 169 of 170 downloaded from cache
  664. 63.60 s Downloading cached path from https://cache.nix-ci.com
  665. 63.60 s [pathway-internal] Phase: setupCompilerEnvironmentPhase
  666. 63.60 s [pathway-internal] Build with /nix/store/4yvzsc21abkayqx2bzncnj5fpx57hb6z-ghc-9.8.4.
  667. 63.67 s [pathway-internal] Phase: unpackPhase
  668. 63.67 s [pathway-internal] unpacking source archive /nix/store/723m6sjvk66iiqzpvcfdd74xi6id5zqq-zjizyqf4pafgh9rycgxd507dhvpisdy1-source/./internal
  669. 63.68 s [pathway-internal] source root is internal
  670. 63.69 s [pathway-internal] Phase: patchPhase
  671. 63.69 s [pathway-internal] Phase: compileBuildDriverPhase
  672. 63.70 s [pathway-internal] setupCompileFlags: -package-db=/build/tmp.u1tOkDbfYm/setup-package.conf.d -threaded
  673. 63.73 s [pathway-internal] [1 of 2] Compiling Main ( Setup.hs, /build/tmp.u1tOkDbfYm/Main.o )
  674. 63.77 s [pathway-internal] [2 of 2] Linking Setup
  675. 63.81 s Downloaded cached path (10.1 MiB) in 209ms
  676. 63.81 s Progress: 0 of 23 built (1 building), 170 of 170 downloaded from cache
  677. 64.75 s [pathway-internal] Phase: updateAutotoolsGnuConfigScriptsPhase
  678. 64.75 s [pathway-internal] Phase: configurePhase
  679. 64.76 s [pathway-internal] configureFlags: --verbose --prefix=/nix/store/slmkn0pzdf3d4rmlym86hl1l475hal92-pathway-internal-0.0.1.0 --libdir=$prefix/lib/$compiler/lib --libsubdir=$abi/$libname --docdir=/nix/store/qpciwdcwqbh00qxc6p9irj3gw6pnxcwd-pathway-internal-0.0.1.0-doc/share/doc/pathway-internal-0.0.1.0 --with-gcc=gcc --package-db=/build/tmp.u1tOkDbfYm/package.conf.d --ghc-option=-j16 --ghc-option=+RTS --ghc-option=-A64M --ghc-option=-RTS --enable-library-profiling --profiling-detail=exported-functions --disable-profiling --enable-shared --disable-coverage --enable-static --disable-executable-dynamic --enable-tests --disable-benchmarks --enable-library-vanilla --disable-library-for-ghci --enable-split-sections --enable-library-stripping --enable-executable-stripping --ghc-option=-haddock --ghc-options=-Werror --extra-lib-dirs=/nix/store/ffyzkisqs4vc4mg28bwwlyqjf8i9ph6b-ncurses-6.5/lib --extra-lib-dirs=/nix/store/n28qgdj8c1q41kf7n4y1jxa6ckp85m3c-libffi-3.5.2/lib --extra-lib-dirs=/nix/store/1b6h99dw7bk4wbn77kbalih42zbc67m1-elfutils-0.194/lib --extra-lib-dirs=/nix/store/hi0ar880110k6jsmmili7dh1gq3cg2a9-gmp-with-cxx-6.3.0/lib --extra-lib-dirs=/nix/store/g09cflpnp4g80q56sj9dng1qzv4v4ybc-numactl-2.0.18/lib --extra-lib-dirs=/nix/store/4yvzsc21abkayqx2bzncnj5fpx57hb6z-ghc-9.8.4/lib
  680. 64.76 s [pathway-internal] Using Parsec parser
  681. 64.76 s [pathway-internal] Configuring pathway-internal-0.0.1.0...
  682. 64.99 s [pathway-internal] Flags chosen: noisy-deprecations=True, verify-no-recursion=False
  683. 64.99 s [pathway-internal] Dependency base >=4.14.0 && <4.15 || >=4.15.0 && <4.16 || >=4.16.0 && <4.17 ||
  684. 64.99 s [pathway-internal] >=4.17.0 && <4.18 || >=4.18.0 && <4.19 || >=4.19.0 && <4.20 || >=4.20.0 &&
  685. 64.99 s [pathway-internal] <4.21 || >=4.21.0 && <4.22 || >=4.22.0 && <4.23: using base-4.19.2.0
  686. 64.99 s [pathway-internal] Dependency yaya >=0.6.2 && <0.7 || >=0.7.0 && <0.8: using yaya-0.6.2.3
  687. 64.99 s [pathway-internal] Dependency base >=4.14.0 && <4.15 || >=4.15.0 && <4.16 || >=4.16.0 && <4.17 ||
  688. 64.99 s [pathway-internal] >=4.17.0 && <4.18 || >=4.18.0 && <4.19 || >=4.19.0 && <4.20 || >=4.20.0 &&
  689. 64.99 s [pathway-internal] <4.21 || >=4.21.0 && <4.22 || >=4.22.0 && <4.23: using base-4.19.2.0
  690. 64.99 s [pathway-internal] Dependency doctest >=0.16.3 && <0.17 || >=0.18.1 && <0.19 || >=0.20.1 && <0.21
  691. 64.99 s [pathway-internal] || >=0.21.1 && <0.22 || >=0.22.2 && <0.23 || >=0.24.2 && <0.25: using
  692. 64.99 s [pathway-internal] doctest-0.24.2
  693. 64.99 s [pathway-internal] Dependency pathway-internal: using pathway-internal-0.0.1.0
  694. 65.20 s [pathway-internal] Source component graph:
  695. 65.20 s [pathway-internal] component lib
  696. 65.20 s [pathway-internal] component test:doctests dependency lib
  697. 65.20 s [pathway-internal] Configured component graph:
  698. 65.20 s [pathway-internal] component pathway-internal-0.0.1.0-BTurcxZAYjHHOlL1rvpIiQ
  699. 65.20 s [pathway-internal] include base-4.19.2.0-8274
  700. 65.20 s [pathway-internal] include yaya-0.6.2.3-5bWn9HCxYKk8n7VJT6hTIW
  701. 65.20 s [pathway-internal] component pathway-internal-0.0.1.0-95AbzV7MJYKF7JRhdax99r-doctests
  702. 65.20 s [pathway-internal] include base-4.19.2.0-8274
  703. 65.20 s [pathway-internal] include doctest-0.24.2-HOk70bisutnFZuBXgSC0HK
  704. 65.20 s [pathway-internal] include pathway-internal-0.0.1.0-BTurcxZAYjHHOlL1rvpIiQ
  705. 65.20 s [pathway-internal] Linked component graph:
  706. 65.20 s [pathway-internal] unit pathway-internal-0.0.1.0-BTurcxZAYjHHOlL1rvpIiQ
  707. 65.20 s [pathway-internal] include base-4.19.2.0-8274
  708. 65.20 s [pathway-internal] include yaya-0.6.2.3-5bWn9HCxYKk8n7VJT6hTIW
  709. 65.20 s [pathway-internal] Data.Path.Internal=pathway-internal-0.0.1.0-BTurcxZAYjHHOlL1rvpIiQ:Data.Path.Internal,Data.Path.Internal.Relativity=pathway-internal-0.0.1.0-BTurcxZAYjHHOlL1rvpIiQ:Data.Path.Internal.Relativity,Data.Path.Internal.Type=pathway-internal-0.0.1.0-BTurcxZAYjHHOlL1rvpIiQ:Data.Path.Internal.Type
  710. 65.20 s [pathway-internal] unit pathway-internal-0.0.1.0-95AbzV7MJYKF7JRhdax99r-doctests
  711. 65.20 s [pathway-internal] include base-4.19.2.0-8274
  712. 65.20 s [pathway-internal] include doctest-0.24.2-HOk70bisutnFZuBXgSC0HK
  713. 65.20 s [pathway-internal] include pathway-internal-0.0.1.0-BTurcxZAYjHHOlL1rvpIiQ
  714. 65.20 s [pathway-internal] Ready component graph:
  715. 65.20 s [pathway-internal] definite pathway-internal-0.0.1.0-BTurcxZAYjHHOlL1rvpIiQ
  716. 65.20 s [pathway-internal] depends base-4.19.2.0-8274
  717. 65.20 s [pathway-internal] depends yaya-0.6.2.3-5bWn9HCxYKk8n7VJT6hTIW
  718. 65.20 s [pathway-internal] definite pathway-internal-0.0.1.0-95AbzV7MJYKF7JRhdax99r-doctests
  719. 65.20 s [pathway-internal] depends base-4.19.2.0-8274
  720. 65.20 s [pathway-internal] depends doctest-0.24.2-HOk70bisutnFZuBXgSC0HK
  721. 65.20 s [pathway-internal] depends pathway-internal-0.0.1.0-BTurcxZAYjHHOlL1rvpIiQ
  722. 65.20 s [pathway-internal] Using Cabal-3.10.3.0 compiled by ghc-9.8
  723. 65.20 s [pathway-internal] Using compiler: ghc-9.8.4
  724. 65.20 s [pathway-internal] Using install prefix:
  725. 65.20 s [pathway-internal] /nix/store/slmkn0pzdf3d4rmlym86hl1l475hal92-pathway-internal-0.0.1.0
  726. 65.20 s [pathway-internal] Executables installed in:
  727. 65.20 s [pathway-internal] /nix/store/slmkn0pzdf3d4rmlym86hl1l475hal92-pathway-internal-0.0.1.0/bin
  728. 65.20 s [pathway-internal] Libraries installed in:
  729. 65.20 s [pathway-internal] /nix/store/slmkn0pzdf3d4rmlym86hl1l475hal92-pathway-internal-0.0.1.0/lib/ghc-9.8.4/lib/x86_64-linux-ghc-9.8.4/pathway-internal-0.0.1.0-BTurcxZAYjHHOlL1rvpIiQ
  730. 65.20 s [pathway-internal] Dynamic Libraries installed in:
  731. 65.20 s [pathway-internal] /nix/store/slmkn0pzdf3d4rmlym86hl1l475hal92-pathway-internal-0.0.1.0/lib/ghc-9.8.4/lib/x86_64-linux-ghc-9.8.4
  732. 65.20 s [pathway-internal] Private executables installed in:
  733. 65.20 s [pathway-internal] /nix/store/slmkn0pzdf3d4rmlym86hl1l475hal92-pathway-internal-0.0.1.0/libexec/x86_64-linux-ghc-9.8.4/pathway-internal-0.0.1.0
  734. 65.20 s [pathway-internal] Data files installed in:
  735. 65.20 s [pathway-internal] /nix/store/slmkn0pzdf3d4rmlym86hl1l475hal92-pathway-internal-0.0.1.0/share/x86_64-linux-ghc-9.8.4/pathway-internal-0.0.1.0
  736. 65.20 s [pathway-internal] Documentation installed in:
  737. 65.20 s [pathway-internal] /nix/store/qpciwdcwqbh00qxc6p9irj3gw6pnxcwd-pathway-internal-0.0.1.0-doc/share/doc/pathway-internal-0.0.1.0
  738. 65.20 s [pathway-internal] Configuration files installed in:
  739. 65.20 s [pathway-internal] /nix/store/slmkn0pzdf3d4rmlym86hl1l475hal92-pathway-internal-0.0.1.0/etc
  740. 65.20 s [pathway-internal] No alex found
  741. 65.20 s [pathway-internal] Using ar found on system at:
  742. 65.20 s [pathway-internal] /nix/store/iz5lckcsg66r223si2gck7csk2hihj0m-binutils-wrapper-2.44/bin/ar
  743. 65.20 s [pathway-internal] No c2hs found
  744. 65.20 s [pathway-internal] No cpphs found
  745. 65.20 s [pathway-internal] Using doctest version 0.24.2 found on system at:
  746. 65.20 s [pathway-internal] /nix/store/ipqa88qiasixywmsikcnq7nhq6340lg5-doctest-0.24.2/bin/doctest
  747. 65.20 s [pathway-internal] Using gcc version 14.3.0 given by user at:
  748. 65.20 s [pathway-internal] /nix/store/8v97ngkcpfzgghwnnr7fsz33p2x22gy9-gcc-wrapper-14.3.0/bin/gcc
  749. 65.20 s [pathway-internal] Using ghc version 9.8.4 found on system at:
  750. 65.20 s [pathway-internal] /nix/store/4yvzsc21abkayqx2bzncnj5fpx57hb6z-ghc-9.8.4/bin/ghc
  751. 65.20 s [pathway-internal] Using ghc-pkg version 9.8.4 found on system at:
  752. 65.20 s [pathway-internal] /nix/store/4yvzsc21abkayqx2bzncnj5fpx57hb6z-ghc-9.8.4/bin/ghc-pkg-9.8.4
  753. 65.20 s [pathway-internal] No ghcjs found
  754. 65.20 s [pathway-internal] No ghcjs-pkg found
  755. 65.20 s [pathway-internal] No greencard found
  756. 65.20 s [pathway-internal] Using haddock version 2.30.0 found on system at:
  757. 65.20 s [pathway-internal] /nix/store/4yvzsc21abkayqx2bzncnj5fpx57hb6z-ghc-9.8.4/bin/haddock-ghc-9.8.4
  758. 65.20 s [pathway-internal] No happy found
  759. 65.20 s [pathway-internal] Using haskell-suite found on system at: haskell-suite-dummy-location
  760. 65.20 s [pathway-internal] Using haskell-suite-pkg found on system at: haskell-suite-pkg-dummy-location
  761. 65.20 s [pathway-internal] No hmake found
  762. 65.20 s [pathway-internal] Using hpc version 0.69 found on system at:
  763. 65.20 s [pathway-internal] /nix/store/4yvzsc21abkayqx2bzncnj5fpx57hb6z-ghc-9.8.4/bin/hpc-ghc-9.8.4
  764. 65.20 s [pathway-internal] Using hsc2hs version 0.68.10 found on system at:
  765. 65.20 s [pathway-internal] /nix/store/4yvzsc21abkayqx2bzncnj5fpx57hb6z-ghc-9.8.4/bin/hsc2hs-ghc-9.8.4
  766. 65.20 s [pathway-internal] Using hscolour version 1.25 found on system at:
  767. 65.20 s [pathway-internal] /nix/store/palqpb4p9k5rqxhxjdgqrak8n91p6c4z-hscolour-1.25/bin/HsColour
  768. 65.20 s [pathway-internal] No jhc found
  769. 65.20 s [pathway-internal] Using ld found on system at:
  770. 65.20 s [pathway-internal] /nix/store/iz5lckcsg66r223si2gck7csk2hihj0m-binutils-wrapper-2.44/bin/ld.gold
  771. 65.20 s [pathway-internal] No pkg-config found
  772. 65.20 s [pathway-internal] Using runghc version 9.8.4 found on system at:
  773. 65.20 s [pathway-internal] /nix/store/4yvzsc21abkayqx2bzncnj5fpx57hb6z-ghc-9.8.4/bin/runghc-9.8.4
  774. 65.20 s [pathway-internal] Using strip version 2.44 found on system at:
  775. 65.20 s [pathway-internal] /nix/store/8v97ngkcpfzgghwnnr7fsz33p2x22gy9-gcc-wrapper-14.3.0/bin/strip
  776. 65.20 s [pathway-internal] Using tar found on system at:
  777. 65.20 s [pathway-internal] /nix/store/xl6pd2spjajwcpq09fnmnjv5psqmlmma-gnutar-1.35/bin/tar
  778. 65.20 s [pathway-internal] No uhc found
  779. 65.41 s [pathway-internal] Phase: buildPhase
  780. 65.45 s [pathway-internal] Preprocessing library for pathway-internal-0.0.1.0..
  781. 65.45 s [pathway-internal] Building library for pathway-internal-0.0.1.0..
  782. 65.50 s [pathway-internal] [1 of 3] Compiling Data.Path.Internal.Relativity ( src/Data/Path/Internal/Relativity.hs, dist/build/Data/Path/Internal/Relativity.o, dist/build/Data/Path/Internal/Relativity.dyn_o )
  783. 65.67 s [pathway-internal] [2 of 3] Compiling Data.Path.Internal.Type ( src/Data/Path/Internal/Type.hs, dist/build/Data/Path/Internal/Type.o, dist/build/Data/Path/Internal/Type.dyn_o )
  784. 65.67 s [pathway-internal] [3 of 3] Compiling Data.Path.Internal ( src/Data/Path/Internal.hs, dist/build/Data/Path/Internal.o, dist/build/Data/Path/Internal.dyn_o )
  785. 66.74 s [pathway-internal] [1 of 3] Compiling Data.Path.Internal.Relativity ( src/Data/Path/Internal/Relativity.hs, dist/build/Data/Path/Internal/Relativity.p_o )
  786. 66.95 s [pathway-internal] [2 of 3] Compiling Data.Path.Internal.Type ( src/Data/Path/Internal/Type.hs, dist/build/Data/Path/Internal/Type.p_o )
  787. 66.95 s [pathway-internal] [3 of 3] Compiling Data.Path.Internal ( src/Data/Path/Internal.hs, dist/build/Data/Path/Internal.p_o )
  788. 69.00 s [pathway-internal] Preprocessing test suite 'doctests' for pathway-internal-0.0.1.0..
  789. 69.00 s [pathway-internal] Building test suite 'doctests' for pathway-internal-0.0.1.0..
  790. 69.11 s [pathway-internal] [1 of 2] Compiling Build_doctests ( dist/build/doctests/autogen/Build_doctests.hs, dist/build/doctests/doctests-tmp/Build_doctests.o )
  791. 69.22 s [pathway-internal] [2 of 2] Compiling Main ( tests/doctests.hs, dist/build/doctests/doctests-tmp/Main.o )
  792. 69.42 s [pathway-internal] [3 of 3] Linking dist/build/doctests/doctests
  793. 72.45 s [pathway-internal] Phase: checkPhase
  794. 72.49 s [pathway-internal] Running 1 test suites...
  795. 72.49 s [pathway-internal] Test suite doctests: RUNNING...
  796. 72.67 s [pathway-internal]
  797. 72.67 s [pathway-internal] on the commandline: warning: [GHC-98887]
  798. 72.67 s [pathway-internal] -XTemplateHaskell is not allowed in Safe Haskell; ignoring -XTemplateHaskell
  799. 72.67 s [pathway-internal]
  800. 72.67 s [pathway-internal] on the commandline: warning: [GHC-98887]
  801. 72.67 s [pathway-internal] -XTemplateHaskell is not allowed in Safe Haskell; ignoring -XTemplateHaskell
  802. 73.06 s [pathway-internal] Examples: 0 Tried: 0 Errors: 0 Failures: 0
  803. 73.10 s [pathway-internal] Test suite doctests: PASS
  804. 73.10 s [pathway-internal] Test suite logged to: dist/test/pathway-internal-0.0.1.0-doctests.log
  805. 73.10 s [pathway-internal] 1 of 1 test suites (1 of 1 test cases) passed.
  806. 73.11 s [pathway-internal] Phase: haddockPhase
  807. 73.20 s [pathway-internal] Preprocessing library for pathway-internal-0.0.1.0..
  808. 73.20 s [pathway-internal] Running Haddock on library for pathway-internal-0.0.1.0..
  809. 73.21 s [pathway-internal] Warning: The documentation for the following packages are not installed. No
  810. 73.21 s [pathway-internal] links will be generated to these packages: vector-0.13.2.0
  811. 73.25 s [pathway-internal] Warning: --source-* options are ignored when --hyperlinked-source is enabled.
  812. 73.35 s [pathway-internal] [1 of 3] Compiling Data.Path.Internal.Relativity ( src/Data/Path/Internal/Relativity.hs, nothing )
  813. 73.43 s [pathway-internal] [2 of 3] Compiling Data.Path.Internal.Type ( src/Data/Path/Internal/Type.hs, nothing )
  814. 73.44 s [pathway-internal] [3 of 3] Compiling Data.Path.Internal ( src/Data/Path/Internal.hs, nothing )
  815. 73.69 s [pathway-internal] Haddock coverage:
  816. 73.69 s [pathway-internal] Warning: 'Path' is out of scope.
  817. 73.69 s [pathway-internal] If you qualify the identifier, haddock can try to link it anyway.
  818. 73.69 s [pathway-internal] Warning: 'True' is out of scope.
  819. 73.70 s [pathway-internal] If you qualify the identifier, haddock can try to link it anyway.
  820. 73.70 s [pathway-internal] Warning: 'False' is out of scope.
  821. 73.70 s [pathway-internal] If you qualify the identifier, haddock can try to link it anyway.
  822. 73.70 s [pathway-internal] Warning: 'Nat' is out of scope.
  823. 73.70 s [pathway-internal] If you qualify the identifier, haddock can try to link it anyway.
  824. 73.70 s [pathway-internal] Warning: 'Maybe' is out of scope.
  825. 73.70 s [pathway-internal] If you qualify the identifier, haddock can try to link it anyway.
  826. 73.70 s [pathway-internal] Warning: 'Nothing' is out of scope.
  827. 73.70 s [pathway-internal] If you qualify the identifier, haddock can try to link it anyway.
  828. 73.70 s [pathway-internal] 50% ( 1 / 2) in 'Data.Path.Internal.Relativity'
  829. 73.70 s [pathway-internal] Missing documentation for:
  830. 73.70 s [pathway-internal] Module header
  831. 73.70 s [pathway-internal] Warning: 'Path' is out of scope.
  832. 73.70 s [pathway-internal] If you qualify the identifier, haddock can try to link it anyway.
  833. 73.70 s [pathway-internal] 50% ( 1 / 2) in 'Data.Path.Internal.Type'
  834. 73.70 s [pathway-internal] Missing documentation for:
  835. 73.70 s [pathway-internal] Module header
  836. 73.70 s [pathway-internal] Warning: 'toText' is out of scope.
  837. 73.70 s [pathway-internal] If you qualify the identifier, haddock can try to link it anyway.
  838. 73.70 s [pathway-internal] Warning: '</?>' is out of scope.
  839. 73.70 s [pathway-internal] If you qualify the identifier, haddock can try to link it anyway.
  840. 73.70 s [pathway-internal] Warning: 'AnyPath' is out of scope.
  841. 73.70 s [pathway-internal] If you qualify the identifier, haddock can try to link it anyway.
  842. 73.70 s [pathway-internal] 66% ( 6 / 9) in 'Data.Path.Internal'
  843. 73.70 s [pathway-internal] Missing documentation for:
  844. 73.70 s [pathway-internal] Module header
  845. 73.70 s [pathway-internal] TotalOps (src/Data/Path/Internal.hs:199)
  846. 73.70 s [pathway-internal] Filename (src/Data/Path/Internal.hs:77)
  847. 74.03 s [pathway-internal] Warning: Data.Path.Internal.Relativity: could not find link destinations for:
  848. 74.09 s [pathway-internal] - Data.Path.Internal.Relativity.Rep_Relativity
  849. 74.09 s [pathway-internal] Warning: Data.Path.Internal.Type: could not find link destinations for:
  850. 74.09 s [pathway-internal] - Data.Path.Internal.Type.Rep_Type
  851. 74.09 s [pathway-internal] Warning: Data.Path.Internal: could not find link destinations for:
  852. 74.09 s [pathway-internal] - Data.Path.Internal.Rep_Path
  853. 74.09 s [pathway-internal] - Data.Path.Internal.Rep1_Path
  854. 74.09 s [pathway-internal] - Data.Path.Internal.Rep_List
  855. 77.13 s [pathway-internal] Documentation created: dist/doc/html/pathway-internal/,
  856. 77.13 s [pathway-internal] dist/doc/html/pathway-internal/pathway-internal.txt
  857. 77.18 s [pathway-internal] Preprocessing test suite 'doctests' for pathway-internal-0.0.1.0..
  858. 77.18 s [pathway-internal] Phase: installPhase
  859. 77.24 s [pathway-internal] Installing library in /nix/store/slmkn0pzdf3d4rmlym86hl1l475hal92-pathway-internal-0.0.1.0/lib/ghc-9.8.4/lib/x86_64-linux-ghc-9.8.4/pathway-internal-0.0.1.0-BTurcxZAYjHHOlL1rvpIiQ
  860. 77.41 s [pathway-internal] Phase: fixupPhase
  861. 77.43 s [pathway-internal] shrinking RPATHs of ELF executables and libraries in /nix/store/slmkn0pzdf3d4rmlym86hl1l475hal92-pathway-internal-0.0.1.0
  862. 77.43 s [pathway-internal] shrinking /nix/store/slmkn0pzdf3d4rmlym86hl1l475hal92-pathway-internal-0.0.1.0/lib/ghc-9.8.4/lib/x86_64-linux-ghc-9.8.4/libHSpathway-internal-0.0.1.0-BTurcxZAYjHHOlL1rvpIiQ-ghc9.8.4.so
  863. 77.44 s [pathway-internal] checking for references to /build/ in /nix/store/slmkn0pzdf3d4rmlym86hl1l475hal92-pathway-internal-0.0.1.0...
  864. 77.46 s [pathway-internal] patching script interpreter paths in /nix/store/slmkn0pzdf3d4rmlym86hl1l475hal92-pathway-internal-0.0.1.0
  865. 77.46 s [pathway-internal] stripping (with command strip and flags -S -p) in /nix/store/slmkn0pzdf3d4rmlym86hl1l475hal92-pathway-internal-0.0.1.0/lib
  866. 77.50 s [pathway-internal] shrinking RPATHs of ELF executables and libraries in /nix/store/qpciwdcwqbh00qxc6p9irj3gw6pnxcwd-pathway-internal-0.0.1.0-doc
  867. 77.51 s [pathway-internal] checking for references to /build/ in /nix/store/qpciwdcwqbh00qxc6p9irj3gw6pnxcwd-pathway-internal-0.0.1.0-doc...
  868. 77.52 s [pathway-internal] patching script interpreter paths in /nix/store/qpciwdcwqbh00qxc6p9irj3gw6pnxcwd-pathway-internal-0.0.1.0-doc
  869. 77.60 s [pathway-internal:post-build] Uploading to cachix cache "sellout": /nix/store/qpciwdcwqbh00qxc6p9irj3gw6pnxcwd-pathway-internal-0.0.1.0-doc /nix/store/slmkn0pzdf3d4rmlym86hl1l475hal92-pathway-internal-0.0.1.0
  870. 79.21 s [pathway-internal:post-build] Pushing 2 paths (160 are already present) using zstd to cache sellout ⏳
  871. 79.21 s [pathway-internal:post-build]
  872. 79.87 s [pathway-internal:post-build] Pushing /nix/store/qpciwdcwqbh00qxc6p9irj3gw6pnxcwd-pathway-internal-0.0.1.0-doc (612.64 KiB)
  873. 79.87 s [pathway-internal:post-build] Pushing /nix/store/slmkn0pzdf3d4rmlym86hl1l475hal92-pathway-internal-0.0.1.0 (2.05 MiB)
  874. 81.16 s [pathway-internal:post-build]
  875. 81.16 s [pathway-internal:post-build] All done.
  876. 81.18 s [pathway-internal:post-build] Uploading to the NixCI cache: /nix/store/qpciwdcwqbh00qxc6p9irj3gw6pnxcwd-pathway-internal-0.0.1.0-doc /nix/store/slmkn0pzdf3d4rmlym86hl1l475hal92-pathway-internal-0.0.1.0
  877. 81.22 s [pathway-internal:post-build] warning: 'warn-short-path-literals' is deprecated, use 'lint-short-path-literals = ignore' instead
  878. 81.23 s [pathway-internal:post-build] copying 2 paths...
  879. 81.23 s [pathway-internal:post-build] copying path '/nix/store/qpciwdcwqbh00qxc6p9irj3gw6pnxcwd-pathway-internal-0.0.1.0-doc' to 'https://cache.nix-ci.com'...
  880. 81.70 s [pathway-internal:post-build] copying path '/nix/store/slmkn0pzdf3d4rmlym86hl1l475hal92-pathway-internal-0.0.1.0' to 'https://cache.nix-ci.com'...
  881. 82.40 s [pathway-internal:post-build] warning: 'warn-short-path-literals' is deprecated, use 'lint-short-path-literals = ignore' instead
  882. 82.91 s [pathway-internal:post-build] copying 20 paths...
  883. 82.91 s [pathway-internal:post-build] copying path '/nix/store/4rry1xcj2wl2165p52nl18mq3x03q90d-StateVar-1.2.2.drv' to 'https://cache.nix-ci.com'...
  884. 82.91 s [pathway-internal:post-build] copying path '/nix/store/66wsy3v4r7fbvymcl7m59mfmwfyd1yf9-reflection-2.1.9.drv' to 'https://cache.nix-ci.com'...
  885. 82.91 s [pathway-internal:post-build] copying path '/nix/store/8n8bg2279nmsxid1wb6n2lphmany4mfh-parallel-3.2.2.0.drv' to 'https://cache.nix-ci.com'...
  886. 82.91 s [pathway-internal:post-build] copying path '/nix/store/7zykjxx7aw2rnin4awb1qvqi5am5csmd-indexed-traversable-0.1.4.drv' to 'https://cache.nix-ci.com'...
  887. 82.91 s [pathway-internal:post-build] copying path '/nix/store/y68w2hr4jx3vda6zpvgfz0d3y9j8rq1h-semigroups-0.20.drv' to 'https://cache.nix-ci.com'...
  888. 82.91 s [pathway-internal:post-build] copying path '/nix/store/b6mmi5qkvnx8grvl6ysg3wcpy5c7all7-simple-reflect-0.3.3.drv' to 'https://cache.nix-ci.com'...
  889. 83.18 s [pathway-internal:post-build] copying path '/nix/store/rls6s0nv02j9iva2ykhcwb7zyc22n1xw-indexed-traversable-instances-0.1.2.drv' to 'https://cache.nix-ci.com'...
  890. 83.18 s [pathway-internal:post-build] copying path '/nix/store/w0f8dxyph2lhzxsaigwfx0zjwfm7z51s-comonad-5.0.9.drv' to 'https://cache.nix-ci.com'...
  891. 83.19 s [pathway-internal:post-build] copying path '/nix/store/ciw33gv3fyzr4g27q13c83dvhwn76zgr-contravariant-1.5.5.drv' to 'https://cache.nix-ci.com'...
  892. 83.46 s [pathway-internal:post-build] copying path '/nix/store/sijx40b3mbdwqc2x91vbgivnqy44hqcd-bifunctors-5.6.2.drv' to 'https://cache.nix-ci.com'...
  893. 83.71 s [pathway-internal:post-build] copying path '/nix/store/d8jniwmnh69fw52v3kfhv55c92y6vq0h-semigroupoids-6.0.1.drv' to 'https://cache.nix-ci.com'...
  894. 83.71 s [pathway-internal:post-build] copying path '/nix/store/x57kvia3yh986m9sqp0k7ljjlr3ykwcf-profunctors-5.6.3.drv' to 'https://cache.nix-ci.com'...
  895. 83.96 s [pathway-internal:post-build] copying path '/nix/store/97azfmm1xivwn6iinmwy6r9ivbm3jhn8-invariant-0.6.4.drv' to 'https://cache.nix-ci.com'...
  896. 83.96 s [pathway-internal:post-build] copying path '/nix/store/sm93zavw65z9vglwb7nfpjznyrkc79f8-either-5.0.3.drv' to 'https://cache.nix-ci.com'...
  897. 83.96 s [pathway-internal:post-build] copying path '/nix/store/cjnrnpdnnf2npj539dnfkkfr5pdb38ax-free-5.2.drv' to 'https://cache.nix-ci.com'...
  898. 84.22 s [pathway-internal:post-build] copying path '/nix/store/6dvbfgqxwk0w9kqvcxsv7gj0bagjv42r-adjunctions-4.4.3.drv' to 'https://cache.nix-ci.com'...
  899. 84.46 s [pathway-internal:post-build] copying path '/nix/store/5f85qci9xy5xchyik8ajqp8f87yxc38j-kan-extensions-5.2.7.drv' to 'https://cache.nix-ci.com'...
  900. 84.70 s [pathway-internal:post-build] copying path '/nix/store/5f12sj86b2in7ppbw28m717l3rvnpw79-lens-5.3.5.drv' to 'https://cache.nix-ci.com'...
  901. 84.96 s [pathway-internal:post-build] copying path '/nix/store/n1ln1yriy594d0z4qpahmbd2gvifppwy-yaya-0.6.2.3.drv' to 'https://cache.nix-ci.com'...
  902. 85.21 s [pathway-internal:post-build] copying path '/nix/store/6zwpwkb8szxhcf1531x81q83naq1r52j-pathway-internal-0.0.1.0.drv' to 'https://cache.nix-ci.com'...
  903. 85.47 s Uploaded pathway-internal in 7.8s
  904. 85.47 s Progress: 1 of 23 built, 170 of 170 downloaded from cache
  905. 85.47 s Built pathway-internal in 22.1s
  906. 85.51 s Building /nix/store/2iz5h9kg0pvql75haymb7mqcb8gc20a8-pathway-quickcheck-0.0.1.0.drv
  907. 85.70 s [pathway-quickcheck] Phase: setupCompilerEnvironmentPhase
  908. 85.70 s [pathway-quickcheck] Build with /nix/store/4yvzsc21abkayqx2bzncnj5fpx57hb6z-ghc-9.8.4.
  909. 85.92 s [pathway-quickcheck] Phase: unpackPhase
  910. 85.92 s [pathway-quickcheck] unpacking source archive /nix/store/723m6sjvk66iiqzpvcfdd74xi6id5zqq-zjizyqf4pafgh9rycgxd507dhvpisdy1-source/./quickcheck
  911. 85.93 s [pathway-quickcheck] source root is quickcheck
  912. 85.93 s [pathway-quickcheck] Phase: patchPhase
  913. 85.94 s [pathway-quickcheck] Phase: compileBuildDriverPhase
  914. 85.94 s [pathway-quickcheck] setupCompileFlags: -package-db=/build/tmp.LDoNJHKNtk/setup-package.conf.d -threaded
  915. 85.98 s [pathway-quickcheck] [1 of 2] Compiling Main ( Setup.hs, /build/tmp.LDoNJHKNtk/Main.o )
  916. 86.02 s [pathway-quickcheck] [2 of 2] Linking Setup
  917. 87.04 s [pathway-quickcheck] Phase: updateAutotoolsGnuConfigScriptsPhase
  918. 87.05 s [pathway-quickcheck] Phase: configurePhase
  919. 87.06 s [pathway-quickcheck] configureFlags: --verbose --prefix=/nix/store/1fvrpvqa0c6cy0agzm75j1nn0203nx95-pathway-quickcheck-0.0.1.0 --libdir=$prefix/lib/$compiler/lib --libsubdir=$abi/$libname --docdir=/nix/store/w1gy8gzknqd9qx96nda0vapx5viccqff-pathway-quickcheck-0.0.1.0-doc/share/doc/pathway-quickcheck-0.0.1.0 --with-gcc=gcc --package-db=/build/tmp.LDoNJHKNtk/package.conf.d --ghc-option=-j16 --ghc-option=+RTS --ghc-option=-A64M --ghc-option=-RTS --enable-library-profiling --profiling-detail=exported-functions --disable-profiling --enable-shared --disable-coverage --enable-static --disable-executable-dynamic --enable-tests --disable-benchmarks --enable-library-vanilla --disable-library-for-ghci --enable-split-sections --enable-library-stripping --enable-executable-stripping --ghc-option=-haddock --ghc-options=-Werror --extra-lib-dirs=/nix/store/ffyzkisqs4vc4mg28bwwlyqjf8i9ph6b-ncurses-6.5/lib --extra-lib-dirs=/nix/store/n28qgdj8c1q41kf7n4y1jxa6ckp85m3c-libffi-3.5.2/lib --extra-lib-dirs=/nix/store/1b6h99dw7bk4wbn77kbalih42zbc67m1-elfutils-0.194/lib --extra-lib-dirs=/nix/store/hi0ar880110k6jsmmili7dh1gq3cg2a9-gmp-with-cxx-6.3.0/lib --extra-lib-dirs=/nix/store/g09cflpnp4g80q56sj9dng1qzv4v4ybc-numactl-2.0.18/lib --extra-lib-dirs=/nix/store/4yvzsc21abkayqx2bzncnj5fpx57hb6z-ghc-9.8.4/lib
  920. 87.06 s [pathway-quickcheck] Using Parsec parser
  921. 87.06 s [pathway-quickcheck] Configuring pathway-quickcheck-0.0.1.0...
  922. 87.32 s [pathway-quickcheck] Flags chosen: noisy-deprecations=True, verify-no-recursion=False
  923. 87.32 s [pathway-quickcheck] Dependency QuickCheck >=2.14.2 && <2.15 || >=2.15.0 && <2.16 || >=2.16.0 &&
  924. 87.32 s [pathway-quickcheck] <2.17 || >=2.17.1 && <2.18: using QuickCheck-2.15.0.1
  925. 87.32 s [pathway-quickcheck] Dependency base >=4.14.0 && <4.15 || >=4.15.0 && <4.16 || >=4.16.0 && <4.17 ||
  926. 87.32 s [pathway-quickcheck] >=4.17.0 && <4.18 || >=4.18.0 && <4.19 || >=4.19.0 && <4.20 || >=4.20.0 &&
  927. 87.32 s [pathway-quickcheck] <4.21 || >=4.21.0 && <4.22 || >=4.22.0 && <4.23: using base-4.19.2.0
  928. 87.32 s [pathway-quickcheck] Dependency pathway-internal >=0.0.1 && <0.1: using pathway-internal-0.0.1.0
  929. 87.32 s [pathway-quickcheck] Dependency quickcheck-instances >=0.3.26 && <0.5: using
  930. 87.32 s [pathway-quickcheck] quickcheck-instances-0.3.33
  931. 87.32 s [pathway-quickcheck] Dependency yaya >=0.6.2 && <0.7 || >=0.7.0 && <0.8: using yaya-0.6.2.3
  932. 87.32 s [pathway-quickcheck] Dependency yaya-quickcheck >=0.2.0 && <0.3 || >=0.3.0 && <0.4: using
  933. 87.32 s [pathway-quickcheck] yaya-quickcheck-0.2.0.3
  934. 87.32 s [pathway-quickcheck] Dependency QuickCheck >=2.14.2 && <2.15 || >=2.15.0 && <2.16 || >=2.16.0 &&
  935. 87.32 s [pathway-quickcheck] <2.17 || >=2.17.1 && <2.18: using QuickCheck-2.15.0.1
  936. 87.32 s [pathway-quickcheck] Dependency base >=4.14.0 && <4.15 || >=4.15.0 && <4.16 || >=4.16.0 && <4.17 ||
  937. 87.32 s [pathway-quickcheck] >=4.17.0 && <4.18 || >=4.18.0 && <4.19 || >=4.19.0 && <4.20 || >=4.20.0 &&
  938. 87.32 s [pathway-quickcheck] <4.21 || >=4.21.0 && <4.22 || >=4.22.0 && <4.23: using base-4.19.2.0
  939. 87.32 s [pathway-quickcheck] Dependency doctest >=0.16.3 && <0.17 || >=0.18.1 && <0.19 || >=0.20.1 && <0.21
  940. 87.32 s [pathway-quickcheck] || >=0.21.1 && <0.22 || >=0.22.2 && <0.23 || >=0.24.2 && <0.25: using
  941. 87.32 s [pathway-quickcheck] doctest-0.24.2
  942. 87.32 s [pathway-quickcheck] Dependency pathway-quickcheck: using pathway-quickcheck-0.0.1.0
  943. 87.53 s [pathway-quickcheck] Source component graph:
  944. 87.53 s [pathway-quickcheck] component lib
  945. 87.53 s [pathway-quickcheck] component test:doctests dependency lib
  946. 87.53 s [pathway-quickcheck] Configured component graph:
  947. 87.53 s [pathway-quickcheck] component pathway-quickcheck-0.0.1.0-D8tq4Sgr5zz6I2F19xa0Lq
  948. 87.53 s [pathway-quickcheck] include QuickCheck-2.15.0.1-5u5mV1pqdXQ9rGVQgPoEeu
  949. 87.53 s [pathway-quickcheck] include base-4.19.2.0-8274
  950. 87.53 s [pathway-quickcheck] include pathway-internal-0.0.1.0-BTurcxZAYjHHOlL1rvpIiQ
  951. 87.53 s [pathway-quickcheck] include quickcheck-instances-0.3.33-Eq1AGcKEE1f6BkZVBZKnhW
  952. 87.53 s [pathway-quickcheck] include yaya-0.6.2.3-5bWn9HCxYKk8n7VJT6hTIW
  953. 87.53 s [pathway-quickcheck] include yaya-quickcheck-0.2.0.3-ivAffrialf3PmKbRttOIm
  954. 87.53 s [pathway-quickcheck] component pathway-quickcheck-0.0.1.0-DAT4Bi50KwHEXPb9o42Gpi-doctests
  955. 87.53 s [pathway-quickcheck] include QuickCheck-2.15.0.1-5u5mV1pqdXQ9rGVQgPoEeu
  956. 87.53 s [pathway-quickcheck] include base-4.19.2.0-8274
  957. 87.53 s [pathway-quickcheck] include doctest-0.24.2-HOk70bisutnFZuBXgSC0HK
  958. 87.53 s [pathway-quickcheck] include pathway-quickcheck-0.0.1.0-D8tq4Sgr5zz6I2F19xa0Lq
  959. 87.53 s [pathway-quickcheck] Linked component graph:
  960. 87.53 s [pathway-quickcheck] unit pathway-quickcheck-0.0.1.0-D8tq4Sgr5zz6I2F19xa0Lq
  961. 87.53 s [pathway-quickcheck] include QuickCheck-2.15.0.1-5u5mV1pqdXQ9rGVQgPoEeu
  962. 87.53 s [pathway-quickcheck] include base-4.19.2.0-8274
  963. 87.53 s [pathway-quickcheck] include pathway-internal-0.0.1.0-BTurcxZAYjHHOlL1rvpIiQ
  964. 87.53 s [pathway-quickcheck] include quickcheck-instances-0.3.33-Eq1AGcKEE1f6BkZVBZKnhW
  965. 87.53 s [pathway-quickcheck] include yaya-0.6.2.3-5bWn9HCxYKk8n7VJT6hTIW
  966. 87.53 s [pathway-quickcheck] include yaya-quickcheck-0.2.0.3-ivAffrialf3PmKbRttOIm
  967. 87.53 s [pathway-quickcheck] Test.Path.QuickCheck=pathway-quickcheck-0.0.1.0-D8tq4Sgr5zz6I2F19xa0Lq:Test.Path.QuickCheck
  968. 87.53 s [pathway-quickcheck] unit pathway-quickcheck-0.0.1.0-DAT4Bi50KwHEXPb9o42Gpi-doctests
  969. 87.53 s [pathway-quickcheck] include QuickCheck-2.15.0.1-5u5mV1pqdXQ9rGVQgPoEeu
  970. 87.53 s [pathway-quickcheck] include base-4.19.2.0-8274
  971. 87.53 s [pathway-quickcheck] include doctest-0.24.2-HOk70bisutnFZuBXgSC0HK
  972. 87.53 s [pathway-quickcheck] include pathway-quickcheck-0.0.1.0-D8tq4Sgr5zz6I2F19xa0Lq
  973. 87.53 s [pathway-quickcheck] Ready component graph:
  974. 87.53 s [pathway-quickcheck] definite pathway-quickcheck-0.0.1.0-D8tq4Sgr5zz6I2F19xa0Lq
  975. 87.53 s [pathway-quickcheck] depends QuickCheck-2.15.0.1-5u5mV1pqdXQ9rGVQgPoEeu
  976. 87.53 s [pathway-quickcheck] depends base-4.19.2.0-8274
  977. 87.53 s [pathway-quickcheck] depends pathway-internal-0.0.1.0-BTurcxZAYjHHOlL1rvpIiQ
  978. 87.53 s [pathway-quickcheck] depends quickcheck-instances-0.3.33-Eq1AGcKEE1f6BkZVBZKnhW
  979. 87.53 s [pathway-quickcheck] depends yaya-0.6.2.3-5bWn9HCxYKk8n7VJT6hTIW
  980. 87.53 s [pathway-quickcheck] depends yaya-quickcheck-0.2.0.3-ivAffrialf3PmKbRttOIm
  981. 87.53 s [pathway-quickcheck] definite pathway-quickcheck-0.0.1.0-DAT4Bi50KwHEXPb9o42Gpi-doctests
  982. 87.53 s [pathway-quickcheck] depends QuickCheck-2.15.0.1-5u5mV1pqdXQ9rGVQgPoEeu
  983. 87.53 s [pathway-quickcheck] depends base-4.19.2.0-8274
  984. 87.53 s [pathway-quickcheck] depends doctest-0.24.2-HOk70bisutnFZuBXgSC0HK
  985. 87.53 s [pathway-quickcheck] depends pathway-quickcheck-0.0.1.0-D8tq4Sgr5zz6I2F19xa0Lq
  986. 87.53 s [pathway-quickcheck] Using Cabal-3.10.3.0 compiled by ghc-9.8
  987. 87.53 s [pathway-quickcheck] Using compiler: ghc-9.8.4
  988. 87.53 s [pathway-quickcheck] Using install prefix:
  989. 87.53 s [pathway-quickcheck] /nix/store/1fvrpvqa0c6cy0agzm75j1nn0203nx95-pathway-quickcheck-0.0.1.0
  990. 87.53 s [pathway-quickcheck] Executables installed in:
  991. 87.53 s [pathway-quickcheck] /nix/store/1fvrpvqa0c6cy0agzm75j1nn0203nx95-pathway-quickcheck-0.0.1.0/bin
  992. 87.53 s [pathway-quickcheck] Libraries installed in:
  993. 87.53 s [pathway-quickcheck] /nix/store/1fvrpvqa0c6cy0agzm75j1nn0203nx95-pathway-quickcheck-0.0.1.0/lib/ghc-9.8.4/lib/x86_64-linux-ghc-9.8.4/pathway-quickcheck-0.0.1.0-D8tq4Sgr5zz6I2F19xa0Lq
  994. 87.53 s [pathway-quickcheck] Dynamic Libraries installed in:
  995. 87.53 s [pathway-quickcheck] /nix/store/1fvrpvqa0c6cy0agzm75j1nn0203nx95-pathway-quickcheck-0.0.1.0/lib/ghc-9.8.4/lib/x86_64-linux-ghc-9.8.4
  996. 87.53 s [pathway-quickcheck] Private executables installed in:
  997. 87.53 s [pathway-quickcheck] /nix/store/1fvrpvqa0c6cy0agzm75j1nn0203nx95-pathway-quickcheck-0.0.1.0/libexec/x86_64-linux-ghc-9.8.4/pathway-quickcheck-0.0.1.0
  998. 87.53 s [pathway-quickcheck] Data files installed in:
  999. 87.53 s [pathway-quickcheck] /nix/store/1fvrpvqa0c6cy0agzm75j1nn0203nx95-pathway-quickcheck-0.0.1.0/share/x86_64-linux-ghc-9.8.4/pathway-quickcheck-0.0.1.0
  1000. 87.53 s [pathway-quickcheck] Documentation installed in:
  1001. 87.53 s [pathway-quickcheck] /nix/store/w1gy8gzknqd9qx96nda0vapx5viccqff-pathway-quickcheck-0.0.1.0-doc/share/doc/pathway-quickcheck-0.0.1.0
  1002. 87.53 s [pathway-quickcheck] Configuration files installed in:
  1003. 87.53 s [pathway-quickcheck] /nix/store/1fvrpvqa0c6cy0agzm75j1nn0203nx95-pathway-quickcheck-0.0.1.0/etc
  1004. 87.53 s [pathway-quickcheck] No alex found
  1005. 87.53 s [pathway-quickcheck] Using ar found on system at:
  1006. 87.53 s [pathway-quickcheck] /nix/store/iz5lckcsg66r223si2gck7csk2hihj0m-binutils-wrapper-2.44/bin/ar
  1007. 87.53 s [pathway-quickcheck] No c2hs found
  1008. 87.53 s [pathway-quickcheck] No cpphs found
  1009. 87.53 s [pathway-quickcheck] Using doctest version 0.24.2 found on system at:
  1010. 87.53 s [pathway-quickcheck] /nix/store/ipqa88qiasixywmsikcnq7nhq6340lg5-doctest-0.24.2/bin/doctest
  1011. 87.53 s [pathway-quickcheck] Using gcc version 14.3.0 given by user at:
  1012. 87.53 s [pathway-quickcheck] /nix/store/8v97ngkcpfzgghwnnr7fsz33p2x22gy9-gcc-wrapper-14.3.0/bin/gcc
  1013. 87.53 s [pathway-quickcheck] Using ghc version 9.8.4 found on system at:
  1014. 87.53 s [pathway-quickcheck] /nix/store/4yvzsc21abkayqx2bzncnj5fpx57hb6z-ghc-9.8.4/bin/ghc
  1015. 87.53 s [pathway-quickcheck] Using ghc-pkg version 9.8.4 found on system at:
  1016. 87.53 s [pathway-quickcheck] /nix/store/4yvzsc21abkayqx2bzncnj5fpx57hb6z-ghc-9.8.4/bin/ghc-pkg-9.8.4
  1017. 87.53 s [pathway-quickcheck] No ghcjs found
  1018. 87.53 s [pathway-quickcheck] No ghcjs-pkg found
  1019. 87.53 s [pathway-quickcheck] No greencard found
  1020. 87.53 s [pathway-quickcheck] Using haddock version 2.30.0 found on system at:
  1021. 87.53 s [pathway-quickcheck] /nix/store/4yvzsc21abkayqx2bzncnj5fpx57hb6z-ghc-9.8.4/bin/haddock-ghc-9.8.4
  1022. 87.53 s [pathway-quickcheck] No happy found
  1023. 87.53 s [pathway-quickcheck] Using haskell-suite found on system at: haskell-suite-dummy-location
  1024. 87.53 s [pathway-quickcheck] Using haskell-suite-pkg found on system at: haskell-suite-pkg-dummy-location
  1025. 87.53 s [pathway-quickcheck] No hmake found
  1026. 87.53 s [pathway-quickcheck] Using hpc version 0.69 found on system at:
  1027. 87.53 s [pathway-quickcheck] /nix/store/4yvzsc21abkayqx2bzncnj5fpx57hb6z-ghc-9.8.4/bin/hpc-ghc-9.8.4
  1028. 87.53 s [pathway-quickcheck] Using hsc2hs version 0.68.10 found on system at:
  1029. 87.53 s [pathway-quickcheck] /nix/store/4yvzsc21abkayqx2bzncnj5fpx57hb6z-ghc-9.8.4/bin/hsc2hs-ghc-9.8.4
  1030. 87.53 s [pathway-quickcheck] Using hscolour version 1.25 found on system at:
  1031. 87.53 s [pathway-quickcheck] /nix/store/palqpb4p9k5rqxhxjdgqrak8n91p6c4z-hscolour-1.25/bin/HsColour
  1032. 87.53 s [pathway-quickcheck] No jhc found
  1033. 87.53 s [pathway-quickcheck] Using ld found on system at:
  1034. 87.53 s [pathway-quickcheck] /nix/store/iz5lckcsg66r223si2gck7csk2hihj0m-binutils-wrapper-2.44/bin/ld.gold
  1035. 87.53 s [pathway-quickcheck] No pkg-config found
  1036. 87.53 s [pathway-quickcheck] Using runghc version 9.8.4 found on system at:
  1037. 87.53 s [pathway-quickcheck] /nix/store/4yvzsc21abkayqx2bzncnj5fpx57hb6z-ghc-9.8.4/bin/runghc-9.8.4
  1038. 87.53 s [pathway-quickcheck] Using strip version 2.44 found on system at:
  1039. 87.53 s [pathway-quickcheck] /nix/store/8v97ngkcpfzgghwnnr7fsz33p2x22gy9-gcc-wrapper-14.3.0/bin/strip
  1040. 87.53 s [pathway-quickcheck] Using tar found on system at:
  1041. 87.53 s [pathway-quickcheck] /nix/store/xl6pd2spjajwcpq09fnmnjv5psqmlmma-gnutar-1.35/bin/tar
  1042. 87.53 s [pathway-quickcheck] No uhc found
  1043. 87.77 s [pathway-quickcheck] Phase: buildPhase
  1044. 87.83 s [pathway-quickcheck] Preprocessing library for pathway-quickcheck-0.0.1.0..
  1045. 87.83 s [pathway-quickcheck] Building library for pathway-quickcheck-0.0.1.0..
  1046. 87.89 s [pathway-quickcheck] [1 of 1] Compiling Test.Path.QuickCheck ( src/Test/Path/QuickCheck.hs, dist/build/Test/Path/QuickCheck.o, dist/build/Test/Path/QuickCheck.dyn_o )
  1047. 88.24 s [pathway-quickcheck] [1 of 1] Compiling Test.Path.QuickCheck ( src/Test/Path/QuickCheck.hs, dist/build/Test/Path/QuickCheck.p_o )
  1048. 89.69 s [pathway-quickcheck] Preprocessing test suite 'doctests' for pathway-quickcheck-0.0.1.0..
  1049. 89.80 s [pathway-quickcheck] Building test suite 'doctests' for pathway-quickcheck-0.0.1.0..
  1050. 89.80 s [pathway-quickcheck] [1 of 2] Compiling Build_doctests ( dist/build/doctests/autogen/Build_doctests.hs, dist/build/doctests/doctests-tmp/Build_doctests.o )
  1051. 89.92 s [pathway-quickcheck] [2 of 2] Compiling Main ( tests/doctests.hs, dist/build/doctests/doctests-tmp/Main.o )
  1052. 90.12 s [pathway-quickcheck] [3 of 3] Linking dist/build/doctests/doctests
  1053. 93.14 s [pathway-quickcheck] Phase: checkPhase
  1054. 93.18 s [pathway-quickcheck] Running 1 test suites...
  1055. 93.18 s [pathway-quickcheck] Test suite doctests: RUNNING...
  1056. 93.51 s [pathway-quickcheck]
  1057. 93.51 s [pathway-quickcheck] on the commandline: warning: [GHC-98887]
  1058. 93.51 s [pathway-quickcheck] -XTemplateHaskell is not allowed in Safe Haskell; ignoring -XTemplateHaskell
  1059. 93.68 s [pathway-quickcheck] Examples: 0 Tried: 0 Errors: 0 Failures: 0
  1060. 93.71 s [pathway-quickcheck] Test suite doctests: PASS
  1061. 93.71 s [pathway-quickcheck] Test suite logged to: dist/test/pathway-quickcheck-0.0.1.0-doctests.log
  1062. 93.71 s [pathway-quickcheck] 1 of 1 test suites (1 of 1 test cases) passed.
  1063. 93.72 s [pathway-quickcheck] Phase: haddockPhase
  1064. 93.82 s [pathway-quickcheck] Preprocessing library for pathway-quickcheck-0.0.1.0..
  1065. 93.82 s [pathway-quickcheck] Running Haddock on library for pathway-quickcheck-0.0.1.0..
  1066. 93.82 s [pathway-quickcheck] Warning: The documentation for the following packages are not installed. No
  1067. 93.82 s [pathway-quickcheck] links will be generated to these packages: vector-0.13.2.0
  1068. 93.86 s [pathway-quickcheck] Warning: --source-* options are ignored when --hyperlinked-source is enabled.
  1069. 93.98 s [pathway-quickcheck] [1 of 1] Compiling Test.Path.QuickCheck ( src/Test/Path/QuickCheck.hs, nothing )
  1070. 94.12 s [pathway-quickcheck] Haddock coverage:
  1071. 94.12 s [pathway-quickcheck] 0% ( 0 / 3) in 'Test.Path.QuickCheck'
  1072. 94.12 s [pathway-quickcheck] Missing documentation for:
  1073. 94.12 s [pathway-quickcheck] Module header
  1074. 94.13 s [pathway-quickcheck] arbitraryNonEmptyText (src/Test/Path/QuickCheck.hs:33)
  1075. 94.13 s [pathway-quickcheck] arbitraryPath (src/Test/Path/QuickCheck.hs:43)
  1076. 97.37 s [pathway-quickcheck] Documentation created: dist/doc/html/pathway-quickcheck/,
  1077. 97.37 s [pathway-quickcheck] dist/doc/html/pathway-quickcheck/pathway-quickcheck.txt
  1078. 97.44 s [pathway-quickcheck] Preprocessing test suite 'doctests' for pathway-quickcheck-0.0.1.0..
  1079. 97.44 s [pathway-quickcheck] Phase: installPhase
  1080. 97.49 s [pathway-quickcheck] Installing library in /nix/store/1fvrpvqa0c6cy0agzm75j1nn0203nx95-pathway-quickcheck-0.0.1.0/lib/ghc-9.8.4/lib/x86_64-linux-ghc-9.8.4/pathway-quickcheck-0.0.1.0-D8tq4Sgr5zz6I2F19xa0Lq
  1081. 97.64 s [pathway-quickcheck] Phase: fixupPhase
  1082. 97.65 s [pathway-quickcheck] shrinking RPATHs of ELF executables and libraries in /nix/store/1fvrpvqa0c6cy0agzm75j1nn0203nx95-pathway-quickcheck-0.0.1.0
  1083. 97.65 s [pathway-quickcheck] shrinking /nix/store/1fvrpvqa0c6cy0agzm75j1nn0203nx95-pathway-quickcheck-0.0.1.0/lib/ghc-9.8.4/lib/x86_64-linux-ghc-9.8.4/libHSpathway-quickcheck-0.0.1.0-D8tq4Sgr5zz6I2F19xa0Lq-ghc9.8.4.so
  1084. 97.67 s [pathway-quickcheck] checking for references to /build/ in /nix/store/1fvrpvqa0c6cy0agzm75j1nn0203nx95-pathway-quickcheck-0.0.1.0...
  1085. 97.69 s [pathway-quickcheck] patching script interpreter paths in /nix/store/1fvrpvqa0c6cy0agzm75j1nn0203nx95-pathway-quickcheck-0.0.1.0
  1086. 97.69 s [pathway-quickcheck] stripping (with command strip and flags -S -p) in /nix/store/1fvrpvqa0c6cy0agzm75j1nn0203nx95-pathway-quickcheck-0.0.1.0/lib
  1087. 97.71 s [pathway-quickcheck] shrinking RPATHs of ELF executables and libraries in /nix/store/w1gy8gzknqd9qx96nda0vapx5viccqff-pathway-quickcheck-0.0.1.0-doc
  1088. 97.72 s [pathway-quickcheck] checking for references to /build/ in /nix/store/w1gy8gzknqd9qx96nda0vapx5viccqff-pathway-quickcheck-0.0.1.0-doc...
  1089. 97.73 s [pathway-quickcheck] patching script interpreter paths in /nix/store/w1gy8gzknqd9qx96nda0vapx5viccqff-pathway-quickcheck-0.0.1.0-doc
  1090. 97.81 s [pathway-quickcheck:post-build] Uploading to cachix cache "sellout": /nix/store/1fvrpvqa0c6cy0agzm75j1nn0203nx95-pathway-quickcheck-0.0.1.0 /nix/store/w1gy8gzknqd9qx96nda0vapx5viccqff-pathway-quickcheck-0.0.1.0-doc
  1091. 98.31 s [pathway-quickcheck:post-build] Pushing 2 paths (186 are already present) using zstd to cache sellout ⏳
  1092. 98.31 s [pathway-quickcheck:post-build]
  1093. 98.67 s [pathway-quickcheck:post-build] Pushing /nix/store/1fvrpvqa0c6cy0agzm75j1nn0203nx95-pathway-quickcheck-0.0.1.0 (180.16 KiB)
  1094. 98.78 s [pathway-quickcheck:post-build] Pushing /nix/store/w1gy8gzknqd9qx96nda0vapx5viccqff-pathway-quickcheck-0.0.1.0-doc (217.63 KiB)
  1095. 100.20 s [pathway-quickcheck:post-build]
  1096. 100.20 s [pathway-quickcheck:post-build] All done.
  1097. 100.22 s [pathway-quickcheck:post-build] Uploading to the NixCI cache: /nix/store/1fvrpvqa0c6cy0agzm75j1nn0203nx95-pathway-quickcheck-0.0.1.0 /nix/store/w1gy8gzknqd9qx96nda0vapx5viccqff-pathway-quickcheck-0.0.1.0-doc
  1098. 100.26 s [pathway-quickcheck:post-build] warning: 'warn-short-path-literals' is deprecated, use 'lint-short-path-literals = ignore' instead
  1099. 100.27 s [pathway-quickcheck:post-build] copying 2 paths...
  1100. 100.27 s [pathway-quickcheck:post-build] copying path '/nix/store/w1gy8gzknqd9qx96nda0vapx5viccqff-pathway-quickcheck-0.0.1.0-doc' to 'https://cache.nix-ci.com'...
  1101. 100.69 s [pathway-quickcheck:post-build] copying path '/nix/store/1fvrpvqa0c6cy0agzm75j1nn0203nx95-pathway-quickcheck-0.0.1.0' to 'https://cache.nix-ci.com'...
  1102. 101.02 s [pathway-quickcheck:post-build] warning: 'warn-short-path-literals' is deprecated, use 'lint-short-path-literals = ignore' instead
  1103. 101.30 s [pathway-quickcheck:post-build] copying 2 paths...
  1104. 101.30 s [pathway-quickcheck:post-build] copying path '/nix/store/fza8zhb6v628rkm9kxfddlzgkjanc6k1-yaya-quickcheck-0.2.0.3.drv' to 'https://cache.nix-ci.com'...
  1105. 101.56 s [pathway-quickcheck:post-build] copying path '/nix/store/2iz5h9kg0pvql75haymb7mqcb8gc20a8-pathway-quickcheck-0.0.1.0.drv' to 'https://cache.nix-ci.com'...
  1106. 101.85 s Uploaded pathway-quickcheck in 4.0s
  1107. 101.85 s Progress: 2 of 22 built, 170 of 170 downloaded from cache
  1108. 101.85 s Built pathway-quickcheck in 16.3s
  1109. 101.89 s Building /nix/store/fp6wbpzhzl9a14wxkic4d989f00gh4wv-pathway-0.0.1.0.drv
  1110. 102.09 s [pathway] Phase: setupCompilerEnvironmentPhase
  1111. 102.10 s [pathway] Build with /nix/store/4yvzsc21abkayqx2bzncnj5fpx57hb6z-ghc-9.8.4.
  1112. 102.32 s [pathway] Phase: unpackPhase
  1113. 102.32 s [pathway] unpacking source archive /nix/store/723m6sjvk66iiqzpvcfdd74xi6id5zqq-zjizyqf4pafgh9rycgxd507dhvpisdy1-source/./pathway
  1114. 102.33 s [pathway] source root is pathway
  1115. 102.33 s [pathway] Phase: patchPhase
  1116. 102.34 s [pathway] Phase: compileBuildDriverPhase
  1117. 102.34 s [pathway] setupCompileFlags: -package-db=/build/tmp.WlDVWBhI4l/setup-package.conf.d -threaded
  1118. 102.38 s [pathway] [1 of 2] Compiling Main ( Setup.hs, /build/tmp.WlDVWBhI4l/Main.o )
  1119. 102.42 s [pathway] [2 of 2] Linking Setup
  1120. 103.45 s [pathway] Phase: updateAutotoolsGnuConfigScriptsPhase
  1121. 103.53 s [pathway] Phase: configurePhase
  1122. 103.53 s [pathway] configureFlags: --verbose --prefix=/nix/store/p0hxlm27mvqbppssqqmc9z4pis7mf3kg-pathway-0.0.1.0 --libdir=$prefix/lib/$compiler/lib --libsubdir=$abi/$libname --docdir=/nix/store/r6im1p1yv5ia2m3h1c2rl3krdhyazqfg-pathway-0.0.1.0-doc/share/doc/pathway-0.0.1.0 --with-gcc=gcc --package-db=/build/tmp.WlDVWBhI4l/package.conf.d --ghc-option=-j16 --ghc-option=+RTS --ghc-option=-A64M --ghc-option=-RTS --enable-library-profiling --profiling-detail=exported-functions --disable-profiling --enable-shared --disable-coverage --enable-static --disable-executable-dynamic --enable-tests --disable-benchmarks --enable-library-vanilla --disable-library-for-ghci --enable-split-sections --enable-library-stripping --enable-executable-stripping --ghc-option=-haddock --ghc-options=-Werror --extra-lib-dirs=/nix/store/ffyzkisqs4vc4mg28bwwlyqjf8i9ph6b-ncurses-6.5/lib --extra-lib-dirs=/nix/store/n28qgdj8c1q41kf7n4y1jxa6ckp85m3c-libffi-3.5.2/lib --extra-lib-dirs=/nix/store/1b6h99dw7bk4wbn77kbalih42zbc67m1-elfutils-0.194/lib --extra-lib-dirs=/nix/store/hi0ar880110k6jsmmili7dh1gq3cg2a9-gmp-with-cxx-6.3.0/lib --extra-lib-dirs=/nix/store/g09cflpnp4g80q56sj9dng1qzv4v4ybc-numactl-2.0.18/lib --extra-lib-dirs=/nix/store/4yvzsc21abkayqx2bzncnj5fpx57hb6z-ghc-9.8.4/lib
  1123. 103.53 s [pathway] Using Parsec parser
  1124. 103.53 s [pathway] Configuring pathway-0.0.1.0...
  1125. 103.75 s [pathway] Flags chosen: noisy-deprecations=True, verify-no-recursion=False
  1126. 103.75 s [pathway] Dependency base >=4.14.0 && <4.15 || >=4.15.0 && <4.16 || >=4.16.0 && <4.17 ||
  1127. 103.75 s [pathway] >=4.17.0 && <4.18 || >=4.18.0 && <4.19 || >=4.19.0 && <4.20 || >=4.20.0 &&
  1128. 103.75 s [pathway] <4.21 || >=4.21.0 && <4.22 || >=4.22.0 && <4.23: using base-4.19.2.0
  1129. 103.75 s [pathway] Dependency containers >=0.6.2 && <0.9: using containers-0.6.8
  1130. 103.75 s [pathway] Dependency extra >=1.5 && <1.6 || >=1.7.7 && <1.8 || >=1.8.1 && <1.9: using
  1131. 103.75 s [pathway] extra-1.8.1
  1132. 103.75 s [pathway] Dependency megaparsec >=9.0.1 && <9.1 || >=9.2.1 && <9.3 || >=9.5.0 && <9.6 ||
  1133. 103.75 s [pathway] >=9.7.0 && <9.8: using megaparsec-9.7.0
  1134. 103.75 s [pathway] Dependency pathway-internal >=0.0.1 && <0.1: using pathway-internal-0.0.1.0
  1135. 103.75 s [pathway] Dependency template-haskell >=2.16.0 && <2.17 || >=2.17.0 && <2.18 || >=2.18.0
  1136. 103.75 s [pathway] && <2.19 || >=2.19.0 && <2.20 || >=2.20.0 && <2.21 || >=2.21.0 && <2.22 ||
  1137. 103.75 s [pathway] >=2.22.0 && <2.23 || >=2.23.0 && <2.24 || >=2.24.0 && <2.25: using
  1138. 103.75 s [pathway] template-haskell-2.21.0.0
  1139. 103.75 s [pathway] Dependency text >=1.2.3 && <1.3 || >=2.0.2 && <2.2: using text-2.1.1
  1140. 103.75 s [pathway] Dependency yaya >=0.6.2 && <0.7 || >=0.7.0 && <0.8: using yaya-0.6.2.3
  1141. 103.75 s [pathway] Dependency yaya-containers >=0.1.2 && <0.2 || >=0.2.0 && <0.3: using
  1142. 103.75 s [pathway] yaya-containers-0.1.2.2
  1143. 103.75 s [pathway] Dependency yaya-unsafe >=0.4.1 && <0.5 || >=0.5.0 && <0.6: using
  1144. 103.75 s [pathway] yaya-unsafe-0.4.1.4
  1145. 103.75 s [pathway] Dependency QuickCheck >=2.14.2 && <2.15 || >=2.15.0 && <2.16 || >=2.16.0 &&
  1146. 103.75 s [pathway] <2.17 || >=2.17.1 && <2.18: using QuickCheck-2.15.0.1
  1147. 103.75 s [pathway] Dependency base >=4.14.0 && <4.15 || >=4.15.0 && <4.16 || >=4.16.0 && <4.17 ||
  1148. 103.75 s [pathway] >=4.17.0 && <4.18 || >=4.18.0 && <4.19 || >=4.19.0 && <4.20 || >=4.20.0 &&
  1149. 103.75 s [pathway] <4.21 || >=4.21.0 && <4.22 || >=4.22.0 && <4.23: using base-4.19.2.0
  1150. 103.75 s [pathway] Dependency doctest >=0.16.3 && <0.17 || >=0.18.1 && <0.19 || >=0.20.1 && <0.21
  1151. 103.75 s [pathway] || >=0.21.1 && <0.22 || >=0.22.2 && <0.23 || >=0.24.2 && <0.25: using
  1152. 103.75 s [pathway] doctest-0.24.2
  1153. 103.75 s [pathway] Dependency pathway: using pathway-0.0.1.0
  1154. 103.75 s [pathway] Dependency pathway-quickcheck >=0.0.1 && <0.1: using
  1155. 103.75 s [pathway] pathway-quickcheck-0.0.1.0
  1156. 103.96 s [pathway] Source component graph:
  1157. 103.96 s [pathway] component lib
  1158. 103.96 s [pathway] component test:doctests dependency lib
  1159. 103.96 s [pathway] Configured component graph:
  1160. 103.96 s [pathway] component pathway-0.0.1.0-IloKB8qrk9OLBhIjlawLWM
  1161. 103.96 s [pathway] include base-4.19.2.0-8274
  1162. 103.96 s [pathway] include containers-0.6.8-15d9
  1163. 103.96 s [pathway] include extra-1.8.1-EssMUQCsBco9gsyBCwwe73
  1164. 103.96 s [pathway] include megaparsec-9.7.0-HGZe2UnGqRgF6D6IR9jAPL
  1165. 103.96 s [pathway] include pathway-internal-0.0.1.0-BTurcxZAYjHHOlL1rvpIiQ
  1166. 103.96 s [pathway] include template-haskell-2.21.0.0-cbc4
  1167. 103.96 s [pathway] include text-2.1.1-5314
  1168. 103.96 s [pathway] include yaya-0.6.2.3-5bWn9HCxYKk8n7VJT6hTIW
  1169. 103.96 s [pathway] include yaya-containers-0.1.2.2-LBNp7rymHT9VXLpoYya8L
  1170. 103.96 s [pathway] include yaya-unsafe-0.4.1.4-7ZhQ68MgouGLZkEM9p6ZPq
  1171. 103.96 s [pathway] component pathway-0.0.1.0-GgtCepDTUWb4W2CqgTgA7r-doctests
  1172. 103.96 s [pathway] include QuickCheck-2.15.0.1-5u5mV1pqdXQ9rGVQgPoEeu
  1173. 103.96 s [pathway] include base-4.19.2.0-8274
  1174. 103.96 s [pathway] include doctest-0.24.2-HOk70bisutnFZuBXgSC0HK
  1175. 103.96 s [pathway] include pathway-0.0.1.0-IloKB8qrk9OLBhIjlawLWM
  1176. 103.96 s [pathway] include pathway-quickcheck-0.0.1.0-D8tq4Sgr5zz6I2F19xa0Lq
  1177. 103.96 s [pathway] Linked component graph:
  1178. 103.96 s [pathway] unit pathway-0.0.1.0-IloKB8qrk9OLBhIjlawLWM
  1179. 103.96 s [pathway] include base-4.19.2.0-8274
  1180. 103.96 s [pathway] include containers-0.6.8-15d9
  1181. 103.96 s [pathway] include extra-1.8.1-EssMUQCsBco9gsyBCwwe73
  1182. 103.96 s [pathway] include megaparsec-9.7.0-HGZe2UnGqRgF6D6IR9jAPL
  1183. 103.96 s [pathway] include pathway-internal-0.0.1.0-BTurcxZAYjHHOlL1rvpIiQ
  1184. 103.96 s [pathway] include template-haskell-2.21.0.0-cbc4
  1185. 103.96 s [pathway] include text-2.1.1-5314
  1186. 103.96 s [pathway] include yaya-0.6.2.3-5bWn9HCxYKk8n7VJT6hTIW
  1187. 103.96 s [pathway] include yaya-containers-0.1.2.2-LBNp7rymHT9VXLpoYya8L
  1188. 103.96 s [pathway] include yaya-unsafe-0.4.1.4-7ZhQ68MgouGLZkEM9p6ZPq
  1189. 103.96 s [pathway] Data.Path=pathway-0.0.1.0-IloKB8qrk9OLBhIjlawLWM:Data.Path,Data.Path.Directory=pathway-0.0.1.0-IloKB8qrk9OLBhIjlawLWM:Data.Path.Directory,Data.Path.File=pathway-0.0.1.0-IloKB8qrk9OLBhIjlawLWM:Data.Path.File,Data.Path.Format=pathway-0.0.1.0-IloKB8qrk9OLBhIjlawLWM:Data.Path.Format,Data.Path.Parser=pathway-0.0.1.0-IloKB8qrk9OLBhIjlawLWM:Data.Path.Parser,Data.Path.Relativity=pathway-0.0.1.0-IloKB8qrk9OLBhIjlawLWM:Data.Path.Relativity,Data.Path.TH=pathway-0.0.1.0-IloKB8qrk9OLBhIjlawLWM:Data.Path.TH,Data.Path.Type=pathway-0.0.1.0-IloKB8qrk9OLBhIjlawLWM:Data.Path.Type
  1190. 103.96 s [pathway] unit pathway-0.0.1.0-GgtCepDTUWb4W2CqgTgA7r-doctests
  1191. 103.96 s [pathway] include QuickCheck-2.15.0.1-5u5mV1pqdXQ9rGVQgPoEeu
  1192. 103.96 s [pathway] include base-4.19.2.0-8274
  1193. 103.96 s [pathway] include doctest-0.24.2-HOk70bisutnFZuBXgSC0HK
  1194. 103.96 s [pathway] include pathway-0.0.1.0-IloKB8qrk9OLBhIjlawLWM
  1195. 103.96 s [pathway] include pathway-quickcheck-0.0.1.0-D8tq4Sgr5zz6I2F19xa0Lq
  1196. 103.96 s [pathway] Ready component graph:
  1197. 103.96 s [pathway] definite pathway-0.0.1.0-IloKB8qrk9OLBhIjlawLWM
  1198. 103.96 s [pathway] depends base-4.19.2.0-8274
  1199. 103.96 s [pathway] depends containers-0.6.8-15d9
  1200. 103.96 s [pathway] depends extra-1.8.1-EssMUQCsBco9gsyBCwwe73
  1201. 103.96 s [pathway] depends megaparsec-9.7.0-HGZe2UnGqRgF6D6IR9jAPL
  1202. 103.96 s [pathway] depends pathway-internal-0.0.1.0-BTurcxZAYjHHOlL1rvpIiQ
  1203. 103.96 s [pathway] depends template-haskell-2.21.0.0-cbc4
  1204. 103.96 s [pathway] depends text-2.1.1-5314
  1205. 103.96 s [pathway] depends yaya-0.6.2.3-5bWn9HCxYKk8n7VJT6hTIW
  1206. 103.96 s [pathway] depends yaya-containers-0.1.2.2-LBNp7rymHT9VXLpoYya8L
  1207. 103.96 s [pathway] depends yaya-unsafe-0.4.1.4-7ZhQ68MgouGLZkEM9p6ZPq
  1208. 103.96 s [pathway] definite pathway-0.0.1.0-GgtCepDTUWb4W2CqgTgA7r-doctests
  1209. 103.96 s [pathway] depends QuickCheck-2.15.0.1-5u5mV1pqdXQ9rGVQgPoEeu
  1210. 103.96 s [pathway] depends base-4.19.2.0-8274
  1211. 103.96 s [pathway] depends doctest-0.24.2-HOk70bisutnFZuBXgSC0HK
  1212. 103.96 s [pathway] depends pathway-0.0.1.0-IloKB8qrk9OLBhIjlawLWM
  1213. 103.96 s [pathway] depends pathway-quickcheck-0.0.1.0-D8tq4Sgr5zz6I2F19xa0Lq
  1214. 103.96 s [pathway] Using Cabal-3.10.3.0 compiled by ghc-9.8
  1215. 103.96 s [pathway] Using compiler: ghc-9.8.4
  1216. 103.96 s [pathway] Using install prefix:
  1217. 103.96 s [pathway] /nix/store/p0hxlm27mvqbppssqqmc9z4pis7mf3kg-pathway-0.0.1.0
  1218. 103.96 s [pathway] Executables installed in:
  1219. 103.96 s [pathway] /nix/store/p0hxlm27mvqbppssqqmc9z4pis7mf3kg-pathway-0.0.1.0/bin
  1220. 103.96 s [pathway] Libraries installed in:
  1221. 103.96 s [pathway] /nix/store/p0hxlm27mvqbppssqqmc9z4pis7mf3kg-pathway-0.0.1.0/lib/ghc-9.8.4/lib/x86_64-linux-ghc-9.8.4/pathway-0.0.1.0-IloKB8qrk9OLBhIjlawLWM
  1222. 103.96 s [pathway] Dynamic Libraries installed in:
  1223. 103.96 s [pathway] /nix/store/p0hxlm27mvqbppssqqmc9z4pis7mf3kg-pathway-0.0.1.0/lib/ghc-9.8.4/lib/x86_64-linux-ghc-9.8.4
  1224. 103.96 s [pathway] Private executables installed in:
  1225. 103.96 s [pathway] /nix/store/p0hxlm27mvqbppssqqmc9z4pis7mf3kg-pathway-0.0.1.0/libexec/x86_64-linux-ghc-9.8.4/pathway-0.0.1.0
  1226. 103.96 s [pathway] Data files installed in:
  1227. 103.96 s [pathway] /nix/store/p0hxlm27mvqbppssqqmc9z4pis7mf3kg-pathway-0.0.1.0/share/x86_64-linux-ghc-9.8.4/pathway-0.0.1.0
  1228. 103.96 s [pathway] Documentation installed in:
  1229. 103.96 s [pathway] /nix/store/r6im1p1yv5ia2m3h1c2rl3krdhyazqfg-pathway-0.0.1.0-doc/share/doc/pathway-0.0.1.0
  1230. 103.96 s [pathway] Configuration files installed in:
  1231. 103.96 s [pathway] /nix/store/p0hxlm27mvqbppssqqmc9z4pis7mf3kg-pathway-0.0.1.0/etc
  1232. 103.96 s [pathway] No alex found
  1233. 103.96 s [pathway] Using ar found on system at:
  1234. 103.96 s [pathway] /nix/store/iz5lckcsg66r223si2gck7csk2hihj0m-binutils-wrapper-2.44/bin/ar
  1235. 103.96 s [pathway] No c2hs found
  1236. 103.96 s [pathway] No cpphs found
  1237. 103.96 s [pathway] Using doctest version 0.24.2 found on system at:
  1238. 103.96 s [pathway] /nix/store/ipqa88qiasixywmsikcnq7nhq6340lg5-doctest-0.24.2/bin/doctest
  1239. 103.96 s [pathway] Using gcc version 14.3.0 given by user at:
  1240. 103.96 s [pathway] /nix/store/8v97ngkcpfzgghwnnr7fsz33p2x22gy9-gcc-wrapper-14.3.0/bin/gcc
  1241. 103.96 s [pathway] Using ghc version 9.8.4 found on system at:
  1242. 103.96 s [pathway] /nix/store/4yvzsc21abkayqx2bzncnj5fpx57hb6z-ghc-9.8.4/bin/ghc
  1243. 103.96 s [pathway] Using ghc-pkg version 9.8.4 found on system at:
  1244. 103.96 s [pathway] /nix/store/4yvzsc21abkayqx2bzncnj5fpx57hb6z-ghc-9.8.4/bin/ghc-pkg-9.8.4
  1245. 103.96 s [pathway] No ghcjs found
  1246. 103.96 s [pathway] No ghcjs-pkg found
  1247. 103.96 s [pathway] No greencard found
  1248. 103.96 s [pathway] Using haddock version 2.30.0 found on system at:
  1249. 103.96 s [pathway] /nix/store/4yvzsc21abkayqx2bzncnj5fpx57hb6z-ghc-9.8.4/bin/haddock-ghc-9.8.4
  1250. 103.96 s [pathway] No happy found
  1251. 103.96 s [pathway] Using haskell-suite found on system at: haskell-suite-dummy-location
  1252. 103.96 s [pathway] Using haskell-suite-pkg found on system at: haskell-suite-pkg-dummy-location
  1253. 103.96 s [pathway] No hmake found
  1254. 103.96 s [pathway] Using hpc version 0.69 found on system at:
  1255. 103.96 s [pathway] /nix/store/4yvzsc21abkayqx2bzncnj5fpx57hb6z-ghc-9.8.4/bin/hpc-ghc-9.8.4
  1256. 103.96 s [pathway] Using hsc2hs version 0.68.10 found on system at:
  1257. 103.96 s [pathway] /nix/store/4yvzsc21abkayqx2bzncnj5fpx57hb6z-ghc-9.8.4/bin/hsc2hs-ghc-9.8.4
  1258. 103.96 s [pathway] Using hscolour version 1.25 found on system at:
  1259. 103.96 s [pathway] /nix/store/palqpb4p9k5rqxhxjdgqrak8n91p6c4z-hscolour-1.25/bin/HsColour
  1260. 103.96 s [pathway] No jhc found
  1261. 103.96 s [pathway] Using ld found on system at:
  1262. 103.96 s [pathway] /nix/store/iz5lckcsg66r223si2gck7csk2hihj0m-binutils-wrapper-2.44/bin/ld.gold
  1263. 103.96 s [pathway] No pkg-config found
  1264. 103.96 s [pathway] Using runghc version 9.8.4 found on system at:
  1265. 103.96 s [pathway] /nix/store/4yvzsc21abkayqx2bzncnj5fpx57hb6z-ghc-9.8.4/bin/runghc-9.8.4
  1266. 103.97 s [pathway] Using strip version 2.44 found on system at:
  1267. 103.97 s [pathway] /nix/store/8v97ngkcpfzgghwnnr7fsz33p2x22gy9-gcc-wrapper-14.3.0/bin/strip
  1268. 103.97 s [pathway] Using tar found on system at:
  1269. 103.97 s [pathway] /nix/store/xl6pd2spjajwcpq09fnmnjv5psqmlmma-gnutar-1.35/bin/tar
  1270. 103.97 s [pathway] No uhc found
  1271. 104.23 s [pathway] Phase: buildPhase
  1272. 104.28 s [pathway] Preprocessing library for pathway-0.0.1.0..
  1273. 104.28 s [pathway] Building library for pathway-0.0.1.0..
  1274. 104.38 s [pathway] [1 of 8] Compiling Data.Path.Format ( src/Data/Path/Format.hs, dist/build/Data/Path/Format.o, dist/build/Data/Path/Format.dyn_o )
  1275. 104.47 s [pathway] [2 of 8] Compiling Data.Path.Relativity ( src/Data/Path/Relativity.hs, dist/build/Data/Path/Relativity.o, dist/build/Data/Path/Relativity.dyn_o )
  1276. 104.47 s [pathway] [3 of 8] Compiling Data.Path.Type ( src/Data/Path/Type.hs, dist/build/Data/Path/Type.o, dist/build/Data/Path/Type.dyn_o )
  1277. 104.47 s [pathway] [4 of 8] Compiling Data.Path.File ( src/Data/Path/File.hs, dist/build/Data/Path/File.o, dist/build/Data/Path/File.dyn_o )
  1278. 104.47 s [pathway] [5 of 8] Compiling Data.Path.Directory ( src/Data/Path/Directory.hs, dist/build/Data/Path/Directory.o, dist/build/Data/Path/Directory.dyn_o )
  1279. 104.53 s [pathway] [6 of 8] Compiling Data.Path ( src/Data/Path.hs, dist/build/Data/Path.o, dist/build/Data/Path.dyn_o )
  1280. 105.55 s [pathway] [7 of 8] Compiling Data.Path.Parser ( src/Data/Path/Parser.hs, dist/build/Data/Path/Parser.o, dist/build/Data/Path/Parser.dyn_o )
  1281. 105.68 s [pathway] [8 of 8] Compiling Data.Path.TH ( src/Data/Path/TH.hs, dist/build/Data/Path/TH.o, dist/build/Data/Path/TH.dyn_o )
  1282. 105.94 s [pathway] [1 of 8] Compiling Data.Path.Format ( src/Data/Path/Format.hs, dist/build/Data/Path/Format.p_o )
  1283. 106.10 s [pathway] [2 of 8] Compiling Data.Path.Relativity ( src/Data/Path/Relativity.hs, dist/build/Data/Path/Relativity.p_o )
  1284. 106.10 s [pathway] [3 of 8] Compiling Data.Path.Type ( src/Data/Path/Type.hs, dist/build/Data/Path/Type.p_o )
  1285. 106.10 s [pathway] [4 of 8] Compiling Data.Path.File ( src/Data/Path/File.hs, dist/build/Data/Path/File.p_o )
  1286. 106.20 s [pathway] [5 of 8] Compiling Data.Path.Directory ( src/Data/Path/Directory.hs, dist/build/Data/Path/Directory.p_o )
  1287. 106.27 s [pathway] [6 of 8] Compiling Data.Path ( src/Data/Path.hs, dist/build/Data/Path.p_o )
  1288. 107.25 s [pathway] [7 of 8] Compiling Data.Path.Parser ( src/Data/Path/Parser.hs, dist/build/Data/Path/Parser.p_o )
  1289. 107.46 s [pathway] [8 of 8] Compiling Data.Path.TH ( src/Data/Path/TH.hs, dist/build/Data/Path/TH.p_o )
  1290. 108.88 s [pathway] Preprocessing test suite 'doctests' for pathway-0.0.1.0..
  1291. 109.01 s [pathway] Building test suite 'doctests' for pathway-0.0.1.0..
  1292. 109.01 s [pathway] [1 of 2] Compiling Build_doctests ( dist/build/doctests/autogen/Build_doctests.hs, dist/build/doctests/doctests-tmp/Build_doctests.o )
  1293. 109.11 s [pathway] [2 of 2] Compiling Main ( tests/doctests.hs, dist/build/doctests/doctests-tmp/Main.o )
  1294. 109.32 s [pathway] [3 of 3] Linking dist/build/doctests/doctests
  1295. 112.35 s [pathway] Phase: checkPhase
  1296. 112.39 s [pathway] Running 1 test suites...
  1297. 112.39 s [pathway] Test suite doctests: RUNNING...
  1298. 112.68 s [pathway]
  1299. 112.68 s [pathway] on the commandline: warning: [GHC-98887]
  1300. 112.68 s [pathway] -XTemplateHaskell is not allowed in Safe Haskell; ignoring -XTemplateHaskell
  1301. 112.68 s [pathway]
  1302. 112.68 s [pathway] on the commandline: warning: [GHC-98887]
  1303. 112.68 s [pathway] -XTemplateHaskell is not allowed in Safe Haskell; ignoring -XTemplateHaskell
  1304. 112.70 s [pathway]
  1305. 112.70 s [pathway] on the commandline: warning: [GHC-98887]
  1306. 112.70 s [pathway] -XTemplateHaskell is not allowed in Safe Haskell; ignoring -XTemplateHaskell
  1307. 112.70 s [pathway]
  1308. 112.70 s [pathway] on the commandline: warning: [GHC-98887]
  1309. 112.70 s [pathway] -XTemplateHaskell is not allowed in Safe Haskell; ignoring -XTemplateHaskell
  1310. 112.70 s [pathway]
  1311. 112.70 s [pathway] on the commandline: warning: [GHC-98887]
  1312. 112.70 s [pathway] -XTemplateHaskell is not allowed in Safe Haskell; ignoring -XTemplateHaskell
  1313. 112.70 s [pathway]
  1314. 112.70 s [pathway] on the commandline: warning: [GHC-98887]
  1315. 112.70 s [pathway] -XTemplateHaskell is not allowed in Safe Haskell; ignoring -XTemplateHaskell
  1316. 112.70 s [pathway]
  1317. 112.70 s [pathway] on the commandline: warning: [GHC-98887]
  1318. 112.70 s [pathway] -XTemplateHaskell is not allowed in Safe Haskell; ignoring -XTemplateHaskell
  1319. 112.70 s [pathway]
  1320. 112.70 s [pathway] on the commandline: warning: [GHC-98887]
  1321. 112.70 s [pathway] -XTemplateHaskell is not allowed in Safe Haskell; ignoring -XTemplateHaskell
  1322. 112.70 s [pathway]
  1323. 112.70 s [pathway] on the commandline: warning: [GHC-98887]
  1324. 112.70 s [pathway] -XTemplateHaskell is not allowed in Safe Haskell; ignoring -XTemplateHaskell
  1325. 112.72 s [pathway]
  1326. 112.72 s [pathway] on the commandline: warning: [GHC-98887]
  1327. 112.72 s [pathway] -XTemplateHaskell is not allowed in Safe Haskell; ignoring -XTemplateHaskell
  1328. 112.72 s [pathway]
  1329. 112.72 s [pathway] on the commandline: warning: [GHC-98887]
  1330. 112.72 s [pathway] -XTemplateHaskell is not allowed in Safe Haskell; ignoring -XTemplateHaskell
  1331. 114.07 s [pathway] Examples: 53 Tried: 53 Errors: 0 Failures: 0
  1332. 114.13 s [pathway] Test suite doctests: PASS
  1333. 114.13 s [pathway] Test suite logged to: dist/test/pathway-0.0.1.0-doctests.log
  1334. 114.19 s [pathway] 1 of 1 test suites (1 of 1 test cases) passed.
  1335. 114.19 s [pathway] Phase: haddockPhase
  1336. 114.24 s [pathway] Preprocessing library for pathway-0.0.1.0..
  1337. 114.24 s [pathway] Running Haddock on library for pathway-0.0.1.0..
  1338. 114.24 s [pathway] Warning: The documentation for the following packages are not installed. No
  1339. 114.24 s [pathway] links will be generated to these packages: vector-0.13.2.0
  1340. 114.29 s [pathway] Warning: --source-* options are ignored when --hyperlinked-source is enabled.
  1341. 114.46 s [pathway] [1 of 8] Compiling Data.Path.Format ( src/Data/Path/Format.hs, nothing )
  1342. 114.54 s [pathway] [2 of 8] Compiling Data.Path.Relativity ( src/Data/Path/Relativity.hs, nothing )
  1343. 114.55 s [pathway] [3 of 8] Compiling Data.Path.Type ( src/Data/Path/Type.hs, nothing )
  1344. 114.55 s [pathway] [4 of 8] Compiling Data.Path.File ( src/Data/Path/File.hs, nothing )
  1345. 114.59 s [pathway] [5 of 8] Compiling Data.Path.Directory ( src/Data/Path/Directory.hs, nothing )
  1346. 114.61 s [pathway] [6 of 8] Compiling Data.Path ( src/Data/Path.hs, nothing )
  1347. 114.94 s [pathway] [7 of 8] Compiling Data.Path.Parser ( src/Data/Path/Parser.hs, nothing )
  1348. 115.09 s [pathway] [8 of 8] Compiling Data.Path.TH ( src/Data/Path/TH.hs, nothing )
  1349. 115.11 s [pathway] Haddock coverage:
  1350. 115.11 s [pathway] 20% ( 1 / 5) in 'Data.Path.Format'
  1351. 115.11 s [pathway] Missing documentation for:
  1352. 115.11 s [pathway] Module header
  1353. 115.11 s [pathway] Format (src/Data/Path/Format.hs:25)
  1354. 115.12 s [pathway] posix (src/Data/Path/Format.hs:38)
  1355. 115.12 s [pathway] windows (src/Data/Path/Format.hs:48)
  1356. 115.12 s [pathway] 50% ( 1 / 2) in 'Data.Path.Relativity'
  1357. 115.12 s [pathway] Missing documentation for:
  1358. 115.12 s [pathway] Module header
  1359. 115.12 s [pathway] 50% ( 1 / 2) in 'Data.Path.Type'
  1360. 115.12 s [pathway] Missing documentation for:
  1361. 115.12 s [pathway] Module header
  1362. 115.12 s [pathway] 0% ( 0 / 3) in 'Data.Path.File'
  1363. 115.12 s [pathway] Missing documentation for:
  1364. 115.12 s [pathway] Module header
  1365. 115.12 s [pathway] basename (src/Data/Path/File.hs:21)
  1366. 115.12 s [pathway] directory (src/Data/Path/File.hs:24)
  1367. 115.12 s [pathway] Warning: '<$>' is out of scope.
  1368. 115.12 s [pathway] If you qualify the identifier, haddock can try to link it anyway.
  1369. 115.12 s [pathway] 36% ( 4 / 11) in 'Data.Path.Directory'
  1370. 115.12 s [pathway] Missing documentation for:
  1371. 115.12 s [pathway] Module header
  1372. 115.12 s [pathway] isCurrent (src/Data/Path/Directory.hs:94)
  1373. 115.12 s [pathway] root (src/Data/Path/Directory.hs:105)
  1374. 115.12 s [pathway] isRoot (src/Data/Path/Directory.hs:108)
  1375. 115.12 s [pathway] descendThrough (src/Data/Path/Directory.hs:97)
  1376. 115.12 s [pathway] descendTo (src/Data/Path/Directory.hs:101)
  1377. 115.12 s [pathway] selectFile (src/Data/Path/Directory.hs:111)
  1378. 115.12 s [pathway] Warning: 'None' is out of scope.
  1379. 115.12 s [pathway] If you qualify the identifier, haddock can try to link it anyway.
  1380. 115.12 s [pathway] Warning: '../' is out of scope.
  1381. 115.12 s [pathway] If you qualify the identifier, haddock can try to link it anyway.
  1382. 115.12 s [pathway] Warning: 'Path' is ambiguous. It is defined
  1383. 115.12 s [pathway] * in ‘Data.Path.Internal’
  1384. 115.12 s [pathway] * in ‘Data.Path.Internal’
  1385. 115.12 s [pathway] You may be able to disambiguate the identifier by qualifying it or
  1386. 115.12 s [pathway] by specifying the type/value namespace explicitly.
  1387. 115.12 s [pathway] Defaulting to the one defined in ‘Data.Path.Internal’
  1388. 115.12 s [pathway] 55% ( 16 / 29) in 'Data.Path'
  1389. 115.12 s [pathway] Missing documentation for:
  1390. 115.12 s [pathway] Anchored (src/Data/Path.hs:638)
  1391. 115.12 s [pathway] Filename
  1392. 115.12 s [pathway] Pathy (src/Data/Path.hs:203)
  1393. 115.12 s [pathway] RelOps (src/Data/Path.hs:227)
  1394. 115.12 s [pathway] Relative (src/Data/Path.hs:174)
  1395. 115.12 s [pathway] Substible (src/Data/Path.hs:586)
  1396. 115.12 s [pathway] Typey (src/Data/Path.hs:190)
  1397. 115.12 s [pathway] escapeComponent (src/Data/Path.hs:601)
  1398. 115.12 s [pathway] forgetRelativity (src/Data/Path.hs:711)
  1399. 115.12 s [pathway] forgetType (src/Data/Path.hs:714)
  1400. 115.12 s [pathway] reparent (src/Data/Path.hs:360)
  1401. 115.12 s [pathway] replace
  1402. 115.12 s [pathway] strengthen (src/Data/Path.hs:634)
  1403. 115.12 s [pathway] Warning: 'Path' is ambiguous. It is defined
  1404. 115.12 s [pathway] * in ‘Data.Path.Internal’
  1405. 115.12 s [pathway] * in ‘Data.Path.Internal’
  1406. 115.12 s [pathway] You may be able to disambiguate the identifier by qualifying it or
  1407. 115.12 s [pathway] by specifying the type/value namespace explicitly.
  1408. 115.12 s [pathway] Defaulting to the one defined in ‘Data.Path.Internal’
  1409. 115.12 s [pathway] Warning: 'parse' is out of scope.
  1410. 115.12 s [pathway] If you qualify the identifier, haddock can try to link it anyway.
  1411. 115.12 s [pathway] Warning: 'local' is out of scope.
  1412. 115.12 s [pathway] If you qualify the identifier, haddock can try to link it anyway.
  1413. 115.13 s [pathway] 100% ( 3 / 3) in 'Data.Path.Parser'
  1414. 115.13 s [pathway] Warning: 'IsString' is out of scope.
  1415. 115.13 s [pathway] If you qualify the identifier, haddock can try to link it anyway.
  1416. 115.13 s [pathway] Warning: 'Path' is ambiguous. It is defined
  1417. 115.13 s [pathway] * in ‘Data.Path.Internal’
  1418. 115.13 s [pathway] * in ‘Data.Path.Internal’
  1419. 115.13 s [pathway] You may be able to disambiguate the identifier by qualifying it or
  1420. 115.13 s [pathway] by specifying the type/value namespace explicitly.
  1421. 115.13 s [pathway] Defaulting to the one defined in ‘Data.Path.Internal’
  1422. 115.13 s [pathway] 50% ( 2 / 4) in 'Data.Path.TH'
  1423. 115.13 s [pathway] Missing documentation for:
  1424. 115.13 s [pathway] Module header
  1425. 115.13 s [pathway] path (src/Data/Path/TH.hs:82)
  1426. 115.62 s [pathway] Warning: Data.Path: could not find link destinations for:
  1427. 115.62 s [pathway] - Data.Path.Internal.Relativity.Rep_Relativity
  1428. 115.62 s [pathway] - Data.Path.Internal.Type.Rep_Type
  1429. 115.62 s [pathway] - Data.Path.Internal.Rep1_Path
  1430. 115.62 s [pathway] - Data.Path.Internal.Rep_Path
  1431. 115.62 s [pathway] - Data.Path.Routable
  1432. 115.62 s [pathway] - Data.Path.generalizeType
  1433. 115.62 s [pathway] - Data.Path.generalizeRelativity
  1434. 115.62 s [pathway] - Data.Path.Rep_Anchored
  1435. 115.62 s [pathway] - Data.Path.Rep1_Anchored
  1436. 115.62 s [pathway] Warning: Data.Path.Parser: could not find link destinations for:
  1437. 115.62 s [pathway] - Data.Path.Parser.anchor
  1438. 119.11 s [pathway] Documentation created: dist/doc/html/pathway/,
  1439. 119.11 s [pathway] dist/doc/html/pathway/pathway.txt
  1440. 119.16 s [pathway] Preprocessing test suite 'doctests' for pathway-0.0.1.0..
  1441. 119.17 s [pathway] Phase: installPhase
  1442. 119.25 s [pathway] Installing library in /nix/store/p0hxlm27mvqbppssqqmc9z4pis7mf3kg-pathway-0.0.1.0/lib/ghc-9.8.4/lib/x86_64-linux-ghc-9.8.4/pathway-0.0.1.0-IloKB8qrk9OLBhIjlawLWM
  1443. 119.49 s [pathway] Phase: fixupPhase
  1444. 119.50 s [pathway] shrinking RPATHs of ELF executables and libraries in /nix/store/p0hxlm27mvqbppssqqmc9z4pis7mf3kg-pathway-0.0.1.0
  1445. 119.51 s [pathway] shrinking /nix/store/p0hxlm27mvqbppssqqmc9z4pis7mf3kg-pathway-0.0.1.0/lib/ghc-9.8.4/lib/x86_64-linux-ghc-9.8.4/libHSpathway-0.0.1.0-IloKB8qrk9OLBhIjlawLWM-ghc9.8.4.so
  1446. 119.52 s [pathway] checking for references to /build/ in /nix/store/p0hxlm27mvqbppssqqmc9z4pis7mf3kg-pathway-0.0.1.0...
  1447. 119.54 s [pathway] patching script interpreter paths in /nix/store/p0hxlm27mvqbppssqqmc9z4pis7mf3kg-pathway-0.0.1.0
  1448. 119.55 s [pathway] stripping (with command strip and flags -S -p) in /nix/store/p0hxlm27mvqbppssqqmc9z4pis7mf3kg-pathway-0.0.1.0/lib
  1449. 119.60 s [pathway] shrinking RPATHs of ELF executables and libraries in /nix/store/r6im1p1yv5ia2m3h1c2rl3krdhyazqfg-pathway-0.0.1.0-doc
  1450. 119.60 s [pathway] checking for references to /build/ in /nix/store/r6im1p1yv5ia2m3h1c2rl3krdhyazqfg-pathway-0.0.1.0-doc...
  1451. 119.62 s [pathway] patching script interpreter paths in /nix/store/r6im1p1yv5ia2m3h1c2rl3krdhyazqfg-pathway-0.0.1.0-doc
  1452. 119.71 s [pathway:post-build] Uploading to cachix cache "sellout": /nix/store/p0hxlm27mvqbppssqqmc9z4pis7mf3kg-pathway-0.0.1.0 /nix/store/r6im1p1yv5ia2m3h1c2rl3krdhyazqfg-pathway-0.0.1.0-doc
  1453. 120.20 s [pathway:post-build] Pushing 3 paths (179 are already present) using zstd to cache sellout ⏳
  1454. 120.20 s [pathway:post-build]
  1455. 120.57 s [pathway:post-build] Pushing /nix/store/r6im1p1yv5ia2m3h1c2rl3krdhyazqfg-pathway-0.0.1.0-doc (1.34 MiB)
  1456. 120.64 s [pathway:post-build] Pushing /nix/store/69pl43dzdlfb8n0pig904kccf1j5rks2-keyutils-1.6.3-lib (41.87 KiB)
  1457. 120.65 s [pathway:post-build] Pushing /nix/store/p0hxlm27mvqbppssqqmc9z4pis7mf3kg-pathway-0.0.1.0 (2.68 MiB)
  1458. 122.18 s [pathway:post-build]
  1459. 122.18 s [pathway:post-build] All done.
  1460. 122.20 s [pathway:post-build] Uploading to the NixCI cache: /nix/store/p0hxlm27mvqbppssqqmc9z4pis7mf3kg-pathway-0.0.1.0 /nix/store/r6im1p1yv5ia2m3h1c2rl3krdhyazqfg-pathway-0.0.1.0-doc
  1461. 122.24 s [pathway:post-build] warning: 'warn-short-path-literals' is deprecated, use 'lint-short-path-literals = ignore' instead
  1462. 122.25 s [pathway:post-build] copying 2 paths...
  1463. 122.25 s [pathway:post-build] copying path '/nix/store/r6im1p1yv5ia2m3h1c2rl3krdhyazqfg-pathway-0.0.1.0-doc' to 'https://cache.nix-ci.com'...
  1464. 122.85 s [pathway:post-build] copying path '/nix/store/p0hxlm27mvqbppssqqmc9z4pis7mf3kg-pathway-0.0.1.0' to 'https://cache.nix-ci.com'...
  1465. 123.71 s [pathway:post-build] warning: 'warn-short-path-literals' is deprecated, use 'lint-short-path-literals = ignore' instead
  1466. 124.03 s [pathway:post-build] copying 9 paths...
  1467. 124.03 s [pathway:post-build] copying path '/nix/store/rjhfb7pdrggnx682rcq895v4azrsabwq-yaya-containers-0.1.2.2.drv' to 'https://cache.nix-ci.com'...
  1468. 124.03 s [pathway:post-build] copying path '/nix/store/j1aq36ksjn1vm3ql4i1yp1av04kh7j5d-parser-combinators-1.3.0.drv' to 'https://cache.nix-ci.com'...
  1469. 124.03 s [pathway:post-build] copying path '/nix/store/753y1pdnrzldihj7kr52723vn3qjlcwk-deriving-compat-0.6.7.drv' to 'https://cache.nix-ci.com'...
  1470. 124.03 s [pathway:post-build] copying path '/nix/store/i220nxxqyhd3na73qqf77c319x1iygpq-clock-0.8.4.drv' to 'https://cache.nix-ci.com'...
  1471. 124.29 s [pathway:post-build] copying path '/nix/store/2clyhjsi3c5nddi5qydqnmwdqiy6k9qr-megaparsec-9.7.0.drv' to 'https://cache.nix-ci.com'...
  1472. 124.35 s [pathway:post-build] copying path '/nix/store/bzxg4rllmzmhxq4cffzrnvib7rb55jnh-yaya-hedgehog-0.3.0.5.drv' to 'https://cache.nix-ci.com'...
  1473. 124.35 s [pathway:post-build] copying path '/nix/store/pz55fkjzk85hg4djbn5m8q5z6shyx828-extra-1.8.1.drv' to 'https://cache.nix-ci.com'...
  1474. 124.56 s [pathway:post-build] copying path '/nix/store/jqs5his0ygbhjd5ai0vfh8qqcnlv8lmj-yaya-unsafe-0.4.1.4.drv' to 'https://cache.nix-ci.com'...
  1475. 124.81 s [pathway:post-build] copying path '/nix/store/fp6wbpzhzl9a14wxkic4d989f00gh4wv-pathway-0.0.1.0.drv' to 'https://cache.nix-ci.com'...
  1476. 125.06 s Uploaded pathway in 5.3s
  1477. 125.06 s Progress: 3 of 21 built, 170 of 170 downloaded from cache
  1478. 125.06 s Built pathway in 23.1s
  1479. 125.11 s Building /nix/store/cwh5ylr2yrdilqb72gdxw3rv376mz14d-pathway-compat-base-0.0.1.0.drv
  1480. 125.15 s Building /nix/store/3bz58wy5dnv86iixnxdamks3jahnkfvk-pathway-path-0.0.1.0.drv
  1481. 125.30 s [pathway-compat-base] Phase: setupCompilerEnvironmentPhase
  1482. 125.30 s [pathway-compat-base] Build with /nix/store/4yvzsc21abkayqx2bzncnj5fpx57hb6z-ghc-9.8.4.
  1483. 125.38 s [pathway-path] Phase: setupCompilerEnvironmentPhase
  1484. 125.39 s [pathway-path] Build with /nix/store/4yvzsc21abkayqx2bzncnj5fpx57hb6z-ghc-9.8.4.
  1485. 125.54 s [pathway-compat-base] Phase: unpackPhase
  1486. 125.54 s [pathway-compat-base] unpacking source archive /nix/store/723m6sjvk66iiqzpvcfdd74xi6id5zqq-zjizyqf4pafgh9rycgxd507dhvpisdy1-source/./compat/base
  1487. 125.54 s [pathway-compat-base] source root is base
  1488. 125.55 s [pathway-compat-base] Phase: patchPhase
  1489. 125.56 s [pathway-compat-base] Phase: compileBuildDriverPhase
  1490. 125.56 s [pathway-compat-base] setupCompileFlags: -package-db=/build/tmp.Hd1CQ0Tl4k/setup-package.conf.d -threaded
  1491. 125.61 s [pathway-compat-base] [1 of 2] Compiling Main ( Setup.hs, /build/tmp.Hd1CQ0Tl4k/Main.o )
  1492. 125.65 s [pathway-compat-base] [2 of 2] Linking Setup
  1493. 125.66 s [pathway-path] Phase: unpackPhase
  1494. 125.66 s [pathway-path] unpacking source archive /nix/store/723m6sjvk66iiqzpvcfdd74xi6id5zqq-zjizyqf4pafgh9rycgxd507dhvpisdy1-source/./path
  1495. 125.67 s [pathway-path] source root is path
  1496. 125.67 s [pathway-path] Phase: patchPhase
  1497. 125.68 s [pathway-path] Phase: compileBuildDriverPhase
  1498. 125.69 s [pathway-path] setupCompileFlags: -package-db=/build/tmp.XL9BrgGpPi/setup-package.conf.d -threaded
  1499. 125.73 s [pathway-path] [1 of 2] Compiling Main ( Setup.hs, /build/tmp.XL9BrgGpPi/Main.o )
  1500. 125.77 s [pathway-path] [2 of 2] Linking Setup
  1501. 126.77 s [pathway-compat-base] Phase: updateAutotoolsGnuConfigScriptsPhase
  1502. 126.78 s [pathway-compat-base] Phase: configurePhase
  1503. 126.79 s [pathway-compat-base] configureFlags: --verbose --prefix=/nix/store/61cwgjh608q90z9kzvxvx57433mqjy63-pathway-compat-base-0.0.1.0 --libdir=$prefix/lib/$compiler/lib --libsubdir=$abi/$libname --docdir=/nix/store/rw67h0pnh3jd7dx34rz4rs7zq7apv3jx-pathway-compat-base-0.0.1.0-doc/share/doc/pathway-compat-base-0.0.1.0 --with-gcc=gcc --package-db=/build/tmp.Hd1CQ0Tl4k/package.conf.d --ghc-option=-j16 --ghc-option=+RTS --ghc-option=-A64M --ghc-option=-RTS --enable-library-profiling --profiling-detail=exported-functions --disable-profiling --enable-shared --disable-coverage --enable-static --disable-executable-dynamic --enable-tests --disable-benchmarks --enable-library-vanilla --disable-library-for-ghci --enable-split-sections --enable-library-stripping --enable-executable-stripping --ghc-option=-haddock --ghc-options=-Werror --extra-lib-dirs=/nix/store/ffyzkisqs4vc4mg28bwwlyqjf8i9ph6b-ncurses-6.5/lib --extra-lib-dirs=/nix/store/n28qgdj8c1q41kf7n4y1jxa6ckp85m3c-libffi-3.5.2/lib --extra-lib-dirs=/nix/store/1b6h99dw7bk4wbn77kbalih42zbc67m1-elfutils-0.194/lib --extra-lib-dirs=/nix/store/hi0ar880110k6jsmmili7dh1gq3cg2a9-gmp-with-cxx-6.3.0/lib --extra-lib-dirs=/nix/store/g09cflpnp4g80q56sj9dng1qzv4v4ybc-numactl-2.0.18/lib --extra-lib-dirs=/nix/store/4yvzsc21abkayqx2bzncnj5fpx57hb6z-ghc-9.8.4/lib
  1504. 126.80 s [pathway-compat-base] Using Parsec parser
  1505. 126.80 s [pathway-compat-base] Configuring pathway-compat-base-0.0.1.0...
  1506. 126.87 s [pathway-path] Phase: updateAutotoolsGnuConfigScriptsPhase
  1507. 126.88 s [pathway-path] Phase: configurePhase
  1508. 126.88 s [pathway-path] configureFlags: --verbose --prefix=/nix/store/vpm197ksjcqdaf88lmplg7fa309xan4f-pathway-path-0.0.1.0 --libdir=$prefix/lib/$compiler/lib --libsubdir=$abi/$libname --docdir=/nix/store/ld9397k8jc0klnls538mwpw7mk8cgli2-pathway-path-0.0.1.0-doc/share/doc/pathway-path-0.0.1.0 --with-gcc=gcc --package-db=/build/tmp.XL9BrgGpPi/package.conf.d --ghc-option=-j16 --ghc-option=+RTS --ghc-option=-A64M --ghc-option=-RTS --enable-library-profiling --profiling-detail=exported-functions --disable-profiling --enable-shared --disable-coverage --enable-static --disable-executable-dynamic --enable-tests --disable-benchmarks --enable-library-vanilla --disable-library-for-ghci --enable-split-sections --enable-library-stripping --enable-executable-stripping --ghc-option=-haddock --ghc-options=-Werror --extra-lib-dirs=/nix/store/ffyzkisqs4vc4mg28bwwlyqjf8i9ph6b-ncurses-6.5/lib --extra-lib-dirs=/nix/store/n28qgdj8c1q41kf7n4y1jxa6ckp85m3c-libffi-3.5.2/lib --extra-lib-dirs=/nix/store/1b6h99dw7bk4wbn77kbalih42zbc67m1-elfutils-0.194/lib --extra-lib-dirs=/nix/store/hi0ar880110k6jsmmili7dh1gq3cg2a9-gmp-with-cxx-6.3.0/lib --extra-lib-dirs=/nix/store/g09cflpnp4g80q56sj9dng1qzv4v4ybc-numactl-2.0.18/lib --extra-lib-dirs=/nix/store/4yvzsc21abkayqx2bzncnj5fpx57hb6z-ghc-9.8.4/lib
  1509. 126.89 s [pathway-path] Using Parsec parser
  1510. 126.89 s [pathway-path] Configuring pathway-path-0.0.1.0...
  1511. 127.08 s [pathway-compat-base] Flags chosen: noisy-deprecations=True, verify-no-recursion=False
  1512. 127.08 s [pathway-compat-base] Dependency base >=4.14.0 && <4.15 || >=4.15.0 && <4.16 || >=4.16.0 && <4.17 ||
  1513. 127.08 s [pathway-compat-base] >=4.17.0 && <4.18 || >=4.18.0 && <4.19 || >=4.19.0 && <4.20 || >=4.20.0 &&
  1514. 127.08 s [pathway-compat-base] <4.21 || >=4.21.0 && <4.22 || >=4.22.0 && <4.23: using base-4.19.2.0
  1515. 127.08 s [pathway-compat-base] Dependency exceptions: using exceptions-0.10.7
  1516. 127.08 s [pathway-compat-base] Dependency megaparsec >=9.0.1 && <9.1 || >=9.2.1 && <9.3 || >=9.5.0 && <9.6 ||
  1517. 127.08 s [pathway-compat-base] >=9.7.0 && <9.8: using megaparsec-9.7.0
  1518. 127.08 s [pathway-compat-base] Dependency pathway >=0.0.1 && <0.1: using pathway-0.0.1.0
  1519. 127.08 s [pathway-compat-base] Dependency variant: using variant-1.0.1
  1520. 127.08 s [pathway-compat-base] Dependency base >=4.14.0 && <4.15 || >=4.15.0 && <4.16 || >=4.16.0 && <4.17 ||
  1521. 127.08 s [pathway-compat-base] >=4.17.0 && <4.18 || >=4.18.0 && <4.19 || >=4.19.0 && <4.20 || >=4.20.0 &&
  1522. 127.08 s [pathway-compat-base] <4.21 || >=4.21.0 && <4.22 || >=4.22.0 && <4.23: using base-4.19.2.0
  1523. 127.08 s [pathway-compat-base] Dependency doctest >=0.16.3 && <0.17 || >=0.18.1 && <0.19 || >=0.20.1 && <0.21
  1524. 127.08 s [pathway-compat-base] || >=0.21.1 && <0.22 || >=0.22.2 && <0.23 || >=0.24.2 && <0.25: using
  1525. 127.08 s [pathway-compat-base] doctest-0.24.2
  1526. 127.08 s [pathway-compat-base] Dependency pathway-compat-base: using pathway-compat-base-0.0.1.0
  1527. 127.19 s [pathway-path] Flags chosen: noisy-deprecations=True, verify-no-recursion=False
  1528. 127.19 s [pathway-path] Dependency base >=4.14.0 && <4.15 || >=4.15.0 && <4.16 || >=4.16.0 && <4.17 ||
  1529. 127.19 s [pathway-path] >=4.17.0 && <4.18 || >=4.18.0 && <4.19 || >=4.19.0 && <4.20 || >=4.20.0 &&
  1530. 127.19 s [pathway-path] <4.21 || >=4.21.0 && <4.22 || >=4.22.0 && <4.23: using base-4.19.2.0
  1531. 127.19 s [pathway-path] Dependency filepath >=1.4.2 && <1.5 || >=1.5.2 && <1.6: using
  1532. 127.19 s [pathway-path] filepath-1.4.301.0
  1533. 127.19 s [pathway-path] Dependency path >=0.9.0 && <0.10: using path-0.9.6
  1534. 127.19 s [pathway-path] Dependency pathway >=0.0.1 && <0.1: using pathway-0.0.1.0
  1535. 127.19 s [pathway-path] Dependency pathway-internal >=0.0.1 && <0.1: using pathway-internal-0.0.1.0
  1536. 127.19 s [pathway-path] Dependency yaya >=0.6.2 && <0.7 || >=0.7.0 && <0.8: using yaya-0.6.2.3
  1537. 127.19 s [pathway-path] Dependency yaya-unsafe >=0.4.1 && <0.5 || >=0.5.0 && <0.6: using
  1538. 127.19 s [pathway-path] yaya-unsafe-0.4.1.4
  1539. 127.19 s [pathway-path] Dependency QuickCheck >=2.14.2 && <2.15 || >=2.15.0 && <2.16 || >=2.16.0 &&
  1540. 127.19 s [pathway-path] <2.17 || >=2.17.1 && <2.18: using QuickCheck-2.15.0.1
  1541. 127.19 s [pathway-path] Dependency base >=4.14.0 && <4.15 || >=4.15.0 && <4.16 || >=4.16.0 && <4.17 ||
  1542. 127.19 s [pathway-path] >=4.17.0 && <4.18 || >=4.18.0 && <4.19 || >=4.19.0 && <4.20 || >=4.20.0 &&
  1543. 127.19 s [pathway-path] <4.21 || >=4.21.0 && <4.22 || >=4.22.0 && <4.23: using base-4.19.2.0
  1544. 127.19 s [pathway-path] Dependency doctest >=0.16.3 && <0.17 || >=0.18.1 && <0.19 || >=0.20.1 && <0.21
  1545. 127.19 s [pathway-path] || >=0.21.1 && <0.22 || >=0.22.2 && <0.23 || >=0.24.2 && <0.25: using
  1546. 127.19 s [pathway-path] doctest-0.24.2
  1547. 127.19 s [pathway-path] Dependency pathway-path: using pathway-path-0.0.1.0
  1548. 127.19 s [pathway-path] Dependency pathway-quickcheck >=0.0.1 && <0.1: using
  1549. 127.19 s [pathway-path] pathway-quickcheck-0.0.1.0
  1550. 127.30 s [pathway-compat-base] Source component graph:
  1551. 127.30 s [pathway-compat-base] component lib
  1552. 127.30 s [pathway-compat-base] component test:doctests dependency lib
  1553. 127.30 s [pathway-compat-base] Configured component graph:
  1554. 127.30 s [pathway-compat-base] component pathway-compat-base-0.0.1.0-9LwOiYzUq1SHjg9jvEQyqL
  1555. 127.30 s [pathway-compat-base] include base-4.19.2.0-8274
  1556. 127.30 s [pathway-compat-base] include exceptions-0.10.7-cb67
  1557. 127.30 s [pathway-compat-base] include megaparsec-9.7.0-HGZe2UnGqRgF6D6IR9jAPL
  1558. 127.30 s [pathway-compat-base] include pathway-0.0.1.0-IloKB8qrk9OLBhIjlawLWM
  1559. 127.30 s [pathway-compat-base] include variant-1.0.1-66oQRCUCY4iHh6G9Sh3Js
  1560. 127.30 s [pathway-compat-base] component pathway-compat-base-0.0.1.0-8dLQHTSquWrAP7faE49vxo-doctests
  1561. 127.30 s [pathway-compat-base] include base-4.19.2.0-8274
  1562. 127.30 s [pathway-compat-base] include doctest-0.24.2-HOk70bisutnFZuBXgSC0HK
  1563. 127.30 s [pathway-compat-base] include pathway-compat-base-0.0.1.0-9LwOiYzUq1SHjg9jvEQyqL
  1564. 127.30 s [pathway-compat-base] Linked component graph:
  1565. 127.30 s [pathway-compat-base] unit pathway-compat-base-0.0.1.0-9LwOiYzUq1SHjg9jvEQyqL
  1566. 127.30 s [pathway-compat-base] include base-4.19.2.0-8274
  1567. 127.30 s [pathway-compat-base] include exceptions-0.10.7-cb67
  1568. 127.30 s [pathway-compat-base] include megaparsec-9.7.0-HGZe2UnGqRgF6D6IR9jAPL
  1569. 127.30 s [pathway-compat-base] include pathway-0.0.1.0-IloKB8qrk9OLBhIjlawLWM
  1570. 127.30 s [pathway-compat-base] include variant-1.0.1-66oQRCUCY4iHh6G9Sh3Js
  1571. 127.30 s [pathway-compat-base] Common=pathway-compat-base-0.0.1.0-9LwOiYzUq1SHjg9jvEQyqL:Common,System.Environment.DropIn=pathway-compat-base-0.0.1.0-9LwOiYzUq1SHjg9jvEQyqL:System.Environment.DropIn,System.Environment.Overlay=pathway-compat-base-0.0.1.0-9LwOiYzUq1SHjg9jvEQyqL:System.Environment.Overlay,System.Environment.Pathway=pathway-compat-base-0.0.1.0-9LwOiYzUq1SHjg9jvEQyqL:System.Environment.Pathway,System.Environment.Thin=pathway-compat-base-0.0.1.0-9LwOiYzUq1SHjg9jvEQyqL:System.Environment.Thin,System.IO.Caught=pathway-compat-base-0.0.1.0-9LwOiYzUq1SHjg9jvEQyqL:System.IO.Caught,System.IO.DropIn=pathway-compat-base-0.0.1.0-9LwOiYzUq1SHjg9jvEQyqL:System.IO.DropIn,System.IO.Error.Caught=pathway-compat-base-0.0.1.0-9LwOiYzUq1SHjg9jvEQyqL:System.IO.Error.Caught,System.IO.Error.DropIn=pathway-compat-base-0.0.1.0-9LwOiYzUq1SHjg9jvEQyqL:System.IO.Error.DropIn,System.IO.Error.Overlay=pathway-compat-base-0.0.1.0-9LwOiYzUq1SHjg9jvEQyqL:System.IO.Error.Overlay,System.IO.Error.Pathway=pathway-compat-base-0.0.1.0-9LwOiYzUq1SHjg9jvEQyqL:System.IO.Error.Pathway,System.IO.Error.Thin=pathway-compat-base-0.0.1.0-9LwOiYzUq1SHjg9jvEQyqL:System.IO.Error.Thin,System.IO.Overlay=pathway-compat-base-0.0.1.0-9LwOiYzUq1SHjg9jvEQyqL:System.IO.Overlay,System.IO.Pathway=pathway-compat-base-0.0.1.0-9LwOiYzUq1SHjg9jvEQyqL:System.IO.Pathway,System.IO.Thin=pathway-compat-base-0.0.1.0-9LwOiYzUq1SHjg9jvEQyqL:System.IO.Thin
  1572. 127.30 s [pathway-compat-base] unit pathway-compat-base-0.0.1.0-8dLQHTSquWrAP7faE49vxo-doctests
  1573. 127.30 s [pathway-compat-base] include base-4.19.2.0-8274
  1574. 127.30 s [pathway-compat-base] include doctest-0.24.2-HOk70bisutnFZuBXgSC0HK
  1575. 127.30 s [pathway-compat-base] include pathway-compat-base-0.0.1.0-9LwOiYzUq1SHjg9jvEQyqL
  1576. 127.30 s [pathway-compat-base] Ready component graph:
  1577. 127.30 s [pathway-compat-base] definite pathway-compat-base-0.0.1.0-9LwOiYzUq1SHjg9jvEQyqL
  1578. 127.30 s [pathway-compat-base] depends base-4.19.2.0-8274
  1579. 127.30 s [pathway-compat-base] depends exceptions-0.10.7-cb67
  1580. 127.30 s [pathway-compat-base] depends megaparsec-9.7.0-HGZe2UnGqRgF6D6IR9jAPL
  1581. 127.30 s [pathway-compat-base] depends pathway-0.0.1.0-IloKB8qrk9OLBhIjlawLWM
  1582. 127.30 s [pathway-compat-base] depends variant-1.0.1-66oQRCUCY4iHh6G9Sh3Js
  1583. 127.30 s [pathway-compat-base] definite pathway-compat-base-0.0.1.0-8dLQHTSquWrAP7faE49vxo-doctests
  1584. 127.30 s [pathway-compat-base] depends base-4.19.2.0-8274
  1585. 127.30 s [pathway-compat-base] depends doctest-0.24.2-HOk70bisutnFZuBXgSC0HK
  1586. 127.30 s [pathway-compat-base] depends pathway-compat-base-0.0.1.0-9LwOiYzUq1SHjg9jvEQyqL
  1587. 127.30 s [pathway-compat-base] Using Cabal-3.10.3.0 compiled by ghc-9.8
  1588. 127.30 s [pathway-compat-base] Using compiler: ghc-9.8.4
  1589. 127.30 s [pathway-compat-base] Using install prefix:
  1590. 127.30 s [pathway-compat-base] /nix/store/61cwgjh608q90z9kzvxvx57433mqjy63-pathway-compat-base-0.0.1.0
  1591. 127.30 s [pathway-compat-base] Executables installed in:
  1592. 127.30 s [pathway-compat-base] /nix/store/61cwgjh608q90z9kzvxvx57433mqjy63-pathway-compat-base-0.0.1.0/bin
  1593. 127.30 s [pathway-compat-base] Libraries installed in:
  1594. 127.30 s [pathway-compat-base] /nix/store/61cwgjh608q90z9kzvxvx57433mqjy63-pathway-compat-base-0.0.1.0/lib/ghc-9.8.4/lib/x86_64-linux-ghc-9.8.4/pathway-compat-base-0.0.1.0-9LwOiYzUq1SHjg9jvEQyqL
  1595. 127.30 s [pathway-compat-base] Dynamic Libraries installed in:
  1596. 127.30 s [pathway-compat-base] /nix/store/61cwgjh608q90z9kzvxvx57433mqjy63-pathway-compat-base-0.0.1.0/lib/ghc-9.8.4/lib/x86_64-linux-ghc-9.8.4
  1597. 127.30 s [pathway-compat-base] Private executables installed in:
  1598. 127.30 s [pathway-compat-base] /nix/store/61cwgjh608q90z9kzvxvx57433mqjy63-pathway-compat-base-0.0.1.0/libexec/x86_64-linux-ghc-9.8.4/pathway-compat-base-0.0.1.0
  1599. 127.30 s [pathway-compat-base] Data files installed in:
  1600. 127.30 s [pathway-compat-base] /nix/store/61cwgjh608q90z9kzvxvx57433mqjy63-pathway-compat-base-0.0.1.0/share/x86_64-linux-ghc-9.8.4/pathway-compat-base-0.0.1.0
  1601. 127.30 s [pathway-compat-base] Documentation installed in:
  1602. 127.30 s [pathway-compat-base] /nix/store/rw67h0pnh3jd7dx34rz4rs7zq7apv3jx-pathway-compat-base-0.0.1.0-doc/share/doc/pathway-compat-base-0.0.1.0
  1603. 127.30 s [pathway-compat-base] Configuration files installed in:
  1604. 127.30 s [pathway-compat-base] /nix/store/61cwgjh608q90z9kzvxvx57433mqjy63-pathway-compat-base-0.0.1.0/etc
  1605. 127.30 s [pathway-compat-base] No alex found
  1606. 127.30 s [pathway-compat-base] Using ar found on system at:
  1607. 127.30 s [pathway-compat-base] /nix/store/iz5lckcsg66r223si2gck7csk2hihj0m-binutils-wrapper-2.44/bin/ar
  1608. 127.30 s [pathway-compat-base] No c2hs found
  1609. 127.30 s [pathway-compat-base] No cpphs found
  1610. 127.30 s [pathway-compat-base] Using doctest version 0.24.2 found on system at:
  1611. 127.30 s [pathway-compat-base] /nix/store/ipqa88qiasixywmsikcnq7nhq6340lg5-doctest-0.24.2/bin/doctest
  1612. 127.30 s [pathway-compat-base] Using gcc version 14.3.0 given by user at:
  1613. 127.30 s [pathway-compat-base] /nix/store/8v97ngkcpfzgghwnnr7fsz33p2x22gy9-gcc-wrapper-14.3.0/bin/gcc
  1614. 127.30 s [pathway-compat-base] Using ghc version 9.8.4 found on system at:
  1615. 127.30 s [pathway-compat-base] /nix/store/4yvzsc21abkayqx2bzncnj5fpx57hb6z-ghc-9.8.4/bin/ghc
  1616. 127.30 s [pathway-compat-base] Using ghc-pkg version 9.8.4 found on system at:
  1617. 127.30 s [pathway-compat-base] /nix/store/4yvzsc21abkayqx2bzncnj5fpx57hb6z-ghc-9.8.4/bin/ghc-pkg-9.8.4
  1618. 127.30 s [pathway-compat-base] No ghcjs found
  1619. 127.30 s [pathway-compat-base] No ghcjs-pkg found
  1620. 127.30 s [pathway-compat-base] No greencard found
  1621. 127.30 s [pathway-compat-base] Using haddock version 2.30.0 found on system at:
  1622. 127.30 s [pathway-compat-base] /nix/store/4yvzsc21abkayqx2bzncnj5fpx57hb6z-ghc-9.8.4/bin/haddock-ghc-9.8.4
  1623. 127.30 s [pathway-compat-base] No happy found
  1624. 127.30 s [pathway-compat-base] Using haskell-suite found on system at: haskell-suite-dummy-location
  1625. 127.30 s [pathway-compat-base] Using haskell-suite-pkg found on system at: haskell-suite-pkg-dummy-location
  1626. 127.30 s [pathway-compat-base] No hmake found
  1627. 127.30 s [pathway-compat-base] Using hpc version 0.69 found on system at:
  1628. 127.30 s [pathway-compat-base] /nix/store/4yvzsc21abkayqx2bzncnj5fpx57hb6z-ghc-9.8.4/bin/hpc-ghc-9.8.4
  1629. 127.30 s [pathway-compat-base] Using hsc2hs version 0.68.10 found on system at:
  1630. 127.30 s [pathway-compat-base] /nix/store/4yvzsc21abkayqx2bzncnj5fpx57hb6z-ghc-9.8.4/bin/hsc2hs-ghc-9.8.4
  1631. 127.30 s [pathway-compat-base] Using hscolour version 1.25 found on system at:
  1632. 127.30 s [pathway-compat-base] /nix/store/palqpb4p9k5rqxhxjdgqrak8n91p6c4z-hscolour-1.25/bin/HsColour
  1633. 127.30 s [pathway-compat-base] No jhc found
  1634. 127.30 s [pathway-compat-base] Using ld found on system at:
  1635. 127.30 s [pathway-compat-base] /nix/store/iz5lckcsg66r223si2gck7csk2hihj0m-binutils-wrapper-2.44/bin/ld.gold
  1636. 127.30 s [pathway-compat-base] No pkg-config found
  1637. 127.30 s [pathway-compat-base] Using runghc version 9.8.4 found on system at:
  1638. 127.30 s [pathway-compat-base] /nix/store/4yvzsc21abkayqx2bzncnj5fpx57hb6z-ghc-9.8.4/bin/runghc-9.8.4
  1639. 127.30 s [pathway-compat-base] Using strip version 2.44 found on system at:
  1640. 127.30 s [pathway-compat-base] /nix/store/8v97ngkcpfzgghwnnr7fsz33p2x22gy9-gcc-wrapper-14.3.0/bin/strip
  1641. 127.30 s [pathway-compat-base] Using tar found on system at:
  1642. 127.30 s [pathway-compat-base] /nix/store/xl6pd2spjajwcpq09fnmnjv5psqmlmma-gnutar-1.35/bin/tar
  1643. 127.30 s [pathway-compat-base] No uhc found
  1644. 127.41 s [pathway-path] Source component graph:
  1645. 127.41 s [pathway-path] component lib
  1646. 127.41 s [pathway-path] component test:doctests dependency lib
  1647. 127.41 s [pathway-path] Configured component graph:
  1648. 127.41 s [pathway-path] component pathway-path-0.0.1.0-1gBdfnbBkz7Jht1AQhKOGl
  1649. 127.41 s [pathway-path] include base-4.19.2.0-8274
  1650. 127.41 s [pathway-path] include filepath-1.4.301.0-9527
  1651. 127.41 s [pathway-path] include path-0.9.6-8iOl2NPInLgAh1yzJngOhf
  1652. 127.41 s [pathway-path] include pathway-0.0.1.0-IloKB8qrk9OLBhIjlawLWM
  1653. 127.41 s [pathway-path] include pathway-internal-0.0.1.0-BTurcxZAYjHHOlL1rvpIiQ
  1654. 127.41 s [pathway-path] include yaya-0.6.2.3-5bWn9HCxYKk8n7VJT6hTIW
  1655. 127.41 s [pathway-path] include yaya-unsafe-0.4.1.4-7ZhQ68MgouGLZkEM9p6ZPq
  1656. 127.41 s [pathway-path] component pathway-path-0.0.1.0-CdPR8btLCnh2Vz1Cb8Ogig-doctests
  1657. 127.41 s [pathway-path] include QuickCheck-2.15.0.1-5u5mV1pqdXQ9rGVQgPoEeu
  1658. 127.41 s [pathway-path] include base-4.19.2.0-8274
  1659. 127.41 s [pathway-path] include doctest-0.24.2-HOk70bisutnFZuBXgSC0HK
  1660. 127.41 s [pathway-path] include pathway-path-0.0.1.0-1gBdfnbBkz7Jht1AQhKOGl
  1661. 127.41 s [pathway-path] include pathway-quickcheck-0.0.1.0-D8tq4Sgr5zz6I2F19xa0Lq
  1662. 127.41 s [pathway-path] Linked component graph:
  1663. 127.41 s [pathway-path] unit pathway-path-0.0.1.0-1gBdfnbBkz7Jht1AQhKOGl
  1664. 127.41 s [pathway-path] include base-4.19.2.0-8274
  1665. 127.41 s [pathway-path] include filepath-1.4.301.0-9527
  1666. 127.41 s [pathway-path] include path-0.9.6-8iOl2NPInLgAh1yzJngOhf
  1667. 127.41 s [pathway-path] include pathway-0.0.1.0-IloKB8qrk9OLBhIjlawLWM
  1668. 127.41 s [pathway-path] include pathway-internal-0.0.1.0-BTurcxZAYjHHOlL1rvpIiQ
  1669. 127.41 s [pathway-path] include yaya-0.6.2.3-5bWn9HCxYKk8n7VJT6hTIW
  1670. 127.41 s [pathway-path] include yaya-unsafe-0.4.1.4-7ZhQ68MgouGLZkEM9p6ZPq
  1671. 127.41 s [pathway-path] Data.Path.Integration.Path=pathway-path-0.0.1.0-1gBdfnbBkz7Jht1AQhKOGl:Data.Path.Integration.Path
  1672. 127.41 s [pathway-path] unit pathway-path-0.0.1.0-CdPR8btLCnh2Vz1Cb8Ogig-doctests
  1673. 127.41 s [pathway-path] include QuickCheck-2.15.0.1-5u5mV1pqdXQ9rGVQgPoEeu
  1674. 127.41 s [pathway-path] include base-4.19.2.0-8274
  1675. 127.41 s [pathway-path] include doctest-0.24.2-HOk70bisutnFZuBXgSC0HK
  1676. 127.41 s [pathway-path] include pathway-path-0.0.1.0-1gBdfnbBkz7Jht1AQhKOGl
  1677. 127.41 s [pathway-path] include pathway-quickcheck-0.0.1.0-D8tq4Sgr5zz6I2F19xa0Lq
  1678. 127.41 s [pathway-path] Ready component graph:
  1679. 127.41 s [pathway-path] definite pathway-path-0.0.1.0-1gBdfnbBkz7Jht1AQhKOGl
  1680. 127.41 s [pathway-path] depends base-4.19.2.0-8274
  1681. 127.41 s [pathway-path] depends filepath-1.4.301.0-9527
  1682. 127.41 s [pathway-path] depends path-0.9.6-8iOl2NPInLgAh1yzJngOhf
  1683. 127.41 s [pathway-path] depends pathway-0.0.1.0-IloKB8qrk9OLBhIjlawLWM
  1684. 127.41 s [pathway-path] depends pathway-internal-0.0.1.0-BTurcxZAYjHHOlL1rvpIiQ
  1685. 127.41 s [pathway-path] depends yaya-0.6.2.3-5bWn9HCxYKk8n7VJT6hTIW
  1686. 127.41 s [pathway-path] depends yaya-unsafe-0.4.1.4-7ZhQ68MgouGLZkEM9p6ZPq
  1687. 127.41 s [pathway-path] definite pathway-path-0.0.1.0-CdPR8btLCnh2Vz1Cb8Ogig-doctests
  1688. 127.41 s [pathway-path] depends QuickCheck-2.15.0.1-5u5mV1pqdXQ9rGVQgPoEeu
  1689. 127.41 s [pathway-path] depends base-4.19.2.0-8274
  1690. 127.41 s [pathway-path] depends doctest-0.24.2-HOk70bisutnFZuBXgSC0HK
  1691. 127.41 s [pathway-path] depends pathway-path-0.0.1.0-1gBdfnbBkz7Jht1AQhKOGl
  1692. 127.41 s [pathway-path] depends pathway-quickcheck-0.0.1.0-D8tq4Sgr5zz6I2F19xa0Lq
  1693. 127.41 s [pathway-path] Using Cabal-3.10.3.0 compiled by ghc-9.8
  1694. 127.41 s [pathway-path] Using compiler: ghc-9.8.4
  1695. 127.41 s [pathway-path] Using install prefix:
  1696. 127.41 s [pathway-path] /nix/store/vpm197ksjcqdaf88lmplg7fa309xan4f-pathway-path-0.0.1.0
  1697. 127.41 s [pathway-path] Executables installed in:
  1698. 127.41 s [pathway-path] /nix/store/vpm197ksjcqdaf88lmplg7fa309xan4f-pathway-path-0.0.1.0/bin
  1699. 127.41 s [pathway-path] Libraries installed in:
  1700. 127.41 s [pathway-path] /nix/store/vpm197ksjcqdaf88lmplg7fa309xan4f-pathway-path-0.0.1.0/lib/ghc-9.8.4/lib/x86_64-linux-ghc-9.8.4/pathway-path-0.0.1.0-1gBdfnbBkz7Jht1AQhKOGl
  1701. 127.41 s [pathway-path] Dynamic Libraries installed in:
  1702. 127.41 s [pathway-path] /nix/store/vpm197ksjcqdaf88lmplg7fa309xan4f-pathway-path-0.0.1.0/lib/ghc-9.8.4/lib/x86_64-linux-ghc-9.8.4
  1703. 127.41 s [pathway-path] Private executables installed in:
  1704. 127.41 s [pathway-path] /nix/store/vpm197ksjcqdaf88lmplg7fa309xan4f-pathway-path-0.0.1.0/libexec/x86_64-linux-ghc-9.8.4/pathway-path-0.0.1.0
  1705. 127.41 s [pathway-path] Data files installed in:
  1706. 127.41 s [pathway-path] /nix/store/vpm197ksjcqdaf88lmplg7fa309xan4f-pathway-path-0.0.1.0/share/x86_64-linux-ghc-9.8.4/pathway-path-0.0.1.0
  1707. 127.41 s [pathway-path] Documentation installed in:
  1708. 127.41 s [pathway-path] /nix/store/ld9397k8jc0klnls538mwpw7mk8cgli2-pathway-path-0.0.1.0-doc/share/doc/pathway-path-0.0.1.0
  1709. 127.41 s [pathway-path] Configuration files installed in:
  1710. 127.41 s [pathway-path] /nix/store/vpm197ksjcqdaf88lmplg7fa309xan4f-pathway-path-0.0.1.0/etc
  1711. 127.41 s [pathway-path] No alex found
  1712. 127.41 s [pathway-path] Using ar found on system at:
  1713. 127.41 s [pathway-path] /nix/store/iz5lckcsg66r223si2gck7csk2hihj0m-binutils-wrapper-2.44/bin/ar
  1714. 127.41 s [pathway-path] No c2hs found
  1715. 127.41 s [pathway-path] No cpphs found
  1716. 127.41 s [pathway-path] Using doctest version 0.24.2 found on system at:
  1717. 127.41 s [pathway-path] /nix/store/ipqa88qiasixywmsikcnq7nhq6340lg5-doctest-0.24.2/bin/doctest
  1718. 127.41 s [pathway-path] Using gcc version 14.3.0 given by user at:
  1719. 127.41 s [pathway-path] /nix/store/8v97ngkcpfzgghwnnr7fsz33p2x22gy9-gcc-wrapper-14.3.0/bin/gcc
  1720. 127.41 s [pathway-path] Using ghc version 9.8.4 found on system at:
  1721. 127.41 s [pathway-path] /nix/store/4yvzsc21abkayqx2bzncnj5fpx57hb6z-ghc-9.8.4/bin/ghc
  1722. 127.41 s [pathway-path] Using ghc-pkg version 9.8.4 found on system at:
  1723. 127.41 s [pathway-path] /nix/store/4yvzsc21abkayqx2bzncnj5fpx57hb6z-ghc-9.8.4/bin/ghc-pkg-9.8.4
  1724. 127.41 s [pathway-path] No ghcjs found
  1725. 127.41 s [pathway-path] No ghcjs-pkg found
  1726. 127.41 s [pathway-path] No greencard found
  1727. 127.41 s [pathway-path] Using haddock version 2.30.0 found on system at:
  1728. 127.41 s [pathway-path] /nix/store/4yvzsc21abkayqx2bzncnj5fpx57hb6z-ghc-9.8.4/bin/haddock-ghc-9.8.4
  1729. 127.41 s [pathway-path] No happy found
  1730. 127.41 s [pathway-path] Using haskell-suite found on system at: haskell-suite-dummy-location
  1731. 127.41 s [pathway-path] Using haskell-suite-pkg found on system at: haskell-suite-pkg-dummy-location
  1732. 127.41 s [pathway-path] No hmake found
  1733. 127.41 s [pathway-path] Using hpc version 0.69 found on system at:
  1734. 127.41 s [pathway-path] /nix/store/4yvzsc21abkayqx2bzncnj5fpx57hb6z-ghc-9.8.4/bin/hpc-ghc-9.8.4
  1735. 127.41 s [pathway-path] Using hsc2hs version 0.68.10 found on system at:
  1736. 127.41 s [pathway-path] /nix/store/4yvzsc21abkayqx2bzncnj5fpx57hb6z-ghc-9.8.4/bin/hsc2hs-ghc-9.8.4
  1737. 127.41 s [pathway-path] Using hscolour version 1.25 found on system at:
  1738. 127.41 s [pathway-path] /nix/store/palqpb4p9k5rqxhxjdgqrak8n91p6c4z-hscolour-1.25/bin/HsColour
  1739. 127.41 s [pathway-path] No jhc found
  1740. 127.41 s [pathway-path] Using ld found on system at:
  1741. 127.41 s [pathway-path] /nix/store/iz5lckcsg66r223si2gck7csk2hihj0m-binutils-wrapper-2.44/bin/ld.gold
  1742. 127.41 s [pathway-path] No pkg-config found
  1743. 127.41 s [pathway-path] Using runghc version 9.8.4 found on system at:
  1744. 127.41 s [pathway-path] /nix/store/4yvzsc21abkayqx2bzncnj5fpx57hb6z-ghc-9.8.4/bin/runghc-9.8.4
  1745. 127.41 s [pathway-path] Using strip version 2.44 found on system at:
  1746. 127.41 s [pathway-path] /nix/store/8v97ngkcpfzgghwnnr7fsz33p2x22gy9-gcc-wrapper-14.3.0/bin/strip
  1747. 127.41 s [pathway-path] Using tar found on system at:
  1748. 127.41 s [pathway-path] /nix/store/xl6pd2spjajwcpq09fnmnjv5psqmlmma-gnutar-1.35/bin/tar
  1749. 127.41 s [pathway-path] No uhc found
  1750. 127.56 s [pathway-compat-base] Phase: buildPhase
  1751. 127.61 s [pathway-compat-base] Preprocessing library for pathway-compat-base-0.0.1.0..
  1752. 127.61 s [pathway-compat-base] Building library for pathway-compat-base-0.0.1.0..
  1753. 127.71 s [pathway-path] Phase: buildPhase
  1754. 127.74 s [pathway-compat-base] [ 1 of 15] Compiling Common ( src/Common.hs, dist/build/Common.o, dist/build/Common.dyn_o )
  1755. 127.77 s [pathway-path] Preprocessing library for pathway-path-0.0.1.0..
  1756. 127.77 s [pathway-path] Building library for pathway-path-0.0.1.0..
  1757. 127.83 s [pathway-path] [1 of 1] Compiling Data.Path.Integration.Path ( src/Data/Path/Integration/Path.hs, dist/build/Data/Path/Integration/Path.o, dist/build/Data/Path/Integration/Path.dyn_o )
  1758. 128.17 s [pathway-path] [1 of 1] Compiling Data.Path.Integration.Path ( src/Data/Path/Integration/Path.hs, dist/build/Data/Path/Integration/Path.p_o )
  1759. 128.19 s [pathway-compat-base] [ 2 of 15] Compiling System.Environment.Thin ( src/System/Environment/Thin.hs, dist/build/System/Environment/Thin.o, dist/build/System/Environment/Thin.dyn_o )
  1760. 128.24 s [pathway-compat-base] [ 3 of 15] Compiling System.Environment.Pathway ( src/System/Environment/Pathway.hs, dist/build/System/Environment/Pathway.o, dist/build/System/Environment/Pathway.dyn_o )
  1761. 128.26 s [pathway-compat-base] [ 4 of 15] Compiling System.Environment.Overlay ( src/System/Environment/Overlay.hs, dist/build/System/Environment/Overlay.o, dist/build/System/Environment/Overlay.dyn_o )
  1762. 128.28 s [pathway-compat-base] [ 5 of 15] Compiling System.Environment.DropIn ( src/System/Environment/DropIn.hs, dist/build/System/Environment/DropIn.o, dist/build/System/Environment/DropIn.dyn_o )
  1763. 128.30 s [pathway-compat-base] [ 6 of 15] Compiling System.IO.Error.Caught ( src/System/IO/Error/Caught.hs, dist/build/System/IO/Error/Caught.o, dist/build/System/IO/Error/Caught.dyn_o )
  1764. 128.30 s [pathway-compat-base] [ 7 of 15] Compiling System.IO.Error.Thin ( src/System/IO/Error/Thin.hs, dist/build/System/IO/Error/Thin.o, dist/build/System/IO/Error/Thin.dyn_o )
  1765. 128.30 s [pathway-compat-base] [ 8 of 15] Compiling System.IO.Error.Pathway ( src/System/IO/Error/Pathway.hs, dist/build/System/IO/Error/Pathway.o, dist/build/System/IO/Error/Pathway.dyn_o )
  1766. 128.30 s [pathway-compat-base] [ 9 of 15] Compiling System.IO.Error.Overlay ( src/System/IO/Error/Overlay.hs, dist/build/System/IO/Error/Overlay.o, dist/build/System/IO/Error/Overlay.dyn_o )
  1767. 128.30 s [pathway-compat-base] [10 of 15] Compiling System.IO.Error.DropIn ( src/System/IO/Error/DropIn.hs, dist/build/System/IO/Error/DropIn.o, dist/build/System/IO/Error/DropIn.dyn_o )
  1768. 128.30 s [pathway-compat-base] [11 of 15] Compiling System.IO.Thin ( src/System/IO/Thin.hs, dist/build/System/IO/Thin.o, dist/build/System/IO/Thin.dyn_o )
  1769. 128.30 s [pathway-compat-base] [12 of 15] Compiling System.IO.Overlay ( src/System/IO/Overlay.hs, dist/build/System/IO/Overlay.o, dist/build/System/IO/Overlay.dyn_o )
  1770. 128.33 s [pathway-compat-base] [13 of 15] Compiling System.IO.DropIn ( src/System/IO/DropIn.hs, dist/build/System/IO/DropIn.o, dist/build/System/IO/DropIn.dyn_o )
  1771. 128.35 s [pathway-compat-base] [14 of 15] Compiling System.IO.Caught ( src/System/IO/Caught.hs, dist/build/System/IO/Caught.o, dist/build/System/IO/Caught.dyn_o )
  1772. 128.35 s [pathway-compat-base] [15 of 15] Compiling System.IO.Pathway ( src/System/IO/Pathway.hs, dist/build/System/IO/Pathway.o, dist/build/System/IO/Pathway.dyn_o )
  1773. 128.59 s [pathway-compat-base] [ 1 of 15] Compiling Common ( src/Common.hs, dist/build/Common.p_o )
  1774. 129.03 s [pathway-compat-base] [ 2 of 15] Compiling System.Environment.Thin ( src/System/Environment/Thin.hs, dist/build/System/Environment/Thin.p_o )
  1775. 129.16 s [pathway-compat-base] [ 3 of 15] Compiling System.Environment.Pathway ( src/System/Environment/Pathway.hs, dist/build/System/Environment/Pathway.p_o )
  1776. 129.28 s [pathway-compat-base] [ 4 of 15] Compiling System.Environment.Overlay ( src/System/Environment/Overlay.hs, dist/build/System/Environment/Overlay.p_o )
  1777. 129.30 s [pathway-compat-base] [ 5 of 15] Compiling System.Environment.DropIn ( src/System/Environment/DropIn.hs, dist/build/System/Environment/DropIn.p_o )
  1778. 129.44 s [pathway-compat-base] [ 6 of 15] Compiling System.IO.Error.Caught ( src/System/IO/Error/Caught.hs, dist/build/System/IO/Error/Caught.p_o )
  1779. 129.44 s [pathway-compat-base] [ 7 of 15] Compiling System.IO.Error.Thin ( src/System/IO/Error/Thin.hs, dist/build/System/IO/Error/Thin.p_o )
  1780. 129.45 s [pathway-compat-base] [ 8 of 15] Compiling System.IO.Error.Pathway ( src/System/IO/Error/Pathway.hs, dist/build/System/IO/Error/Pathway.p_o )
  1781. 129.45 s [pathway-compat-base] [ 9 of 15] Compiling System.IO.Error.Overlay ( src/System/IO/Error/Overlay.hs, dist/build/System/IO/Error/Overlay.p_o )
  1782. 129.45 s [pathway-compat-base] [10 of 15] Compiling System.IO.Error.DropIn ( src/System/IO/Error/DropIn.hs, dist/build/System/IO/Error/DropIn.p_o )
  1783. 129.45 s [pathway-compat-base] [11 of 15] Compiling System.IO.Thin ( src/System/IO/Thin.hs, dist/build/System/IO/Thin.p_o )
  1784. 129.45 s [pathway-compat-base] [12 of 15] Compiling System.IO.Overlay ( src/System/IO/Overlay.hs, dist/build/System/IO/Overlay.p_o )
  1785. 129.45 s [pathway-compat-base] [13 of 15] Compiling System.IO.DropIn ( src/System/IO/DropIn.hs, dist/build/System/IO/DropIn.p_o )
  1786. 129.50 s [pathway-compat-base] [14 of 15] Compiling System.IO.Caught ( src/System/IO/Caught.hs, dist/build/System/IO/Caught.p_o )
  1787. 129.50 s [pathway-compat-base] [15 of 15] Compiling System.IO.Pathway ( src/System/IO/Pathway.hs, dist/build/System/IO/Pathway.p_o )
  1788. 129.96 s [pathway-path] Preprocessing test suite 'doctests' for pathway-path-0.0.1.0..
  1789. 129.96 s [pathway-path] Building test suite 'doctests' for pathway-path-0.0.1.0..
  1790. 130.02 s [pathway-path] [1 of 2] Compiling Build_doctests ( dist/build/doctests/autogen/Build_doctests.hs, dist/build/doctests/doctests-tmp/Build_doctests.o )
  1791. 130.19 s [pathway-path] [2 of 2] Compiling Main ( tests/doctests.hs, dist/build/doctests/doctests-tmp/Main.o )
  1792. 130.41 s [pathway-path] [3 of 3] Linking dist/build/doctests/doctests
  1793. 130.96 s [pathway-compat-base] Preprocessing test suite 'doctests' for pathway-compat-base-0.0.1.0..
  1794. 130.96 s [pathway-compat-base] Building test suite 'doctests' for pathway-compat-base-0.0.1.0..
  1795. 131.01 s [pathway-compat-base] [1 of 2] Compiling Build_doctests ( dist/build/doctests/autogen/Build_doctests.hs, dist/build/doctests/doctests-tmp/Build_doctests.o )
  1796. 131.19 s [pathway-compat-base] [2 of 2] Compiling Main ( tests/doctests.hs, dist/build/doctests/doctests-tmp/Main.o )
  1797. 131.41 s [pathway-compat-base] [3 of 3] Linking dist/build/doctests/doctests
  1798. 133.65 s [pathway-path] Phase: checkPhase
  1799. 133.69 s [pathway-path] Running 1 test suites...
  1800. 133.69 s [pathway-path] Test suite doctests: RUNNING...
  1801. 134.06 s [pathway-path] Examples: 0 Tried: 0 Errors: 0 Failures: 0
  1802. 134.10 s [pathway-path] Test suite doctests: PASS
  1803. 134.10 s [pathway-path] Test suite logged to: dist/test/pathway-path-0.0.1.0-doctests.log
  1804. 134.10 s [pathway-path] 1 of 1 test suites (1 of 1 test cases) passed.
  1805. 134.10 s [pathway-path] Phase: haddockPhase
  1806. 134.21 s [pathway-path] Preprocessing library for pathway-path-0.0.1.0..
  1807. 134.22 s [pathway-path] Running Haddock on library for pathway-path-0.0.1.0..
  1808. 134.22 s [pathway-path] Warning: The documentation for the following packages are not installed. No
  1809. 134.22 s [pathway-path] links will be generated to these packages: path-0.9.6, path-0.9.6,
  1810. 134.22 s [pathway-path] vector-0.13.2.0
  1811. 134.27 s [pathway-path] Warning: --source-* options are ignored when --hyperlinked-source is enabled.
  1812. 134.37 s [pathway-path] [1 of 1] Compiling Data.Path.Integration.Path ( src/Data/Path/Integration/Path.hs, nothing )
  1813. 134.43 s [pathway-compat-base] Phase: checkPhase
  1814. 134.50 s [pathway-compat-base] Running 1 test suites...
  1815. 134.50 s [pathway-compat-base] Test suite doctests: RUNNING...
  1816. 134.60 s [pathway-path] Haddock coverage:
  1817. 134.61 s [pathway-path] Warning: 'Any' is out of scope.
  1818. 134.61 s [pathway-path] If you qualify the identifier, haddock can try to link it anyway.
  1819. 134.61 s [pathway-path] Warning: 'AmbiguousPath' is out of scope.
  1820. 134.61 s [pathway-path] If you qualify the identifier, haddock can try to link it anyway.
  1821. 134.61 s [pathway-path] 100% ( 1 / 1) in 'Data.Path.Integration.Path'
  1822. 134.73 s [pathway-path] Warning: Data.Path.Integration.Path: could not find link destinations for:
  1823. 134.73 s [pathway-path] - Path.Internal.Posix.Path
  1824. 134.73 s [pathway-path] - Path.Posix.Abs
  1825. 134.73 s [pathway-path] - Path.Posix.Dir
  1826. 134.73 s [pathway-path] - Path.Posix.File
  1827. 134.73 s [pathway-path] - Path.Posix.Rel
  1828. 134.73 s [pathway-path] - Path.Posix.SomeBase
  1829. 134.75 s [pathway-compat-base]
  1830. 134.75 s [pathway-compat-base] on the commandline: warning: [GHC-98887]
  1831. 134.75 s [pathway-compat-base] -XTemplateHaskell is not allowed in Safe Haskell; ignoring -XTemplateHaskell
  1832. 134.75 s [pathway-compat-base]
  1833. 134.75 s [pathway-compat-base] on the commandline: warning: [GHC-98887]
  1834. 134.75 s [pathway-compat-base] -XTemplateHaskell is not allowed in Safe Haskell; ignoring -XTemplateHaskell
  1835. 134.75 s [pathway-compat-base]
  1836. 134.75 s [pathway-compat-base] on the commandline: warning: [GHC-98887]
  1837. 134.75 s [pathway-compat-base] -XTemplateHaskell is not allowed in Safe Haskell; ignoring -XTemplateHaskell
  1838. 134.75 s [pathway-compat-base]
  1839. 134.75 s [pathway-compat-base] on the commandline: warning: [GHC-98887]
  1840. 134.75 s [pathway-compat-base] -XTemplateHaskell is not allowed in Safe Haskell; ignoring -XTemplateHaskell
  1841. 134.77 s [pathway-compat-base]
  1842. 134.77 s [pathway-compat-base] on the commandline: warning: [GHC-98887]
  1843. 134.77 s [pathway-compat-base] -XTemplateHaskell is not allowed in Safe Haskell; ignoring -XTemplateHaskell
  1844. 134.77 s [pathway-compat-base]
  1845. 134.77 s [pathway-compat-base] on the commandline: warning: [GHC-98887]
  1846. 134.77 s [pathway-compat-base] -XTemplateHaskell is not allowed in Safe Haskell; ignoring -XTemplateHaskell
  1847. 134.77 s [pathway-compat-base]
  1848. 134.77 s [pathway-compat-base] on the commandline: warning: [GHC-98887]
  1849. 134.77 s [pathway-compat-base] -XTemplateHaskell is not allowed in Safe Haskell; ignoring -XTemplateHaskell
  1850. 134.77 s [pathway-compat-base]
  1851. 134.77 s [pathway-compat-base] on the commandline: warning: [GHC-98887]
  1852. 134.77 s [pathway-compat-base] -XTemplateHaskell is not allowed in Safe Haskell; ignoring -XTemplateHaskell
  1853. 134.77 s [pathway-compat-base]
  1854. 134.77 s [pathway-compat-base] on the commandline: warning: [GHC-98887]
  1855. 134.77 s [pathway-compat-base] -XTemplateHaskell is not allowed in Safe Haskell; ignoring -XTemplateHaskell
  1856. 134.77 s [pathway-compat-base]
  1857. 134.77 s [pathway-compat-base] on the commandline: warning: [GHC-98887]
  1858. 134.77 s [pathway-compat-base] -XTemplateHaskell is not allowed in Safe Haskell; ignoring -XTemplateHaskell
  1859. 134.77 s [pathway-compat-base]
  1860. 134.77 s [pathway-compat-base] on the commandline: warning: [GHC-98887]
  1861. 134.77 s [pathway-compat-base] -XTemplateHaskell is not allowed in Safe Haskell; ignoring -XTemplateHaskell
  1862. 134.77 s [pathway-compat-base]
  1863. 134.77 s [pathway-compat-base] on the commandline: warning: [GHC-98887]
  1864. 134.77 s [pathway-compat-base] -XTemplateHaskell is not allowed in Safe Haskell; ignoring -XTemplateHaskell
  1865. 134.77 s [pathway-compat-base]
  1866. 134.77 s [pathway-compat-base] on the commandline: warning: [GHC-98887]
  1867. 134.77 s [pathway-compat-base] -XTemplateHaskell is not allowed in Safe Haskell; ignoring -XTemplateHaskell
  1868. 134.77 s [pathway-compat-base]
  1869. 134.77 s [pathway-compat-base] on the commandline: warning: [GHC-98887]
  1870. 134.77 s [pathway-compat-base] -XTemplateHaskell is not allowed in Safe Haskell; ignoring -XTemplateHaskell
  1871. 134.79 s [pathway-compat-base]
  1872. 134.79 s [pathway-compat-base] on the commandline: warning: [GHC-98887]
  1873. 134.79 s [pathway-compat-base] -XTemplateHaskell is not allowed in Safe Haskell; ignoring -XTemplateHaskell
  1874. 134.79 s [pathway-compat-base]
  1875. 134.79 s [pathway-compat-base] on the commandline: warning: [GHC-98887]
  1876. 134.79 s [pathway-compat-base] -XTemplateHaskell is not allowed in Safe Haskell; ignoring -XTemplateHaskell
  1877. 134.79 s [pathway-compat-base]
  1878. 134.79 s [pathway-compat-base] on the commandline: warning: [GHC-98887]
  1879. 134.79 s [pathway-compat-base] -XTemplateHaskell is not allowed in Safe Haskell; ignoring -XTemplateHaskell
  1880. 134.79 s [pathway-compat-base]
  1881. 134.79 s [pathway-compat-base] on the commandline: warning: [GHC-98887]
  1882. 134.79 s [pathway-compat-base] -XTemplateHaskell is not allowed in Safe Haskell; ignoring -XTemplateHaskell
  1883. 134.79 s [pathway-compat-base]
  1884. 134.79 s [pathway-compat-base] on the commandline: warning: [GHC-98887]
  1885. 134.79 s [pathway-compat-base] -XTemplateHaskell is not allowed in Safe Haskell; ignoring -XTemplateHaskell
  1886. 134.79 s [pathway-compat-base]
  1887. 134.79 s [pathway-compat-base] on the commandline: warning: [GHC-98887]
  1888. 134.79 s [pathway-compat-base] -XTemplateHaskell is not allowed in Safe Haskell; ignoring -XTemplateHaskell
  1889. 134.79 s [pathway-compat-base]
  1890. 134.79 s [pathway-compat-base] on the commandline: warning: [GHC-98887]
  1891. 134.79 s [pathway-compat-base] -XTemplateHaskell is not allowed in Safe Haskell; ignoring -XTemplateHaskell
  1892. 134.79 s [pathway-compat-base]
  1893. 134.79 s [pathway-compat-base] on the commandline: warning: [GHC-98887]
  1894. 134.79 s [pathway-compat-base] -XTemplateHaskell is not allowed in Safe Haskell; ignoring -XTemplateHaskell
  1895. 134.80 s [pathway-compat-base]
  1896. 134.80 s [pathway-compat-base] on the commandline: warning: [GHC-98887]
  1897. 134.80 s [pathway-compat-base] -XTemplateHaskell is not allowed in Safe Haskell; ignoring -XTemplateHaskell
  1898. 135.20 s [pathway-compat-base] Examples: 0 Tried: 0 Errors: 0 Failures: 0
  1899. 135.26 s [pathway-compat-base] Test suite doctests: PASS
  1900. 135.26 s [pathway-compat-base] Test suite logged to: dist/test/pathway-compat-base-0.0.1.0-doctests.log
  1901. 135.26 s [pathway-compat-base] 1 of 1 test suites (1 of 1 test cases) passed.
  1902. 135.26 s [pathway-compat-base] Phase: haddockPhase
  1903. 135.36 s [pathway-compat-base] Preprocessing library for pathway-compat-base-0.0.1.0..
  1904. 135.36 s [pathway-compat-base] Running Haddock on library for pathway-compat-base-0.0.1.0..
  1905. 135.37 s [pathway-compat-base] Warning: The documentation for the following packages are not installed. No
  1906. 135.37 s [pathway-compat-base] links will be generated to these packages: vector-0.13.2.0
  1907. 135.41 s [pathway-compat-base] Warning: --source-* options are ignored when --hyperlinked-source is enabled.
  1908. 135.56 s [pathway-compat-base] [ 1 of 15] Compiling Common ( src/Common.hs, nothing )
  1909. 135.85 s [pathway-compat-base] [ 2 of 15] Compiling System.Environment.Thin ( src/System/Environment/Thin.hs, nothing )
  1910. 135.86 s [pathway-compat-base] [ 3 of 15] Compiling System.Environment.Pathway ( src/System/Environment/Pathway.hs, nothing )
  1911. 135.86 s [pathway-compat-base] [ 4 of 15] Compiling System.Environment.Overlay ( src/System/Environment/Overlay.hs, nothing )
  1912. 135.86 s [pathway-compat-base] [ 5 of 15] Compiling System.Environment.DropIn ( src/System/Environment/DropIn.hs, nothing )
  1913. 135.86 s [pathway-compat-base] [ 6 of 15] Compiling System.IO.Error.Caught ( src/System/IO/Error/Caught.hs, nothing )
  1914. 135.88 s [pathway-compat-base] [ 7 of 15] Compiling System.IO.Error.Thin ( src/System/IO/Error/Thin.hs, nothing )
  1915. 135.88 s [pathway-compat-base] [ 8 of 15] Compiling System.IO.Error.Pathway ( src/System/IO/Error/Pathway.hs, nothing )
  1916. 135.89 s [pathway-compat-base] [ 9 of 15] Compiling System.IO.Error.Overlay ( src/System/IO/Error/Overlay.hs, nothing )
  1917. 135.89 s [pathway-compat-base] [10 of 15] Compiling System.IO.Error.DropIn ( src/System/IO/Error/DropIn.hs, nothing )
  1918. 135.89 s [pathway-compat-base] [11 of 15] Compiling System.IO.Thin ( src/System/IO/Thin.hs, nothing )
  1919. 135.90 s [pathway-compat-base] [12 of 15] Compiling System.IO.Overlay ( src/System/IO/Overlay.hs, nothing )
  1920. 135.90 s [pathway-compat-base] [13 of 15] Compiling System.IO.DropIn ( src/System/IO/DropIn.hs, nothing )
  1921. 135.91 s [pathway-compat-base] [14 of 15] Compiling System.IO.Caught ( src/System/IO/Caught.hs, nothing )
  1922. 135.92 s [pathway-compat-base] [15 of 15] Compiling System.IO.Pathway ( src/System/IO/Pathway.hs, nothing )
  1923. 135.92 s [pathway-compat-base] Haddock coverage:
  1924. 135.93 s [pathway-compat-base] Warning: '</?>' is out of scope.
  1925. 135.93 s [pathway-compat-base] If you qualify the identifier, haddock can try to link it anyway.
  1926. 135.93 s [pathway-compat-base] Warning: '<$>' is out of scope.
  1927. 135.93 s [pathway-compat-base] If you qualify the identifier, haddock can try to link it anyway.
  1928. 135.93 s [pathway-compat-base] Warning: 'getCurrentDirectory' is out of scope.
  1929. 135.93 s [pathway-compat-base] If you qualify the identifier, haddock can try to link it anyway.
  1930. 135.93 s [pathway-compat-base] Warning: 'makeRelativeToCurrentDirectory' is out of scope.
  1931. 135.93 s [pathway-compat-base] If you qualify the identifier, haddock can try to link it anyway.
  1932. 135.93 s [pathway-compat-base] Warning: 'IOError' is out of scope.
  1933. 135.93 s [pathway-compat-base] If you qualify the identifier, haddock can try to link it anyway.
  1934. 135.93 s [pathway-compat-base] 14% ( 1 / 7) in 'Common'
  1935. 135.93 s [pathway-compat-base] Missing documentation for:
  1936. 135.93 s [pathway-compat-base] InternalFailure (src/Common.hs:69)
  1937. 135.93 s [pathway-compat-base] toPathRep (src/Common.hs:85)
  1938. 135.93 s [pathway-compat-base] fromPathRep (src/Common.hs:91)
  1939. 135.93 s [pathway-compat-base] handleAnchoredPath (src/Common.hs:98)
  1940. 135.93 s [pathway-compat-base] absFileFromPathRep (src/Common.hs:104)
  1941. 135.93 s [pathway-compat-base] fileFromPathRep (src/Common.hs:120)
  1942. 135.93 s [pathway-compat-base] Warning: '</?>' is out of scope.
  1943. 135.93 s [pathway-compat-base] If you qualify the identifier, haddock can try to link it anyway.
  1944. 135.93 s [pathway-compat-base] Warning: 'getCurrentDirectory' is out of scope.
  1945. 135.93 s [pathway-compat-base] If you qualify the identifier, haddock can try to link it anyway.
  1946. 135.93 s [pathway-compat-base] Warning: 'makeRelativeToCurrentDirectory' is out of scope.
  1947. 135.93 s [pathway-compat-base] If you qualify the identifier, haddock can try to link it anyway.
  1948. 135.93 s [pathway-compat-base] Warning: 'IOError' is out of scope.
  1949. 135.93 s [pathway-compat-base] If you qualify the identifier, haddock can try to link it anyway.
  1950. 135.93 s [pathway-compat-base] Warning: 'Anchored' is out of scope.
  1951. 135.93 s [pathway-compat-base] If you qualify the identifier, haddock can try to link it anyway.
  1952. 135.93 s [pathway-compat-base] 33% ( 1 / 3) in 'System.Environment.Thin'
  1953. 135.93 s [pathway-compat-base] Missing documentation for:
  1954. 135.93 s [pathway-compat-base] executablePath (src/System/Environment/Thin.hs:58)
  1955. 135.93 s [pathway-compat-base] getExecutablePath (src/System/Environment/Thin.hs:72)
  1956. 135.93 s [pathway-compat-base] 100% ( 11 / 11) in 'System.Environment.Pathway'
  1957. 135.93 s [pathway-compat-base] Warning: '</?>' is out of scope.
  1958. 135.93 s [pathway-compat-base] If you qualify the identifier, haddock can try to link it anyway.
  1959. 135.93 s [pathway-compat-base] Warning: 'getCurrentDirectory' is out of scope.
  1960. 135.93 s [pathway-compat-base] If you qualify the identifier, haddock can try to link it anyway.
  1961. 135.93 s [pathway-compat-base] Warning: 'makeRelativeToCurrentDirectory' is out of scope.
  1962. 135.93 s [pathway-compat-base] If you qualify the identifier, haddock can try to link it anyway.
  1963. 135.93 s [pathway-compat-base] Warning: 'IOError' is out of scope.
  1964. 135.93 s [pathway-compat-base] If you qualify the identifier, haddock can try to link it anyway.
  1965. 135.93 s [pathway-compat-base] 33% ( 1 / 3) in 'System.Environment.Overlay'
  1966. 135.93 s [pathway-compat-base] Missing documentation for:
  1967. 135.93 s [pathway-compat-base] executablePath (src/System/Environment/Overlay.hs:51)
  1968. 135.93 s [pathway-compat-base] getExecutablePath (src/System/Environment/Overlay.hs:55)
  1969. 135.93 s [pathway-compat-base] 100% ( 11 / 11) in 'System.Environment.DropIn'
  1970. 135.93 s [pathway-compat-base] 90% ( 10 / 11) in 'System.IO.Error.Caught'
  1971. 135.93 s [pathway-compat-base] Missing documentation for:
  1972. 135.93 s [pathway-compat-base] AlreadyInUseError (src/System/IO/Error/Caught.hs:103)
  1973. 135.93 s [pathway-compat-base] 0% ( 0 / 5) in 'System.IO.Error.Thin'
  1974. 135.93 s [pathway-compat-base] Missing documentation for:
  1975. 135.93 s [pathway-compat-base] Module header
  1976. 135.93 s [pathway-compat-base] mkIOError (src/System/IO/Error/Thin.hs:29)
  1977. 135.93 s [pathway-compat-base] annotateIOError (src/System/IO/Error/Thin.hs:33)
  1978. 135.93 s [pathway-compat-base] ioeGetFileName (src/System/IO/Error/Thin.hs:39)
  1979. 135.93 s [pathway-compat-base] ioeSetFileName (src/System/IO/Error/Thin.hs:42)
  1980. 135.93 s [pathway-compat-base] 82% ( 37 / 45) in 'System.IO.Error.Pathway'
  1981. 135.93 s [pathway-compat-base] Missing documentation for:
  1982. 135.93 s [pathway-compat-base] ioeGetErrorType
  1983. 135.93 s [pathway-compat-base] ioeGetErrorString
  1984. 135.93 s [pathway-compat-base] ioeGetLocation
  1985. 135.93 s [pathway-compat-base] ioeGetHandle
  1986. 135.93 s [pathway-compat-base] ioeSetErrorType
  1987. 135.93 s [pathway-compat-base] ioeSetErrorString
  1988. 135.93 s [pathway-compat-base] ioeSetLocation
  1989. 135.93 s [pathway-compat-base] ioeSetHandle
  1990. 135.93 s [pathway-compat-base] 0% ( 0 / 2) in 'System.IO.Error.Overlay'
  1991. 135.93 s [pathway-compat-base] Missing documentation for:
  1992. 135.93 s [pathway-compat-base] Module header
  1993. 135.93 s [pathway-compat-base] ioeGetFileName (src/System/IO/Error/Overlay.hs:21)
  1994. 135.93 s [pathway-compat-base] 76% ( 36 / 47) in 'System.IO.Error.DropIn'
  1995. 135.93 s [pathway-compat-base] Missing documentation for:
  1996. 135.93 s [pathway-compat-base] ioeGetErrorType
  1997. 135.93 s [pathway-compat-base] ioeGetErrorString
  1998. 135.93 s [pathway-compat-base] ioeGetLocation
  1999. 135.93 s [pathway-compat-base] ioeGetHandle
  2000. 135.93 s [pathway-compat-base] ioeSetErrorType
  2001. 135.93 s [pathway-compat-base] ioeSetErrorString
  2002. 135.93 s [pathway-compat-base] ioeSetLocation
  2003. 135.93 s [pathway-compat-base] ioeSetHandle
  2004. 135.93 s [pathway-compat-base] mkIOError (src/System/IO/Error/Thin.hs:29)
  2005. 135.93 s [pathway-compat-base] ioeSetFileName (src/System/IO/Error/Thin.hs:42)
  2006. 135.93 s [pathway-compat-base] annotateIOError (src/System/IO/Error/Thin.hs:33)
  2007. 135.93 s [pathway-compat-base] 0% ( 0 / 13) in 'System.IO.Thin'
  2008. 135.93 s [pathway-compat-base] Missing documentation for:
  2009. 135.93 s [pathway-compat-base] Module header
  2010. 135.93 s [pathway-compat-base] withFile (src/System/IO/Thin.hs:32)
  2011. 135.93 s [pathway-compat-base] openFile (src/System/IO/Thin.hs:35)
  2012. 135.93 s [pathway-compat-base] readFile (src/System/IO/Thin.hs:38)
  2013. 135.93 s [pathway-compat-base] readFile' (src/System/IO/Thin.hs:41)
  2014. 135.93 s [pathway-compat-base] writeFile (src/System/IO/Thin.hs:44)
  2015. 135.94 s [pathway-compat-base] appendFile (src/System/IO/Thin.hs:47)
  2016. 135.94 s [pathway-compat-base] withBinaryFile (src/System/IO/Thin.hs:50)
  2017. 135.94 s [pathway-compat-base] openBinaryFile (src/System/IO/Thin.hs:53)
  2018. 135.94 s [pathway-compat-base] openTempFile (src/System/IO/Thin.hs:66)
  2019. 135.94 s [pathway-compat-base] openBinaryTempFile (src/System/IO/Thin.hs:80)
  2020. 135.94 s [pathway-compat-base] openTempFileWithDefaultPermissions (src/System/IO/Thin.hs:89)
  2021. 135.94 s [pathway-compat-base] openBinaryTempFileWithDefaultPermissions (src/System/IO/Thin.hs:98)
  2022. 135.94 s [pathway-compat-base] 0% ( 0 / 5) in 'System.IO.Overlay'
  2023. 135.94 s [pathway-compat-base] Missing documentation for:
  2024. 135.94 s [pathway-compat-base] Module header
  2025. 135.94 s [pathway-compat-base] openTempFile (src/System/IO/Overlay.hs:24)
  2026. 135.94 s [pathway-compat-base] openBinaryTempFile (src/System/IO/Overlay.hs:30)
  2027. 135.94 s [pathway-compat-base] openTempFileWithDefaultPermissions (src/System/IO/Overlay.hs:34)
  2028. 135.94 s [pathway-compat-base] openBinaryTempFileWithDefaultPermissions (src/System/IO/Overlay.hs:41)
  2029. 135.94 s [pathway-compat-base] 80% ( 73 / 91) in 'System.IO.DropIn'
  2030. 135.94 s [pathway-compat-base] Missing documentation for:
  2031. 135.94 s [pathway-compat-base] stdout
  2032. 135.94 s [pathway-compat-base] stdin
  2033. 135.94 s [pathway-compat-base] stderr
  2034. 135.94 s [pathway-compat-base] hPutBufNonBlocking
  2035. 135.94 s [pathway-compat-base] HandlePosn
  2036. 135.94 s [pathway-compat-base] hIsOpen
  2037. 135.94 s [pathway-compat-base] hIsClosed
  2038. 135.94 s [pathway-compat-base] hIsReadable
  2039. 135.94 s [pathway-compat-base] hIsWritable
  2040. 135.94 s [pathway-compat-base] hIsSeekable
  2041. 135.94 s [pathway-compat-base] openFile (src/System/IO/Thin.hs:35)
  2042. 135.94 s [pathway-compat-base] readFile' (src/System/IO/Thin.hs:41)
  2043. 135.94 s [pathway-compat-base] writeFile (src/System/IO/Thin.hs:44)
  2044. 135.94 s [pathway-compat-base] withFile (src/System/IO/Thin.hs:32)
  2045. 135.94 s [pathway-compat-base] openBinaryFile (src/System/IO/Thin.hs:53)
  2046. 135.94 s [pathway-compat-base] withBinaryFile (src/System/IO/Thin.hs:50)
  2047. 135.94 s [pathway-compat-base] readFile (src/System/IO/Thin.hs:38)
  2048. 135.94 s [pathway-compat-base] appendFile (src/System/IO/Thin.hs:47)
  2049. 135.94 s [pathway-compat-base] 20% ( 1 / 5) in 'System.IO.Caught'
  2050. 135.94 s [pathway-compat-base] Missing documentation for:
  2051. 135.94 s [pathway-compat-base] Module header
  2052. 135.94 s [pathway-compat-base] OpenFileFailure (src/System/IO/Caught.hs:38)
  2053. 135.94 s [pathway-compat-base] openFile (src/System/IO/Caught.hs:50)
  2054. 135.94 s [pathway-compat-base] recoverOpenFileFailure (src/System/IO/Caught.hs:41)
  2055. 135.94 s [pathway-compat-base] 77% ( 73 / 94) in 'System.IO.Pathway'
  2056. 135.94 s [pathway-compat-base] Missing documentation for:
  2057. 135.94 s [pathway-compat-base] stdout
  2058. 135.94 s [pathway-compat-base] stdin
  2059. 135.94 s [pathway-compat-base] stderr
  2060. 135.94 s [pathway-compat-base] hPutBufNonBlocking
  2061. 135.94 s [pathway-compat-base] HandlePosn
  2062. 135.94 s [pathway-compat-base] hIsOpen
  2063. 135.94 s [pathway-compat-base] hIsClosed
  2064. 135.94 s [pathway-compat-base] hIsReadable
  2065. 135.94 s [pathway-compat-base] hIsWritable
  2066. 135.94 s [pathway-compat-base] hIsSeekable
  2067. 135.94 s [pathway-compat-base] readFile' (src/System/IO/Thin.hs:41)
  2068. 135.94 s [pathway-compat-base] writeFile (src/System/IO/Thin.hs:44)
  2069. 135.94 s [pathway-compat-base] withFile (src/System/IO/Thin.hs:32)
  2070. 135.94 s [pathway-compat-base] openBinaryFile (src/System/IO/Thin.hs:53)
  2071. 135.94 s [pathway-compat-base] withBinaryFile (src/System/IO/Thin.hs:50)
  2072. 135.94 s [pathway-compat-base] readFile (src/System/IO/Thin.hs:38)
  2073. 135.94 s [pathway-compat-base] appendFile (src/System/IO/Thin.hs:47)
  2074. 135.94 s [pathway-compat-base] openTempFile (src/System/IO/Thin.hs:66)
  2075. 135.94 s [pathway-compat-base] openBinaryTempFile (src/System/IO/Thin.hs:80)
  2076. 135.94 s [pathway-compat-base] openTempFileWithDefaultPermissions (src/System/IO/Thin.hs:89)
  2077. 135.94 s [pathway-compat-base] openBinaryTempFileWithDefaultPermissions (src/System/IO/Thin.hs:98)
  2078. 136.28 s [pathway-compat-base] Warning: Common: could not find link destinations for:
  2079. 136.28 s [pathway-compat-base] - Common.Rep_InternalFailure
  2080. 136.28 s [pathway-compat-base] Warning: System.IO.Error.Caught: could not find link destinations for:
  2081. 136.28 s [pathway-compat-base] - System.IO.Error.Caught.Rep_UnsatisfiedConstraints
  2082. 136.28 s [pathway-compat-base] - System.IO.Error.Caught.Rep_UnsupportedOperation
  2083. 136.28 s [pathway-compat-base] - System.IO.Error.Caught.Rep_AlreadyInUseError
  2084. 136.28 s [pathway-compat-base] - System.IO.Error.Caught.Rep_AlreadyExistsError
  2085. 136.28 s [pathway-compat-base] - System.IO.Error.Caught.Rep_DoesNotExistError
  2086. 136.28 s [pathway-compat-base] - System.IO.Error.Caught.Rep_FullError
  2087. 136.28 s [pathway-compat-base] - System.IO.Error.Caught.Rep_InappropriateType
  2088. 136.28 s [pathway-compat-base] - System.IO.Error.Caught.Rep_InvalidArgument
  2089. 136.28 s [pathway-compat-base] - System.IO.Error.Caught.Rep_HardwareFault
  2090. 136.28 s [pathway-compat-base] - System.IO.Error.Caught.Rep_PermissionError
  2091. 136.29 s [pathway-compat-base] Warning: System.IO.DropIn: could not find link destinations for:
  2092. 136.29 s [pathway-compat-base] - Control.Monad.Primitive.D:R:PrimStateIO
  2093. 136.29 s [pathway-compat-base] - Text.Printf.UPrintf
  2094. 136.29 s [pathway-compat-base] - Text.Printf.hspr
  2095. 136.29 s [pathway-compat-base] - Text.Printf.spr
  2096. 136.30 s [pathway-compat-base] Warning: System.IO.Pathway: could not find link destinations for:
  2097. 136.30 s [pathway-compat-base] - Control.Monad.Primitive.D:R:PrimStateIO
  2098. 136.30 s [pathway-compat-base] - Text.Printf.UPrintf
  2099. 136.30 s [pathway-compat-base] - Text.Printf.hspr
  2100. 136.30 s [pathway-compat-base] - Text.Printf.spr
  2101. 138.60 s [pathway-path] Documentation created: dist/doc/html/pathway-path/,
  2102. 138.60 s [pathway-path] dist/doc/html/pathway-path/pathway-path.txt
  2103. 138.65 s [pathway-path] Preprocessing test suite 'doctests' for pathway-path-0.0.1.0..
  2104. 138.65 s [pathway-path] Phase: installPhase
  2105. 138.73 s [pathway-path] Installing library in /nix/store/vpm197ksjcqdaf88lmplg7fa309xan4f-pathway-path-0.0.1.0/lib/ghc-9.8.4/lib/x86_64-linux-ghc-9.8.4/pathway-path-0.0.1.0-1gBdfnbBkz7Jht1AQhKOGl
  2106. 138.89 s [pathway-path] Phase: fixupPhase
  2107. 138.91 s [pathway-path] shrinking RPATHs of ELF executables and libraries in /nix/store/vpm197ksjcqdaf88lmplg7fa309xan4f-pathway-path-0.0.1.0
  2108. 138.91 s [pathway-path] shrinking /nix/store/vpm197ksjcqdaf88lmplg7fa309xan4f-pathway-path-0.0.1.0/lib/ghc-9.8.4/lib/x86_64-linux-ghc-9.8.4/libHSpathway-path-0.0.1.0-1gBdfnbBkz7Jht1AQhKOGl-ghc9.8.4.so
  2109. 138.94 s [pathway-path] checking for references to /build/ in /nix/store/vpm197ksjcqdaf88lmplg7fa309xan4f-pathway-path-0.0.1.0...
  2110. 138.95 s [pathway-path] patching script interpreter paths in /nix/store/vpm197ksjcqdaf88lmplg7fa309xan4f-pathway-path-0.0.1.0
  2111. 138.95 s [pathway-path] stripping (with command strip and flags -S -p) in /nix/store/vpm197ksjcqdaf88lmplg7fa309xan4f-pathway-path-0.0.1.0/lib
  2112. 138.98 s [pathway-path] shrinking RPATHs of ELF executables and libraries in /nix/store/ld9397k8jc0klnls538mwpw7mk8cgli2-pathway-path-0.0.1.0-doc
  2113. 138.98 s [pathway-path] checking for references to /build/ in /nix/store/ld9397k8jc0klnls538mwpw7mk8cgli2-pathway-path-0.0.1.0-doc...
  2114. 138.99 s [pathway-path] patching script interpreter paths in /nix/store/ld9397k8jc0klnls538mwpw7mk8cgli2-pathway-path-0.0.1.0-doc
  2115. 139.08 s [pathway-path:post-build] Uploading to cachix cache "sellout": /nix/store/ld9397k8jc0klnls538mwpw7mk8cgli2-pathway-path-0.0.1.0-doc /nix/store/vpm197ksjcqdaf88lmplg7fa309xan4f-pathway-path-0.0.1.0
  2116. 139.60 s [pathway-path:post-build] Pushing 2 paths (213 are already present) using zstd to cache sellout ⏳
  2117. 139.60 s [pathway-path:post-build]
  2118. 139.96 s [pathway-path:post-build] Pushing /nix/store/ld9397k8jc0klnls538mwpw7mk8cgli2-pathway-path-0.0.1.0-doc (263.15 KiB)
  2119. 140.05 s [pathway-path:post-build] Pushing /nix/store/vpm197ksjcqdaf88lmplg7fa309xan4f-pathway-path-0.0.1.0 (217.70 KiB)
  2120. 141.05 s [pathway-path:post-build]
  2121. 141.05 s [pathway-path:post-build] All done.
  2122. 141.06 s [pathway-path:post-build] Uploading to the NixCI cache: /nix/store/ld9397k8jc0klnls538mwpw7mk8cgli2-pathway-path-0.0.1.0-doc /nix/store/vpm197ksjcqdaf88lmplg7fa309xan4f-pathway-path-0.0.1.0
  2123. 141.10 s [pathway-path:post-build] warning: 'warn-short-path-literals' is deprecated, use 'lint-short-path-literals = ignore' instead
  2124. 141.12 s [pathway-path:post-build] copying 2 paths...
  2125. 141.12 s [pathway-path:post-build] copying path '/nix/store/ld9397k8jc0klnls538mwpw7mk8cgli2-pathway-path-0.0.1.0-doc' to 'https://cache.nix-ci.com'...
  2126. 141.60 s [pathway-path:post-build] copying path '/nix/store/vpm197ksjcqdaf88lmplg7fa309xan4f-pathway-path-0.0.1.0' to 'https://cache.nix-ci.com'...
  2127. 141.92 s [pathway-path:post-build] warning: 'warn-short-path-literals' is deprecated, use 'lint-short-path-literals = ignore' instead
  2128. 142.29 s [pathway-path:post-build] copying 17 paths...
  2129. 142.29 s [pathway-path:post-build] copying path '/nix/store/30mk0w4m1qfbq76xn2jc7nlg8a979ffn-integer-conversion-0.1.1.drv' to 'https://cache.nix-ci.com'...
  2130. 142.29 s [pathway-path:post-build] copying path '/nix/store/73ki207pb529c4mvyw7b4qm91j93ihwq-Diff-1.0.2.drv' to 'https://cache.nix-ci.com'...
  2131. 142.29 s [pathway-path:post-build] copying path '/nix/store/1cn3w2kwbxayhdfgvvn8valp7r1r92rv-base64-bytestring-1.2.1.0.drv' to 'https://cache.nix-ci.com'...
  2132. 142.29 s [pathway-path:post-build] copying path '/nix/store/2y4jhj1gd8xcm846bfw3zl36lzdhycf3-th-compat-0.1.6.drv' to 'https://cache.nix-ci.com'...
  2133. 142.29 s [pathway-path:post-build] copying path '/nix/store/sga1g25ks22y4gbwgbp1pxv0vqrk801n-generically-0.1.1.drv' to 'https://cache.nix-ci.com'...
  2134. 142.29 s [pathway-path:post-build] copying path '/nix/store/qr9mazxmdbyivpic84yr87a97rhq9j7c-semialign-1.3.1.drv' to 'https://cache.nix-ci.com'...
  2135. 142.29 s [pathway-path:post-build] copying path '/nix/store/3y602f93m9bdczvq978girls19pnw19m-dlist-1.0.drv' to 'https://cache.nix-ci.com'...
  2136. 142.29 s [pathway-path:post-build] copying path '/nix/store/sawh1hb2v0im038wn729abl9rvf1cbqw-witherable-0.5.drv' to 'https://cache.nix-ci.com'...
  2137. 142.29 s [pathway-path:post-build] copying path '/nix/store/v5hr9cx54zc8zp1q4z9k5h16ffwxcvs1-base16-bytestring-1.0.2.0.drv' to 'https://cache.nix-ci.com'...
  2138. 142.29 s [pathway-path:post-build] copying path '/nix/store/85hbimxj6l601i18567vvxnh0asf9cr8-character-ps-0.1.drv' to 'https://cache.nix-ci.com'...
  2139. 142.55 s [pathway-path:post-build] copying path '/nix/store/haz9kkxic7wn8w2vp8cb5gs0ga211c36-text-iso8601-0.1.1.drv' to 'https://cache.nix-ci.com'...
  2140. 142.56 s [pathway-path:post-build] copying path '/nix/store/17paavaxkihkl2i034l60dqbg3nls6z3-network-uri-2.6.4.2.drv' to 'https://cache.nix-ci.com'...
  2141. 142.59 s [pathway-path:post-build] copying path '/nix/store/fppjvzmhx7bb60g69gpipwd1lkhh2f25-typed-process-0.2.13.0.drv' to 'https://cache.nix-ci.com'...
  2142. 142.82 s [pathway-path:post-build] copying path '/nix/store/z4fmik54b6bzqk6qqkcb9pj6k8nrqdmz-tasty-golden-2.3.5.drv' to 'https://cache.nix-ci.com'...
  2143. 143.05 s [pathway-path:post-build] copying path '/nix/store/b8bmvkqs830jvj65cvn8j3hsrlh0xj26-aeson-2.2.3.0.drv' to 'https://cache.nix-ci.com'...
  2144. 143.28 s [pathway-path:post-build] copying path '/nix/store/k387jb0yi9mm4mqgf3bx9yhfkd0cik0v-path-0.9.6.drv' to 'https://cache.nix-ci.com'...
  2145. 143.51 s [pathway-path:post-build] copying path '/nix/store/3bz58wy5dnv86iixnxdamks3jahnkfvk-pathway-path-0.0.1.0.drv' to 'https://cache.nix-ci.com'...
  2146. 143.75 s Uploaded pathway-path in 4.6s
  2147. 143.75 s Progress: 4 of 20 built (1 building), 170 of 170 downloaded from cache
  2148. 143.75 s Built pathway-path in 18.6s
  2149. 143.75 s [pathway-compat-base] Documentation created: dist/doc/html/pathway-compat-base/,
  2150. 143.75 s [pathway-compat-base] dist/doc/html/pathway-compat-base/pathway-compat-base.txt
  2151. 143.75 s [pathway-compat-base] Preprocessing test suite 'doctests' for pathway-compat-base-0.0.1.0..
  2152. 143.75 s [pathway-compat-base] Phase: installPhase
  2153. 143.75 s [pathway-compat-base] Installing library in /nix/store/61cwgjh608q90z9kzvxvx57433mqjy63-pathway-compat-base-0.0.1.0/lib/ghc-9.8.4/lib/x86_64-linux-ghc-9.8.4/pathway-compat-base-0.0.1.0-9LwOiYzUq1SHjg9jvEQyqL
  2154. 143.75 s [pathway-compat-base] Phase: fixupPhase
  2155. 143.75 s [pathway-compat-base] shrinking RPATHs of ELF executables and libraries in /nix/store/61cwgjh608q90z9kzvxvx57433mqjy63-pathway-compat-base-0.0.1.0
  2156. 143.75 s [pathway-compat-base] shrinking /nix/store/61cwgjh608q90z9kzvxvx57433mqjy63-pathway-compat-base-0.0.1.0/lib/ghc-9.8.4/lib/x86_64-linux-ghc-9.8.4/libHSpathway-compat-base-0.0.1.0-9LwOiYzUq1SHjg9jvEQyqL-ghc9.8.4.so
  2157. 143.75 s [pathway-compat-base] checking for references to /build/ in /nix/store/61cwgjh608q90z9kzvxvx57433mqjy63-pathway-compat-base-0.0.1.0...
  2158. 143.75 s [pathway-compat-base] patching script interpreter paths in /nix/store/61cwgjh608q90z9kzvxvx57433mqjy63-pathway-compat-base-0.0.1.0
  2159. 143.75 s [pathway-compat-base] stripping (with command strip and flags -S -p) in /nix/store/61cwgjh608q90z9kzvxvx57433mqjy63-pathway-compat-base-0.0.1.0/lib
  2160. 143.75 s [pathway-compat-base] shrinking RPATHs of ELF executables and libraries in /nix/store/rw67h0pnh3jd7dx34rz4rs7zq7apv3jx-pathway-compat-base-0.0.1.0-doc
  2161. 143.75 s [pathway-compat-base] checking for references to /build/ in /nix/store/rw67h0pnh3jd7dx34rz4rs7zq7apv3jx-pathway-compat-base-0.0.1.0-doc...
  2162. 143.75 s [pathway-compat-base] patching script interpreter paths in /nix/store/rw67h0pnh3jd7dx34rz4rs7zq7apv3jx-pathway-compat-base-0.0.1.0-doc
  2163. 143.82 s [pathway-compat-base:post-build] Uploading to cachix cache "sellout": /nix/store/61cwgjh608q90z9kzvxvx57433mqjy63-pathway-compat-base-0.0.1.0 /nix/store/rw67h0pnh3jd7dx34rz4rs7zq7apv3jx-pathway-compat-base-0.0.1.0-doc
  2164. 144.32 s [pathway-compat-base:post-build] Pushing 2 paths (190 are already present) using zstd to cache sellout ⏳
  2165. 144.32 s [pathway-compat-base:post-build]
  2166. 144.68 s [pathway-compat-base:post-build] Pushing /nix/store/rw67h0pnh3jd7dx34rz4rs7zq7apv3jx-pathway-compat-base-0.0.1.0-doc (1.92 MiB)
  2167. 144.75 s [pathway-compat-base:post-build] Pushing /nix/store/61cwgjh608q90z9kzvxvx57433mqjy63-pathway-compat-base-0.0.1.0 (2.02 MiB)
  2168. 145.97 s [pathway-compat-base:post-build]
  2169. 145.97 s [pathway-compat-base:post-build] All done.
  2170. 145.99 s [pathway-compat-base:post-build] Uploading to the NixCI cache: /nix/store/61cwgjh608q90z9kzvxvx57433mqjy63-pathway-compat-base-0.0.1.0 /nix/store/rw67h0pnh3jd7dx34rz4rs7zq7apv3jx-pathway-compat-base-0.0.1.0-doc
  2171. 146.02 s [pathway-compat-base:post-build] warning: 'warn-short-path-literals' is deprecated, use 'lint-short-path-literals = ignore' instead
  2172. 146.04 s [pathway-compat-base:post-build] copying 6 paths...
  2173. 146.04 s [pathway-compat-base:post-build] copying path '/nix/store/wcfcgw93j320f2zb8s0r916im9rnivmz-recursion-schemes-5.2.3-doc' to 'https://cache.nix-ci.com'...
  2174. 146.70 s [pathway-compat-base:post-build] copying path '/nix/store/1k9g0cxhnxjh3dw2bygn3lycqs2c37sy-variant-1.0.1-doc' to 'https://cache.nix-ci.com'...
  2175. 146.70 s [pathway-compat-base:post-build] copying path '/nix/store/wn20iarv9czcax0m3jcccw9b1n6j4ymm-recursion-schemes-5.2.3' to 'https://cache.nix-ci.com'...
  2176. 147.51 s [pathway-compat-base:post-build] copying path '/nix/store/rw67h0pnh3jd7dx34rz4rs7zq7apv3jx-pathway-compat-base-0.0.1.0-doc' to 'https://cache.nix-ci.com'...
  2177. 148.27 s [pathway-compat-base:post-build] copying path '/nix/store/mzfml1wk1cpka34gh6ybpa42cxsp4yzf-variant-1.0.1' to 'https://cache.nix-ci.com'...
  2178. 150.09 s [pathway-compat-base:post-build] copying path '/nix/store/61cwgjh608q90z9kzvxvx57433mqjy63-pathway-compat-base-0.0.1.0' to 'https://cache.nix-ci.com'...
  2179. 150.70 s [pathway-compat-base:post-build] warning: 'warn-short-path-literals' is deprecated, use 'lint-short-path-literals = ignore' instead
  2180. 150.98 s [pathway-compat-base:post-build] copying 3 paths...
  2181. 150.98 s [pathway-compat-base:post-build] copying path '/nix/store/pyxhg1clqmlkjpc0fbkh6dc3d0cb7djj-recursion-schemes-5.2.3.drv' to 'https://cache.nix-ci.com'...
  2182. 151.59 s [pathway-compat-base:post-build] copying path '/nix/store/nk631nxibx48z5na47acg8ddanr0yavh-variant-1.0.1.drv' to 'https://cache.nix-ci.com'...
  2183. 151.85 s [pathway-compat-base:post-build] copying path '/nix/store/cwh5ylr2yrdilqb72gdxw3rv376mz14d-pathway-compat-base-0.0.1.0.drv' to 'https://cache.nix-ci.com'...
  2184. 152.12 s Uploaded pathway-compat-base in 8.3s
  2185. 152.12 s Progress: 5 of 19 built, 170 of 170 downloaded from cache
  2186. 152.12 s Built pathway-compat-base in 27.0s
  2187. 152.16 s Building /nix/store/a7kn8c1mldf3bb70zbglbid9cdnfr0m8-pathway-compat-filepath-0.0.1.0.drv
  2188. 152.36 s [pathway-compat-filepath] Phase: setupCompilerEnvironmentPhase
  2189. 152.36 s [pathway-compat-filepath] Build with /nix/store/4yvzsc21abkayqx2bzncnj5fpx57hb6z-ghc-9.8.4.
  2190. 152.58 s [pathway-compat-filepath] Phase: unpackPhase
  2191. 152.58 s [pathway-compat-filepath] unpacking source archive /nix/store/723m6sjvk66iiqzpvcfdd74xi6id5zqq-zjizyqf4pafgh9rycgxd507dhvpisdy1-source/./compat/filepath
  2192. 152.59 s [pathway-compat-filepath] source root is filepath
  2193. 152.60 s [pathway-compat-filepath] Phase: patchPhase
  2194. 152.60 s [pathway-compat-filepath] Phase: compileBuildDriverPhase
  2195. 152.61 s [pathway-compat-filepath] setupCompileFlags: -package-db=/build/tmp.vdjsDG0FhH/setup-package.conf.d -threaded
  2196. 152.65 s [pathway-compat-filepath] [1 of 2] Compiling Main ( Setup.hs, /build/tmp.vdjsDG0FhH/Main.o )
  2197. 152.68 s [pathway-compat-filepath] [2 of 2] Linking Setup
  2198. 153.70 s [pathway-compat-filepath] Phase: updateAutotoolsGnuConfigScriptsPhase
  2199. 153.71 s [pathway-compat-filepath] Phase: configurePhase
  2200. 153.72 s [pathway-compat-filepath] configureFlags: --verbose --prefix=/nix/store/8f1mfxn0kr70aq65d42dval09amwcmyg-pathway-compat-filepath-0.0.1.0 --libdir=$prefix/lib/$compiler/lib --libsubdir=$abi/$libname --docdir=/nix/store/sq6j1k7axnqkgy9n1f5x1z3j6fc0kdn9-pathway-compat-filepath-0.0.1.0-doc/share/doc/pathway-compat-filepath-0.0.1.0 --with-gcc=gcc --package-db=/build/tmp.vdjsDG0FhH/package.conf.d --ghc-option=-j16 --ghc-option=+RTS --ghc-option=-A64M --ghc-option=-RTS --enable-library-profiling --profiling-detail=exported-functions --disable-profiling --enable-shared --disable-coverage --enable-static --disable-executable-dynamic --enable-tests --disable-benchmarks --enable-library-vanilla --disable-library-for-ghci --enable-split-sections --enable-library-stripping --enable-executable-stripping --ghc-option=-haddock --ghc-options=-Werror --extra-lib-dirs=/nix/store/ffyzkisqs4vc4mg28bwwlyqjf8i9ph6b-ncurses-6.5/lib --extra-lib-dirs=/nix/store/n28qgdj8c1q41kf7n4y1jxa6ckp85m3c-libffi-3.5.2/lib --extra-lib-dirs=/nix/store/1b6h99dw7bk4wbn77kbalih42zbc67m1-elfutils-0.194/lib --extra-lib-dirs=/nix/store/hi0ar880110k6jsmmili7dh1gq3cg2a9-gmp-with-cxx-6.3.0/lib --extra-lib-dirs=/nix/store/g09cflpnp4g80q56sj9dng1qzv4v4ybc-numactl-2.0.18/lib --extra-lib-dirs=/nix/store/4yvzsc21abkayqx2bzncnj5fpx57hb6z-ghc-9.8.4/lib
  2201. 153.72 s [pathway-compat-filepath] Using Parsec parser
  2202. 153.72 s [pathway-compat-filepath] Configuring pathway-compat-filepath-0.0.1.0...
  2203. 153.99 s [pathway-compat-filepath] Flags chosen: noisy-deprecations=True, verify-no-recursion=False
  2204. 153.99 s [pathway-compat-filepath] Dependency base >=4.14.0 && <4.15 || >=4.15.0 && <4.16 || >=4.16.0 && <4.17 ||
  2205. 153.99 s [pathway-compat-filepath] >=4.17.0 && <4.18 || >=4.18.0 && <4.19 || >=4.19.0 && <4.20 || >=4.20.0 &&
  2206. 153.99 s [pathway-compat-filepath] <4.21 || >=4.21.0 && <4.22 || >=4.22.0 && <4.23: using base-4.19.2.0
  2207. 153.99 s [pathway-compat-filepath] Dependency extra: using extra-1.8.1
  2208. 153.99 s [pathway-compat-filepath] Dependency filepath >=1.4.2 && <1.5 || >=1.5.0 && <1.6: using
  2209. 153.99 s [pathway-compat-filepath] filepath-1.4.301.0
  2210. 153.99 s [pathway-compat-filepath] Dependency megaparsec >=9.0.1 && <9.1 || >=9.2.1 && <9.3 || >=9.5.0 && <9.6 ||
  2211. 153.99 s [pathway-compat-filepath] >=9.7.0 && <9.8: using megaparsec-9.7.0
  2212. 153.99 s [pathway-compat-filepath] Dependency pathway >=0.0.1 && <0.1: using pathway-0.0.1.0
  2213. 153.99 s [pathway-compat-filepath] Dependency pathway-compat-base >=0.0.1 && <0.1: using
  2214. 153.99 s [pathway-compat-filepath] pathway-compat-base-0.0.1.0
  2215. 153.99 s [pathway-compat-filepath] Dependency pathway-internal >=0.0.1 && <0.1: using pathway-internal-0.0.1.0
  2216. 153.99 s [pathway-compat-filepath] Dependency base >=4.14.0 && <4.15 || >=4.15.0 && <4.16 || >=4.16.0 && <4.17 ||
  2217. 153.99 s [pathway-compat-filepath] >=4.17.0 && <4.18 || >=4.18.0 && <4.19 || >=4.19.0 && <4.20 || >=4.20.0 &&
  2218. 153.99 s [pathway-compat-filepath] <4.21 || >=4.21.0 && <4.22 || >=4.22.0 && <4.23: using base-4.19.2.0
  2219. 153.99 s [pathway-compat-filepath] Dependency doctest >=0.16.3 && <0.17 || >=0.18.1 && <0.19 || >=0.20.1 && <0.21
  2220. 153.99 s [pathway-compat-filepath] || >=0.21.1 && <0.22 || >=0.22.2 && <0.23 || >=0.24.2 && <0.25: using
  2221. 153.99 s [pathway-compat-filepath] doctest-0.24.2
  2222. 153.99 s [pathway-compat-filepath] Dependency pathway-compat-filepath: using pathway-compat-filepath-0.0.1.0
  2223. 154.20 s [pathway-compat-filepath] Source component graph:
  2224. 154.20 s [pathway-compat-filepath] component lib
  2225. 154.20 s [pathway-compat-filepath] component test:doctests dependency lib
  2226. 154.20 s [pathway-compat-filepath] Configured component graph:
  2227. 154.20 s [pathway-compat-filepath] component pathway-compat-filepath-0.0.1.0-IRur2AkqsMdDEUYM0d6HNv
  2228. 154.20 s [pathway-compat-filepath] include base-4.19.2.0-8274
  2229. 154.20 s [pathway-compat-filepath] include extra-1.8.1-EssMUQCsBco9gsyBCwwe73
  2230. 154.20 s [pathway-compat-filepath] include filepath-1.4.301.0-9527
  2231. 154.20 s [pathway-compat-filepath] include megaparsec-9.7.0-HGZe2UnGqRgF6D6IR9jAPL
  2232. 154.20 s [pathway-compat-filepath] include pathway-0.0.1.0-IloKB8qrk9OLBhIjlawLWM
  2233. 154.20 s [pathway-compat-filepath] include pathway-compat-base-0.0.1.0-9LwOiYzUq1SHjg9jvEQyqL
  2234. 154.20 s [pathway-compat-filepath] include pathway-internal-0.0.1.0-BTurcxZAYjHHOlL1rvpIiQ
  2235. 154.20 s [pathway-compat-filepath] component pathway-compat-filepath-0.0.1.0-LgIlxVMMZcr79s2T7PofOx-doctests
  2236. 154.20 s [pathway-compat-filepath] include base-4.19.2.0-8274
  2237. 154.20 s [pathway-compat-filepath] include doctest-0.24.2-HOk70bisutnFZuBXgSC0HK
  2238. 154.20 s [pathway-compat-filepath] include pathway-compat-filepath-0.0.1.0-IRur2AkqsMdDEUYM0d6HNv
  2239. 154.20 s [pathway-compat-filepath] Linked component graph:
  2240. 154.20 s [pathway-compat-filepath] unit pathway-compat-filepath-0.0.1.0-IRur2AkqsMdDEUYM0d6HNv
  2241. 154.20 s [pathway-compat-filepath] include base-4.19.2.0-8274
  2242. 154.20 s [pathway-compat-filepath] include extra-1.8.1-EssMUQCsBco9gsyBCwwe73
  2243. 154.20 s [pathway-compat-filepath] include filepath-1.4.301.0-9527
  2244. 154.20 s [pathway-compat-filepath] include megaparsec-9.7.0-HGZe2UnGqRgF6D6IR9jAPL
  2245. 154.20 s [pathway-compat-filepath] include pathway-0.0.1.0-IloKB8qrk9OLBhIjlawLWM
  2246. 154.20 s [pathway-compat-filepath] include pathway-compat-base-0.0.1.0-9LwOiYzUq1SHjg9jvEQyqL
  2247. 154.20 s [pathway-compat-filepath] include pathway-internal-0.0.1.0-BTurcxZAYjHHOlL1rvpIiQ
  2248. 154.20 s [pathway-compat-filepath] Common.FilePath=pathway-compat-filepath-0.0.1.0-IRur2AkqsMdDEUYM0d6HNv:Common.FilePath,Common.OsPath=pathway-compat-filepath-0.0.1.0-IRur2AkqsMdDEUYM0d6HNv:Common.OsPath,System.FilePath=pathway-compat-filepath-0.0.1.0-IRur2AkqsMdDEUYM0d6HNv:System.FilePath,System.FilePath.Overlay=pathway-compat-filepath-0.0.1.0-IRur2AkqsMdDEUYM0d6HNv:System.FilePath.Overlay,System.FilePath.Pathway=pathway-compat-filepath-0.0.1.0-IRur2AkqsMdDEUYM0d6HNv:System.FilePath.Pathway,System.FilePath.Thin=pathway-compat-filepath-0.0.1.0-IRur2AkqsMdDEUYM0d6HNv:System.FilePath.Thin,System.OsPath=pathway-compat-filepath-0.0.1.0-IRur2AkqsMdDEUYM0d6HNv:System.OsPath,System.OsPath.Overlay=pathway-compat-filepath-0.0.1.0-IRur2AkqsMdDEUYM0d6HNv:System.OsPath.Overlay,System.OsPath.Pathway=pathway-compat-filepath-0.0.1.0-IRur2AkqsMdDEUYM0d6HNv:System.OsPath.Pathway,System.OsPath.Thin=pathway-compat-filepath-0.0.1.0-IRur2AkqsMdDEUYM0d6HNv:System.OsPath.Thin
  2249. 154.20 s [pathway-compat-filepath] unit pathway-compat-filepath-0.0.1.0-LgIlxVMMZcr79s2T7PofOx-doctests
  2250. 154.20 s [pathway-compat-filepath] include base-4.19.2.0-8274
  2251. 154.20 s [pathway-compat-filepath] include doctest-0.24.2-HOk70bisutnFZuBXgSC0HK
  2252. 154.20 s [pathway-compat-filepath] include pathway-compat-filepath-0.0.1.0-IRur2AkqsMdDEUYM0d6HNv
  2253. 154.20 s [pathway-compat-filepath] Ready component graph:
  2254. 154.20 s [pathway-compat-filepath] definite pathway-compat-filepath-0.0.1.0-IRur2AkqsMdDEUYM0d6HNv
  2255. 154.20 s [pathway-compat-filepath] depends base-4.19.2.0-8274
  2256. 154.20 s [pathway-compat-filepath] depends extra-1.8.1-EssMUQCsBco9gsyBCwwe73
  2257. 154.20 s [pathway-compat-filepath] depends filepath-1.4.301.0-9527
  2258. 154.20 s [pathway-compat-filepath] depends megaparsec-9.7.0-HGZe2UnGqRgF6D6IR9jAPL
  2259. 154.20 s [pathway-compat-filepath] depends pathway-0.0.1.0-IloKB8qrk9OLBhIjlawLWM
  2260. 154.20 s [pathway-compat-filepath] depends pathway-compat-base-0.0.1.0-9LwOiYzUq1SHjg9jvEQyqL
  2261. 154.20 s [pathway-compat-filepath] depends pathway-internal-0.0.1.0-BTurcxZAYjHHOlL1rvpIiQ
  2262. 154.20 s [pathway-compat-filepath] definite pathway-compat-filepath-0.0.1.0-LgIlxVMMZcr79s2T7PofOx-doctests
  2263. 154.20 s [pathway-compat-filepath] depends base-4.19.2.0-8274
  2264. 154.20 s [pathway-compat-filepath] depends doctest-0.24.2-HOk70bisutnFZuBXgSC0HK
  2265. 154.20 s [pathway-compat-filepath] depends pathway-compat-filepath-0.0.1.0-IRur2AkqsMdDEUYM0d6HNv
  2266. 154.20 s [pathway-compat-filepath] Using Cabal-3.10.3.0 compiled by ghc-9.8
  2267. 154.20 s [pathway-compat-filepath] Using compiler: ghc-9.8.4
  2268. 154.20 s [pathway-compat-filepath] Using install prefix:
  2269. 154.20 s [pathway-compat-filepath] /nix/store/8f1mfxn0kr70aq65d42dval09amwcmyg-pathway-compat-filepath-0.0.1.0
  2270. 154.20 s [pathway-compat-filepath] Executables installed in:
  2271. 154.20 s [pathway-compat-filepath] /nix/store/8f1mfxn0kr70aq65d42dval09amwcmyg-pathway-compat-filepath-0.0.1.0/bin
  2272. 154.20 s [pathway-compat-filepath] Libraries installed in:
  2273. 154.20 s [pathway-compat-filepath] /nix/store/8f1mfxn0kr70aq65d42dval09amwcmyg-pathway-compat-filepath-0.0.1.0/lib/ghc-9.8.4/lib/x86_64-linux-ghc-9.8.4/pathway-compat-filepath-0.0.1.0-IRur2AkqsMdDEUYM0d6HNv
  2274. 154.20 s [pathway-compat-filepath] Dynamic Libraries installed in:
  2275. 154.20 s [pathway-compat-filepath] /nix/store/8f1mfxn0kr70aq65d42dval09amwcmyg-pathway-compat-filepath-0.0.1.0/lib/ghc-9.8.4/lib/x86_64-linux-ghc-9.8.4
  2276. 154.20 s [pathway-compat-filepath] Private executables installed in:
  2277. 154.20 s [pathway-compat-filepath] /nix/store/8f1mfxn0kr70aq65d42dval09amwcmyg-pathway-compat-filepath-0.0.1.0/libexec/x86_64-linux-ghc-9.8.4/pathway-compat-filepath-0.0.1.0
  2278. 154.20 s [pathway-compat-filepath] Data files installed in:
  2279. 154.20 s [pathway-compat-filepath] /nix/store/8f1mfxn0kr70aq65d42dval09amwcmyg-pathway-compat-filepath-0.0.1.0/share/x86_64-linux-ghc-9.8.4/pathway-compat-filepath-0.0.1.0
  2280. 154.20 s [pathway-compat-filepath] Documentation installed in:
  2281. 154.20 s [pathway-compat-filepath] /nix/store/sq6j1k7axnqkgy9n1f5x1z3j6fc0kdn9-pathway-compat-filepath-0.0.1.0-doc/share/doc/pathway-compat-filepath-0.0.1.0
  2282. 154.20 s [pathway-compat-filepath] Configuration files installed in:
  2283. 154.20 s [pathway-compat-filepath] /nix/store/8f1mfxn0kr70aq65d42dval09amwcmyg-pathway-compat-filepath-0.0.1.0/etc
  2284. 154.20 s [pathway-compat-filepath] No alex found
  2285. 154.20 s [pathway-compat-filepath] Using ar found on system at:
  2286. 154.20 s [pathway-compat-filepath] /nix/store/iz5lckcsg66r223si2gck7csk2hihj0m-binutils-wrapper-2.44/bin/ar
  2287. 154.20 s [pathway-compat-filepath] No c2hs found
  2288. 154.20 s [pathway-compat-filepath] No cpphs found
  2289. 154.20 s [pathway-compat-filepath] Using doctest version 0.24.2 found on system at:
  2290. 154.20 s [pathway-compat-filepath] /nix/store/ipqa88qiasixywmsikcnq7nhq6340lg5-doctest-0.24.2/bin/doctest
  2291. 154.20 s [pathway-compat-filepath] Using gcc version 14.3.0 given by user at:
  2292. 154.20 s [pathway-compat-filepath] /nix/store/8v97ngkcpfzgghwnnr7fsz33p2x22gy9-gcc-wrapper-14.3.0/bin/gcc
  2293. 154.20 s [pathway-compat-filepath] Using ghc version 9.8.4 found on system at:
  2294. 154.20 s [pathway-compat-filepath] /nix/store/4yvzsc21abkayqx2bzncnj5fpx57hb6z-ghc-9.8.4/bin/ghc
  2295. 154.20 s [pathway-compat-filepath] Using ghc-pkg version 9.8.4 found on system at:
  2296. 154.20 s [pathway-compat-filepath] /nix/store/4yvzsc21abkayqx2bzncnj5fpx57hb6z-ghc-9.8.4/bin/ghc-pkg-9.8.4
  2297. 154.20 s [pathway-compat-filepath] No ghcjs found
  2298. 154.20 s [pathway-compat-filepath] No ghcjs-pkg found
  2299. 154.20 s [pathway-compat-filepath] No greencard found
  2300. 154.20 s [pathway-compat-filepath] Using haddock version 2.30.0 found on system at:
  2301. 154.20 s [pathway-compat-filepath] /nix/store/4yvzsc21abkayqx2bzncnj5fpx57hb6z-ghc-9.8.4/bin/haddock-ghc-9.8.4
  2302. 154.20 s [pathway-compat-filepath] No happy found
  2303. 154.20 s [pathway-compat-filepath] Using haskell-suite found on system at: haskell-suite-dummy-location
  2304. 154.20 s [pathway-compat-filepath] Using haskell-suite-pkg found on system at: haskell-suite-pkg-dummy-location
  2305. 154.20 s [pathway-compat-filepath] No hmake found
  2306. 154.20 s [pathway-compat-filepath] Using hpc version 0.69 found on system at:
  2307. 154.20 s [pathway-compat-filepath] /nix/store/4yvzsc21abkayqx2bzncnj5fpx57hb6z-ghc-9.8.4/bin/hpc-ghc-9.8.4
  2308. 154.20 s [pathway-compat-filepath] Using hsc2hs version 0.68.10 found on system at:
  2309. 154.20 s [pathway-compat-filepath] /nix/store/4yvzsc21abkayqx2bzncnj5fpx57hb6z-ghc-9.8.4/bin/hsc2hs-ghc-9.8.4
  2310. 154.20 s [pathway-compat-filepath] Using hscolour version 1.25 found on system at:
  2311. 154.20 s [pathway-compat-filepath] /nix/store/palqpb4p9k5rqxhxjdgqrak8n91p6c4z-hscolour-1.25/bin/HsColour
  2312. 154.20 s [pathway-compat-filepath] No jhc found
  2313. 154.20 s [pathway-compat-filepath] Using ld found on system at:
  2314. 154.20 s [pathway-compat-filepath] /nix/store/iz5lckcsg66r223si2gck7csk2hihj0m-binutils-wrapper-2.44/bin/ld.gold
  2315. 154.20 s [pathway-compat-filepath] No pkg-config found
  2316. 154.20 s [pathway-compat-filepath] Using runghc version 9.8.4 found on system at:
  2317. 154.20 s [pathway-compat-filepath] /nix/store/4yvzsc21abkayqx2bzncnj5fpx57hb6z-ghc-9.8.4/bin/runghc-9.8.4
  2318. 154.20 s [pathway-compat-filepath] Using strip version 2.44 found on system at:
  2319. 154.20 s [pathway-compat-filepath] /nix/store/8v97ngkcpfzgghwnnr7fsz33p2x22gy9-gcc-wrapper-14.3.0/bin/strip
  2320. 154.20 s [pathway-compat-filepath] Using tar found on system at:
  2321. 154.20 s [pathway-compat-filepath] /nix/store/xl6pd2spjajwcpq09fnmnjv5psqmlmma-gnutar-1.35/bin/tar
  2322. 154.20 s [pathway-compat-filepath] No uhc found
  2323. 154.45 s [pathway-compat-filepath] Phase: buildPhase
  2324. 154.50 s [pathway-compat-filepath] Preprocessing library for pathway-compat-filepath-0.0.1.0..
  2325. 154.50 s [pathway-compat-filepath] Building library for pathway-compat-filepath-0.0.1.0..
  2326. 154.57 s [pathway-compat-filepath] [ 1 of 10] Compiling Common.FilePath ( src/Common/FilePath.hs, dist/build/Common/FilePath.o, dist/build/Common/FilePath.dyn_o )
  2327. 154.80 s [pathway-compat-filepath] [ 2 of 10] Compiling Common.OsPath ( src/Common/OsPath.hs, dist/build/Common/OsPath.o, dist/build/Common/OsPath.dyn_o )
  2328. 154.80 s [pathway-compat-filepath]
  2329. 154.81 s [pathway-compat-filepath] src/Common/OsPath.hs:87:23: error: [GHC-76037]
  2330. 154.81 s [pathway-compat-filepath] Not in scope: ‘O.unsafeEncodeUtf’
  2331. 154.81 s [pathway-compat-filepath] NB: the module ‘System.OsPath’ does not export ‘unsafeEncodeUtf’.
  2332. 154.81 s [pathway-compat-filepath] |
  2333. 154.81 s [pathway-compat-filepath] 87 | Format.parent = O.unsafeEncodeUtf "..",
  2334. 154.81 s [pathway-compat-filepath] | ^^^^^^^^^^^^^^^^^
  2335. 154.81 s [pathway-compat-filepath] [ 3 of 10] Compiling System.FilePath.Thin ( src/System/FilePath/Thin.hs, dist/build/System/FilePath/Thin.o, dist/build/System/FilePath/Thin.dyn_o )
  2336. 154.94 s [pathway-compat-filepath] [ 4 of 10] Compiling System.FilePath.Pathway ( src/System/FilePath/Pathway.hs, dist/build/System/FilePath/Pathway.o, dist/build/System/FilePath/Pathway.dyn_o )
  2337. 154.96 s [pathway-compat-filepath] [ 5 of 10] Compiling System.FilePath.Overlay ( src/System/FilePath/Overlay.hs, dist/build/System/FilePath/Overlay.o, dist/build/System/FilePath/Overlay.dyn_o )
  2338. 154.99 s [pathway-compat-filepath] [ 6 of 10] Compiling System.FilePath ( src/System/FilePath.hs, dist/build/System/FilePath.o, dist/build/System/FilePath.dyn_o )
  2339. 155.09 s Progress: 5 of 17 built (1 failed), 170 of 170 downloaded from cache
  2340. 155.09 s Failed to build pathway-compat-filepath after 2.9s
  2341. 155.09 s error: Cannot build '/nix/store/a7kn8c1mldf3bb70zbglbid9cdnfr0m8-pathway-compat-filepath-0.0.1.0.drv'.
  2342. 155.09 s Reason: builder failed with exit code 1.
  2343. 155.09 s Output paths:
  2344. 155.09 s /nix/store/8f1mfxn0kr70aq65d42dval09amwcmyg-pathway-compat-filepath-0.0.1.0
  2345. 155.09 s /nix/store/sq6j1k7axnqkgy9n1f5x1z3j6fc0kdn9-pathway-compat-filepath-0.0.1.0-doc
  2346. 155.09 s Last 151 log lines:
  2347. 155.09 s > Running phase: setupCompilerEnvironmentPhase
  2348. 155.09 s > Build with /nix/store/4yvzsc21abkayqx2bzncnj5fpx57hb6z-ghc-9.8.4.
  2349. 155.09 s > Running phase: unpackPhase
  2350. 155.09 s > unpacking source archive /nix/store/723m6sjvk66iiqzpvcfdd74xi6id5zqq-zjizyqf4pafgh9rycgxd507dhvpisdy1-source/./compat/filepath
  2351. 155.09 s > source root is filepath
  2352. 155.09 s > Running phase: patchPhase
  2353. 155.09 s > Running phase: compileBuildDriverPhase
  2354. 155.09 s > setupCompileFlags: -package-db=/build/tmp.vdjsDG0FhH/setup-package.conf.d -threaded
  2355. 155.09 s > [1 of 2] Compiling Main ( Setup.hs, /build/tmp.vdjsDG0FhH/Main.o )
  2356. 155.09 s > [2 of 2] Linking Setup
  2357. 155.09 s > Running phase: updateAutotoolsGnuConfigScriptsPhase
  2358. 155.09 s > Running phase: configurePhase
  2359. 155.09 s > configureFlags: --verbose --prefix=/nix/store/8f1mfxn0kr70aq65d42dval09amwcmyg-pathway-compat-filepath-0.0.1.0 --libdir=$prefix/lib/$compiler/lib --libsubdir=$abi/$libname --docdir=/nix/store/sq6j1k7axnqkgy9n1f5x1z3j6fc0kdn9-pathway-compat-filepath-0.0.1.0-doc/share/doc/pathway-compat-filepath-0.0.1.0 --with-gcc=gcc --package-db=/build/tmp.vdjsDG0FhH/package.conf.d --ghc-option=-j16 --ghc-option=+RTS --ghc-option=-A64M --ghc-option=-RTS --enable-library-profiling --profiling-detail=exported-functions --disable-profiling --enable-shared --disable-coverage --enable-static --disable-executable-dynamic --enable-tests --disable-benchmarks --enable-library-vanilla --disable-library-for-ghci --enable-split-sections --enable-library-stripping --enable-executable-stripping --ghc-option=-haddock --ghc-options=-Werror --extra-lib-dirs=/nix/store/ffyzkisqs4vc4mg28bwwlyqjf8i9ph6b-ncurses-6.5/lib --extra-lib-dirs=/nix/store/n28qgdj8c1q41kf7n4y1jxa6ckp85m3c-libffi-3.5.2/lib --extra-lib-dirs=/nix/store/1b6h99dw7bk4wbn77kbalih42zbc67m1-elfutils-0.194/lib --extra-lib-dirs=/nix/store/hi0ar880110k6jsmmili7dh1gq3cg2a9-gmp-with-cxx-6.3.0/lib --extra-lib-dirs=/nix/store/g09cflpnp4g80q56sj9dng1qzv4v4ybc-numactl-2.0.18/lib --extra-lib-dirs=/nix/store/4yvzsc21abkayqx2bzncnj5fpx57hb6z-ghc-9.8.4/lib
  2360. 155.09 s > Using Parsec parser
  2361. 155.09 s > Configuring pathway-compat-filepath-0.0.1.0...
  2362. 155.09 s > Flags chosen: noisy-deprecations=True, verify-no-recursion=False
  2363. 155.09 s > Dependency base >=4.14.0 && <4.15 || >=4.15.0 && <4.16 || >=4.16.0 && <4.17 ||
  2364. 155.09 s > >=4.17.0 && <4.18 || >=4.18.0 && <4.19 || >=4.19.0 && <4.20 || >=4.20.0 &&
  2365. 155.09 s > <4.21 || >=4.21.0 && <4.22 || >=4.22.0 && <4.23: using base-4.19.2.0
  2366. 155.09 s > Dependency extra: using extra-1.8.1
  2367. 155.09 s > Dependency filepath >=1.4.2 && <1.5 || >=1.5.0 && <1.6: using
  2368. 155.09 s > filepath-1.4.301.0
  2369. 155.09 s > Dependency megaparsec >=9.0.1 && <9.1 || >=9.2.1 && <9.3 || >=9.5.0 && <9.6 ||
  2370. 155.09 s > >=9.7.0 && <9.8: using megaparsec-9.7.0
  2371. 155.09 s > Dependency pathway >=0.0.1 && <0.1: using pathway-0.0.1.0
  2372. 155.09 s > Dependency pathway-compat-base >=0.0.1 && <0.1: using
  2373. 155.09 s > pathway-compat-base-0.0.1.0
  2374. 155.09 s > Dependency pathway-internal >=0.0.1 && <0.1: using pathway-internal-0.0.1.0
  2375. 155.09 s > Dependency base >=4.14.0 && <4.15 || >=4.15.0 && <4.16 || >=4.16.0 && <4.17 ||
  2376. 155.09 s > >=4.17.0 && <4.18 || >=4.18.0 && <4.19 || >=4.19.0 && <4.20 || >=4.20.0 &&
  2377. 155.09 s > <4.21 || >=4.21.0 && <4.22 || >=4.22.0 && <4.23: using base-4.19.2.0
  2378. 155.09 s > Dependency doctest >=0.16.3 && <0.17 || >=0.18.1 && <0.19 || >=0.20.1 && <0.21
  2379. 155.09 s > || >=0.21.1 && <0.22 || >=0.22.2 && <0.23 || >=0.24.2 && <0.25: using
  2380. 155.09 s > doctest-0.24.2
  2381. 155.09 s > Dependency pathway-compat-filepath: using pathway-compat-filepath-0.0.1.0
  2382. 155.09 s > Source component graph:
  2383. 155.09 s > component lib
  2384. 155.09 s > component test:doctests dependency lib
  2385. 155.09 s > Configured component graph:
  2386. 155.09 s > component pathway-compat-filepath-0.0.1.0-IRur2AkqsMdDEUYM0d6HNv
  2387. 155.09 s > include base-4.19.2.0-8274
  2388. 155.09 s > include extra-1.8.1-EssMUQCsBco9gsyBCwwe73
  2389. 155.09 s > include filepath-1.4.301.0-9527
  2390. 155.09 s > include megaparsec-9.7.0-HGZe2UnGqRgF6D6IR9jAPL
  2391. 155.09 s > include pathway-0.0.1.0-IloKB8qrk9OLBhIjlawLWM
  2392. 155.09 s > include pathway-compat-base-0.0.1.0-9LwOiYzUq1SHjg9jvEQyqL
  2393. 155.09 s > include pathway-internal-0.0.1.0-BTurcxZAYjHHOlL1rvpIiQ
  2394. 155.09 s > component pathway-compat-filepath-0.0.1.0-LgIlxVMMZcr79s2T7PofOx-doctests
  2395. 155.09 s > include base-4.19.2.0-8274
  2396. 155.09 s > include doctest-0.24.2-HOk70bisutnFZuBXgSC0HK
  2397. 155.09 s > include pathway-compat-filepath-0.0.1.0-IRur2AkqsMdDEUYM0d6HNv
  2398. 155.09 s > Linked component graph:
  2399. 155.09 s > unit pathway-compat-filepath-0.0.1.0-IRur2AkqsMdDEUYM0d6HNv
  2400. 155.09 s > include base-4.19.2.0-8274
  2401. 155.09 s > include extra-1.8.1-EssMUQCsBco9gsyBCwwe73
  2402. 155.09 s > include filepath-1.4.301.0-9527
  2403. 155.09 s > include megaparsec-9.7.0-HGZe2UnGqRgF6D6IR9jAPL
  2404. 155.09 s > include pathway-0.0.1.0-IloKB8qrk9OLBhIjlawLWM
  2405. 155.09 s > include pathway-compat-base-0.0.1.0-9LwOiYzUq1SHjg9jvEQyqL
  2406. 155.09 s > include pathway-internal-0.0.1.0-BTurcxZAYjHHOlL1rvpIiQ
  2407. 155.09 s > Common.FilePath=pathway-compat-filepath-0.0.1.0-IRur2AkqsMdDEUYM0d6HNv:Common.FilePath,Common.OsPath=pathway-compat-filepath-0.0.1.0-IRur2AkqsMdDEUYM0d6HNv:Common.OsPath,System.FilePath=pathway-compat-filepath-0.0.1.0-IRur2AkqsMdDEUYM0d6HNv:System.FilePath,System.FilePath.Overlay=pathway-compat-filepath-0.0.1.0-IRur2AkqsMdDEUYM0d6HNv:System.FilePath.Overlay,System.FilePath.Pathway=pathway-compat-filepath-0.0.1.0-IRur2AkqsMdDEUYM0d6HNv:System.FilePath.Pathway,System.FilePath.Thin=pathway-compat-filepath-0.0.1.0-IRur2AkqsMdDEUYM0d6HNv:System.FilePath.Thin,System.OsPath=pathway-compat-filepath-0.0.1.0-IRur2AkqsMdDEUYM0d6HNv:System.OsPath,System.OsPath.Overlay=pathway-compat-filepath-0.0.1.0-IRur2AkqsMdDEUYM0d6HNv:System.OsPath.Overlay,System.OsPath.Pathway=pathway-compat-filepath-0.0.1.0-IRur2AkqsMdDEUYM0d6HNv:System.OsPath.Pathway,System.OsPath.Thin=pathway-compat-filepath-0.0.1.0-IRur2AkqsMdDEUYM0d6HNv:System.OsPath.Thin
  2408. 155.09 s > unit pathway-compat-filepath-0.0.1.0-LgIlxVMMZcr79s2T7PofOx-doctests
  2409. 155.09 s > include base-4.19.2.0-8274
  2410. 155.09 s > include doctest-0.24.2-HOk70bisutnFZuBXgSC0HK
  2411. 155.09 s > include pathway-compat-filepath-0.0.1.0-IRur2AkqsMdDEUYM0d6HNv
  2412. 155.09 s > Ready component graph:
  2413. 155.09 s > definite pathway-compat-filepath-0.0.1.0-IRur2AkqsMdDEUYM0d6HNv
  2414. 155.09 s > depends base-4.19.2.0-8274
  2415. 155.09 s > depends extra-1.8.1-EssMUQCsBco9gsyBCwwe73
  2416. 155.09 s > depends filepath-1.4.301.0-9527
  2417. 155.09 s > depends megaparsec-9.7.0-HGZe2UnGqRgF6D6IR9jAPL
  2418. 155.09 s > depends pathway-0.0.1.0-IloKB8qrk9OLBhIjlawLWM
  2419. 155.09 s > depends pathway-compat-base-0.0.1.0-9LwOiYzUq1SHjg9jvEQyqL
  2420. 155.09 s > depends pathway-internal-0.0.1.0-BTurcxZAYjHHOlL1rvpIiQ
  2421. 155.09 s > definite pathway-compat-filepath-0.0.1.0-LgIlxVMMZcr79s2T7PofOx-doctests
  2422. 155.09 s > depends base-4.19.2.0-8274
  2423. 155.09 s > depends doctest-0.24.2-HOk70bisutnFZuBXgSC0HK
  2424. 155.09 s > depends pathway-compat-filepath-0.0.1.0-IRur2AkqsMdDEUYM0d6HNv
  2425. 155.09 s > Using Cabal-3.10.3.0 compiled by ghc-9.8
  2426. 155.09 s > Using compiler: ghc-9.8.4
  2427. 155.09 s > Using install prefix:
  2428. 155.09 s > /nix/store/8f1mfxn0kr70aq65d42dval09amwcmyg-pathway-compat-filepath-0.0.1.0
  2429. 155.09 s > Executables installed in:
  2430. 155.09 s > /nix/store/8f1mfxn0kr70aq65d42dval09amwcmyg-pathway-compat-filepath-0.0.1.0/bin
  2431. 155.09 s > Libraries installed in:
  2432. 155.09 s > /nix/store/8f1mfxn0kr70aq65d42dval09amwcmyg-pathway-compat-filepath-0.0.1.0/lib/ghc-9.8.4/lib/x86_64-linux-ghc-9.8.4/pathway-compat-filepath-0.0.1.0-IRur2AkqsMdDEUYM0d6HNv
  2433. 155.09 s > Dynamic Libraries installed in:
  2434. 155.09 s > /nix/store/8f1mfxn0kr70aq65d42dval09amwcmyg-pathway-compat-filepath-0.0.1.0/lib/ghc-9.8.4/lib/x86_64-linux-ghc-9.8.4
  2435. 155.09 s > Private executables installed in:
  2436. 155.09 s > /nix/store/8f1mfxn0kr70aq65d42dval09amwcmyg-pathway-compat-filepath-0.0.1.0/libexec/x86_64-linux-ghc-9.8.4/pathway-compat-filepath-0.0.1.0
  2437. 155.09 s > Data files installed in:
  2438. 155.09 s > /nix/store/8f1mfxn0kr70aq65d42dval09amwcmyg-pathway-compat-filepath-0.0.1.0/share/x86_64-linux-ghc-9.8.4/pathway-compat-filepath-0.0.1.0
  2439. 155.09 s > Documentation installed in:
  2440. 155.09 s > /nix/store/sq6j1k7axnqkgy9n1f5x1z3j6fc0kdn9-pathway-compat-filepath-0.0.1.0-doc/share/doc/pathway-compat-filepath-0.0.1.0
  2441. 155.09 s > Configuration files installed in:
  2442. 155.09 s > /nix/store/8f1mfxn0kr70aq65d42dval09amwcmyg-pathway-compat-filepath-0.0.1.0/etc
  2443. 155.09 s > No alex found
  2444. 155.09 s > Using ar found on system at:
  2445. 155.09 s > /nix/store/iz5lckcsg66r223si2gck7csk2hihj0m-binutils-wrapper-2.44/bin/ar
  2446. 155.09 s > No c2hs found
  2447. 155.09 s > No cpphs found
  2448. 155.09 s > Using doctest version 0.24.2 found on system at:
  2449. 155.09 s > /nix/store/ipqa88qiasixywmsikcnq7nhq6340lg5-doctest-0.24.2/bin/doctest
  2450. 155.09 s > Using gcc version 14.3.0 given by user at:
  2451. 155.09 s > /nix/store/8v97ngkcpfzgghwnnr7fsz33p2x22gy9-gcc-wrapper-14.3.0/bin/gcc
  2452. 155.09 s > Using ghc version 9.8.4 found on system at:
  2453. 155.09 s > /nix/store/4yvzsc21abkayqx2bzncnj5fpx57hb6z-ghc-9.8.4/bin/ghc
  2454. 155.09 s > Using ghc-pkg version 9.8.4 found on system at:
  2455. 155.09 s > /nix/store/4yvzsc21abkayqx2bzncnj5fpx57hb6z-ghc-9.8.4/bin/ghc-pkg-9.8.4
  2456. 155.09 s > No ghcjs found
  2457. 155.09 s > No ghcjs-pkg found
  2458. 155.09 s > No greencard found
  2459. 155.09 s > Using haddock version 2.30.0 found on system at:
  2460. 155.09 s > /nix/store/4yvzsc21abkayqx2bzncnj5fpx57hb6z-ghc-9.8.4/bin/haddock-ghc-9.8.4
  2461. 155.09 s > No happy found
  2462. 155.09 s > Using haskell-suite found on system at: haskell-suite-dummy-location
  2463. 155.09 s > Using haskell-suite-pkg found on system at: haskell-suite-pkg-dummy-location
  2464. 155.09 s > No hmake found
  2465. 155.09 s > Using hpc version 0.69 found on system at:
  2466. 155.09 s > /nix/store/4yvzsc21abkayqx2bzncnj5fpx57hb6z-ghc-9.8.4/bin/hpc-ghc-9.8.4
  2467. 155.09 s > Using hsc2hs version 0.68.10 found on system at:
  2468. 155.09 s > /nix/store/4yvzsc21abkayqx2bzncnj5fpx57hb6z-ghc-9.8.4/bin/hsc2hs-ghc-9.8.4
  2469. 155.09 s > Using hscolour version 1.25 found on system at:
  2470. 155.09 s > /nix/store/palqpb4p9k5rqxhxjdgqrak8n91p6c4z-hscolour-1.25/bin/HsColour
  2471. 155.09 s > No jhc found
  2472. 155.09 s > Using ld found on system at:
  2473. 155.09 s > /nix/store/iz5lckcsg66r223si2gck7csk2hihj0m-binutils-wrapper-2.44/bin/ld.gold
  2474. 155.09 s > No pkg-config found
  2475. 155.09 s > Using runghc version 9.8.4 found on system at:
  2476. 155.09 s > /nix/store/4yvzsc21abkayqx2bzncnj5fpx57hb6z-ghc-9.8.4/bin/runghc-9.8.4
  2477. 155.09 s > Using strip version 2.44 found on system at:
  2478. 155.09 s > /nix/store/8v97ngkcpfzgghwnnr7fsz33p2x22gy9-gcc-wrapper-14.3.0/bin/strip
  2479. 155.09 s > Using tar found on system at:
  2480. 155.09 s > /nix/store/xl6pd2spjajwcpq09fnmnjv5psqmlmma-gnutar-1.35/bin/tar
  2481. 155.09 s > No uhc found
  2482. 155.09 s > Running phase: buildPhase
  2483. 155.09 s > Preprocessing library for pathway-compat-filepath-0.0.1.0..
  2484. 155.09 s > Building library for pathway-compat-filepath-0.0.1.0..
  2485. 155.09 s > [ 1 of 10] Compiling Common.FilePath ( src/Common/FilePath.hs, dist/build/Common/FilePath.o, dist/build/Common/FilePath.dyn_o )
  2486. 155.09 s > [ 2 of 10] Compiling Common.OsPath ( src/Common/OsPath.hs, dist/build/Common/OsPath.o, dist/build/Common/OsPath.dyn_o )
  2487. 155.09 s >
  2488. 155.09 s > src/Common/OsPath.hs:87:23: error: [GHC-76037]
  2489. 155.09 s > Not in scope: ‘O.unsafeEncodeUtf’
  2490. 155.09 s > NB: the module ‘System.OsPath’ does not export ‘unsafeEncodeUtf’.
  2491. 155.09 s > |
  2492. 155.09 s > 87 | Format.parent = O.unsafeEncodeUtf "..",
  2493. 155.09 s > | ^^^^^^^^^^^^^^^^^
  2494. 155.09 s > [ 3 of 10] Compiling System.FilePath.Thin ( src/System/FilePath/Thin.hs, dist/build/System/FilePath/Thin.o, dist/build/System/FilePath/Thin.dyn_o )
  2495. 155.09 s > [ 4 of 10] Compiling System.FilePath.Pathway ( src/System/FilePath/Pathway.hs, dist/build/System/FilePath/Pathway.o, dist/build/System/FilePath/Pathway.dyn_o )
  2496. 155.09 s > [ 5 of 10] Compiling System.FilePath.Overlay ( src/System/FilePath/Overlay.hs, dist/build/System/FilePath/Overlay.o, dist/build/System/FilePath/Overlay.dyn_o )
  2497. 155.09 s > [ 6 of 10] Compiling System.FilePath ( src/System/FilePath.hs, dist/build/System/FilePath.o, dist/build/System/FilePath.dyn_o )
  2498. 155.09 s For full logs, run:
  2499. 155.09 s nix log /nix/store/a7kn8c1mldf3bb70zbglbid9cdnfr0m8-pathway-compat-filepath-0.0.1.0.drv
  2500. 155.09 s error: Cannot build '/nix/store/a7kn8c1mldf3bb70zbglbid9cdnfr0m8-pathway-compat-filepath-0.0.1.0.drv'.
  2501. 155.09 s Reason: builder failed with exit code 1.
  2502. 155.09 s Output paths:
  2503. 155.09 s /nix/store/8f1mfxn0kr70aq65d42dval09amwcmyg-pathway-compat-filepath-0.0.1.0
  2504. 155.09 s /nix/store/sq6j1k7axnqkgy9n1f5x1z3j6fc0kdn9-pathway-compat-filepath-0.0.1.0-doc
  2505. 155.09 s Last 151 log lines:
  2506. 155.09 s > Running phase: setupCompilerEnvironmentPhase
  2507. 155.09 s > Build with /nix/store/4yvzsc21abkayqx2bzncnj5fpx57hb6z-ghc-9.8.4.
  2508. 155.09 s > Running phase: unpackPhase
  2509. 155.09 s > unpacking source archive /nix/store/723m6sjvk66iiqzpvcfdd74xi6id5zqq-zjizyqf4pafgh9rycgxd507dhvpisdy1-source/./compat/filepath
  2510. 155.09 s > source root is filepath
  2511. 155.09 s > Running phase: patchPhase
  2512. 155.09 s > Running phase: compileBuildDriverPhase
  2513. 155.09 s > setupCompileFlags: -package-db=/build/tmp.vdjsDG0FhH/setup-package.conf.d -threaded
  2514. 155.09 s > [1 of 2] Compiling Main ( Setup.hs, /build/tmp.vdjsDG0FhH/Main.o )
  2515. 155.09 s > [2 of 2] Linking Setup
  2516. 155.09 s > Running phase: updateAutotoolsGnuConfigScriptsPhase
  2517. 155.09 s > Running phase: configurePhase
  2518. 155.09 s > configureFlags: --verbose --prefix=/nix/store/8f1mfxn0kr70aq65d42dval09amwcmyg-pathway-compat-filepath-0.0.1.0 --libdir=$prefix/lib/$compiler/lib --libsubdir=$abi/$libname --docdir=/nix/store/sq6j1k7axnqkgy9n1f5x1z3j6fc0kdn9-pathway-compat-filepath-0.0.1.0-doc/share/doc/pathway-compat-filepath-0.0.1.0 --with-gcc=gcc --package-db=/build/tmp.vdjsDG0FhH/package.conf.d --ghc-option=-j16 --ghc-option=+RTS --ghc-option=-A64M --ghc-option=-RTS --enable-library-profiling --profiling-detail=exported-functions --disable-profiling --enable-shared --disable-coverage --enable-static --disable-executable-dynamic --enable-tests --disable-benchmarks --enable-library-vanilla --disable-library-for-ghci --enable-split-sections --enable-library-stripping --enable-executable-stripping --ghc-option=-haddock --ghc-options=-Werror --extra-lib-dirs=/nix/store/ffyzkisqs4vc4mg28bwwlyqjf8i9ph6b-ncurses-6.5/lib --extra-lib-dirs=/nix/store/n28qgdj8c1q41kf7n4y1jxa6ckp85m3c-libffi-3.5.2/lib --extra-lib-dirs=/nix/store/1b6h99dw7bk4wbn77kbalih42zbc67m1-elfutils-0.194/lib --extra-lib-dirs=/nix/store/hi0ar880110k6jsmmili7dh1gq3cg2a9-gmp-with-cxx-6.3.0/lib --extra-lib-dirs=/nix/store/g09cflpnp4g80q56sj9dng1qzv4v4ybc-numactl-2.0.18/lib --extra-lib-dirs=/nix/store/4yvzsc21abkayqx2bzncnj5fpx57hb6z-ghc-9.8.4/lib
  2519. 155.09 s > Using Parsec parser
  2520. 155.09 s > Configuring pathway-compat-filepath-0.0.1.0...
  2521. 155.09 s > Flags chosen: noisy-deprecations=True, verify-no-recursion=False
  2522. 155.09 s > Dependency base >=4.14.0 && <4.15 || >=4.15.0 && <4.16 || >=4.16.0 && <4.17 ||
  2523. 155.09 s > >=4.17.0 && <4.18 || >=4.18.0 && <4.19 || >=4.19.0 && <4.20 || >=4.20.0 &&
  2524. 155.09 s > <4.21 || >=4.21.0 && <4.22 || >=4.22.0 && <4.23: using base-4.19.2.0
  2525. 155.09 s > Dependency extra: using extra-1.8.1
  2526. 155.09 s > Dependency filepath >=1.4.2 && <1.5 || >=1.5.0 && <1.6: using
  2527. 155.09 s > filepath-1.4.301.0
  2528. 155.09 s > Dependency megaparsec >=9.0.1 && <9.1 || >=9.2.1 && <9.3 || >=9.5.0 && <9.6 ||
  2529. 155.09 s > >=9.7.0 && <9.8: using megaparsec-9.7.0
  2530. 155.09 s > Dependency pathway >=0.0.1 && <0.1: using pathway-0.0.1.0
  2531. 155.09 s > Dependency pathway-compat-base >=0.0.1 && <0.1: using
  2532. 155.09 s > pathway-compat-base-0.0.1.0
  2533. 155.09 s > Dependency pathway-internal >=0.0.1 && <0.1: using pathway-internal-0.0.1.0
  2534. 155.09 s > Dependency base >=4.14.0 && <4.15 || >=4.15.0 && <4.16 || >=4.16.0 && <4.17 ||
  2535. 155.09 s > >=4.17.0 && <4.18 || >=4.18.0 && <4.19 || >=4.19.0 && <4.20 || >=4.20.0 &&
  2536. 155.09 s > <4.21 || >=4.21.0 && <4.22 || >=4.22.0 && <4.23: using base-4.19.2.0
  2537. 155.09 s > Dependency doctest >=0.16.3 && <0.17 || >=0.18.1 && <0.19 || >=0.20.1 && <0.21
  2538. 155.09 s > || >=0.21.1 && <0.22 || >=0.22.2 && <0.23 || >=0.24.2 && <0.25: using
  2539. 155.09 s > doctest-0.24.2
  2540. 155.09 s > Dependency pathway-compat-filepath: using pathway-compat-filepath-0.0.1.0
  2541. 155.09 s > Source component graph:
  2542. 155.09 s > component lib
  2543. 155.09 s > component test:doctests dependency lib
  2544. 155.09 s > Configured component graph:
  2545. 155.09 s > component pathway-compat-filepath-0.0.1.0-IRur2AkqsMdDEUYM0d6HNv
  2546. 155.09 s > include base-4.19.2.0-8274
  2547. 155.09 s > include extra-1.8.1-EssMUQCsBco9gsyBCwwe73
  2548. 155.09 s > include filepath-1.4.301.0-9527
  2549. 155.09 s > include megaparsec-9.7.0-HGZe2UnGqRgF6D6IR9jAPL
  2550. 155.09 s > include pathway-0.0.1.0-IloKB8qrk9OLBhIjlawLWM
  2551. 155.09 s > include pathway-compat-base-0.0.1.0-9LwOiYzUq1SHjg9jvEQyqL
  2552. 155.09 s > include pathway-internal-0.0.1.0-BTurcxZAYjHHOlL1rvpIiQ
  2553. 155.09 s > component pathway-compat-filepath-0.0.1.0-LgIlxVMMZcr79s2T7PofOx-doctests
  2554. 155.09 s > include base-4.19.2.0-8274
  2555. 155.09 s > include doctest-0.24.2-HOk70bisutnFZuBXgSC0HK
  2556. 155.09 s > include pathway-compat-filepath-0.0.1.0-IRur2AkqsMdDEUYM0d6HNv
  2557. 155.09 s > Linked component graph:
  2558. 155.09 s > unit pathway-compat-filepath-0.0.1.0-IRur2AkqsMdDEUYM0d6HNv
  2559. 155.09 s > include base-4.19.2.0-8274
  2560. 155.09 s > include extra-1.8.1-EssMUQCsBco9gsyBCwwe73
  2561. 155.09 s > include filepath-1.4.301.0-9527
  2562. 155.09 s > include megaparsec-9.7.0-HGZe2UnGqRgF6D6IR9jAPL
  2563. 155.09 s > include pathway-0.0.1.0-IloKB8qrk9OLBhIjlawLWM
  2564. 155.09 s > include pathway-compat-base-0.0.1.0-9LwOiYzUq1SHjg9jvEQyqL
  2565. 155.09 s > include pathway-internal-0.0.1.0-BTurcxZAYjHHOlL1rvpIiQ
  2566. 155.09 s > Common.FilePath=pathway-compat-filepath-0.0.1.0-IRur2AkqsMdDEUYM0d6HNv:Common.FilePath,Common.OsPath=pathway-compat-filepath-0.0.1.0-IRur2AkqsMdDEUYM0d6HNv:Common.OsPath,System.FilePath=pathway-compat-filepath-0.0.1.0-IRur2AkqsMdDEUYM0d6HNv:System.FilePath,System.FilePath.Overlay=pathway-compat-filepath-0.0.1.0-IRur2AkqsMdDEUYM0d6HNv:System.FilePath.Overlay,System.FilePath.Pathway=pathway-compat-filepath-0.0.1.0-IRur2AkqsMdDEUYM0d6HNv:System.FilePath.Pathway,System.FilePath.Thin=pathway-compat-filepath-0.0.1.0-IRur2AkqsMdDEUYM0d6HNv:System.FilePath.Thin,System.OsPath=pathway-compat-filepath-0.0.1.0-IRur2AkqsMdDEUYM0d6HNv:System.OsPath,System.OsPath.Overlay=pathway-compat-filepath-0.0.1.0-IRur2AkqsMdDEUYM0d6HNv:System.OsPath.Overlay,System.OsPath.Pathway=pathway-compat-filepath-0.0.1.0-IRur2AkqsMdDEUYM0d6HNv:System.OsPath.Pathway,System.OsPath.Thin=pathway-compat-filepath-0.0.1.0-IRur2AkqsMdDEUYM0d6HNv:System.OsPath.Thin
  2567. 155.09 s > unit pathway-compat-filepath-0.0.1.0-LgIlxVMMZcr79s2T7PofOx-doctests
  2568. 155.09 s > include base-4.19.2.0-8274
  2569. 155.09 s > include doctest-0.24.2-HOk70bisutnFZuBXgSC0HK
  2570. 155.09 s > include pathway-compat-filepath-0.0.1.0-IRur2AkqsMdDEUYM0d6HNv
  2571. 155.09 s > Ready component graph:
  2572. 155.09 s > definite pathway-compat-filepath-0.0.1.0-IRur2AkqsMdDEUYM0d6HNv
  2573. 155.09 s > depends base-4.19.2.0-8274
  2574. 155.09 s > depends extra-1.8.1-EssMUQCsBco9gsyBCwwe73
  2575. 155.09 s > depends filepath-1.4.301.0-9527
  2576. 155.09 s > depends megaparsec-9.7.0-HGZe2UnGqRgF6D6IR9jAPL
  2577. 155.09 s > depends pathway-0.0.1.0-IloKB8qrk9OLBhIjlawLWM
  2578. 155.09 s > depends pathway-compat-base-0.0.1.0-9LwOiYzUq1SHjg9jvEQyqL
  2579. 155.09 s > depends pathway-internal-0.0.1.0-BTurcxZAYjHHOlL1rvpIiQ
  2580. 155.09 s > definite pathway-compat-filepath-0.0.1.0-LgIlxVMMZcr79s2T7PofOx-doctests
  2581. 155.09 s > depends base-4.19.2.0-8274
  2582. 155.09 s > depends doctest-0.24.2-HOk70bisutnFZuBXgSC0HK
  2583. 155.09 s > depends pathway-compat-filepath-0.0.1.0-IRur2AkqsMdDEUYM0d6HNv
  2584. 155.09 s > Using Cabal-3.10.3.0 compiled by ghc-9.8
  2585. 155.09 s > Using compiler: ghc-9.8.4
  2586. 155.09 s > Using install prefix:
  2587. 155.09 s > /nix/store/8f1mfxn0kr70aq65d42dval09amwcmyg-pathway-compat-filepath-0.0.1.0
  2588. 155.09 s > Executables installed in:
  2589. 155.09 s > /nix/store/8f1mfxn0kr70aq65d42dval09amwcmyg-pathway-compat-filepath-0.0.1.0/bin
  2590. 155.09 s > Libraries installed in:
  2591. 155.09 s > /nix/store/8f1mfxn0kr70aq65d42dval09amwcmyg-pathway-compat-filepath-0.0.1.0/lib/ghc-9.8.4/lib/x86_64-linux-ghc-9.8.4/pathway-compat-filepath-0.0.1.0-IRur2AkqsMdDEUYM0d6HNv
  2592. 155.09 s > Dynamic Libraries installed in:
  2593. 155.09 s > /nix/store/8f1mfxn0kr70aq65d42dval09amwcmyg-pathway-compat-filepath-0.0.1.0/lib/ghc-9.8.4/lib/x86_64-linux-ghc-9.8.4
  2594. 155.09 s > Private executables installed in:
  2595. 155.09 s > /nix/store/8f1mfxn0kr70aq65d42dval09amwcmyg-pathway-compat-filepath-0.0.1.0/libexec/x86_64-linux-ghc-9.8.4/pathway-compat-filepath-0.0.1.0
  2596. 155.09 s > Data files installed in:
  2597. 155.09 s > /nix/store/8f1mfxn0kr70aq65d42dval09amwcmyg-pathway-compat-filepath-0.0.1.0/share/x86_64-linux-ghc-9.8.4/pathway-compat-filepath-0.0.1.0
  2598. 155.09 s > Documentation installed in:
  2599. 155.09 s > /nix/store/sq6j1k7axnqkgy9n1f5x1z3j6fc0kdn9-pathway-compat-filepath-0.0.1.0-doc/share/doc/pathway-compat-filepath-0.0.1.0
  2600. 155.09 s > Configuration files installed in:
  2601. 155.09 s > /nix/store/8f1mfxn0kr70aq65d42dval09amwcmyg-pathway-compat-filepath-0.0.1.0/etc
  2602. 155.09 s > No alex found
  2603. 155.09 s > Using ar found on system at:
  2604. 155.09 s > /nix/store/iz5lckcsg66r223si2gck7csk2hihj0m-binutils-wrapper-2.44/bin/ar
  2605. 155.09 s > No c2hs found
  2606. 155.09 s > No cpphs found
  2607. 155.09 s > Using doctest version 0.24.2 found on system at:
  2608. 155.09 s > /nix/store/ipqa88qiasixywmsikcnq7nhq6340lg5-doctest-0.24.2/bin/doctest
  2609. 155.09 s > Using gcc version 14.3.0 given by user at:
  2610. 155.09 s > /nix/store/8v97ngkcpfzgghwnnr7fsz33p2x22gy9-gcc-wrapper-14.3.0/bin/gcc
  2611. 155.09 s > Using ghc version 9.8.4 found on system at:
  2612. 155.09 s > /nix/store/4yvzsc21abkayqx2bzncnj5fpx57hb6z-ghc-9.8.4/bin/ghc
  2613. 155.09 s > Using ghc-pkg version 9.8.4 found on system at:
  2614. 155.09 s > /nix/store/4yvzsc21abkayqx2bzncnj5fpx57hb6z-ghc-9.8.4/bin/ghc-pkg-9.8.4
  2615. 155.09 s > No ghcjs found
  2616. 155.09 s > No ghcjs-pkg found
  2617. 155.09 s > No greencard found
  2618. 155.09 s > Using haddock version 2.30.0 found on system at:
  2619. 155.09 s > /nix/store/4yvzsc21abkayqx2bzncnj5fpx57hb6z-ghc-9.8.4/bin/haddock-ghc-9.8.4
  2620. 155.09 s > No happy found
  2621. 155.09 s > Using haskell-suite found on system at: haskell-suite-dummy-location
  2622. 155.09 s > Using haskell-suite-pkg found on system at: haskell-suite-pkg-dummy-location
  2623. 155.09 s > No hmake found
  2624. 155.09 s > Using hpc version 0.69 found on system at:
  2625. 155.09 s > /nix/store/4yvzsc21abkayqx2bzncnj5fpx57hb6z-ghc-9.8.4/bin/hpc-ghc-9.8.4
  2626. 155.09 s > Using hsc2hs version 0.68.10 found on system at:
  2627. 155.09 s > /nix/store/4yvzsc21abkayqx2bzncnj5fpx57hb6z-ghc-9.8.4/bin/hsc2hs-ghc-9.8.4
  2628. 155.09 s > Using hscolour version 1.25 found on system at:
  2629. 155.09 s > /nix/store/palqpb4p9k5rqxhxjdgqrak8n91p6c4z-hscolour-1.25/bin/HsColour
  2630. 155.09 s > No jhc found
  2631. 155.09 s > Using ld found on system at:
  2632. 155.09 s > /nix/store/iz5lckcsg66r223si2gck7csk2hihj0m-binutils-wrapper-2.44/bin/ld.gold
  2633. 155.09 s > No pkg-config found
  2634. 155.09 s > Using runghc version 9.8.4 found on system at:
  2635. 155.09 s > /nix/store/4yvzsc21abkayqx2bzncnj5fpx57hb6z-ghc-9.8.4/bin/runghc-9.8.4
  2636. 155.09 s > Using strip version 2.44 found on system at:
  2637. 155.09 s > /nix/store/8v97ngkcpfzgghwnnr7fsz33p2x22gy9-gcc-wrapper-14.3.0/bin/strip
  2638. 155.09 s > Using tar found on system at:
  2639. 155.09 s > /nix/store/xl6pd2spjajwcpq09fnmnjv5psqmlmma-gnutar-1.35/bin/tar
  2640. 155.09 s > No uhc found
  2641. 155.09 s > Running phase: buildPhase
  2642. 155.09 s > Preprocessing library for pathway-compat-filepath-0.0.1.0..
  2643. 155.09 s > Building library for pathway-compat-filepath-0.0.1.0..
  2644. 155.09 s > [ 1 of 10] Compiling Common.FilePath ( src/Common/FilePath.hs, dist/build/Common/FilePath.o, dist/build/Common/FilePath.dyn_o )
  2645. 155.09 s > [ 2 of 10] Compiling Common.OsPath ( src/Common/OsPath.hs, dist/build/Common/OsPath.o, dist/build/Common/OsPath.dyn_o )
  2646. 155.09 s >
  2647. 155.09 s > src/Common/OsPath.hs:87:23: error: [GHC-76037]
  2648. 155.09 s > Not in scope: ‘O.unsafeEncodeUtf’
  2649. 155.09 s > NB: the module ‘System.OsPath’ does not export ‘unsafeEncodeUtf’.
  2650. 155.09 s > |
  2651. 155.09 s > 87 | Format.parent = O.unsafeEncodeUtf "..",
  2652. 155.09 s > | ^^^^^^^^^^^^^^^^^
  2653. 155.09 s > [ 3 of 10] Compiling System.FilePath.Thin ( src/System/FilePath/Thin.hs, dist/build/System/FilePath/Thin.o, dist/build/System/FilePath/Thin.dyn_o )
  2654. 155.09 s > [ 4 of 10] Compiling System.FilePath.Pathway ( src/System/FilePath/Pathway.hs, dist/build/System/FilePath/Pathway.o, dist/build/System/FilePath/Pathway.dyn_o )
  2655. 155.09 s > [ 5 of 10] Compiling System.FilePath.Overlay ( src/System/FilePath/Overlay.hs, dist/build/System/FilePath/Overlay.o, dist/build/System/FilePath/Overlay.dyn_o )
  2656. 155.09 s > [ 6 of 10] Compiling System.FilePath ( src/System/FilePath.hs, dist/build/System/FilePath.o, dist/build/System/FilePath.dyn_o )
  2657. 155.09 s For full logs, run:
  2658. 155.09 s nix log /nix/store/a7kn8c1mldf3bb70zbglbid9cdnfr0m8-pathway-compat-filepath-0.0.1.0.drv
  2659. 155.09 s error: Cannot build '/nix/store/blkw723shcpbnfifd3fa6d8fnarlf55z-ghc-9.8.4-with-packages.drv'.
  2660. 155.09 s Reason: 1 dependency failed.
  2661. 155.09 s Output paths:
  2662. 155.09 s /nix/store/087v8475vkhjq5a81yfh0x1276474c14-ghc-9.8.4-with-packages
  2663. 155.09 s error: Cannot build '/nix/store/7xg1gsggfpl05235383k9na9yqqbnanz-pathway-compat-directory-0.0.1.0.drv'.
  2664. 155.09 s Reason: 1 dependency failed.
  2665. 155.09 s Output paths:
  2666. 155.09 s /nix/store/f2vqb9rl88rm2297as2v33y6nx9v6by3-pathway-compat-directory-0.0.1.0-doc
  2667. 155.09 s /nix/store/hkzlvycigjksgpl6bhfacglhsvy5zq30-pathway-compat-directory-0.0.1.0
  2668. 155.09 s error: Cannot build '/nix/store/q0nssswl35scyg2dnc6ny4s822dd86zp-pathway-compat-file-io-0.0.1.0.drv'.
  2669. 155.09 s Reason: 1 dependency failed.
  2670. 155.09 s Output paths:
  2671. 155.09 s /nix/store/a538c1sbf04xxlrly9wrwgwkmh0wp65z-pathway-compat-file-io-0.0.1.0-doc
  2672. 155.09 s /nix/store/iza5w2w92h4i64q6davpj6ddy209hzaq-pathway-compat-file-io-0.0.1.0
  2673. 155.09 s error: Cannot build '/nix/store/f0c4jgak407gsl4f0gsxrdlv0ksvcpir-pathway-compat-temporary-0.0.1.0.drv'.
  2674. 155.09 s Reason: 1 dependency failed.
  2675. 155.09 s Output paths:
  2676. 155.09 s /nix/store/bnxqi4h6vm3yzkhiwbdmc81smswzvivk-pathway-compat-temporary-0.0.1.0-doc
  2677. 155.09 s /nix/store/pzbvzsfll48py6yvyas4hrmvdv2l65sm-pathway-compat-temporary-0.0.1.0
  2678. 155.09 s error: Cannot build '/nix/store/ix9k5awwf5inpd0hgaghxbhj9wc43gx9-pathway-system-0.0.1.0.drv'.
  2679. 155.09 s Reason: 1 dependency failed.
  2680. 155.09 s Output paths:
  2681. 155.09 s /nix/store/i5d4wpjzqgrg2brh3cib653hcd8s43m4-pathway-system-0.0.1.0
  2682. 155.09 s /nix/store/jsz52hm01k5m5wl49pnk6mk2cn7wwnad-pathway-system-0.0.1.0-doc
  2683. 155.09 s error: Build failed due to failed dependency
  2684. 155.09 s error: Cannot build '/nix/store/qcp48sa8nmysda2b9cdcs4da4wvmbqs0-all-packages.drv'.
  2685. 155.09 s Reason: 1 dependency failed.
  2686. 155.09 s Output paths:
  2687. 155.09 s /nix/store/9ibfrdc9iwbp0hp5cyc5zqsz9yw5n5sc-all-packages
  2688. 155.10 s Build failed due to failed dependency
  2689. 155.25 s Build failed.