0.75 s
$ /nix/store/9ypz3flqsrl5xl495mm8h645gadjsxi1-coreutils-9.11/bin/timeout --kill-after=15s 7200s /nix/store/23zk8sgzamrbmj1fday15szf7f2279s8-nix-2.34.7/bin/nix --extra-experimental-features nix-command --extra-experimental-features flakes --log-format internal-json build --no-link --print-out-paths git+https://github.com/sellout/pathway?ref=more-system&rev=48808d129e08f84a9d17c382758a97ce6d627392&shallow=1#packages.x86_64-linux.ghc984_all --print-build-logs
0.76 s
warning: ignoring untrusted flake configuration setting 'allow-import-from-derivation'.
0.76 s
Pass '--accept-flake-config' to trust it
0.76 s
warning: ignoring untrusted flake configuration setting 'extra-experimental-features'.
0.76 s
Pass '--accept-flake-config' to trust it
0.76 s
warning: ignoring untrusted flake configuration setting 'extra-substituters'.
0.76 s
Pass '--accept-flake-config' to trust it
0.76 s
warning: ignoring untrusted flake configuration setting 'extra-trusted-public-keys'.
0.76 s
Pass '--accept-flake-config' to trust it
0.76 s
warning: ignoring untrusted flake configuration setting 'sandbox'.
0.76 s
Pass '--accept-flake-config' to trust it
0.76 s
warning: ignoring untrusted flake configuration setting 'use-registries'.
0.76 s
Pass '--accept-flake-config' to trust it
1.83 s
3.54 s
Downloading cached pathway-internal-0.0.1.0-doc from https://cache.nix-ci.com
5.84 s
Downloaded cached pathway-internal-0.0.1.0-doc (612 KiB) in 2.2s
5.85 s
Progress: 0 of 22 built, 1 of 10 downloaded from cache
5.85 s
Downloading cached pathway-0.0.1.0-doc from https://cache.nix-ci.com
5.85 s
Downloading cached pathway-internal from https://cache.nix-ci.com
5.85 s
Downloading cached pathway-quickcheck-0.0.1.0-doc from https://cache.nix-ci.com
5.85 s
Downloaded cached pathway-quickcheck-0.0.1.0-doc (217 KiB) in 4ms
5.85 s
Progress: 0 of 21 built, 2 of 10 downloaded from cache (2 downloading)
5.86 s
Downloaded cached pathway-0.0.1.0-doc (1.3 MiB) in 9ms
5.86 s
Progress: 0 of 20 built, 3 of 10 downloaded from cache (1 downloading)
5.86 s
Downloading cached pathway-compat-base-0.0.1.0-doc from https://cache.nix-ci.com
5.86 s
Downloading cached pathway-path-0.0.1.0-doc from https://cache.nix-ci.com
5.86 s
Downloaded cached pathway-internal (2 MiB) in 14ms
5.86 s
Progress: 0 of 19 built, 4 of 10 downloaded from cache (2 downloading)
5.86 s
Downloading cached pathway from https://cache.nix-ci.com
5.86 s
Downloading cached pathway-quickcheck from https://cache.nix-ci.com
5.87 s
Downloaded cached pathway-path-0.0.1.0-doc (263 KiB) in 11ms
5.87 s
Progress: 0 of 18 built, 5 of 10 downloaded from cache (3 downloading)
5.87 s
Downloaded cached pathway-quickcheck (179 KiB) in 7ms
5.87 s
Progress: 0 of 17 built, 6 of 10 downloaded from cache (2 downloading)
5.88 s
Downloaded cached pathway-compat-base-0.0.1.0-doc (1.9 MiB) in 18ms
5.88 s
Progress: 0 of 16 built, 7 of 10 downloaded from cache (1 downloading)
5.89 s
Downloaded cached pathway (2.7 MiB) in 23ms
5.89 s
Progress: 0 of 15 built, 8 of 10 downloaded from cache
5.89 s
Downloading cached pathway-compat-base from https://cache.nix-ci.com
5.89 s
Downloading cached pathway-path from https://cache.nix-ci.com
5.90 s
Downloaded cached pathway-path (217 KiB) in 9ms
5.90 s
Progress: 0 of 14 built, 9 of 10 downloaded from cache (1 downloading)
5.91 s
Downloaded cached pathway-compat-base (2 MiB) in 19ms
5.91 s
Progress: 0 of 13 built, 10 of 10 downloaded from cache
6.02 s
Building /nix/store/7szrkx5w148zqvipzqp9kpvdwyixf2jm-pathway-compat-filepath-0.0.1.0.drv
6.25 s
[pathway-compat-filepath] Phase: setupCompilerEnvironmentPhase
6.25 s
[pathway-compat-filepath] Build with /nix/store/7r9b0bl984hdgd70nf5p8raa55kml491-ghc-9.8.4.
6.60 s
[pathway-compat-filepath] Phase: unpackPhase
6.60 s
[pathway-compat-filepath] unpacking source archive /nix/store/99h2nwiw8z9r3kqrm9kdhv4k4sf61d7w-filepath
6.61 s
[pathway-compat-filepath] source root is filepath
6.62 s
[pathway-compat-filepath] Phase: patchPhase
6.64 s
[pathway-compat-filepath] Phase: compileBuildDriverPhase
6.64 s
[pathway-compat-filepath] setupCompileFlags: -package-db=/build/tmp.TKICidthJY/setup-package.conf.d -threaded
6.69 s
[pathway-compat-filepath] [1 of 2] Compiling Main ( Setup.hs, /build/tmp.TKICidthJY/Main.o )
6.74 s
[pathway-compat-filepath] [2 of 2] Linking Setup
8.09 s
[pathway-compat-filepath] Phase: updateAutotoolsGnuConfigScriptsPhase
8.11 s
[pathway-compat-filepath] Phase: configurePhase
8.11 s
[pathway-compat-filepath] configureFlags: --verbose --prefix=/nix/store/3wxxzpw33d72qx9kng4qpfmhidc1ba2f-pathway-compat-filepath-0.0.1.0 --libdir=$prefix/lib/$compiler/lib --libsubdir=$abi/$libname --docdir=/nix/store/1a5zli1srydg9czyyyns0ql1sl8i4gzp-pathway-compat-filepath-0.0.1.0-doc/share/doc/pathway-compat-filepath-0.0.1.0 --with-gcc=gcc --package-db=/build/tmp.TKICidthJY/package.conf.d --ghc-option=-j16 --ghc-option=+RTS --ghc-option=-A64M --ghc-option=-RTS --enable-library-profiling --profiling-detail=exported-functions --disable-profiling --enable-shared --disable-coverage --enable-static --disable-executable-dynamic --enable-tests --disable-benchmarks --enable-library-vanilla --disable-library-for-ghci --enable-split-sections --enable-library-stripping --enable-executable-stripping --ghc-option=-haddock --ghc-options=-Werror --extra-lib-dirs=/nix/store/pndhkk0l649lm1sj0mxk7cbwq26qd1ra-ncurses-6.6/lib --extra-lib-dirs=/nix/store/0djlg4g0b81w94k3vcaqsxsc2hh4kism-libffi-3.5.2/lib --extra-lib-dirs=/nix/store/md4paia7riiggyrj8p24c7a6vf8w7jz8-elfutils-0.194/lib --extra-lib-dirs=/nix/store/39vv2pf64gd8li48a4hpbhw2crzd8z5p-gmp-with-cxx-6.3.0/lib --extra-lib-dirs=/nix/store/7wwvald8lapkrsr72qanlw8blyn55ifx-numactl-2.0.18/lib --extra-lib-dirs=/nix/store/7r9b0bl984hdgd70nf5p8raa55kml491-ghc-9.8.4/lib
8.12 s
[pathway-compat-filepath] Using Parsec parser
8.12 s
[pathway-compat-filepath] Configuring pathway-compat-filepath-0.0.1.0...
8.47 s
[pathway-compat-filepath] Flags chosen: noisy-deprecations=True, verify-no-recursion=False
8.47 s
[pathway-compat-filepath] Dependency base >=4.14.0 && <4.15 || >=4.15.0 && <4.16 || >=4.16.0 && <4.17 ||
8.47 s
[pathway-compat-filepath] >=4.17.0 && <4.18 || >=4.18.0 && <4.19 || >=4.19.0 && <4.20 || >=4.20.0 &&
8.47 s
[pathway-compat-filepath] <4.21 || >=4.21.0 && <4.22 || >=4.22.0 && <4.23: using base-4.19.2.0
8.47 s
[pathway-compat-filepath] Dependency extra: using extra-1.8.1
8.47 s
[pathway-compat-filepath] Dependency filepath >=1.4.2 && <1.5 || >=1.5.0 && <1.6: using
8.47 s
[pathway-compat-filepath] filepath-1.4.301.0
8.47 s
[pathway-compat-filepath] Dependency megaparsec >=9.0.1 && <9.1 || >=9.2.1 && <9.3 || >=9.5.0 && <9.6 ||
8.47 s
[pathway-compat-filepath] >=9.7.0 && <9.8: using megaparsec-9.7.0
8.47 s
[pathway-compat-filepath] Dependency pathway >=0.0.1 && <0.1: using pathway-0.0.1.0
8.47 s
[pathway-compat-filepath] Dependency pathway-compat-base >=0.0.1 && <0.1: using
8.47 s
[pathway-compat-filepath] pathway-compat-base-0.0.1.0
8.47 s
[pathway-compat-filepath] Dependency pathway-internal >=0.0.1 && <0.1: using pathway-internal-0.0.1.0
8.47 s
[pathway-compat-filepath] Dependency base >=4.14.0 && <4.15 || >=4.15.0 && <4.16 || >=4.16.0 && <4.17 ||
8.47 s
[pathway-compat-filepath] >=4.17.0 && <4.18 || >=4.18.0 && <4.19 || >=4.19.0 && <4.20 || >=4.20.0 &&
8.47 s
[pathway-compat-filepath] <4.21 || >=4.21.0 && <4.22 || >=4.22.0 && <4.23: using base-4.19.2.0
8.47 s
[pathway-compat-filepath] Dependency doctest >=0.16.3 && <0.17 || >=0.18.1 && <0.19 || >=0.20.1 && <0.21
8.47 s
[pathway-compat-filepath] || >=0.21.1 && <0.22 || >=0.22.2 && <0.23 || >=0.24.2 && <0.25: using
8.47 s
[pathway-compat-filepath] doctest-0.24.3
8.47 s
[pathway-compat-filepath] Dependency pathway-compat-filepath: using pathway-compat-filepath-0.0.1.0
8.80 s
[pathway-compat-filepath] Source component graph:
8.80 s
[pathway-compat-filepath] component lib
8.80 s
[pathway-compat-filepath] component test:doctests dependency lib
8.80 s
[pathway-compat-filepath] Configured component graph:
8.80 s
[pathway-compat-filepath] component pathway-compat-filepath-0.0.1.0-1aSZ3UXFr73FDOQtPeyw7g
8.80 s
[pathway-compat-filepath] include base-4.19.2.0-934f
8.80 s
[pathway-compat-filepath] include extra-1.8.1-F4oHgTKCper3ZiIUPZjGPK
8.80 s
[pathway-compat-filepath] include filepath-1.4.301.0-6e15
8.80 s
[pathway-compat-filepath] include megaparsec-9.7.0-10vHZAF1maw9O8p2gXs66N
8.80 s
[pathway-compat-filepath] include pathway-0.0.1.0-H5uD0SRA9755UrSqFBaCYE
8.80 s
[pathway-compat-filepath] include pathway-compat-base-0.0.1.0-8ldj6SPXbxq2Shd8yFeOpr
8.80 s
[pathway-compat-filepath] include pathway-internal-0.0.1.0-Lnjdb2M8cxN196wSdsfQUK
8.80 s
[pathway-compat-filepath] component pathway-compat-filepath-0.0.1.0-5Vlr121wsSlHY9yKgCvAGY-doctests
8.80 s
[pathway-compat-filepath] include base-4.19.2.0-934f
8.80 s
[pathway-compat-filepath] include doctest-0.24.3-1aDs7zEYV5r7raSsXr9TQC
8.80 s
[pathway-compat-filepath] include pathway-compat-filepath-0.0.1.0-1aSZ3UXFr73FDOQtPeyw7g
8.80 s
[pathway-compat-filepath] Linked component graph:
8.80 s
[pathway-compat-filepath] unit pathway-compat-filepath-0.0.1.0-1aSZ3UXFr73FDOQtPeyw7g
8.80 s
[pathway-compat-filepath] include base-4.19.2.0-934f
8.80 s
[pathway-compat-filepath] include extra-1.8.1-F4oHgTKCper3ZiIUPZjGPK
8.80 s
[pathway-compat-filepath] include filepath-1.4.301.0-6e15
8.80 s
[pathway-compat-filepath] include megaparsec-9.7.0-10vHZAF1maw9O8p2gXs66N
8.80 s
[pathway-compat-filepath] include pathway-0.0.1.0-H5uD0SRA9755UrSqFBaCYE
8.80 s
[pathway-compat-filepath] include pathway-compat-base-0.0.1.0-8ldj6SPXbxq2Shd8yFeOpr
8.80 s
[pathway-compat-filepath] include pathway-internal-0.0.1.0-Lnjdb2M8cxN196wSdsfQUK
8.80 s
[pathway-compat-filepath] Common.FilePath=pathway-compat-filepath-0.0.1.0-1aSZ3UXFr73FDOQtPeyw7g:Common.FilePath,Common.OsPath=pathway-compat-filepath-0.0.1.0-1aSZ3UXFr73FDOQtPeyw7g:Common.OsPath,System.FilePath=pathway-compat-filepath-0.0.1.0-1aSZ3UXFr73FDOQtPeyw7g:System.FilePath,System.FilePath.Overlay=pathway-compat-filepath-0.0.1.0-1aSZ3UXFr73FDOQtPeyw7g:System.FilePath.Overlay,System.FilePath.Pathway=pathway-compat-filepath-0.0.1.0-1aSZ3UXFr73FDOQtPeyw7g:System.FilePath.Pathway,System.FilePath.Thin=pathway-compat-filepath-0.0.1.0-1aSZ3UXFr73FDOQtPeyw7g:System.FilePath.Thin,System.OsPath=pathway-compat-filepath-0.0.1.0-1aSZ3UXFr73FDOQtPeyw7g:System.OsPath,System.OsPath.Overlay=pathway-compat-filepath-0.0.1.0-1aSZ3UXFr73FDOQtPeyw7g:System.OsPath.Overlay,System.OsPath.Pathway=pathway-compat-filepath-0.0.1.0-1aSZ3UXFr73FDOQtPeyw7g:System.OsPath.Pathway,System.OsPath.Thin=pathway-compat-filepath-0.0.1.0-1aSZ3UXFr73FDOQtPeyw7g:System.OsPath.Thin
8.80 s
[pathway-compat-filepath] unit pathway-compat-filepath-0.0.1.0-5Vlr121wsSlHY9yKgCvAGY-doctests
8.80 s
[pathway-compat-filepath] include base-4.19.2.0-934f
8.80 s
[pathway-compat-filepath] include doctest-0.24.3-1aDs7zEYV5r7raSsXr9TQC
8.80 s
[pathway-compat-filepath] include pathway-compat-filepath-0.0.1.0-1aSZ3UXFr73FDOQtPeyw7g
8.80 s
[pathway-compat-filepath] Ready component graph:
8.80 s
[pathway-compat-filepath] definite pathway-compat-filepath-0.0.1.0-1aSZ3UXFr73FDOQtPeyw7g
8.81 s
[pathway-compat-filepath] depends base-4.19.2.0-934f
8.81 s
[pathway-compat-filepath] depends extra-1.8.1-F4oHgTKCper3ZiIUPZjGPK
8.81 s
[pathway-compat-filepath] depends filepath-1.4.301.0-6e15
8.81 s
[pathway-compat-filepath] depends megaparsec-9.7.0-10vHZAF1maw9O8p2gXs66N
8.81 s
[pathway-compat-filepath] depends pathway-0.0.1.0-H5uD0SRA9755UrSqFBaCYE
8.81 s
[pathway-compat-filepath] depends pathway-compat-base-0.0.1.0-8ldj6SPXbxq2Shd8yFeOpr
8.81 s
[pathway-compat-filepath] depends pathway-internal-0.0.1.0-Lnjdb2M8cxN196wSdsfQUK
8.81 s
[pathway-compat-filepath] definite pathway-compat-filepath-0.0.1.0-5Vlr121wsSlHY9yKgCvAGY-doctests
8.81 s
[pathway-compat-filepath] depends base-4.19.2.0-934f
8.81 s
[pathway-compat-filepath] depends doctest-0.24.3-1aDs7zEYV5r7raSsXr9TQC
8.81 s
[pathway-compat-filepath] depends pathway-compat-filepath-0.0.1.0-1aSZ3UXFr73FDOQtPeyw7g
8.81 s
[pathway-compat-filepath] Using Cabal-3.10.3.0 compiled by ghc-9.8
8.81 s
[pathway-compat-filepath] Using compiler: ghc-9.8.4
8.81 s
[pathway-compat-filepath] Using install prefix:
8.81 s
[pathway-compat-filepath] /nix/store/3wxxzpw33d72qx9kng4qpfmhidc1ba2f-pathway-compat-filepath-0.0.1.0
8.81 s
[pathway-compat-filepath] Executables installed in:
8.81 s
[pathway-compat-filepath] /nix/store/3wxxzpw33d72qx9kng4qpfmhidc1ba2f-pathway-compat-filepath-0.0.1.0/bin
8.81 s
[pathway-compat-filepath] Libraries installed in:
8.81 s
[pathway-compat-filepath] /nix/store/3wxxzpw33d72qx9kng4qpfmhidc1ba2f-pathway-compat-filepath-0.0.1.0/lib/ghc-9.8.4/lib/x86_64-linux-ghc-9.8.4/pathway-compat-filepath-0.0.1.0-1aSZ3UXFr73FDOQtPeyw7g
8.81 s
[pathway-compat-filepath] Dynamic Libraries installed in:
8.81 s
[pathway-compat-filepath] /nix/store/3wxxzpw33d72qx9kng4qpfmhidc1ba2f-pathway-compat-filepath-0.0.1.0/lib/ghc-9.8.4/lib/x86_64-linux-ghc-9.8.4
8.81 s
[pathway-compat-filepath] Private executables installed in:
8.81 s
[pathway-compat-filepath] /nix/store/3wxxzpw33d72qx9kng4qpfmhidc1ba2f-pathway-compat-filepath-0.0.1.0/libexec/x86_64-linux-ghc-9.8.4/pathway-compat-filepath-0.0.1.0
8.81 s
[pathway-compat-filepath] Data files installed in:
8.81 s
[pathway-compat-filepath] /nix/store/3wxxzpw33d72qx9kng4qpfmhidc1ba2f-pathway-compat-filepath-0.0.1.0/share/x86_64-linux-ghc-9.8.4/pathway-compat-filepath-0.0.1.0
8.81 s
[pathway-compat-filepath] Documentation installed in:
8.81 s
[pathway-compat-filepath] /nix/store/1a5zli1srydg9czyyyns0ql1sl8i4gzp-pathway-compat-filepath-0.0.1.0-doc/share/doc/pathway-compat-filepath-0.0.1.0
8.81 s
[pathway-compat-filepath] Configuration files installed in:
8.81 s
[pathway-compat-filepath] /nix/store/3wxxzpw33d72qx9kng4qpfmhidc1ba2f-pathway-compat-filepath-0.0.1.0/etc
8.81 s
[pathway-compat-filepath] No alex found
8.81 s
[pathway-compat-filepath] Using ar found on system at:
8.81 s
[pathway-compat-filepath] /nix/store/zjraf40s86y3iwhp626b934r5y6ldkbb-binutils-wrapper-2.46/bin/ar
8.81 s
[pathway-compat-filepath] No c2hs found
8.81 s
[pathway-compat-filepath] No cpphs found
8.81 s
[pathway-compat-filepath] Using doctest version 0.24.3 found on system at:
8.81 s
[pathway-compat-filepath] /nix/store/2y183b1vsybv0157vfr59yhdwjkpqfkn-doctest-0.24.3/bin/doctest
8.81 s
[pathway-compat-filepath] Using gcc version 15.2.0 given by user at:
8.81 s
[pathway-compat-filepath] /nix/store/29qjlshvklnyr67nhpprzgb9igmsfsjj-gcc-wrapper-15.2.0/bin/gcc
8.81 s
[pathway-compat-filepath] Using ghc version 9.8.4 found on system at:
8.81 s
[pathway-compat-filepath] /nix/store/7r9b0bl984hdgd70nf5p8raa55kml491-ghc-9.8.4/bin/ghc
8.81 s
[pathway-compat-filepath] Using ghc-pkg version 9.8.4 found on system at:
8.81 s
[pathway-compat-filepath] /nix/store/7r9b0bl984hdgd70nf5p8raa55kml491-ghc-9.8.4/bin/ghc-pkg-9.8.4
8.81 s
[pathway-compat-filepath] No ghcjs found
8.81 s
[pathway-compat-filepath] No ghcjs-pkg found
8.81 s
[pathway-compat-filepath] No greencard found
8.81 s
[pathway-compat-filepath] Using haddock version 2.30.0 found on system at:
8.81 s
[pathway-compat-filepath] /nix/store/7r9b0bl984hdgd70nf5p8raa55kml491-ghc-9.8.4/bin/haddock-ghc-9.8.4
8.81 s
[pathway-compat-filepath] No happy found
8.81 s
[pathway-compat-filepath] Using haskell-suite found on system at: haskell-suite-dummy-location
8.81 s
[pathway-compat-filepath] Using haskell-suite-pkg found on system at: haskell-suite-pkg-dummy-location
8.81 s
[pathway-compat-filepath] No hmake found
8.81 s
[pathway-compat-filepath] Using hpc version 0.69 found on system at:
8.81 s
[pathway-compat-filepath] /nix/store/7r9b0bl984hdgd70nf5p8raa55kml491-ghc-9.8.4/bin/hpc-ghc-9.8.4
8.81 s
[pathway-compat-filepath] Using hsc2hs version 0.68.10 found on system at:
8.81 s
[pathway-compat-filepath] /nix/store/7r9b0bl984hdgd70nf5p8raa55kml491-ghc-9.8.4/bin/hsc2hs-ghc-9.8.4
8.81 s
[pathway-compat-filepath] Using hscolour version 1.25 found on system at:
8.81 s
[pathway-compat-filepath] /nix/store/awnxn98rlw62rrjwli6d2lb4d27mrzzw-hscolour-1.25/bin/HsColour
8.81 s
[pathway-compat-filepath] No jhc found
8.81 s
[pathway-compat-filepath] Using ld found on system at:
8.81 s
[pathway-compat-filepath] /nix/store/zjraf40s86y3iwhp626b934r5y6ldkbb-binutils-wrapper-2.46/bin/ld.gold
8.81 s
[pathway-compat-filepath] No pkg-config found
8.81 s
[pathway-compat-filepath] Using runghc version 9.8.4 found on system at:
8.81 s
[pathway-compat-filepath] /nix/store/7r9b0bl984hdgd70nf5p8raa55kml491-ghc-9.8.4/bin/runghc-9.8.4
8.81 s
[pathway-compat-filepath] Using strip version 2.46 found on system at:
8.81 s
[pathway-compat-filepath] /nix/store/29qjlshvklnyr67nhpprzgb9igmsfsjj-gcc-wrapper-15.2.0/bin/strip
8.81 s
[pathway-compat-filepath] Using tar found on system at:
8.81 s
[pathway-compat-filepath] /nix/store/z5mq2sam4484prf3kv6v6vjw1m0i7j24-gnutar-1.35/bin/tar
8.81 s
[pathway-compat-filepath] No uhc found
9.24 s
[pathway-compat-filepath] Phase: buildPhase
9.30 s
[pathway-compat-filepath] Preprocessing library for pathway-compat-filepath-0.0.1.0..
9.30 s
[pathway-compat-filepath] Building library for pathway-compat-filepath-0.0.1.0..
9.38 s
[pathway-compat-filepath] [ 1 of 10] Compiling Common.FilePath ( src/Common/FilePath.hs, dist/build/Common/FilePath.o, dist/build/Common/FilePath.dyn_o )
9.65 s
[pathway-compat-filepath] [ 2 of 10] Compiling Common.OsPath ( src/Common/OsPath.hs, dist/build/Common/OsPath.o, dist/build/Common/OsPath.dyn_o )
9.65 s
[pathway-compat-filepath]
9.66 s
[pathway-compat-filepath] src/Common/OsPath.hs:87:23: error : [ GHC-76037 ]
9.66 s
[pathway-compat-filepath] Not in scope: ‘O.unsafeEncodeUtf’
9.66 s
[pathway-compat-filepath] NB: the module ‘System.OsPath’ does not export ‘unsafeEncodeUtf’.
9.66 s
[pathway-compat-filepath] |
9.66 s
[pathway-compat-filepath] 87 | Format.parent = O.unsafeEncodeUtf "..",
9.66 s
[pathway-compat-filepath] | ^^^^^^^^^^^^^^^^^
9.66 s
[pathway-compat-filepath] [ 3 of 10] Compiling System.FilePath.Thin ( src/System/FilePath/Thin.hs, dist/build/System/FilePath/Thin.o, dist/build/System/FilePath/Thin.dyn_o )
9.82 s
[pathway-compat-filepath] [ 4 of 10] Compiling System.FilePath.Pathway ( src/System/FilePath/Pathway.hs, dist/build/System/FilePath/Pathway.o, dist/build/System/FilePath/Pathway.dyn_o )
9.84 s
[pathway-compat-filepath] [ 5 of 10] Compiling System.FilePath.Overlay ( src/System/FilePath/Overlay.hs, dist/build/System/FilePath/Overlay.o, dist/build/System/FilePath/Overlay.dyn_o )
9.87 s
[pathway-compat-filepath] [ 6 of 10] Compiling System.FilePath ( src/System/FilePath.hs, dist/build/System/FilePath.o, dist/build/System/FilePath.dyn_o )
9.98 s
Progress: 0 of 12 built (1 failed), 10 of 10 downloaded from cache
9.98 s
Failed to build pathway-compat-filepath after 3.9s
9.98 s
error: Cannot build '/nix/store/7szrkx5w148zqvipzqp9kpvdwyixf2jm-pathway-compat-filepath-0.0.1.0.drv '.
9.98 s
Reason: builder failed with exit code 1 .
9.98 s
Output paths:
9.98 s
/nix/store/1a5zli1srydg9czyyyns0ql1sl8i4gzp-pathway-compat-filepath-0.0.1.0-doc
9.98 s
/nix/store/3wxxzpw33d72qx9kng4qpfmhidc1ba2f-pathway-compat-filepath-0.0.1.0
9.98 s
Last 151 log lines:
9.98 s
> Running phase: setupCompilerEnvironmentPhase
9.98 s
> Build with /nix/store/7r9b0bl984hdgd70nf5p8raa55kml491-ghc-9.8.4.
9.98 s
> Running phase: unpackPhase
9.98 s
> unpacking source archive /nix/store/99h2nwiw8z9r3kqrm9kdhv4k4sf61d7w-filepath
9.98 s
> source root is filepath
9.98 s
> Running phase: patchPhase
9.98 s
> Running phase: compileBuildDriverPhase
9.98 s
> setupCompileFlags: -package-db=/build/tmp.TKICidthJY/setup-package.conf.d -threaded
9.98 s
> [1 of 2] Compiling Main ( Setup.hs, /build/tmp.TKICidthJY/Main.o )
9.98 s
> [2 of 2] Linking Setup
9.98 s
> Running phase: updateAutotoolsGnuConfigScriptsPhase
9.98 s
> Running phase: configurePhase
9.98 s
> configureFlags: --verbose --prefix=/nix/store/3wxxzpw33d72qx9kng4qpfmhidc1ba2f-pathway-compat-filepath-0.0.1.0 --libdir=$prefix/lib/$compiler/lib --libsubdir=$abi/$libname --docdir=/nix/store/1a5zli1srydg9czyyyns0ql1sl8i4gzp-pathway-compat-filepath-0.0.1.0-doc/share/doc/pathway-compat-filepath-0.0.1.0 --with-gcc=gcc --package-db=/build/tmp.TKICidthJY/package.conf.d --ghc-option=-j16 --ghc-option=+RTS --ghc-option=-A64M --ghc-option=-RTS --enable-library-profiling --profiling-detail=exported-functions --disable-profiling --enable-shared --disable-coverage --enable-static --disable-executable-dynamic --enable-tests --disable-benchmarks --enable-library-vanilla --disable-library-for-ghci --enable-split-sections --enable-library-stripping --enable-executable-stripping --ghc-option=-haddock --ghc-options=-Werror --extra-lib-dirs=/nix/store/pndhkk0l649lm1sj0mxk7cbwq26qd1ra-ncurses-6.6/lib --extra-lib-dirs=/nix/store/0djlg4g0b81w94k3vcaqsxsc2hh4kism-libffi-3.5.2/lib --extra-lib-dirs=/nix/store/md4paia7riiggyrj8p24c7a6vf8w7jz8-elfutils-0.194/lib --extra-lib-dirs=/nix/store/39vv2pf64gd8li48a4hpbhw2crzd8z5p-gmp-with-cxx-6.3.0/lib --extra-lib-dirs=/nix/store/7wwvald8lapkrsr72qanlw8blyn55ifx-numactl-2.0.18/lib --extra-lib-dirs=/nix/store/7r9b0bl984hdgd70nf5p8raa55kml491-ghc-9.8.4/lib
9.98 s
> Using Parsec parser
9.98 s
> Configuring pathway-compat-filepath-0.0.1.0...
9.98 s
> Flags chosen: noisy-deprecations=True, verify-no-recursion=False
9.98 s
> Dependency base >=4.14.0 && <4.15 || >=4.15.0 && <4.16 || >=4.16.0 && <4.17 ||
9.98 s
> >=4.17.0 && <4.18 || >=4.18.0 && <4.19 || >=4.19.0 && <4.20 || >=4.20.0 &&
9.98 s
> <4.21 || >=4.21.0 && <4.22 || >=4.22.0 && <4.23: using base-4.19.2.0
9.98 s
> Dependency extra: using extra-1.8.1
9.98 s
> Dependency filepath >=1.4.2 && <1.5 || >=1.5.0 && <1.6: using
9.98 s
> filepath-1.4.301.0
9.98 s
> Dependency megaparsec >=9.0.1 && <9.1 || >=9.2.1 && <9.3 || >=9.5.0 && <9.6 ||
9.98 s
> >=9.7.0 && <9.8: using megaparsec-9.7.0
9.98 s
> Dependency pathway >=0.0.1 && <0.1: using pathway-0.0.1.0
9.98 s
> Dependency pathway-compat-base >=0.0.1 && <0.1: using
9.98 s
> pathway-compat-base-0.0.1.0
9.98 s
> Dependency pathway-internal >=0.0.1 && <0.1: using pathway-internal-0.0.1.0
9.98 s
> Dependency base >=4.14.0 && <4.15 || >=4.15.0 && <4.16 || >=4.16.0 && <4.17 ||
9.98 s
> >=4.17.0 && <4.18 || >=4.18.0 && <4.19 || >=4.19.0 && <4.20 || >=4.20.0 &&
9.98 s
> <4.21 || >=4.21.0 && <4.22 || >=4.22.0 && <4.23: using base-4.19.2.0
9.98 s
> Dependency doctest >=0.16.3 && <0.17 || >=0.18.1 && <0.19 || >=0.20.1 && <0.21
9.98 s
> || >=0.21.1 && <0.22 || >=0.22.2 && <0.23 || >=0.24.2 && <0.25: using
9.98 s
> doctest-0.24.3
9.98 s
> Dependency pathway-compat-filepath: using pathway-compat-filepath-0.0.1.0
9.98 s
> Source component graph:
9.98 s
> component lib
9.98 s
> component test:doctests dependency lib
9.98 s
> Configured component graph:
9.98 s
> component pathway-compat-filepath-0.0.1.0-1aSZ3UXFr73FDOQtPeyw7g
9.98 s
> include base-4.19.2.0-934f
9.98 s
> include extra-1.8.1-F4oHgTKCper3ZiIUPZjGPK
9.98 s
> include filepath-1.4.301.0-6e15
9.98 s
> include megaparsec-9.7.0-10vHZAF1maw9O8p2gXs66N
9.98 s
> include pathway-0.0.1.0-H5uD0SRA9755UrSqFBaCYE
9.98 s
> include pathway-compat-base-0.0.1.0-8ldj6SPXbxq2Shd8yFeOpr
9.98 s
> include pathway-internal-0.0.1.0-Lnjdb2M8cxN196wSdsfQUK
9.98 s
> component pathway-compat-filepath-0.0.1.0-5Vlr121wsSlHY9yKgCvAGY-doctests
9.98 s
> include base-4.19.2.0-934f
9.98 s
> include doctest-0.24.3-1aDs7zEYV5r7raSsXr9TQC
9.98 s
> include pathway-compat-filepath-0.0.1.0-1aSZ3UXFr73FDOQtPeyw7g
9.98 s
> Linked component graph:
9.98 s
> unit pathway-compat-filepath-0.0.1.0-1aSZ3UXFr73FDOQtPeyw7g
9.98 s
> include base-4.19.2.0-934f
9.98 s
> include extra-1.8.1-F4oHgTKCper3ZiIUPZjGPK
9.98 s
> include filepath-1.4.301.0-6e15
9.98 s
> include megaparsec-9.7.0-10vHZAF1maw9O8p2gXs66N
9.98 s
> include pathway-0.0.1.0-H5uD0SRA9755UrSqFBaCYE
9.98 s
> include pathway-compat-base-0.0.1.0-8ldj6SPXbxq2Shd8yFeOpr
9.98 s
> include pathway-internal-0.0.1.0-Lnjdb2M8cxN196wSdsfQUK
9.98 s
> Common.FilePath=pathway-compat-filepath-0.0.1.0-1aSZ3UXFr73FDOQtPeyw7g:Common.FilePath,Common.OsPath=pathway-compat-filepath-0.0.1.0-1aSZ3UXFr73FDOQtPeyw7g:Common.OsPath,System.FilePath=pathway-compat-filepath-0.0.1.0-1aSZ3UXFr73FDOQtPeyw7g:System.FilePath,System.FilePath.Overlay=pathway-compat-filepath-0.0.1.0-1aSZ3UXFr73FDOQtPeyw7g:System.FilePath.Overlay,System.FilePath.Pathway=pathway-compat-filepath-0.0.1.0-1aSZ3UXFr73FDOQtPeyw7g:System.FilePath.Pathway,System.FilePath.Thin=pathway-compat-filepath-0.0.1.0-1aSZ3UXFr73FDOQtPeyw7g:System.FilePath.Thin,System.OsPath=pathway-compat-filepath-0.0.1.0-1aSZ3UXFr73FDOQtPeyw7g:System.OsPath,System.OsPath.Overlay=pathway-compat-filepath-0.0.1.0-1aSZ3UXFr73FDOQtPeyw7g:System.OsPath.Overlay,System.OsPath.Pathway=pathway-compat-filepath-0.0.1.0-1aSZ3UXFr73FDOQtPeyw7g:System.OsPath.Pathway,System.OsPath.Thin=pathway-compat-filepath-0.0.1.0-1aSZ3UXFr73FDOQtPeyw7g:System.OsPath.Thin
9.98 s
> unit pathway-compat-filepath-0.0.1.0-5Vlr121wsSlHY9yKgCvAGY-doctests
9.98 s
> include base-4.19.2.0-934f
9.98 s
> include doctest-0.24.3-1aDs7zEYV5r7raSsXr9TQC
9.98 s
> include pathway-compat-filepath-0.0.1.0-1aSZ3UXFr73FDOQtPeyw7g
9.98 s
> Ready component graph:
9.98 s
> definite pathway-compat-filepath-0.0.1.0-1aSZ3UXFr73FDOQtPeyw7g
9.98 s
> depends base-4.19.2.0-934f
9.98 s
> depends extra-1.8.1-F4oHgTKCper3ZiIUPZjGPK
9.98 s
> depends filepath-1.4.301.0-6e15
9.98 s
> depends megaparsec-9.7.0-10vHZAF1maw9O8p2gXs66N
9.98 s
> depends pathway-0.0.1.0-H5uD0SRA9755UrSqFBaCYE
9.98 s
> depends pathway-compat-base-0.0.1.0-8ldj6SPXbxq2Shd8yFeOpr
9.98 s
> depends pathway-internal-0.0.1.0-Lnjdb2M8cxN196wSdsfQUK
9.98 s
> definite pathway-compat-filepath-0.0.1.0-5Vlr121wsSlHY9yKgCvAGY-doctests
9.98 s
> depends base-4.19.2.0-934f
9.98 s
> depends doctest-0.24.3-1aDs7zEYV5r7raSsXr9TQC
9.98 s
> depends pathway-compat-filepath-0.0.1.0-1aSZ3UXFr73FDOQtPeyw7g
9.98 s
> Using Cabal-3.10.3.0 compiled by ghc-9.8
9.98 s
> Using compiler: ghc-9.8.4
9.98 s
> Using install prefix:
9.98 s
> /nix/store/3wxxzpw33d72qx9kng4qpfmhidc1ba2f-pathway-compat-filepath-0.0.1.0
9.98 s
> Executables installed in:
9.98 s
> /nix/store/3wxxzpw33d72qx9kng4qpfmhidc1ba2f-pathway-compat-filepath-0.0.1.0/bin
9.98 s
> Libraries installed in:
9.98 s
> /nix/store/3wxxzpw33d72qx9kng4qpfmhidc1ba2f-pathway-compat-filepath-0.0.1.0/lib/ghc-9.8.4/lib/x86_64-linux-ghc-9.8.4/pathway-compat-filepath-0.0.1.0-1aSZ3UXFr73FDOQtPeyw7g
9.98 s
> Dynamic Libraries installed in:
9.98 s
> /nix/store/3wxxzpw33d72qx9kng4qpfmhidc1ba2f-pathway-compat-filepath-0.0.1.0/lib/ghc-9.8.4/lib/x86_64-linux-ghc-9.8.4
9.98 s
> Private executables installed in:
9.98 s
> /nix/store/3wxxzpw33d72qx9kng4qpfmhidc1ba2f-pathway-compat-filepath-0.0.1.0/libexec/x86_64-linux-ghc-9.8.4/pathway-compat-filepath-0.0.1.0
9.98 s
> Data files installed in:
9.98 s
> /nix/store/3wxxzpw33d72qx9kng4qpfmhidc1ba2f-pathway-compat-filepath-0.0.1.0/share/x86_64-linux-ghc-9.8.4/pathway-compat-filepath-0.0.1.0
9.98 s
> Documentation installed in:
9.98 s
> /nix/store/1a5zli1srydg9czyyyns0ql1sl8i4gzp-pathway-compat-filepath-0.0.1.0-doc/share/doc/pathway-compat-filepath-0.0.1.0
9.98 s
> Configuration files installed in:
9.98 s
> /nix/store/3wxxzpw33d72qx9kng4qpfmhidc1ba2f-pathway-compat-filepath-0.0.1.0/etc
9.98 s
> No alex found
9.98 s
> Using ar found on system at:
9.98 s
> /nix/store/zjraf40s86y3iwhp626b934r5y6ldkbb-binutils-wrapper-2.46/bin/ar
9.98 s
> No c2hs found
9.98 s
> No cpphs found
9.98 s
> Using doctest version 0.24.3 found on system at:
9.98 s
> /nix/store/2y183b1vsybv0157vfr59yhdwjkpqfkn-doctest-0.24.3/bin/doctest
9.98 s
> Using gcc version 15.2.0 given by user at:
9.98 s
> /nix/store/29qjlshvklnyr67nhpprzgb9igmsfsjj-gcc-wrapper-15.2.0/bin/gcc
9.98 s
> Using ghc version 9.8.4 found on system at:
9.98 s
> /nix/store/7r9b0bl984hdgd70nf5p8raa55kml491-ghc-9.8.4/bin/ghc
9.98 s
> Using ghc-pkg version 9.8.4 found on system at:
9.98 s
> /nix/store/7r9b0bl984hdgd70nf5p8raa55kml491-ghc-9.8.4/bin/ghc-pkg-9.8.4
9.98 s
> No ghcjs found
9.98 s
> No ghcjs-pkg found
9.98 s
> No greencard found
9.98 s
> Using haddock version 2.30.0 found on system at:
9.98 s
> /nix/store/7r9b0bl984hdgd70nf5p8raa55kml491-ghc-9.8.4/bin/haddock-ghc-9.8.4
9.98 s
> No happy found
9.98 s
> Using haskell-suite found on system at: haskell-suite-dummy-location
9.98 s
> Using haskell-suite-pkg found on system at: haskell-suite-pkg-dummy-location
9.98 s
> No hmake found
9.98 s
> Using hpc version 0.69 found on system at:
9.98 s
> /nix/store/7r9b0bl984hdgd70nf5p8raa55kml491-ghc-9.8.4/bin/hpc-ghc-9.8.4
9.98 s
> Using hsc2hs version 0.68.10 found on system at:
9.98 s
> /nix/store/7r9b0bl984hdgd70nf5p8raa55kml491-ghc-9.8.4/bin/hsc2hs-ghc-9.8.4
9.98 s
> Using hscolour version 1.25 found on system at:
9.98 s
> /nix/store/awnxn98rlw62rrjwli6d2lb4d27mrzzw-hscolour-1.25/bin/HsColour
9.98 s
> No jhc found
9.98 s
> Using ld found on system at:
9.98 s
> /nix/store/zjraf40s86y3iwhp626b934r5y6ldkbb-binutils-wrapper-2.46/bin/ld.gold
9.98 s
> No pkg-config found
9.98 s
> Using runghc version 9.8.4 found on system at:
9.98 s
> /nix/store/7r9b0bl984hdgd70nf5p8raa55kml491-ghc-9.8.4/bin/runghc-9.8.4
9.98 s
> Using strip version 2.46 found on system at:
9.98 s
> /nix/store/29qjlshvklnyr67nhpprzgb9igmsfsjj-gcc-wrapper-15.2.0/bin/strip
9.98 s
> Using tar found on system at:
9.98 s
> /nix/store/z5mq2sam4484prf3kv6v6vjw1m0i7j24-gnutar-1.35/bin/tar
9.98 s
> No uhc found
9.98 s
> Running phase: buildPhase
9.98 s
> Preprocessing library for pathway-compat-filepath-0.0.1.0..
9.98 s
> Building library for pathway-compat-filepath-0.0.1.0..
9.98 s
> [ 1 of 10] Compiling Common.FilePath ( src/Common/FilePath.hs, dist/build/Common/FilePath.o, dist/build/Common/FilePath.dyn_o )
9.98 s
> [ 2 of 10] Compiling Common.OsPath ( src/Common/OsPath.hs, dist/build/Common/OsPath.o, dist/build/Common/OsPath.dyn_o )
9.98 s
>
9.98 s
> src/Common/OsPath.hs:87:23: error : [ GHC-76037 ]
9.98 s
> Not in scope: ‘O.unsafeEncodeUtf’
9.98 s
> NB: the module ‘System.OsPath’ does not export ‘unsafeEncodeUtf’.
9.98 s
> |
9.98 s
> 87 | Format.parent = O.unsafeEncodeUtf "..",
9.98 s
> | ^^^^^^^^^^^^^^^^^
9.98 s
> [ 3 of 10] Compiling System.FilePath.Thin ( src/System/FilePath/Thin.hs, dist/build/System/FilePath/Thin.o, dist/build/System/FilePath/Thin.dyn_o )
9.98 s
> [ 4 of 10] Compiling System.FilePath.Pathway ( src/System/FilePath/Pathway.hs, dist/build/System/FilePath/Pathway.o, dist/build/System/FilePath/Pathway.dyn_o )
9.98 s
> [ 5 of 10] Compiling System.FilePath.Overlay ( src/System/FilePath/Overlay.hs, dist/build/System/FilePath/Overlay.o, dist/build/System/FilePath/Overlay.dyn_o )
9.98 s
> [ 6 of 10] Compiling System.FilePath ( src/System/FilePath.hs, dist/build/System/FilePath.o, dist/build/System/FilePath.dyn_o )
9.98 s
For full logs, run:
9.98 s
nix log /nix/store/7szrkx5w148zqvipzqp9kpvdwyixf2jm-pathway-compat-filepath-0.0.1.0.drv
9.98 s
error: Cannot build '/nix/store/7szrkx5w148zqvipzqp9kpvdwyixf2jm-pathway-compat-filepath-0.0.1.0.drv '.
9.98 s
Reason: builder failed with exit code 1 .
9.98 s
Output paths:
9.98 s
/nix/store/1a5zli1srydg9czyyyns0ql1sl8i4gzp-pathway-compat-filepath-0.0.1.0-doc
9.98 s
/nix/store/3wxxzpw33d72qx9kng4qpfmhidc1ba2f-pathway-compat-filepath-0.0.1.0
9.98 s
Last 151 log lines:
9.98 s
> Running phase: setupCompilerEnvironmentPhase
9.98 s
> Build with /nix/store/7r9b0bl984hdgd70nf5p8raa55kml491-ghc-9.8.4.
9.98 s
> Running phase: unpackPhase
9.98 s
> unpacking source archive /nix/store/99h2nwiw8z9r3kqrm9kdhv4k4sf61d7w-filepath
9.98 s
> source root is filepath
9.98 s
> Running phase: patchPhase
9.98 s
> Running phase: compileBuildDriverPhase
9.98 s
> setupCompileFlags: -package-db=/build/tmp.TKICidthJY/setup-package.conf.d -threaded
9.98 s
> [1 of 2] Compiling Main ( Setup.hs, /build/tmp.TKICidthJY/Main.o )
9.98 s
> [2 of 2] Linking Setup
9.98 s
> Running phase: updateAutotoolsGnuConfigScriptsPhase
9.98 s
> Running phase: configurePhase
9.98 s
> configureFlags: --verbose --prefix=/nix/store/3wxxzpw33d72qx9kng4qpfmhidc1ba2f-pathway-compat-filepath-0.0.1.0 --libdir=$prefix/lib/$compiler/lib --libsubdir=$abi/$libname --docdir=/nix/store/1a5zli1srydg9czyyyns0ql1sl8i4gzp-pathway-compat-filepath-0.0.1.0-doc/share/doc/pathway-compat-filepath-0.0.1.0 --with-gcc=gcc --package-db=/build/tmp.TKICidthJY/package.conf.d --ghc-option=-j16 --ghc-option=+RTS --ghc-option=-A64M --ghc-option=-RTS --enable-library-profiling --profiling-detail=exported-functions --disable-profiling --enable-shared --disable-coverage --enable-static --disable-executable-dynamic --enable-tests --disable-benchmarks --enable-library-vanilla --disable-library-for-ghci --enable-split-sections --enable-library-stripping --enable-executable-stripping --ghc-option=-haddock --ghc-options=-Werror --extra-lib-dirs=/nix/store/pndhkk0l649lm1sj0mxk7cbwq26qd1ra-ncurses-6.6/lib --extra-lib-dirs=/nix/store/0djlg4g0b81w94k3vcaqsxsc2hh4kism-libffi-3.5.2/lib --extra-lib-dirs=/nix/store/md4paia7riiggyrj8p24c7a6vf8w7jz8-elfutils-0.194/lib --extra-lib-dirs=/nix/store/39vv2pf64gd8li48a4hpbhw2crzd8z5p-gmp-with-cxx-6.3.0/lib --extra-lib-dirs=/nix/store/7wwvald8lapkrsr72qanlw8blyn55ifx-numactl-2.0.18/lib --extra-lib-dirs=/nix/store/7r9b0bl984hdgd70nf5p8raa55kml491-ghc-9.8.4/lib
9.98 s
> Using Parsec parser
9.98 s
> Configuring pathway-compat-filepath-0.0.1.0...
9.98 s
> Flags chosen: noisy-deprecations=True, verify-no-recursion=False
9.98 s
> Dependency base >=4.14.0 && <4.15 || >=4.15.0 && <4.16 || >=4.16.0 && <4.17 ||
9.98 s
> >=4.17.0 && <4.18 || >=4.18.0 && <4.19 || >=4.19.0 && <4.20 || >=4.20.0 &&
9.98 s
> <4.21 || >=4.21.0 && <4.22 || >=4.22.0 && <4.23: using base-4.19.2.0
9.98 s
> Dependency extra: using extra-1.8.1
9.98 s
> Dependency filepath >=1.4.2 && <1.5 || >=1.5.0 && <1.6: using
9.98 s
> filepath-1.4.301.0
9.98 s
> Dependency megaparsec >=9.0.1 && <9.1 || >=9.2.1 && <9.3 || >=9.5.0 && <9.6 ||
9.98 s
> >=9.7.0 && <9.8: using megaparsec-9.7.0
9.98 s
> Dependency pathway >=0.0.1 && <0.1: using pathway-0.0.1.0
9.98 s
> Dependency pathway-compat-base >=0.0.1 && <0.1: using
9.98 s
> pathway-compat-base-0.0.1.0
9.98 s
> Dependency pathway-internal >=0.0.1 && <0.1: using pathway-internal-0.0.1.0
9.98 s
> Dependency base >=4.14.0 && <4.15 || >=4.15.0 && <4.16 || >=4.16.0 && <4.17 ||
9.98 s
> >=4.17.0 && <4.18 || >=4.18.0 && <4.19 || >=4.19.0 && <4.20 || >=4.20.0 &&
9.98 s
> <4.21 || >=4.21.0 && <4.22 || >=4.22.0 && <4.23: using base-4.19.2.0
9.98 s
> Dependency doctest >=0.16.3 && <0.17 || >=0.18.1 && <0.19 || >=0.20.1 && <0.21
9.98 s
> || >=0.21.1 && <0.22 || >=0.22.2 && <0.23 || >=0.24.2 && <0.25: using
9.98 s
> doctest-0.24.3
9.98 s
> Dependency pathway-compat-filepath: using pathway-compat-filepath-0.0.1.0
9.98 s
> Source component graph:
9.98 s
> component lib
9.98 s
> component test:doctests dependency lib
9.98 s
> Configured component graph:
9.98 s
> component pathway-compat-filepath-0.0.1.0-1aSZ3UXFr73FDOQtPeyw7g
9.98 s
> include base-4.19.2.0-934f
9.98 s
> include extra-1.8.1-F4oHgTKCper3ZiIUPZjGPK
9.98 s
> include filepath-1.4.301.0-6e15
9.98 s
> include megaparsec-9.7.0-10vHZAF1maw9O8p2gXs66N
9.98 s
> include pathway-0.0.1.0-H5uD0SRA9755UrSqFBaCYE
9.98 s
> include pathway-compat-base-0.0.1.0-8ldj6SPXbxq2Shd8yFeOpr
9.98 s
> include pathway-internal-0.0.1.0-Lnjdb2M8cxN196wSdsfQUK
9.98 s
> component pathway-compat-filepath-0.0.1.0-5Vlr121wsSlHY9yKgCvAGY-doctests
9.98 s
> include base-4.19.2.0-934f
9.98 s
> include doctest-0.24.3-1aDs7zEYV5r7raSsXr9TQC
9.98 s
> include pathway-compat-filepath-0.0.1.0-1aSZ3UXFr73FDOQtPeyw7g
9.98 s
> Linked component graph:
9.98 s
> unit pathway-compat-filepath-0.0.1.0-1aSZ3UXFr73FDOQtPeyw7g
9.98 s
> include base-4.19.2.0-934f
9.98 s
> include extra-1.8.1-F4oHgTKCper3ZiIUPZjGPK
9.98 s
> include filepath-1.4.301.0-6e15
9.98 s
> include megaparsec-9.7.0-10vHZAF1maw9O8p2gXs66N
9.98 s
> include pathway-0.0.1.0-H5uD0SRA9755UrSqFBaCYE
9.98 s
> include pathway-compat-base-0.0.1.0-8ldj6SPXbxq2Shd8yFeOpr
9.98 s
> include pathway-internal-0.0.1.0-Lnjdb2M8cxN196wSdsfQUK
9.98 s
> Common.FilePath=pathway-compat-filepath-0.0.1.0-1aSZ3UXFr73FDOQtPeyw7g:Common.FilePath,Common.OsPath=pathway-compat-filepath-0.0.1.0-1aSZ3UXFr73FDOQtPeyw7g:Common.OsPath,System.FilePath=pathway-compat-filepath-0.0.1.0-1aSZ3UXFr73FDOQtPeyw7g:System.FilePath,System.FilePath.Overlay=pathway-compat-filepath-0.0.1.0-1aSZ3UXFr73FDOQtPeyw7g:System.FilePath.Overlay,System.FilePath.Pathway=pathway-compat-filepath-0.0.1.0-1aSZ3UXFr73FDOQtPeyw7g:System.FilePath.Pathway,System.FilePath.Thin=pathway-compat-filepath-0.0.1.0-1aSZ3UXFr73FDOQtPeyw7g:System.FilePath.Thin,System.OsPath=pathway-compat-filepath-0.0.1.0-1aSZ3UXFr73FDOQtPeyw7g:System.OsPath,System.OsPath.Overlay=pathway-compat-filepath-0.0.1.0-1aSZ3UXFr73FDOQtPeyw7g:System.OsPath.Overlay,System.OsPath.Pathway=pathway-compat-filepath-0.0.1.0-1aSZ3UXFr73FDOQtPeyw7g:System.OsPath.Pathway,System.OsPath.Thin=pathway-compat-filepath-0.0.1.0-1aSZ3UXFr73FDOQtPeyw7g:System.OsPath.Thin
9.98 s
> unit pathway-compat-filepath-0.0.1.0-5Vlr121wsSlHY9yKgCvAGY-doctests
9.98 s
> include base-4.19.2.0-934f
9.98 s
> include doctest-0.24.3-1aDs7zEYV5r7raSsXr9TQC
9.98 s
> include pathway-compat-filepath-0.0.1.0-1aSZ3UXFr73FDOQtPeyw7g
9.98 s
> Ready component graph:
9.98 s
> definite pathway-compat-filepath-0.0.1.0-1aSZ3UXFr73FDOQtPeyw7g
9.98 s
> depends base-4.19.2.0-934f
9.98 s
> depends extra-1.8.1-F4oHgTKCper3ZiIUPZjGPK
9.98 s
> depends filepath-1.4.301.0-6e15
9.98 s
> depends megaparsec-9.7.0-10vHZAF1maw9O8p2gXs66N
9.98 s
> depends pathway-0.0.1.0-H5uD0SRA9755UrSqFBaCYE
9.98 s
> depends pathway-compat-base-0.0.1.0-8ldj6SPXbxq2Shd8yFeOpr
9.98 s
> depends pathway-internal-0.0.1.0-Lnjdb2M8cxN196wSdsfQUK
9.98 s
> definite pathway-compat-filepath-0.0.1.0-5Vlr121wsSlHY9yKgCvAGY-doctests
9.98 s
> depends base-4.19.2.0-934f
9.98 s
> depends doctest-0.24.3-1aDs7zEYV5r7raSsXr9TQC
9.98 s
> depends pathway-compat-filepath-0.0.1.0-1aSZ3UXFr73FDOQtPeyw7g
9.98 s
> Using Cabal-3.10.3.0 compiled by ghc-9.8
9.98 s
> Using compiler: ghc-9.8.4
9.98 s
> Using install prefix:
9.98 s
> /nix/store/3wxxzpw33d72qx9kng4qpfmhidc1ba2f-pathway-compat-filepath-0.0.1.0
9.98 s
> Executables installed in:
9.98 s
> /nix/store/3wxxzpw33d72qx9kng4qpfmhidc1ba2f-pathway-compat-filepath-0.0.1.0/bin
9.98 s
> Libraries installed in:
9.98 s
> /nix/store/3wxxzpw33d72qx9kng4qpfmhidc1ba2f-pathway-compat-filepath-0.0.1.0/lib/ghc-9.8.4/lib/x86_64-linux-ghc-9.8.4/pathway-compat-filepath-0.0.1.0-1aSZ3UXFr73FDOQtPeyw7g
9.98 s
> Dynamic Libraries installed in:
9.98 s
> /nix/store/3wxxzpw33d72qx9kng4qpfmhidc1ba2f-pathway-compat-filepath-0.0.1.0/lib/ghc-9.8.4/lib/x86_64-linux-ghc-9.8.4
9.98 s
> Private executables installed in:
9.98 s
> /nix/store/3wxxzpw33d72qx9kng4qpfmhidc1ba2f-pathway-compat-filepath-0.0.1.0/libexec/x86_64-linux-ghc-9.8.4/pathway-compat-filepath-0.0.1.0
9.98 s
> Data files installed in:
9.98 s
> /nix/store/3wxxzpw33d72qx9kng4qpfmhidc1ba2f-pathway-compat-filepath-0.0.1.0/share/x86_64-linux-ghc-9.8.4/pathway-compat-filepath-0.0.1.0
9.98 s
> Documentation installed in:
9.98 s
> /nix/store/1a5zli1srydg9czyyyns0ql1sl8i4gzp-pathway-compat-filepath-0.0.1.0-doc/share/doc/pathway-compat-filepath-0.0.1.0
9.98 s
> Configuration files installed in:
9.98 s
> /nix/store/3wxxzpw33d72qx9kng4qpfmhidc1ba2f-pathway-compat-filepath-0.0.1.0/etc
9.98 s
> No alex found
9.98 s
> Using ar found on system at:
9.98 s
> /nix/store/zjraf40s86y3iwhp626b934r5y6ldkbb-binutils-wrapper-2.46/bin/ar
9.98 s
> No c2hs found
9.98 s
> No cpphs found
9.98 s
> Using doctest version 0.24.3 found on system at:
9.98 s
> /nix/store/2y183b1vsybv0157vfr59yhdwjkpqfkn-doctest-0.24.3/bin/doctest
9.98 s
> Using gcc version 15.2.0 given by user at:
9.98 s
> /nix/store/29qjlshvklnyr67nhpprzgb9igmsfsjj-gcc-wrapper-15.2.0/bin/gcc
9.98 s
> Using ghc version 9.8.4 found on system at:
9.98 s
> /nix/store/7r9b0bl984hdgd70nf5p8raa55kml491-ghc-9.8.4/bin/ghc
9.98 s
> Using ghc-pkg version 9.8.4 found on system at:
9.98 s
> /nix/store/7r9b0bl984hdgd70nf5p8raa55kml491-ghc-9.8.4/bin/ghc-pkg-9.8.4
9.98 s
> No ghcjs found
9.98 s
> No ghcjs-pkg found
9.98 s
> No greencard found
9.98 s
> Using haddock version 2.30.0 found on system at:
9.98 s
> /nix/store/7r9b0bl984hdgd70nf5p8raa55kml491-ghc-9.8.4/bin/haddock-ghc-9.8.4
9.98 s
> No happy found
9.98 s
> Using haskell-suite found on system at: haskell-suite-dummy-location
9.98 s
> Using haskell-suite-pkg found on system at: haskell-suite-pkg-dummy-location
9.98 s
> No hmake found
9.98 s
> Using hpc version 0.69 found on system at:
9.98 s
> /nix/store/7r9b0bl984hdgd70nf5p8raa55kml491-ghc-9.8.4/bin/hpc-ghc-9.8.4
9.98 s
> Using hsc2hs version 0.68.10 found on system at:
9.98 s
> /nix/store/7r9b0bl984hdgd70nf5p8raa55kml491-ghc-9.8.4/bin/hsc2hs-ghc-9.8.4
9.98 s
> Using hscolour version 1.25 found on system at:
9.98 s
> /nix/store/awnxn98rlw62rrjwli6d2lb4d27mrzzw-hscolour-1.25/bin/HsColour
9.98 s
> No jhc found
9.98 s
> Using ld found on system at:
9.98 s
> /nix/store/zjraf40s86y3iwhp626b934r5y6ldkbb-binutils-wrapper-2.46/bin/ld.gold
9.98 s
> No pkg-config found
9.98 s
> Using runghc version 9.8.4 found on system at:
9.98 s
> /nix/store/7r9b0bl984hdgd70nf5p8raa55kml491-ghc-9.8.4/bin/runghc-9.8.4
9.98 s
> Using strip version 2.46 found on system at:
9.98 s
> /nix/store/29qjlshvklnyr67nhpprzgb9igmsfsjj-gcc-wrapper-15.2.0/bin/strip
9.98 s
> Using tar found on system at:
9.98 s
> /nix/store/z5mq2sam4484prf3kv6v6vjw1m0i7j24-gnutar-1.35/bin/tar
9.98 s
> No uhc found
9.98 s
> Running phase: buildPhase
9.98 s
> Preprocessing library for pathway-compat-filepath-0.0.1.0..
9.98 s
> Building library for pathway-compat-filepath-0.0.1.0..
9.98 s
> [ 1 of 10] Compiling Common.FilePath ( src/Common/FilePath.hs, dist/build/Common/FilePath.o, dist/build/Common/FilePath.dyn_o )
9.98 s
> [ 2 of 10] Compiling Common.OsPath ( src/Common/OsPath.hs, dist/build/Common/OsPath.o, dist/build/Common/OsPath.dyn_o )
9.98 s
>
9.98 s
> src/Common/OsPath.hs:87:23: error : [ GHC-76037 ]
9.98 s
> Not in scope: ‘O.unsafeEncodeUtf’
9.98 s
> NB: the module ‘System.OsPath’ does not export ‘unsafeEncodeUtf’.
9.98 s
> |
9.98 s
> 87 | Format.parent = O.unsafeEncodeUtf "..",
9.98 s
> | ^^^^^^^^^^^^^^^^^
9.98 s
> [ 3 of 10] Compiling System.FilePath.Thin ( src/System/FilePath/Thin.hs, dist/build/System/FilePath/Thin.o, dist/build/System/FilePath/Thin.dyn_o )
9.98 s
> [ 4 of 10] Compiling System.FilePath.Pathway ( src/System/FilePath/Pathway.hs, dist/build/System/FilePath/Pathway.o, dist/build/System/FilePath/Pathway.dyn_o )
9.98 s
> [ 5 of 10] Compiling System.FilePath.Overlay ( src/System/FilePath/Overlay.hs, dist/build/System/FilePath/Overlay.o, dist/build/System/FilePath/Overlay.dyn_o )
9.98 s
> [ 6 of 10] Compiling System.FilePath ( src/System/FilePath.hs, dist/build/System/FilePath.o, dist/build/System/FilePath.dyn_o )
9.98 s
For full logs, run:
9.98 s
nix log /nix/store/7szrkx5w148zqvipzqp9kpvdwyixf2jm-pathway-compat-filepath-0.0.1.0.drv
9.98 s
error: Cannot build '/nix/store/xgk4x00p9nxy6vygklkdvq3xhnw85n9f-ghc-9.8.4-with-packages.drv '.
9.98 s
Reason: 1 dependency failed .
9.98 s
Output paths:
9.98 s
/nix/store/28d7zlh94n17052znxscmz95nzy2y14a-ghc-9.8.4-with-packages
9.98 s
error: Cannot build '/nix/store/88ry82jpw7zq3xgbiwnx1w9qxsh0qky4-pathway-compat-directory-0.0.1.0.drv '.
9.98 s
Reason: 1 dependency failed .
9.98 s
Output paths:
9.98 s
/nix/store/dywfb8cm100xr0sf32p9rsxsnsh69rj6-pathway-compat-directory-0.0.1.0-doc
9.98 s
/nix/store/s1ah3f1yscfslflkp1plkhlcli18iy6b-pathway-compat-directory-0.0.1.0
9.98 s
error: Cannot build '/nix/store/63m9x4cv94732rwlvs3r2jcm466wivfm-pathway-compat-file-io-0.0.1.0.drv '.
9.98 s
Reason: 1 dependency failed .
9.98 s
Output paths:
9.98 s
/nix/store/45czry1y9c5sgqm357i6hb6ggvyvx51b-pathway-compat-file-io-0.0.1.0
9.98 s
/nix/store/zrvf42qsq1gy5wil4341p92839w0p49b-pathway-compat-file-io-0.0.1.0-doc
9.98 s
error: Cannot build '/nix/store/ikjmgvjg2wrv8idayqspdv6jg97fzzai-pathway-compat-temporary-0.0.1.0.drv '.
9.98 s
Reason: 1 dependency failed .
9.98 s
Output paths:
9.98 s
/nix/store/5n49iv6xr88nwyza5k8dnqvxx2vqs319-pathway-compat-temporary-0.0.1.0
9.98 s
/nix/store/c3b6wzzcri7hd1jv871c7za1swan4bd1-pathway-compat-temporary-0.0.1.0-doc
9.98 s
error: Cannot build '/nix/store/h33py59mz8imsy05pgjz19b0jvgi7z1i-pathway-system-0.0.1.0.drv '.
9.98 s
Reason: 1 dependency failed .
9.98 s
Output paths:
9.98 s
/nix/store/51r6wz46nnyxhsvn968rjf84gyw6gv74-pathway-system-0.0.1.0
9.98 s
/nix/store/mlni22kgq48krfd8smgpizpj6in7d4ia-pathway-system-0.0.1.0-doc
9.98 s
error: Build failed due to failed dependency
9.98 s
error: Cannot build '/nix/store/cyn0sina55pw6lj00znvq4k29sbkm2vv-all-packages.drv '.
9.98 s
Reason: 1 dependency failed .
9.98 s
Output paths:
9.98 s
/nix/store/jxsli0j2m1xahmhzgsgird7xmfgyq57l-all-packages
9.99 s
Build failed due to failed dependency
10.02 s
Build failed.