build packages.x86_64-linux.ghc984_all

Reproduce this run
Original Run
  1. 0.75 s $ /nix/store/9ypz3flqsrl5xl495mm8h645gadjsxi1-coreutils-9.11/bin/timeout --kill-after=15s 7200s /nix/store/23zk8sgzamrbmj1fday15szf7f2279s8-nix-2.34.7/bin/nix --extra-experimental-features nix-command --extra-experimental-features flakes --log-format internal-json build --no-link --print-out-paths git+https://github.com/sellout/pathway?ref=more-system&rev=48808d129e08f84a9d17c382758a97ce6d627392&shallow=1#packages.x86_64-linux.ghc984_all --print-build-logs
  2. 0.76 s warning: ignoring untrusted flake configuration setting 'allow-import-from-derivation'.
  3. 0.76 s Pass '--accept-flake-config' to trust it
  4. 0.76 s warning: ignoring untrusted flake configuration setting 'extra-experimental-features'.
  5. 0.76 s Pass '--accept-flake-config' to trust it
  6. 0.76 s warning: ignoring untrusted flake configuration setting 'extra-substituters'.
  7. 0.76 s Pass '--accept-flake-config' to trust it
  8. 0.76 s warning: ignoring untrusted flake configuration setting 'extra-trusted-public-keys'.
  9. 0.76 s Pass '--accept-flake-config' to trust it
  10. 0.76 s warning: ignoring untrusted flake configuration setting 'sandbox'.
  11. 0.76 s Pass '--accept-flake-config' to trust it
  12. 0.76 s warning: ignoring untrusted flake configuration setting 'use-registries'.
  13. 0.76 s Pass '--accept-flake-config' to trust it
  14. 1.83 s
  15. 3.54 s Downloading cached pathway-internal-0.0.1.0-doc from https://cache.nix-ci.com
  16. 5.84 s Downloaded cached pathway-internal-0.0.1.0-doc (612 KiB) in 2.2s
  17. 5.85 s Progress: 0 of 22 built, 1 of 10 downloaded from cache
  18. 5.85 s Downloading cached pathway-0.0.1.0-doc from https://cache.nix-ci.com
  19. 5.85 s Downloading cached pathway-internal from https://cache.nix-ci.com
  20. 5.85 s Downloading cached pathway-quickcheck-0.0.1.0-doc from https://cache.nix-ci.com
  21. 5.85 s Downloaded cached pathway-quickcheck-0.0.1.0-doc (217 KiB) in 4ms
  22. 5.85 s Progress: 0 of 21 built, 2 of 10 downloaded from cache (2 downloading)
  23. 5.86 s Downloaded cached pathway-0.0.1.0-doc (1.3 MiB) in 9ms
  24. 5.86 s Progress: 0 of 20 built, 3 of 10 downloaded from cache (1 downloading)
  25. 5.86 s Downloading cached pathway-compat-base-0.0.1.0-doc from https://cache.nix-ci.com
  26. 5.86 s Downloading cached pathway-path-0.0.1.0-doc from https://cache.nix-ci.com
  27. 5.86 s Downloaded cached pathway-internal (2 MiB) in 14ms
  28. 5.86 s Progress: 0 of 19 built, 4 of 10 downloaded from cache (2 downloading)
  29. 5.86 s Downloading cached pathway from https://cache.nix-ci.com
  30. 5.86 s Downloading cached pathway-quickcheck from https://cache.nix-ci.com
  31. 5.87 s Downloaded cached pathway-path-0.0.1.0-doc (263 KiB) in 11ms
  32. 5.87 s Progress: 0 of 18 built, 5 of 10 downloaded from cache (3 downloading)
  33. 5.87 s Downloaded cached pathway-quickcheck (179 KiB) in 7ms
  34. 5.87 s Progress: 0 of 17 built, 6 of 10 downloaded from cache (2 downloading)
  35. 5.88 s Downloaded cached pathway-compat-base-0.0.1.0-doc (1.9 MiB) in 18ms
  36. 5.88 s Progress: 0 of 16 built, 7 of 10 downloaded from cache (1 downloading)
  37. 5.89 s Downloaded cached pathway (2.7 MiB) in 23ms
  38. 5.89 s Progress: 0 of 15 built, 8 of 10 downloaded from cache
  39. 5.89 s Downloading cached pathway-compat-base from https://cache.nix-ci.com
  40. 5.89 s Downloading cached pathway-path from https://cache.nix-ci.com
  41. 5.90 s Downloaded cached pathway-path (217 KiB) in 9ms
  42. 5.90 s Progress: 0 of 14 built, 9 of 10 downloaded from cache (1 downloading)
  43. 5.91 s Downloaded cached pathway-compat-base (2 MiB) in 19ms
  44. 5.91 s Progress: 0 of 13 built, 10 of 10 downloaded from cache
  45. 6.02 s Building /nix/store/7szrkx5w148zqvipzqp9kpvdwyixf2jm-pathway-compat-filepath-0.0.1.0.drv
  46. 6.25 s [pathway-compat-filepath] Phase: setupCompilerEnvironmentPhase
  47. 6.25 s [pathway-compat-filepath] Build with /nix/store/7r9b0bl984hdgd70nf5p8raa55kml491-ghc-9.8.4.
  48. 6.60 s [pathway-compat-filepath] Phase: unpackPhase
  49. 6.60 s [pathway-compat-filepath] unpacking source archive /nix/store/99h2nwiw8z9r3kqrm9kdhv4k4sf61d7w-filepath
  50. 6.61 s [pathway-compat-filepath] source root is filepath
  51. 6.62 s [pathway-compat-filepath] Phase: patchPhase
  52. 6.64 s [pathway-compat-filepath] Phase: compileBuildDriverPhase
  53. 6.64 s [pathway-compat-filepath] setupCompileFlags: -package-db=/build/tmp.TKICidthJY/setup-package.conf.d -threaded
  54. 6.69 s [pathway-compat-filepath] [1 of 2] Compiling Main ( Setup.hs, /build/tmp.TKICidthJY/Main.o )
  55. 6.74 s [pathway-compat-filepath] [2 of 2] Linking Setup
  56. 8.09 s [pathway-compat-filepath] Phase: updateAutotoolsGnuConfigScriptsPhase
  57. 8.11 s [pathway-compat-filepath] Phase: configurePhase
  58. 8.11 s [pathway-compat-filepath] configureFlags: --verbose --prefix=/nix/store/3wxxzpw33d72qx9kng4qpfmhidc1ba2f-pathway-compat-filepath-0.0.1.0 --libdir=$prefix/lib/$compiler/lib --libsubdir=$abi/$libname --docdir=/nix/store/1a5zli1srydg9czyyyns0ql1sl8i4gzp-pathway-compat-filepath-0.0.1.0-doc/share/doc/pathway-compat-filepath-0.0.1.0 --with-gcc=gcc --package-db=/build/tmp.TKICidthJY/package.conf.d --ghc-option=-j16 --ghc-option=+RTS --ghc-option=-A64M --ghc-option=-RTS --enable-library-profiling --profiling-detail=exported-functions --disable-profiling --enable-shared --disable-coverage --enable-static --disable-executable-dynamic --enable-tests --disable-benchmarks --enable-library-vanilla --disable-library-for-ghci --enable-split-sections --enable-library-stripping --enable-executable-stripping --ghc-option=-haddock --ghc-options=-Werror --extra-lib-dirs=/nix/store/pndhkk0l649lm1sj0mxk7cbwq26qd1ra-ncurses-6.6/lib --extra-lib-dirs=/nix/store/0djlg4g0b81w94k3vcaqsxsc2hh4kism-libffi-3.5.2/lib --extra-lib-dirs=/nix/store/md4paia7riiggyrj8p24c7a6vf8w7jz8-elfutils-0.194/lib --extra-lib-dirs=/nix/store/39vv2pf64gd8li48a4hpbhw2crzd8z5p-gmp-with-cxx-6.3.0/lib --extra-lib-dirs=/nix/store/7wwvald8lapkrsr72qanlw8blyn55ifx-numactl-2.0.18/lib --extra-lib-dirs=/nix/store/7r9b0bl984hdgd70nf5p8raa55kml491-ghc-9.8.4/lib
  59. 8.12 s [pathway-compat-filepath] Using Parsec parser
  60. 8.12 s [pathway-compat-filepath] Configuring pathway-compat-filepath-0.0.1.0...
  61. 8.47 s [pathway-compat-filepath] Flags chosen: noisy-deprecations=True, verify-no-recursion=False
  62. 8.47 s [pathway-compat-filepath] Dependency base >=4.14.0 && <4.15 || >=4.15.0 && <4.16 || >=4.16.0 && <4.17 ||
  63. 8.47 s [pathway-compat-filepath] >=4.17.0 && <4.18 || >=4.18.0 && <4.19 || >=4.19.0 && <4.20 || >=4.20.0 &&
  64. 8.47 s [pathway-compat-filepath] <4.21 || >=4.21.0 && <4.22 || >=4.22.0 && <4.23: using base-4.19.2.0
  65. 8.47 s [pathway-compat-filepath] Dependency extra: using extra-1.8.1
  66. 8.47 s [pathway-compat-filepath] Dependency filepath >=1.4.2 && <1.5 || >=1.5.0 && <1.6: using
  67. 8.47 s [pathway-compat-filepath] filepath-1.4.301.0
  68. 8.47 s [pathway-compat-filepath] Dependency megaparsec >=9.0.1 && <9.1 || >=9.2.1 && <9.3 || >=9.5.0 && <9.6 ||
  69. 8.47 s [pathway-compat-filepath] >=9.7.0 && <9.8: using megaparsec-9.7.0
  70. 8.47 s [pathway-compat-filepath] Dependency pathway >=0.0.1 && <0.1: using pathway-0.0.1.0
  71. 8.47 s [pathway-compat-filepath] Dependency pathway-compat-base >=0.0.1 && <0.1: using
  72. 8.47 s [pathway-compat-filepath] pathway-compat-base-0.0.1.0
  73. 8.47 s [pathway-compat-filepath] Dependency pathway-internal >=0.0.1 && <0.1: using pathway-internal-0.0.1.0
  74. 8.47 s [pathway-compat-filepath] Dependency base >=4.14.0 && <4.15 || >=4.15.0 && <4.16 || >=4.16.0 && <4.17 ||
  75. 8.47 s [pathway-compat-filepath] >=4.17.0 && <4.18 || >=4.18.0 && <4.19 || >=4.19.0 && <4.20 || >=4.20.0 &&
  76. 8.47 s [pathway-compat-filepath] <4.21 || >=4.21.0 && <4.22 || >=4.22.0 && <4.23: using base-4.19.2.0
  77. 8.47 s [pathway-compat-filepath] Dependency doctest >=0.16.3 && <0.17 || >=0.18.1 && <0.19 || >=0.20.1 && <0.21
  78. 8.47 s [pathway-compat-filepath] || >=0.21.1 && <0.22 || >=0.22.2 && <0.23 || >=0.24.2 && <0.25: using
  79. 8.47 s [pathway-compat-filepath] doctest-0.24.3
  80. 8.47 s [pathway-compat-filepath] Dependency pathway-compat-filepath: using pathway-compat-filepath-0.0.1.0
  81. 8.80 s [pathway-compat-filepath] Source component graph:
  82. 8.80 s [pathway-compat-filepath] component lib
  83. 8.80 s [pathway-compat-filepath] component test:doctests dependency lib
  84. 8.80 s [pathway-compat-filepath] Configured component graph:
  85. 8.80 s [pathway-compat-filepath] component pathway-compat-filepath-0.0.1.0-1aSZ3UXFr73FDOQtPeyw7g
  86. 8.80 s [pathway-compat-filepath] include base-4.19.2.0-934f
  87. 8.80 s [pathway-compat-filepath] include extra-1.8.1-F4oHgTKCper3ZiIUPZjGPK
  88. 8.80 s [pathway-compat-filepath] include filepath-1.4.301.0-6e15
  89. 8.80 s [pathway-compat-filepath] include megaparsec-9.7.0-10vHZAF1maw9O8p2gXs66N
  90. 8.80 s [pathway-compat-filepath] include pathway-0.0.1.0-H5uD0SRA9755UrSqFBaCYE
  91. 8.80 s [pathway-compat-filepath] include pathway-compat-base-0.0.1.0-8ldj6SPXbxq2Shd8yFeOpr
  92. 8.80 s [pathway-compat-filepath] include pathway-internal-0.0.1.0-Lnjdb2M8cxN196wSdsfQUK
  93. 8.80 s [pathway-compat-filepath] component pathway-compat-filepath-0.0.1.0-5Vlr121wsSlHY9yKgCvAGY-doctests
  94. 8.80 s [pathway-compat-filepath] include base-4.19.2.0-934f
  95. 8.80 s [pathway-compat-filepath] include doctest-0.24.3-1aDs7zEYV5r7raSsXr9TQC
  96. 8.80 s [pathway-compat-filepath] include pathway-compat-filepath-0.0.1.0-1aSZ3UXFr73FDOQtPeyw7g
  97. 8.80 s [pathway-compat-filepath] Linked component graph:
  98. 8.80 s [pathway-compat-filepath] unit pathway-compat-filepath-0.0.1.0-1aSZ3UXFr73FDOQtPeyw7g
  99. 8.80 s [pathway-compat-filepath] include base-4.19.2.0-934f
  100. 8.80 s [pathway-compat-filepath] include extra-1.8.1-F4oHgTKCper3ZiIUPZjGPK
  101. 8.80 s [pathway-compat-filepath] include filepath-1.4.301.0-6e15
  102. 8.80 s [pathway-compat-filepath] include megaparsec-9.7.0-10vHZAF1maw9O8p2gXs66N
  103. 8.80 s [pathway-compat-filepath] include pathway-0.0.1.0-H5uD0SRA9755UrSqFBaCYE
  104. 8.80 s [pathway-compat-filepath] include pathway-compat-base-0.0.1.0-8ldj6SPXbxq2Shd8yFeOpr
  105. 8.80 s [pathway-compat-filepath] include pathway-internal-0.0.1.0-Lnjdb2M8cxN196wSdsfQUK
  106. 8.80 s [pathway-compat-filepath] Common.FilePath=pathway-compat-filepath-0.0.1.0-1aSZ3UXFr73FDOQtPeyw7g:Common.FilePath,Common.OsPath=pathway-compat-filepath-0.0.1.0-1aSZ3UXFr73FDOQtPeyw7g:Common.OsPath,System.FilePath=pathway-compat-filepath-0.0.1.0-1aSZ3UXFr73FDOQtPeyw7g:System.FilePath,System.FilePath.Overlay=pathway-compat-filepath-0.0.1.0-1aSZ3UXFr73FDOQtPeyw7g:System.FilePath.Overlay,System.FilePath.Pathway=pathway-compat-filepath-0.0.1.0-1aSZ3UXFr73FDOQtPeyw7g:System.FilePath.Pathway,System.FilePath.Thin=pathway-compat-filepath-0.0.1.0-1aSZ3UXFr73FDOQtPeyw7g:System.FilePath.Thin,System.OsPath=pathway-compat-filepath-0.0.1.0-1aSZ3UXFr73FDOQtPeyw7g:System.OsPath,System.OsPath.Overlay=pathway-compat-filepath-0.0.1.0-1aSZ3UXFr73FDOQtPeyw7g:System.OsPath.Overlay,System.OsPath.Pathway=pathway-compat-filepath-0.0.1.0-1aSZ3UXFr73FDOQtPeyw7g:System.OsPath.Pathway,System.OsPath.Thin=pathway-compat-filepath-0.0.1.0-1aSZ3UXFr73FDOQtPeyw7g:System.OsPath.Thin
  107. 8.80 s [pathway-compat-filepath] unit pathway-compat-filepath-0.0.1.0-5Vlr121wsSlHY9yKgCvAGY-doctests
  108. 8.80 s [pathway-compat-filepath] include base-4.19.2.0-934f
  109. 8.80 s [pathway-compat-filepath] include doctest-0.24.3-1aDs7zEYV5r7raSsXr9TQC
  110. 8.80 s [pathway-compat-filepath] include pathway-compat-filepath-0.0.1.0-1aSZ3UXFr73FDOQtPeyw7g
  111. 8.80 s [pathway-compat-filepath] Ready component graph:
  112. 8.80 s [pathway-compat-filepath] definite pathway-compat-filepath-0.0.1.0-1aSZ3UXFr73FDOQtPeyw7g
  113. 8.81 s [pathway-compat-filepath] depends base-4.19.2.0-934f
  114. 8.81 s [pathway-compat-filepath] depends extra-1.8.1-F4oHgTKCper3ZiIUPZjGPK
  115. 8.81 s [pathway-compat-filepath] depends filepath-1.4.301.0-6e15
  116. 8.81 s [pathway-compat-filepath] depends megaparsec-9.7.0-10vHZAF1maw9O8p2gXs66N
  117. 8.81 s [pathway-compat-filepath] depends pathway-0.0.1.0-H5uD0SRA9755UrSqFBaCYE
  118. 8.81 s [pathway-compat-filepath] depends pathway-compat-base-0.0.1.0-8ldj6SPXbxq2Shd8yFeOpr
  119. 8.81 s [pathway-compat-filepath] depends pathway-internal-0.0.1.0-Lnjdb2M8cxN196wSdsfQUK
  120. 8.81 s [pathway-compat-filepath] definite pathway-compat-filepath-0.0.1.0-5Vlr121wsSlHY9yKgCvAGY-doctests
  121. 8.81 s [pathway-compat-filepath] depends base-4.19.2.0-934f
  122. 8.81 s [pathway-compat-filepath] depends doctest-0.24.3-1aDs7zEYV5r7raSsXr9TQC
  123. 8.81 s [pathway-compat-filepath] depends pathway-compat-filepath-0.0.1.0-1aSZ3UXFr73FDOQtPeyw7g
  124. 8.81 s [pathway-compat-filepath] Using Cabal-3.10.3.0 compiled by ghc-9.8
  125. 8.81 s [pathway-compat-filepath] Using compiler: ghc-9.8.4
  126. 8.81 s [pathway-compat-filepath] Using install prefix:
  127. 8.81 s [pathway-compat-filepath] /nix/store/3wxxzpw33d72qx9kng4qpfmhidc1ba2f-pathway-compat-filepath-0.0.1.0
  128. 8.81 s [pathway-compat-filepath] Executables installed in:
  129. 8.81 s [pathway-compat-filepath] /nix/store/3wxxzpw33d72qx9kng4qpfmhidc1ba2f-pathway-compat-filepath-0.0.1.0/bin
  130. 8.81 s [pathway-compat-filepath] Libraries installed in:
  131. 8.81 s [pathway-compat-filepath] /nix/store/3wxxzpw33d72qx9kng4qpfmhidc1ba2f-pathway-compat-filepath-0.0.1.0/lib/ghc-9.8.4/lib/x86_64-linux-ghc-9.8.4/pathway-compat-filepath-0.0.1.0-1aSZ3UXFr73FDOQtPeyw7g
  132. 8.81 s [pathway-compat-filepath] Dynamic Libraries installed in:
  133. 8.81 s [pathway-compat-filepath] /nix/store/3wxxzpw33d72qx9kng4qpfmhidc1ba2f-pathway-compat-filepath-0.0.1.0/lib/ghc-9.8.4/lib/x86_64-linux-ghc-9.8.4
  134. 8.81 s [pathway-compat-filepath] Private executables installed in:
  135. 8.81 s [pathway-compat-filepath] /nix/store/3wxxzpw33d72qx9kng4qpfmhidc1ba2f-pathway-compat-filepath-0.0.1.0/libexec/x86_64-linux-ghc-9.8.4/pathway-compat-filepath-0.0.1.0
  136. 8.81 s [pathway-compat-filepath] Data files installed in:
  137. 8.81 s [pathway-compat-filepath] /nix/store/3wxxzpw33d72qx9kng4qpfmhidc1ba2f-pathway-compat-filepath-0.0.1.0/share/x86_64-linux-ghc-9.8.4/pathway-compat-filepath-0.0.1.0
  138. 8.81 s [pathway-compat-filepath] Documentation installed in:
  139. 8.81 s [pathway-compat-filepath] /nix/store/1a5zli1srydg9czyyyns0ql1sl8i4gzp-pathway-compat-filepath-0.0.1.0-doc/share/doc/pathway-compat-filepath-0.0.1.0
  140. 8.81 s [pathway-compat-filepath] Configuration files installed in:
  141. 8.81 s [pathway-compat-filepath] /nix/store/3wxxzpw33d72qx9kng4qpfmhidc1ba2f-pathway-compat-filepath-0.0.1.0/etc
  142. 8.81 s [pathway-compat-filepath] No alex found
  143. 8.81 s [pathway-compat-filepath] Using ar found on system at:
  144. 8.81 s [pathway-compat-filepath] /nix/store/zjraf40s86y3iwhp626b934r5y6ldkbb-binutils-wrapper-2.46/bin/ar
  145. 8.81 s [pathway-compat-filepath] No c2hs found
  146. 8.81 s [pathway-compat-filepath] No cpphs found
  147. 8.81 s [pathway-compat-filepath] Using doctest version 0.24.3 found on system at:
  148. 8.81 s [pathway-compat-filepath] /nix/store/2y183b1vsybv0157vfr59yhdwjkpqfkn-doctest-0.24.3/bin/doctest
  149. 8.81 s [pathway-compat-filepath] Using gcc version 15.2.0 given by user at:
  150. 8.81 s [pathway-compat-filepath] /nix/store/29qjlshvklnyr67nhpprzgb9igmsfsjj-gcc-wrapper-15.2.0/bin/gcc
  151. 8.81 s [pathway-compat-filepath] Using ghc version 9.8.4 found on system at:
  152. 8.81 s [pathway-compat-filepath] /nix/store/7r9b0bl984hdgd70nf5p8raa55kml491-ghc-9.8.4/bin/ghc
  153. 8.81 s [pathway-compat-filepath] Using ghc-pkg version 9.8.4 found on system at:
  154. 8.81 s [pathway-compat-filepath] /nix/store/7r9b0bl984hdgd70nf5p8raa55kml491-ghc-9.8.4/bin/ghc-pkg-9.8.4
  155. 8.81 s [pathway-compat-filepath] No ghcjs found
  156. 8.81 s [pathway-compat-filepath] No ghcjs-pkg found
  157. 8.81 s [pathway-compat-filepath] No greencard found
  158. 8.81 s [pathway-compat-filepath] Using haddock version 2.30.0 found on system at:
  159. 8.81 s [pathway-compat-filepath] /nix/store/7r9b0bl984hdgd70nf5p8raa55kml491-ghc-9.8.4/bin/haddock-ghc-9.8.4
  160. 8.81 s [pathway-compat-filepath] No happy found
  161. 8.81 s [pathway-compat-filepath] Using haskell-suite found on system at: haskell-suite-dummy-location
  162. 8.81 s [pathway-compat-filepath] Using haskell-suite-pkg found on system at: haskell-suite-pkg-dummy-location
  163. 8.81 s [pathway-compat-filepath] No hmake found
  164. 8.81 s [pathway-compat-filepath] Using hpc version 0.69 found on system at:
  165. 8.81 s [pathway-compat-filepath] /nix/store/7r9b0bl984hdgd70nf5p8raa55kml491-ghc-9.8.4/bin/hpc-ghc-9.8.4
  166. 8.81 s [pathway-compat-filepath] Using hsc2hs version 0.68.10 found on system at:
  167. 8.81 s [pathway-compat-filepath] /nix/store/7r9b0bl984hdgd70nf5p8raa55kml491-ghc-9.8.4/bin/hsc2hs-ghc-9.8.4
  168. 8.81 s [pathway-compat-filepath] Using hscolour version 1.25 found on system at:
  169. 8.81 s [pathway-compat-filepath] /nix/store/awnxn98rlw62rrjwli6d2lb4d27mrzzw-hscolour-1.25/bin/HsColour
  170. 8.81 s [pathway-compat-filepath] No jhc found
  171. 8.81 s [pathway-compat-filepath] Using ld found on system at:
  172. 8.81 s [pathway-compat-filepath] /nix/store/zjraf40s86y3iwhp626b934r5y6ldkbb-binutils-wrapper-2.46/bin/ld.gold
  173. 8.81 s [pathway-compat-filepath] No pkg-config found
  174. 8.81 s [pathway-compat-filepath] Using runghc version 9.8.4 found on system at:
  175. 8.81 s [pathway-compat-filepath] /nix/store/7r9b0bl984hdgd70nf5p8raa55kml491-ghc-9.8.4/bin/runghc-9.8.4
  176. 8.81 s [pathway-compat-filepath] Using strip version 2.46 found on system at:
  177. 8.81 s [pathway-compat-filepath] /nix/store/29qjlshvklnyr67nhpprzgb9igmsfsjj-gcc-wrapper-15.2.0/bin/strip
  178. 8.81 s [pathway-compat-filepath] Using tar found on system at:
  179. 8.81 s [pathway-compat-filepath] /nix/store/z5mq2sam4484prf3kv6v6vjw1m0i7j24-gnutar-1.35/bin/tar
  180. 8.81 s [pathway-compat-filepath] No uhc found
  181. 9.24 s [pathway-compat-filepath] Phase: buildPhase
  182. 9.30 s [pathway-compat-filepath] Preprocessing library for pathway-compat-filepath-0.0.1.0..
  183. 9.30 s [pathway-compat-filepath] Building library for pathway-compat-filepath-0.0.1.0..
  184. 9.38 s [pathway-compat-filepath] [ 1 of 10] Compiling Common.FilePath ( src/Common/FilePath.hs, dist/build/Common/FilePath.o, dist/build/Common/FilePath.dyn_o )
  185. 9.65 s [pathway-compat-filepath] [ 2 of 10] Compiling Common.OsPath ( src/Common/OsPath.hs, dist/build/Common/OsPath.o, dist/build/Common/OsPath.dyn_o )
  186. 9.65 s [pathway-compat-filepath]
  187. 9.66 s [pathway-compat-filepath] src/Common/OsPath.hs:87:23: error: [GHC-76037]
  188. 9.66 s [pathway-compat-filepath] Not in scope: ‘O.unsafeEncodeUtf’
  189. 9.66 s [pathway-compat-filepath] NB: the module ‘System.OsPath’ does not export ‘unsafeEncodeUtf’.
  190. 9.66 s [pathway-compat-filepath] |
  191. 9.66 s [pathway-compat-filepath] 87 | Format.parent = O.unsafeEncodeUtf "..",
  192. 9.66 s [pathway-compat-filepath] | ^^^^^^^^^^^^^^^^^
  193. 9.66 s [pathway-compat-filepath] [ 3 of 10] Compiling System.FilePath.Thin ( src/System/FilePath/Thin.hs, dist/build/System/FilePath/Thin.o, dist/build/System/FilePath/Thin.dyn_o )
  194. 9.82 s [pathway-compat-filepath] [ 4 of 10] Compiling System.FilePath.Pathway ( src/System/FilePath/Pathway.hs, dist/build/System/FilePath/Pathway.o, dist/build/System/FilePath/Pathway.dyn_o )
  195. 9.84 s [pathway-compat-filepath] [ 5 of 10] Compiling System.FilePath.Overlay ( src/System/FilePath/Overlay.hs, dist/build/System/FilePath/Overlay.o, dist/build/System/FilePath/Overlay.dyn_o )
  196. 9.87 s [pathway-compat-filepath] [ 6 of 10] Compiling System.FilePath ( src/System/FilePath.hs, dist/build/System/FilePath.o, dist/build/System/FilePath.dyn_o )
  197. 9.98 s Progress: 0 of 12 built (1 failed), 10 of 10 downloaded from cache
  198. 9.98 s Failed to build pathway-compat-filepath after 3.9s
  199. 9.98 s error: Cannot build '/nix/store/7szrkx5w148zqvipzqp9kpvdwyixf2jm-pathway-compat-filepath-0.0.1.0.drv'.
  200. 9.98 s Reason: builder failed with exit code 1.
  201. 9.98 s Output paths:
  202. 9.98 s /nix/store/1a5zli1srydg9czyyyns0ql1sl8i4gzp-pathway-compat-filepath-0.0.1.0-doc
  203. 9.98 s /nix/store/3wxxzpw33d72qx9kng4qpfmhidc1ba2f-pathway-compat-filepath-0.0.1.0
  204. 9.98 s Last 151 log lines:
  205. 9.98 s > Running phase: setupCompilerEnvironmentPhase
  206. 9.98 s > Build with /nix/store/7r9b0bl984hdgd70nf5p8raa55kml491-ghc-9.8.4.
  207. 9.98 s > Running phase: unpackPhase
  208. 9.98 s > unpacking source archive /nix/store/99h2nwiw8z9r3kqrm9kdhv4k4sf61d7w-filepath
  209. 9.98 s > source root is filepath
  210. 9.98 s > Running phase: patchPhase
  211. 9.98 s > Running phase: compileBuildDriverPhase
  212. 9.98 s > setupCompileFlags: -package-db=/build/tmp.TKICidthJY/setup-package.conf.d -threaded
  213. 9.98 s > [1 of 2] Compiling Main ( Setup.hs, /build/tmp.TKICidthJY/Main.o )
  214. 9.98 s > [2 of 2] Linking Setup
  215. 9.98 s > Running phase: updateAutotoolsGnuConfigScriptsPhase
  216. 9.98 s > Running phase: configurePhase
  217. 9.98 s > configureFlags: --verbose --prefix=/nix/store/3wxxzpw33d72qx9kng4qpfmhidc1ba2f-pathway-compat-filepath-0.0.1.0 --libdir=$prefix/lib/$compiler/lib --libsubdir=$abi/$libname --docdir=/nix/store/1a5zli1srydg9czyyyns0ql1sl8i4gzp-pathway-compat-filepath-0.0.1.0-doc/share/doc/pathway-compat-filepath-0.0.1.0 --with-gcc=gcc --package-db=/build/tmp.TKICidthJY/package.conf.d --ghc-option=-j16 --ghc-option=+RTS --ghc-option=-A64M --ghc-option=-RTS --enable-library-profiling --profiling-detail=exported-functions --disable-profiling --enable-shared --disable-coverage --enable-static --disable-executable-dynamic --enable-tests --disable-benchmarks --enable-library-vanilla --disable-library-for-ghci --enable-split-sections --enable-library-stripping --enable-executable-stripping --ghc-option=-haddock --ghc-options=-Werror --extra-lib-dirs=/nix/store/pndhkk0l649lm1sj0mxk7cbwq26qd1ra-ncurses-6.6/lib --extra-lib-dirs=/nix/store/0djlg4g0b81w94k3vcaqsxsc2hh4kism-libffi-3.5.2/lib --extra-lib-dirs=/nix/store/md4paia7riiggyrj8p24c7a6vf8w7jz8-elfutils-0.194/lib --extra-lib-dirs=/nix/store/39vv2pf64gd8li48a4hpbhw2crzd8z5p-gmp-with-cxx-6.3.0/lib --extra-lib-dirs=/nix/store/7wwvald8lapkrsr72qanlw8blyn55ifx-numactl-2.0.18/lib --extra-lib-dirs=/nix/store/7r9b0bl984hdgd70nf5p8raa55kml491-ghc-9.8.4/lib
  218. 9.98 s > Using Parsec parser
  219. 9.98 s > Configuring pathway-compat-filepath-0.0.1.0...
  220. 9.98 s > Flags chosen: noisy-deprecations=True, verify-no-recursion=False
  221. 9.98 s > Dependency base >=4.14.0 && <4.15 || >=4.15.0 && <4.16 || >=4.16.0 && <4.17 ||
  222. 9.98 s > >=4.17.0 && <4.18 || >=4.18.0 && <4.19 || >=4.19.0 && <4.20 || >=4.20.0 &&
  223. 9.98 s > <4.21 || >=4.21.0 && <4.22 || >=4.22.0 && <4.23: using base-4.19.2.0
  224. 9.98 s > Dependency extra: using extra-1.8.1
  225. 9.98 s > Dependency filepath >=1.4.2 && <1.5 || >=1.5.0 && <1.6: using
  226. 9.98 s > filepath-1.4.301.0
  227. 9.98 s > Dependency megaparsec >=9.0.1 && <9.1 || >=9.2.1 && <9.3 || >=9.5.0 && <9.6 ||
  228. 9.98 s > >=9.7.0 && <9.8: using megaparsec-9.7.0
  229. 9.98 s > Dependency pathway >=0.0.1 && <0.1: using pathway-0.0.1.0
  230. 9.98 s > Dependency pathway-compat-base >=0.0.1 && <0.1: using
  231. 9.98 s > pathway-compat-base-0.0.1.0
  232. 9.98 s > Dependency pathway-internal >=0.0.1 && <0.1: using pathway-internal-0.0.1.0
  233. 9.98 s > Dependency base >=4.14.0 && <4.15 || >=4.15.0 && <4.16 || >=4.16.0 && <4.17 ||
  234. 9.98 s > >=4.17.0 && <4.18 || >=4.18.0 && <4.19 || >=4.19.0 && <4.20 || >=4.20.0 &&
  235. 9.98 s > <4.21 || >=4.21.0 && <4.22 || >=4.22.0 && <4.23: using base-4.19.2.0
  236. 9.98 s > Dependency doctest >=0.16.3 && <0.17 || >=0.18.1 && <0.19 || >=0.20.1 && <0.21
  237. 9.98 s > || >=0.21.1 && <0.22 || >=0.22.2 && <0.23 || >=0.24.2 && <0.25: using
  238. 9.98 s > doctest-0.24.3
  239. 9.98 s > Dependency pathway-compat-filepath: using pathway-compat-filepath-0.0.1.0
  240. 9.98 s > Source component graph:
  241. 9.98 s > component lib
  242. 9.98 s > component test:doctests dependency lib
  243. 9.98 s > Configured component graph:
  244. 9.98 s > component pathway-compat-filepath-0.0.1.0-1aSZ3UXFr73FDOQtPeyw7g
  245. 9.98 s > include base-4.19.2.0-934f
  246. 9.98 s > include extra-1.8.1-F4oHgTKCper3ZiIUPZjGPK
  247. 9.98 s > include filepath-1.4.301.0-6e15
  248. 9.98 s > include megaparsec-9.7.0-10vHZAF1maw9O8p2gXs66N
  249. 9.98 s > include pathway-0.0.1.0-H5uD0SRA9755UrSqFBaCYE
  250. 9.98 s > include pathway-compat-base-0.0.1.0-8ldj6SPXbxq2Shd8yFeOpr
  251. 9.98 s > include pathway-internal-0.0.1.0-Lnjdb2M8cxN196wSdsfQUK
  252. 9.98 s > component pathway-compat-filepath-0.0.1.0-5Vlr121wsSlHY9yKgCvAGY-doctests
  253. 9.98 s > include base-4.19.2.0-934f
  254. 9.98 s > include doctest-0.24.3-1aDs7zEYV5r7raSsXr9TQC
  255. 9.98 s > include pathway-compat-filepath-0.0.1.0-1aSZ3UXFr73FDOQtPeyw7g
  256. 9.98 s > Linked component graph:
  257. 9.98 s > unit pathway-compat-filepath-0.0.1.0-1aSZ3UXFr73FDOQtPeyw7g
  258. 9.98 s > include base-4.19.2.0-934f
  259. 9.98 s > include extra-1.8.1-F4oHgTKCper3ZiIUPZjGPK
  260. 9.98 s > include filepath-1.4.301.0-6e15
  261. 9.98 s > include megaparsec-9.7.0-10vHZAF1maw9O8p2gXs66N
  262. 9.98 s > include pathway-0.0.1.0-H5uD0SRA9755UrSqFBaCYE
  263. 9.98 s > include pathway-compat-base-0.0.1.0-8ldj6SPXbxq2Shd8yFeOpr
  264. 9.98 s > include pathway-internal-0.0.1.0-Lnjdb2M8cxN196wSdsfQUK
  265. 9.98 s > Common.FilePath=pathway-compat-filepath-0.0.1.0-1aSZ3UXFr73FDOQtPeyw7g:Common.FilePath,Common.OsPath=pathway-compat-filepath-0.0.1.0-1aSZ3UXFr73FDOQtPeyw7g:Common.OsPath,System.FilePath=pathway-compat-filepath-0.0.1.0-1aSZ3UXFr73FDOQtPeyw7g:System.FilePath,System.FilePath.Overlay=pathway-compat-filepath-0.0.1.0-1aSZ3UXFr73FDOQtPeyw7g:System.FilePath.Overlay,System.FilePath.Pathway=pathway-compat-filepath-0.0.1.0-1aSZ3UXFr73FDOQtPeyw7g:System.FilePath.Pathway,System.FilePath.Thin=pathway-compat-filepath-0.0.1.0-1aSZ3UXFr73FDOQtPeyw7g:System.FilePath.Thin,System.OsPath=pathway-compat-filepath-0.0.1.0-1aSZ3UXFr73FDOQtPeyw7g:System.OsPath,System.OsPath.Overlay=pathway-compat-filepath-0.0.1.0-1aSZ3UXFr73FDOQtPeyw7g:System.OsPath.Overlay,System.OsPath.Pathway=pathway-compat-filepath-0.0.1.0-1aSZ3UXFr73FDOQtPeyw7g:System.OsPath.Pathway,System.OsPath.Thin=pathway-compat-filepath-0.0.1.0-1aSZ3UXFr73FDOQtPeyw7g:System.OsPath.Thin
  266. 9.98 s > unit pathway-compat-filepath-0.0.1.0-5Vlr121wsSlHY9yKgCvAGY-doctests
  267. 9.98 s > include base-4.19.2.0-934f
  268. 9.98 s > include doctest-0.24.3-1aDs7zEYV5r7raSsXr9TQC
  269. 9.98 s > include pathway-compat-filepath-0.0.1.0-1aSZ3UXFr73FDOQtPeyw7g
  270. 9.98 s > Ready component graph:
  271. 9.98 s > definite pathway-compat-filepath-0.0.1.0-1aSZ3UXFr73FDOQtPeyw7g
  272. 9.98 s > depends base-4.19.2.0-934f
  273. 9.98 s > depends extra-1.8.1-F4oHgTKCper3ZiIUPZjGPK
  274. 9.98 s > depends filepath-1.4.301.0-6e15
  275. 9.98 s > depends megaparsec-9.7.0-10vHZAF1maw9O8p2gXs66N
  276. 9.98 s > depends pathway-0.0.1.0-H5uD0SRA9755UrSqFBaCYE
  277. 9.98 s > depends pathway-compat-base-0.0.1.0-8ldj6SPXbxq2Shd8yFeOpr
  278. 9.98 s > depends pathway-internal-0.0.1.0-Lnjdb2M8cxN196wSdsfQUK
  279. 9.98 s > definite pathway-compat-filepath-0.0.1.0-5Vlr121wsSlHY9yKgCvAGY-doctests
  280. 9.98 s > depends base-4.19.2.0-934f
  281. 9.98 s > depends doctest-0.24.3-1aDs7zEYV5r7raSsXr9TQC
  282. 9.98 s > depends pathway-compat-filepath-0.0.1.0-1aSZ3UXFr73FDOQtPeyw7g
  283. 9.98 s > Using Cabal-3.10.3.0 compiled by ghc-9.8
  284. 9.98 s > Using compiler: ghc-9.8.4
  285. 9.98 s > Using install prefix:
  286. 9.98 s > /nix/store/3wxxzpw33d72qx9kng4qpfmhidc1ba2f-pathway-compat-filepath-0.0.1.0
  287. 9.98 s > Executables installed in:
  288. 9.98 s > /nix/store/3wxxzpw33d72qx9kng4qpfmhidc1ba2f-pathway-compat-filepath-0.0.1.0/bin
  289. 9.98 s > Libraries installed in:
  290. 9.98 s > /nix/store/3wxxzpw33d72qx9kng4qpfmhidc1ba2f-pathway-compat-filepath-0.0.1.0/lib/ghc-9.8.4/lib/x86_64-linux-ghc-9.8.4/pathway-compat-filepath-0.0.1.0-1aSZ3UXFr73FDOQtPeyw7g
  291. 9.98 s > Dynamic Libraries installed in:
  292. 9.98 s > /nix/store/3wxxzpw33d72qx9kng4qpfmhidc1ba2f-pathway-compat-filepath-0.0.1.0/lib/ghc-9.8.4/lib/x86_64-linux-ghc-9.8.4
  293. 9.98 s > Private executables installed in:
  294. 9.98 s > /nix/store/3wxxzpw33d72qx9kng4qpfmhidc1ba2f-pathway-compat-filepath-0.0.1.0/libexec/x86_64-linux-ghc-9.8.4/pathway-compat-filepath-0.0.1.0
  295. 9.98 s > Data files installed in:
  296. 9.98 s > /nix/store/3wxxzpw33d72qx9kng4qpfmhidc1ba2f-pathway-compat-filepath-0.0.1.0/share/x86_64-linux-ghc-9.8.4/pathway-compat-filepath-0.0.1.0
  297. 9.98 s > Documentation installed in:
  298. 9.98 s > /nix/store/1a5zli1srydg9czyyyns0ql1sl8i4gzp-pathway-compat-filepath-0.0.1.0-doc/share/doc/pathway-compat-filepath-0.0.1.0
  299. 9.98 s > Configuration files installed in:
  300. 9.98 s > /nix/store/3wxxzpw33d72qx9kng4qpfmhidc1ba2f-pathway-compat-filepath-0.0.1.0/etc
  301. 9.98 s > No alex found
  302. 9.98 s > Using ar found on system at:
  303. 9.98 s > /nix/store/zjraf40s86y3iwhp626b934r5y6ldkbb-binutils-wrapper-2.46/bin/ar
  304. 9.98 s > No c2hs found
  305. 9.98 s > No cpphs found
  306. 9.98 s > Using doctest version 0.24.3 found on system at:
  307. 9.98 s > /nix/store/2y183b1vsybv0157vfr59yhdwjkpqfkn-doctest-0.24.3/bin/doctest
  308. 9.98 s > Using gcc version 15.2.0 given by user at:
  309. 9.98 s > /nix/store/29qjlshvklnyr67nhpprzgb9igmsfsjj-gcc-wrapper-15.2.0/bin/gcc
  310. 9.98 s > Using ghc version 9.8.4 found on system at:
  311. 9.98 s > /nix/store/7r9b0bl984hdgd70nf5p8raa55kml491-ghc-9.8.4/bin/ghc
  312. 9.98 s > Using ghc-pkg version 9.8.4 found on system at:
  313. 9.98 s > /nix/store/7r9b0bl984hdgd70nf5p8raa55kml491-ghc-9.8.4/bin/ghc-pkg-9.8.4
  314. 9.98 s > No ghcjs found
  315. 9.98 s > No ghcjs-pkg found
  316. 9.98 s > No greencard found
  317. 9.98 s > Using haddock version 2.30.0 found on system at:
  318. 9.98 s > /nix/store/7r9b0bl984hdgd70nf5p8raa55kml491-ghc-9.8.4/bin/haddock-ghc-9.8.4
  319. 9.98 s > No happy found
  320. 9.98 s > Using haskell-suite found on system at: haskell-suite-dummy-location
  321. 9.98 s > Using haskell-suite-pkg found on system at: haskell-suite-pkg-dummy-location
  322. 9.98 s > No hmake found
  323. 9.98 s > Using hpc version 0.69 found on system at:
  324. 9.98 s > /nix/store/7r9b0bl984hdgd70nf5p8raa55kml491-ghc-9.8.4/bin/hpc-ghc-9.8.4
  325. 9.98 s > Using hsc2hs version 0.68.10 found on system at:
  326. 9.98 s > /nix/store/7r9b0bl984hdgd70nf5p8raa55kml491-ghc-9.8.4/bin/hsc2hs-ghc-9.8.4
  327. 9.98 s > Using hscolour version 1.25 found on system at:
  328. 9.98 s > /nix/store/awnxn98rlw62rrjwli6d2lb4d27mrzzw-hscolour-1.25/bin/HsColour
  329. 9.98 s > No jhc found
  330. 9.98 s > Using ld found on system at:
  331. 9.98 s > /nix/store/zjraf40s86y3iwhp626b934r5y6ldkbb-binutils-wrapper-2.46/bin/ld.gold
  332. 9.98 s > No pkg-config found
  333. 9.98 s > Using runghc version 9.8.4 found on system at:
  334. 9.98 s > /nix/store/7r9b0bl984hdgd70nf5p8raa55kml491-ghc-9.8.4/bin/runghc-9.8.4
  335. 9.98 s > Using strip version 2.46 found on system at:
  336. 9.98 s > /nix/store/29qjlshvklnyr67nhpprzgb9igmsfsjj-gcc-wrapper-15.2.0/bin/strip
  337. 9.98 s > Using tar found on system at:
  338. 9.98 s > /nix/store/z5mq2sam4484prf3kv6v6vjw1m0i7j24-gnutar-1.35/bin/tar
  339. 9.98 s > No uhc found
  340. 9.98 s > Running phase: buildPhase
  341. 9.98 s > Preprocessing library for pathway-compat-filepath-0.0.1.0..
  342. 9.98 s > Building library for pathway-compat-filepath-0.0.1.0..
  343. 9.98 s > [ 1 of 10] Compiling Common.FilePath ( src/Common/FilePath.hs, dist/build/Common/FilePath.o, dist/build/Common/FilePath.dyn_o )
  344. 9.98 s > [ 2 of 10] Compiling Common.OsPath ( src/Common/OsPath.hs, dist/build/Common/OsPath.o, dist/build/Common/OsPath.dyn_o )
  345. 9.98 s >
  346. 9.98 s > src/Common/OsPath.hs:87:23: error: [GHC-76037]
  347. 9.98 s > Not in scope: ‘O.unsafeEncodeUtf’
  348. 9.98 s > NB: the module ‘System.OsPath’ does not export ‘unsafeEncodeUtf’.
  349. 9.98 s > |
  350. 9.98 s > 87 | Format.parent = O.unsafeEncodeUtf "..",
  351. 9.98 s > | ^^^^^^^^^^^^^^^^^
  352. 9.98 s > [ 3 of 10] Compiling System.FilePath.Thin ( src/System/FilePath/Thin.hs, dist/build/System/FilePath/Thin.o, dist/build/System/FilePath/Thin.dyn_o )
  353. 9.98 s > [ 4 of 10] Compiling System.FilePath.Pathway ( src/System/FilePath/Pathway.hs, dist/build/System/FilePath/Pathway.o, dist/build/System/FilePath/Pathway.dyn_o )
  354. 9.98 s > [ 5 of 10] Compiling System.FilePath.Overlay ( src/System/FilePath/Overlay.hs, dist/build/System/FilePath/Overlay.o, dist/build/System/FilePath/Overlay.dyn_o )
  355. 9.98 s > [ 6 of 10] Compiling System.FilePath ( src/System/FilePath.hs, dist/build/System/FilePath.o, dist/build/System/FilePath.dyn_o )
  356. 9.98 s For full logs, run:
  357. 9.98 s nix log /nix/store/7szrkx5w148zqvipzqp9kpvdwyixf2jm-pathway-compat-filepath-0.0.1.0.drv
  358. 9.98 s error: Cannot build '/nix/store/7szrkx5w148zqvipzqp9kpvdwyixf2jm-pathway-compat-filepath-0.0.1.0.drv'.
  359. 9.98 s Reason: builder failed with exit code 1.
  360. 9.98 s Output paths:
  361. 9.98 s /nix/store/1a5zli1srydg9czyyyns0ql1sl8i4gzp-pathway-compat-filepath-0.0.1.0-doc
  362. 9.98 s /nix/store/3wxxzpw33d72qx9kng4qpfmhidc1ba2f-pathway-compat-filepath-0.0.1.0
  363. 9.98 s Last 151 log lines:
  364. 9.98 s > Running phase: setupCompilerEnvironmentPhase
  365. 9.98 s > Build with /nix/store/7r9b0bl984hdgd70nf5p8raa55kml491-ghc-9.8.4.
  366. 9.98 s > Running phase: unpackPhase
  367. 9.98 s > unpacking source archive /nix/store/99h2nwiw8z9r3kqrm9kdhv4k4sf61d7w-filepath
  368. 9.98 s > source root is filepath
  369. 9.98 s > Running phase: patchPhase
  370. 9.98 s > Running phase: compileBuildDriverPhase
  371. 9.98 s > setupCompileFlags: -package-db=/build/tmp.TKICidthJY/setup-package.conf.d -threaded
  372. 9.98 s > [1 of 2] Compiling Main ( Setup.hs, /build/tmp.TKICidthJY/Main.o )
  373. 9.98 s > [2 of 2] Linking Setup
  374. 9.98 s > Running phase: updateAutotoolsGnuConfigScriptsPhase
  375. 9.98 s > Running phase: configurePhase
  376. 9.98 s > configureFlags: --verbose --prefix=/nix/store/3wxxzpw33d72qx9kng4qpfmhidc1ba2f-pathway-compat-filepath-0.0.1.0 --libdir=$prefix/lib/$compiler/lib --libsubdir=$abi/$libname --docdir=/nix/store/1a5zli1srydg9czyyyns0ql1sl8i4gzp-pathway-compat-filepath-0.0.1.0-doc/share/doc/pathway-compat-filepath-0.0.1.0 --with-gcc=gcc --package-db=/build/tmp.TKICidthJY/package.conf.d --ghc-option=-j16 --ghc-option=+RTS --ghc-option=-A64M --ghc-option=-RTS --enable-library-profiling --profiling-detail=exported-functions --disable-profiling --enable-shared --disable-coverage --enable-static --disable-executable-dynamic --enable-tests --disable-benchmarks --enable-library-vanilla --disable-library-for-ghci --enable-split-sections --enable-library-stripping --enable-executable-stripping --ghc-option=-haddock --ghc-options=-Werror --extra-lib-dirs=/nix/store/pndhkk0l649lm1sj0mxk7cbwq26qd1ra-ncurses-6.6/lib --extra-lib-dirs=/nix/store/0djlg4g0b81w94k3vcaqsxsc2hh4kism-libffi-3.5.2/lib --extra-lib-dirs=/nix/store/md4paia7riiggyrj8p24c7a6vf8w7jz8-elfutils-0.194/lib --extra-lib-dirs=/nix/store/39vv2pf64gd8li48a4hpbhw2crzd8z5p-gmp-with-cxx-6.3.0/lib --extra-lib-dirs=/nix/store/7wwvald8lapkrsr72qanlw8blyn55ifx-numactl-2.0.18/lib --extra-lib-dirs=/nix/store/7r9b0bl984hdgd70nf5p8raa55kml491-ghc-9.8.4/lib
  377. 9.98 s > Using Parsec parser
  378. 9.98 s > Configuring pathway-compat-filepath-0.0.1.0...
  379. 9.98 s > Flags chosen: noisy-deprecations=True, verify-no-recursion=False
  380. 9.98 s > Dependency base >=4.14.0 && <4.15 || >=4.15.0 && <4.16 || >=4.16.0 && <4.17 ||
  381. 9.98 s > >=4.17.0 && <4.18 || >=4.18.0 && <4.19 || >=4.19.0 && <4.20 || >=4.20.0 &&
  382. 9.98 s > <4.21 || >=4.21.0 && <4.22 || >=4.22.0 && <4.23: using base-4.19.2.0
  383. 9.98 s > Dependency extra: using extra-1.8.1
  384. 9.98 s > Dependency filepath >=1.4.2 && <1.5 || >=1.5.0 && <1.6: using
  385. 9.98 s > filepath-1.4.301.0
  386. 9.98 s > Dependency megaparsec >=9.0.1 && <9.1 || >=9.2.1 && <9.3 || >=9.5.0 && <9.6 ||
  387. 9.98 s > >=9.7.0 && <9.8: using megaparsec-9.7.0
  388. 9.98 s > Dependency pathway >=0.0.1 && <0.1: using pathway-0.0.1.0
  389. 9.98 s > Dependency pathway-compat-base >=0.0.1 && <0.1: using
  390. 9.98 s > pathway-compat-base-0.0.1.0
  391. 9.98 s > Dependency pathway-internal >=0.0.1 && <0.1: using pathway-internal-0.0.1.0
  392. 9.98 s > Dependency base >=4.14.0 && <4.15 || >=4.15.0 && <4.16 || >=4.16.0 && <4.17 ||
  393. 9.98 s > >=4.17.0 && <4.18 || >=4.18.0 && <4.19 || >=4.19.0 && <4.20 || >=4.20.0 &&
  394. 9.98 s > <4.21 || >=4.21.0 && <4.22 || >=4.22.0 && <4.23: using base-4.19.2.0
  395. 9.98 s > Dependency doctest >=0.16.3 && <0.17 || >=0.18.1 && <0.19 || >=0.20.1 && <0.21
  396. 9.98 s > || >=0.21.1 && <0.22 || >=0.22.2 && <0.23 || >=0.24.2 && <0.25: using
  397. 9.98 s > doctest-0.24.3
  398. 9.98 s > Dependency pathway-compat-filepath: using pathway-compat-filepath-0.0.1.0
  399. 9.98 s > Source component graph:
  400. 9.98 s > component lib
  401. 9.98 s > component test:doctests dependency lib
  402. 9.98 s > Configured component graph:
  403. 9.98 s > component pathway-compat-filepath-0.0.1.0-1aSZ3UXFr73FDOQtPeyw7g
  404. 9.98 s > include base-4.19.2.0-934f
  405. 9.98 s > include extra-1.8.1-F4oHgTKCper3ZiIUPZjGPK
  406. 9.98 s > include filepath-1.4.301.0-6e15
  407. 9.98 s > include megaparsec-9.7.0-10vHZAF1maw9O8p2gXs66N
  408. 9.98 s > include pathway-0.0.1.0-H5uD0SRA9755UrSqFBaCYE
  409. 9.98 s > include pathway-compat-base-0.0.1.0-8ldj6SPXbxq2Shd8yFeOpr
  410. 9.98 s > include pathway-internal-0.0.1.0-Lnjdb2M8cxN196wSdsfQUK
  411. 9.98 s > component pathway-compat-filepath-0.0.1.0-5Vlr121wsSlHY9yKgCvAGY-doctests
  412. 9.98 s > include base-4.19.2.0-934f
  413. 9.98 s > include doctest-0.24.3-1aDs7zEYV5r7raSsXr9TQC
  414. 9.98 s > include pathway-compat-filepath-0.0.1.0-1aSZ3UXFr73FDOQtPeyw7g
  415. 9.98 s > Linked component graph:
  416. 9.98 s > unit pathway-compat-filepath-0.0.1.0-1aSZ3UXFr73FDOQtPeyw7g
  417. 9.98 s > include base-4.19.2.0-934f
  418. 9.98 s > include extra-1.8.1-F4oHgTKCper3ZiIUPZjGPK
  419. 9.98 s > include filepath-1.4.301.0-6e15
  420. 9.98 s > include megaparsec-9.7.0-10vHZAF1maw9O8p2gXs66N
  421. 9.98 s > include pathway-0.0.1.0-H5uD0SRA9755UrSqFBaCYE
  422. 9.98 s > include pathway-compat-base-0.0.1.0-8ldj6SPXbxq2Shd8yFeOpr
  423. 9.98 s > include pathway-internal-0.0.1.0-Lnjdb2M8cxN196wSdsfQUK
  424. 9.98 s > Common.FilePath=pathway-compat-filepath-0.0.1.0-1aSZ3UXFr73FDOQtPeyw7g:Common.FilePath,Common.OsPath=pathway-compat-filepath-0.0.1.0-1aSZ3UXFr73FDOQtPeyw7g:Common.OsPath,System.FilePath=pathway-compat-filepath-0.0.1.0-1aSZ3UXFr73FDOQtPeyw7g:System.FilePath,System.FilePath.Overlay=pathway-compat-filepath-0.0.1.0-1aSZ3UXFr73FDOQtPeyw7g:System.FilePath.Overlay,System.FilePath.Pathway=pathway-compat-filepath-0.0.1.0-1aSZ3UXFr73FDOQtPeyw7g:System.FilePath.Pathway,System.FilePath.Thin=pathway-compat-filepath-0.0.1.0-1aSZ3UXFr73FDOQtPeyw7g:System.FilePath.Thin,System.OsPath=pathway-compat-filepath-0.0.1.0-1aSZ3UXFr73FDOQtPeyw7g:System.OsPath,System.OsPath.Overlay=pathway-compat-filepath-0.0.1.0-1aSZ3UXFr73FDOQtPeyw7g:System.OsPath.Overlay,System.OsPath.Pathway=pathway-compat-filepath-0.0.1.0-1aSZ3UXFr73FDOQtPeyw7g:System.OsPath.Pathway,System.OsPath.Thin=pathway-compat-filepath-0.0.1.0-1aSZ3UXFr73FDOQtPeyw7g:System.OsPath.Thin
  425. 9.98 s > unit pathway-compat-filepath-0.0.1.0-5Vlr121wsSlHY9yKgCvAGY-doctests
  426. 9.98 s > include base-4.19.2.0-934f
  427. 9.98 s > include doctest-0.24.3-1aDs7zEYV5r7raSsXr9TQC
  428. 9.98 s > include pathway-compat-filepath-0.0.1.0-1aSZ3UXFr73FDOQtPeyw7g
  429. 9.98 s > Ready component graph:
  430. 9.98 s > definite pathway-compat-filepath-0.0.1.0-1aSZ3UXFr73FDOQtPeyw7g
  431. 9.98 s > depends base-4.19.2.0-934f
  432. 9.98 s > depends extra-1.8.1-F4oHgTKCper3ZiIUPZjGPK
  433. 9.98 s > depends filepath-1.4.301.0-6e15
  434. 9.98 s > depends megaparsec-9.7.0-10vHZAF1maw9O8p2gXs66N
  435. 9.98 s > depends pathway-0.0.1.0-H5uD0SRA9755UrSqFBaCYE
  436. 9.98 s > depends pathway-compat-base-0.0.1.0-8ldj6SPXbxq2Shd8yFeOpr
  437. 9.98 s > depends pathway-internal-0.0.1.0-Lnjdb2M8cxN196wSdsfQUK
  438. 9.98 s > definite pathway-compat-filepath-0.0.1.0-5Vlr121wsSlHY9yKgCvAGY-doctests
  439. 9.98 s > depends base-4.19.2.0-934f
  440. 9.98 s > depends doctest-0.24.3-1aDs7zEYV5r7raSsXr9TQC
  441. 9.98 s > depends pathway-compat-filepath-0.0.1.0-1aSZ3UXFr73FDOQtPeyw7g
  442. 9.98 s > Using Cabal-3.10.3.0 compiled by ghc-9.8
  443. 9.98 s > Using compiler: ghc-9.8.4
  444. 9.98 s > Using install prefix:
  445. 9.98 s > /nix/store/3wxxzpw33d72qx9kng4qpfmhidc1ba2f-pathway-compat-filepath-0.0.1.0
  446. 9.98 s > Executables installed in:
  447. 9.98 s > /nix/store/3wxxzpw33d72qx9kng4qpfmhidc1ba2f-pathway-compat-filepath-0.0.1.0/bin
  448. 9.98 s > Libraries installed in:
  449. 9.98 s > /nix/store/3wxxzpw33d72qx9kng4qpfmhidc1ba2f-pathway-compat-filepath-0.0.1.0/lib/ghc-9.8.4/lib/x86_64-linux-ghc-9.8.4/pathway-compat-filepath-0.0.1.0-1aSZ3UXFr73FDOQtPeyw7g
  450. 9.98 s > Dynamic Libraries installed in:
  451. 9.98 s > /nix/store/3wxxzpw33d72qx9kng4qpfmhidc1ba2f-pathway-compat-filepath-0.0.1.0/lib/ghc-9.8.4/lib/x86_64-linux-ghc-9.8.4
  452. 9.98 s > Private executables installed in:
  453. 9.98 s > /nix/store/3wxxzpw33d72qx9kng4qpfmhidc1ba2f-pathway-compat-filepath-0.0.1.0/libexec/x86_64-linux-ghc-9.8.4/pathway-compat-filepath-0.0.1.0
  454. 9.98 s > Data files installed in:
  455. 9.98 s > /nix/store/3wxxzpw33d72qx9kng4qpfmhidc1ba2f-pathway-compat-filepath-0.0.1.0/share/x86_64-linux-ghc-9.8.4/pathway-compat-filepath-0.0.1.0
  456. 9.98 s > Documentation installed in:
  457. 9.98 s > /nix/store/1a5zli1srydg9czyyyns0ql1sl8i4gzp-pathway-compat-filepath-0.0.1.0-doc/share/doc/pathway-compat-filepath-0.0.1.0
  458. 9.98 s > Configuration files installed in:
  459. 9.98 s > /nix/store/3wxxzpw33d72qx9kng4qpfmhidc1ba2f-pathway-compat-filepath-0.0.1.0/etc
  460. 9.98 s > No alex found
  461. 9.98 s > Using ar found on system at:
  462. 9.98 s > /nix/store/zjraf40s86y3iwhp626b934r5y6ldkbb-binutils-wrapper-2.46/bin/ar
  463. 9.98 s > No c2hs found
  464. 9.98 s > No cpphs found
  465. 9.98 s > Using doctest version 0.24.3 found on system at:
  466. 9.98 s > /nix/store/2y183b1vsybv0157vfr59yhdwjkpqfkn-doctest-0.24.3/bin/doctest
  467. 9.98 s > Using gcc version 15.2.0 given by user at:
  468. 9.98 s > /nix/store/29qjlshvklnyr67nhpprzgb9igmsfsjj-gcc-wrapper-15.2.0/bin/gcc
  469. 9.98 s > Using ghc version 9.8.4 found on system at:
  470. 9.98 s > /nix/store/7r9b0bl984hdgd70nf5p8raa55kml491-ghc-9.8.4/bin/ghc
  471. 9.98 s > Using ghc-pkg version 9.8.4 found on system at:
  472. 9.98 s > /nix/store/7r9b0bl984hdgd70nf5p8raa55kml491-ghc-9.8.4/bin/ghc-pkg-9.8.4
  473. 9.98 s > No ghcjs found
  474. 9.98 s > No ghcjs-pkg found
  475. 9.98 s > No greencard found
  476. 9.98 s > Using haddock version 2.30.0 found on system at:
  477. 9.98 s > /nix/store/7r9b0bl984hdgd70nf5p8raa55kml491-ghc-9.8.4/bin/haddock-ghc-9.8.4
  478. 9.98 s > No happy found
  479. 9.98 s > Using haskell-suite found on system at: haskell-suite-dummy-location
  480. 9.98 s > Using haskell-suite-pkg found on system at: haskell-suite-pkg-dummy-location
  481. 9.98 s > No hmake found
  482. 9.98 s > Using hpc version 0.69 found on system at:
  483. 9.98 s > /nix/store/7r9b0bl984hdgd70nf5p8raa55kml491-ghc-9.8.4/bin/hpc-ghc-9.8.4
  484. 9.98 s > Using hsc2hs version 0.68.10 found on system at:
  485. 9.98 s > /nix/store/7r9b0bl984hdgd70nf5p8raa55kml491-ghc-9.8.4/bin/hsc2hs-ghc-9.8.4
  486. 9.98 s > Using hscolour version 1.25 found on system at:
  487. 9.98 s > /nix/store/awnxn98rlw62rrjwli6d2lb4d27mrzzw-hscolour-1.25/bin/HsColour
  488. 9.98 s > No jhc found
  489. 9.98 s > Using ld found on system at:
  490. 9.98 s > /nix/store/zjraf40s86y3iwhp626b934r5y6ldkbb-binutils-wrapper-2.46/bin/ld.gold
  491. 9.98 s > No pkg-config found
  492. 9.98 s > Using runghc version 9.8.4 found on system at:
  493. 9.98 s > /nix/store/7r9b0bl984hdgd70nf5p8raa55kml491-ghc-9.8.4/bin/runghc-9.8.4
  494. 9.98 s > Using strip version 2.46 found on system at:
  495. 9.98 s > /nix/store/29qjlshvklnyr67nhpprzgb9igmsfsjj-gcc-wrapper-15.2.0/bin/strip
  496. 9.98 s > Using tar found on system at:
  497. 9.98 s > /nix/store/z5mq2sam4484prf3kv6v6vjw1m0i7j24-gnutar-1.35/bin/tar
  498. 9.98 s > No uhc found
  499. 9.98 s > Running phase: buildPhase
  500. 9.98 s > Preprocessing library for pathway-compat-filepath-0.0.1.0..
  501. 9.98 s > Building library for pathway-compat-filepath-0.0.1.0..
  502. 9.98 s > [ 1 of 10] Compiling Common.FilePath ( src/Common/FilePath.hs, dist/build/Common/FilePath.o, dist/build/Common/FilePath.dyn_o )
  503. 9.98 s > [ 2 of 10] Compiling Common.OsPath ( src/Common/OsPath.hs, dist/build/Common/OsPath.o, dist/build/Common/OsPath.dyn_o )
  504. 9.98 s >
  505. 9.98 s > src/Common/OsPath.hs:87:23: error: [GHC-76037]
  506. 9.98 s > Not in scope: ‘O.unsafeEncodeUtf’
  507. 9.98 s > NB: the module ‘System.OsPath’ does not export ‘unsafeEncodeUtf’.
  508. 9.98 s > |
  509. 9.98 s > 87 | Format.parent = O.unsafeEncodeUtf "..",
  510. 9.98 s > | ^^^^^^^^^^^^^^^^^
  511. 9.98 s > [ 3 of 10] Compiling System.FilePath.Thin ( src/System/FilePath/Thin.hs, dist/build/System/FilePath/Thin.o, dist/build/System/FilePath/Thin.dyn_o )
  512. 9.98 s > [ 4 of 10] Compiling System.FilePath.Pathway ( src/System/FilePath/Pathway.hs, dist/build/System/FilePath/Pathway.o, dist/build/System/FilePath/Pathway.dyn_o )
  513. 9.98 s > [ 5 of 10] Compiling System.FilePath.Overlay ( src/System/FilePath/Overlay.hs, dist/build/System/FilePath/Overlay.o, dist/build/System/FilePath/Overlay.dyn_o )
  514. 9.98 s > [ 6 of 10] Compiling System.FilePath ( src/System/FilePath.hs, dist/build/System/FilePath.o, dist/build/System/FilePath.dyn_o )
  515. 9.98 s For full logs, run:
  516. 9.98 s nix log /nix/store/7szrkx5w148zqvipzqp9kpvdwyixf2jm-pathway-compat-filepath-0.0.1.0.drv
  517. 9.98 s error: Cannot build '/nix/store/xgk4x00p9nxy6vygklkdvq3xhnw85n9f-ghc-9.8.4-with-packages.drv'.
  518. 9.98 s Reason: 1 dependency failed.
  519. 9.98 s Output paths:
  520. 9.98 s /nix/store/28d7zlh94n17052znxscmz95nzy2y14a-ghc-9.8.4-with-packages
  521. 9.98 s error: Cannot build '/nix/store/88ry82jpw7zq3xgbiwnx1w9qxsh0qky4-pathway-compat-directory-0.0.1.0.drv'.
  522. 9.98 s Reason: 1 dependency failed.
  523. 9.98 s Output paths:
  524. 9.98 s /nix/store/dywfb8cm100xr0sf32p9rsxsnsh69rj6-pathway-compat-directory-0.0.1.0-doc
  525. 9.98 s /nix/store/s1ah3f1yscfslflkp1plkhlcli18iy6b-pathway-compat-directory-0.0.1.0
  526. 9.98 s error: Cannot build '/nix/store/63m9x4cv94732rwlvs3r2jcm466wivfm-pathway-compat-file-io-0.0.1.0.drv'.
  527. 9.98 s Reason: 1 dependency failed.
  528. 9.98 s Output paths:
  529. 9.98 s /nix/store/45czry1y9c5sgqm357i6hb6ggvyvx51b-pathway-compat-file-io-0.0.1.0
  530. 9.98 s /nix/store/zrvf42qsq1gy5wil4341p92839w0p49b-pathway-compat-file-io-0.0.1.0-doc
  531. 9.98 s error: Cannot build '/nix/store/ikjmgvjg2wrv8idayqspdv6jg97fzzai-pathway-compat-temporary-0.0.1.0.drv'.
  532. 9.98 s Reason: 1 dependency failed.
  533. 9.98 s Output paths:
  534. 9.98 s /nix/store/5n49iv6xr88nwyza5k8dnqvxx2vqs319-pathway-compat-temporary-0.0.1.0
  535. 9.98 s /nix/store/c3b6wzzcri7hd1jv871c7za1swan4bd1-pathway-compat-temporary-0.0.1.0-doc
  536. 9.98 s error: Cannot build '/nix/store/h33py59mz8imsy05pgjz19b0jvgi7z1i-pathway-system-0.0.1.0.drv'.
  537. 9.98 s Reason: 1 dependency failed.
  538. 9.98 s Output paths:
  539. 9.98 s /nix/store/51r6wz46nnyxhsvn968rjf84gyw6gv74-pathway-system-0.0.1.0
  540. 9.98 s /nix/store/mlni22kgq48krfd8smgpizpj6in7d4ia-pathway-system-0.0.1.0-doc
  541. 9.98 s error: Build failed due to failed dependency
  542. 9.98 s error: Cannot build '/nix/store/cyn0sina55pw6lj00znvq4k29sbkm2vv-all-packages.drv'.
  543. 9.98 s Reason: 1 dependency failed.
  544. 9.98 s Output paths:
  545. 9.98 s /nix/store/jxsli0j2m1xahmhzgsgird7xmfgyq57l-all-packages
  546. 9.99 s Build failed due to failed dependency
  547. 10.02 s Build failed.