build packages.x86_64-linux.ghc967_all
41.78 s
Downloading cached os-string from https://cache.nix-ci.com
41.78 s
Downloaded cached OneTuple (75 KiB) in 10ms
41.78 s
Progress: 0 of 101 built, 85 of 164 downloaded from cache (15 downloading)
41.78 s
Downloading cached parallel from https://cache.nix-ci.com
41.79 s
Downloaded cached file-io (1.1 MiB) in 10ms
41.79 s
Progress: 0 of 100 built, 86 of 164 downloaded from cache (15 downloading)
41.79 s
Downloading cached parser-combinators from https://cache.nix-ci.com
41.79 s
Downloaded cached StateVar (382 KiB) in 11ms
41.79 s
Progress: 0 of 99 built, 87 of 164 downloaded from cache (15 downloading)
41.79 s
Downloading cached prettyprinter from https://cache.nix-ci.com
41.79 s
Downloaded cached cabal-doctest (768 KiB) in 13ms
41.79 s
Progress: 0 of 98 built, 88 of 164 downloaded from cache (15 downloading)
41.79 s
Downloading cached contravariant from https://cache.nix-ci.com
41.79 s
Downloaded cached call-stack (281 KiB) in 14ms
41.79 s
Progress: 0 of 97 built, 89 of 164 downloaded from cache (15 downloading)
41.79 s
Downloading cached primitive from https://cache.nix-ci.com
41.79 s
Downloaded cached code-page (366 KiB) in 18ms
41.79 s
Progress: 0 of 96 built, 90 of 164 downloaded from cache (15 downloading)
41.79 s
Downloading cached HUnit from https://cache.nix-ci.com
41.79 s
Downloaded cached ghc-paths (101 KiB) in 19ms
41.79 s
Progress: 0 of 96 built, 91 of 164 downloaded from cache (15 downloading)
41.79 s
Downloading cached reflection from https://cache.nix-ci.com
41.82 s
Downloaded cached clock (1.8 MiB) in 42ms
41.82 s
Progress: 0 of 96 built, 92 of 164 downloaded from cache (15 downloading)
41.82 s
Downloading cached splitmix from https://cache.nix-ci.com
41.82 s
Downloaded cached dlist (1.4 MiB) in 44ms
41.82 s
Progress: 0 of 95 built, 93 of 164 downloaded from cache (15 downloading)
41.82 s
Downloaded cached base-orphans (2 MiB) in 44ms
41.82 s
Downloading cached extra from https://cache.nix-ci.com
41.82 s
Progress: 0 of 94 built, 94 of 164 downloaded from cache (15 downloading)
41.82 s
Downloading cached syb from https://cache.nix-ci.com
41.82 s
Downloaded cached old-locale (529 KiB) in 46ms
41.82 s
Progress: 0 of 93 built, 95 of 164 downloaded from cache (15 downloading)
41.82 s
Downloading cached tagged from https://cache.nix-ci.com
41.82 s
Downloaded cached integer-logarithms (912 KiB) in 47ms
41.82 s
Progress: 0 of 92 built, 96 of 164 downloaded from cache (15 downloading)
41.82 s
Downloading cached old-time from https://cache.nix-ci.com
41.82 s
Downloaded cached character-ps (2.2 MiB) in 48ms
41.82 s
Progress: 0 of 91 built, 97 of 164 downloaded from cache (15 downloading)
41.82 s
Downloading cached th-abstraction from https://cache.nix-ci.com
41.83 s
Downloaded cached indexed-traversable (3.9 MiB) in 50ms
41.83 s
Progress: 0 of 90 built, 98 of 164 downloaded from cache (15 downloading)
41.83 s
Downloading cached th-compat from https://cache.nix-ci.com
41.83 s
Downloaded cached colour (5.5 MiB) in 51ms
41.83 s
Progress: 0 of 89 built, 99 of 164 downloaded from cache (15 downloading)
41.83 s
Downloading cached transformers-compat from https://cache.nix-ci.com
41.83 s
Downloaded cached parallel (1.4 MiB) in 47ms
41.83 s
Progress: 0 of 88 built, 100 of 164 downloaded from cache (15 downloading)
41.83 s
Downloading cached ansi-terminal-types from https://cache.nix-ci.com
41.84 s
Downloaded cached parser-combinators (1.8 MiB) in 51ms
41.84 s
Progress: 0 of 87 built, 101 of 164 downloaded from cache (15 downloading)
41.84 s
Downloading cached unliftio-core from https://cache.nix-ci.com
41.85 s
Downloaded cached os-string (5.9 MiB) in 63ms
41.85 s
Progress: 0 of 86 built, 102 of 164 downloaded from cache (15 downloading)
41.85 s
Downloading cached vector-stream from https://cache.nix-ci.com
41.85 s
Downloaded cached prettyprinter (8.6 MiB) in 67ms
41.85 s
Progress: 0 of 85 built, 103 of 164 downloaded from cache (15 downloading)
41.85 s
Downloading cached hashable from https://cache.nix-ci.com
41.85 s
Downloaded cached contravariant (1.9 MiB) in 65ms
41.85 s
Progress: 0 of 84 built, 104 of 164 downloaded from cache (15 downloading)
41.86 s
Downloaded cached HUnit (2 MiB) in 64ms
41.86 s
Progress: 0 of 83 built, 105 of 164 downloaded from cache (14 downloading)
41.87 s
Downloaded cached reflection (6 MiB) in 75ms
41.87 s
Progress: 0 of 82 built, 106 of 164 downloaded from cache (13 downloading)
41.87 s
Downloaded cached primitive (8.7 MiB) in 81ms
41.87 s
Progress: 0 of 81 built, 107 of 164 downloaded from cache (12 downloading)
41.87 s
Downloading cached integer-conversion from https://cache.nix-ci.com
41.88 s
Downloaded cached splitmix (881 KiB) in 58ms
41.88 s
Progress: 0 of 80 built, 108 of 164 downloaded from cache (12 downloading)
41.88 s
Downloading cached random from https://cache.nix-ci.com
41.88 s
Downloaded cached syb (2.8 MiB) in 65ms
41.88 s
Progress: 0 of 79 built, 109 of 164 downloaded from cache (12 downloading)
41.89 s
Downloaded cached th-compat (569 KiB) in 60ms
41.89 s
Progress: 0 of 79 built, 110 of 164 downloaded from cache (11 downloading)
41.89 s
Downloading cached network-uri from https://cache.nix-ci.com
41.89 s
Downloaded cached old-time (2.3 MiB) in 64ms
41.89 s
Progress: 0 of 78 built, 111 of 164 downloaded from cache (11 downloading)
41.89 s
Downloaded cached tagged (1.7 MiB) in 65ms
41.89 s
Progress: 0 of 77 built, 112 of 164 downloaded from cache (10 downloading)
41.89 s
Downloading cached distributive from https://cache.nix-ci.com
41.89 s
Downloaded cached extra (4.2 MiB) in 68ms
41.89 s
Progress: 0 of 76 built, 113 of 164 downloaded from cache (10 downloading)
41.89 s
Downloaded cached transformers-compat (3.4 MiB) in 66ms
41.89 s
Progress: 0 of 75 built, 114 of 164 downloaded from cache (9 downloading)
41.89 s
Downloading cached transformers-base from https://cache.nix-ci.com
41.90 s
Downloaded cached th-abstraction (5.7 MiB) in 77ms
41.90 s
Progress: 0 of 74 built, 115 of 164 downloaded from cache (9 downloading)
41.91 s
Downloaded cached ansi-terminal-types (3.3 MiB) in 74ms
41.91 s
Progress: 0 of 73 built, 116 of 164 downloaded from cache (8 downloading)
41.91 s
Downloading cached ansi-terminal from https://cache.nix-ci.com
41.91 s
Downloaded cached vector-stream (3.1 MiB) in 65ms
41.91 s
Progress: 0 of 72 built, 117 of 164 downloaded from cache (8 downloading)
41.91 s
Downloaded cached hashable (3.3 MiB) in 59ms
41.91 s
Progress: 0 of 71 built, 118 of 164 downloaded from cache (7 downloading)
41.91 s
Downloading cached case-insensitive from https://cache.nix-ci.com
41.91 s
Downloading cached data-fix from https://cache.nix-ci.com
41.91 s
Downloading cached scientific from https://cache.nix-ci.com
41.91 s
Downloading cached text-short from https://cache.nix-ci.com
41.91 s
Downloading cached these from https://cache.nix-ci.com
41.91 s
Downloading cached time-compat from https://cache.nix-ci.com
41.91 s
Downloading cached unordered-containers from https://cache.nix-ci.com
41.91 s
Downloaded cached integer-conversion (193 KiB) in 44ms
41.91 s
Progress: 0 of 70 built, 119 of 164 downloaded from cache (13 downloading)
41.92 s
Downloaded cached distributive (1.2 MiB) in 34ms
41.92 s
Progress: 0 of 69 built, 120 of 164 downloaded from cache (12 downloading)
41.92 s
Downloading cached comonad from https://cache.nix-ci.com
41.92 s
Downloaded cached network-uri (4.8 MiB) in 38ms
41.92 s
Progress: 0 of 68 built, 121 of 164 downloaded from cache (12 downloading)
41.93 s
Downloaded cached unliftio-core (390 KiB) in 88ms
41.93 s
Progress: 0 of 67 built, 122 of 164 downloaded from cache (11 downloading)
41.93 s
Downloaded cached transformers-base (649 KiB) in 34ms
41.93 s
Progress: 0 of 66 built, 123 of 164 downloaded from cache (10 downloading)
41.94 s
Downloaded cached random (8.9 MiB) in 63ms
41.94 s
Progress: 0 of 65 built, 124 of 164 downloaded from cache (9 downloading)
41.94 s
Downloading cached QuickCheck from https://cache.nix-ci.com
41.94 s
Downloading cached temporary from https://cache.nix-ci.com
41.94 s
Downloading cached uuid-types from https://cache.nix-ci.com
41.94 s
Downloaded cached ansi-terminal (1.2 MiB) in 33ms
41.94 s
Progress: 0 of 64 built, 125 of 164 downloaded from cache (11 downloading)
41.94 s
Downloading cached prettyprinter-ansi-terminal from https://cache.nix-ci.com
41.94 s
Downloaded cached data-fix (1.1 MiB) in 31ms
41.94 s
Progress: 0 of 63 built, 126 of 164 downloaded from cache (11 downloading)
41.97 s
Downloaded cached case-insensitive (947 KiB) in 53ms
41.97 s
Progress: 0 of 62 built, 127 of 164 downloaded from cache (10 downloading)
41.97 s
Downloaded cached time-compat (3 MiB) in 60ms
41.97 s
Progress: 0 of 61 built, 128 of 164 downloaded from cache (9 downloading)
41.97 s
Downloading cached text-iso8601 from https://cache.nix-ci.com
41.98 s
Downloaded cached scientific (2.9 MiB) in 65ms
41.98 s
Progress: 0 of 60 built, 129 of 164 downloaded from cache (9 downloading)
41.98 s
Downloading cached megaparsec from https://cache.nix-ci.com
41.98 s
Downloaded cached text-short (1.7 MiB) in 65ms
41.98 s
Progress: 0 of 59 built, 130 of 164 downloaded from cache (9 downloading)
41.98 s
Downloaded cached these (3.1 MiB) in 66ms
41.98 s
Progress: 0 of 58 built, 131 of 164 downloaded from cache (8 downloading)
41.98 s
Downloading cached strict from https://cache.nix-ci.com
41.98 s
Downloaded cached comonad (3.2 MiB) in 62ms
41.98 s
Progress: 0 of 57 built, 132 of 164 downloaded from cache (8 downloading)
41.98 s
Downloading cached bifunctors from https://cache.nix-ci.com
41.99 s
Downloaded cached unordered-containers (9.4 MiB) in 72ms
41.99 s
Progress: 0 of 56 built, 133 of 164 downloaded from cache (8 downloading)
41.99 s
Downloaded cached uuid-types (1.6 MiB) in 54ms
41.99 s
Progress: 0 of 55 built, 134 of 164 downloaded from cache (7 downloading)
42.00 s
Downloaded cached temporary (305 KiB) in 56ms
42.00 s
Progress: 0 of 54 built, 135 of 164 downloaded from cache (6 downloading)
42.00 s
Downloading cached doctest from https://cache.nix-ci.com
42.00 s
Downloaded cached text-iso8601 (2.9 MiB) in 27ms
42.00 s
Progress: 0 of 53 built, 136 of 164 downloaded from cache (6 downloading)
42.01 s
Downloaded cached strict (5.2 MiB) in 33ms
42.01 s
Progress: 0 of 52 built, 137 of 164 downloaded from cache (5 downloading)
42.01 s
Downloaded cached prettyprinter-ansi-terminal (1.4 MiB) in 71ms
42.01 s
Progress: 0 of 51 built, 138 of 164 downloaded from cache (4 downloading)
42.01 s
Downloading cached optparse-applicative from https://cache.nix-ci.com
42.04 s
Downloaded cached megaparsec (15.4 MiB) in 57ms
42.04 s
Progress: 0 of 50 built, 139 of 164 downloaded from cache (4 downloading)
42.05 s
Downloaded cached QuickCheck (20.1 MiB) in 109ms
42.05 s
Progress: 0 of 49 built, 140 of 164 downloaded from cache (3 downloading)
42.06 s
Downloaded cached bifunctors (16 MiB) in 75ms
42.06 s
Progress: 0 of 48 built, 141 of 164 downloaded from cache (2 downloading)
42.06 s
Downloading cached profunctors from https://cache.nix-ci.com
42.06 s
Downloading cached semigroupoids from https://cache.nix-ci.com
42.07 s
Downloaded cached optparse-applicative (8.7 MiB) in 54ms
42.07 s
Progress: 0 of 47 built, 142 of 164 downloaded from cache (3 downloading)
42.07 s
Downloading cached tasty from https://cache.nix-ci.com
42.10 s
Downloaded cached semigroupoids (12.2 MiB) in 37ms
42.10 s
Progress: 0 of 46 built, 143 of 164 downloaded from cache (3 downloading)
42.10 s
Downloaded cached profunctors (10.7 MiB) in 38ms
42.10 s
Progress: 0 of 45 built, 144 of 164 downloaded from cache (2 downloading)
42.10 s
Downloading cached either from https://cache.nix-ci.com
42.10 s
Downloading cached free from https://cache.nix-ci.com
42.10 s
Downloading cached invariant from https://cache.nix-ci.com
42.12 s
Downloaded cached tasty (9.6 MiB) in 54ms
42.12 s
Progress: 0 of 44 built, 145 of 164 downloaded from cache (4 downloading)
42.12 s
Downloading cached tasty-quickcheck from https://cache.nix-ci.com
42.12 s
Downloading cached vector from https://cache.nix-ci.com
42.13 s
Downloaded cached either (891 KiB) in 35ms
42.13 s
Progress: 0 of 43 built, 146 of 164 downloaded from cache (5 downloading)
42.15 s
Downloaded cached invariant (5.5 MiB) in 48ms
42.15 s
Progress: 0 of 42 built, 147 of 164 downloaded from cache (4 downloading)
42.17 s
Downloaded cached tasty-quickcheck (835 KiB) in 44ms
42.17 s
Progress: 0 of 41 built, 148 of 164 downloaded from cache (3 downloading)
42.18 s
Downloaded cached free (22.8 MiB) in 85ms
42.18 s
Progress: 0 of 40 built, 149 of 164 downloaded from cache (2 downloading)
42.18 s
Downloading cached adjunctions from https://cache.nix-ci.com
42.19 s
Building /nix/store/bc2vrvmmgwgny4303v41r3w179xdjv4h-recursion-schemes-5.2.3.drv
42.19 s
[recursion-schemes] Phase: setupCompilerEnvironmentPhase
42.19 s
[recursion-schemes] Build with /nix/store/2djpcnj8a25viv1y24h3mziy1gsy3fc6-ghc-9.6.7.
42.20 s
Downloaded cached adjunctions (6.2 MiB) in 12ms
42.20 s
Progress: 0 of 39 built (1 building), 150 of 164 downloaded from cache (2 downloading)
42.20 s
Downloading cached kan-extensions from https://cache.nix-ci.com
42.22 s
[recursion-schemes] Phase: unpackPhase
42.22 s
[recursion-schemes] unpacking source archive /nix/store/s3552nnjzw3ainjsnswrhxjs51ldc2la-recursion-schemes-5.2.3.tar.gz
42.23 s
[recursion-schemes] source root is recursion-schemes-5.2.3
42.24 s
[recursion-schemes] setting SOURCE_DATE_EPOCH to timestamp 1000000000 of file "recursion-schemes-5.2.3/src/Data/Functor/Foldable/TH.hs"
42.25 s
[recursion-schemes] Phase: patchPhase
42.25 s
[recursion-schemes] Replace Cabal file with edited version from mirror://hackage/recursion-schemes-5.2.3/revision/2.cabal.
42.26 s
[recursion-schemes] Phase: compileBuildDriverPhase
42.26 s
[recursion-schemes] setupCompileFlags: -package-db=/build/tmp.NR1NtCvyB9/setup-package.conf.d -threaded
42.29 s
Downloaded cached kan-extensions (7.2 MiB) in 92ms
42.29 s
Progress: 0 of 38 built (1 building), 151 of 164 downloaded from cache (2 downloading)
42.31 s
[recursion-schemes] [1 of 2] Compiling Main ( /nix/store/4mdp8nhyfddh7bllbi7xszz7k9955n79-Setup.hs, /build/tmp.NR1NtCvyB9/Main.o )
42.32 s
Downloaded cached doctest (66.2 MiB) in 324ms
42.32 s
Progress: 0 of 37 built (1 building), 152 of 164 downloaded from cache (1 downloading)
42.37 s
[recursion-schemes] [2 of 2] Linking Setup
42.45 s
Downloaded cached vector (57.2 MiB) in 323ms
42.45 s
Progress: 0 of 36 built (1 building), 153 of 164 downloaded from cache
42.45 s
Downloading cached indexed-traversable-instances from https://cache.nix-ci.com
42.45 s
Downloading cached quickcheck-instances from https://cache.nix-ci.com
42.59 s
Downloaded cached indexed-traversable-instances (360 KiB) in 142ms
42.59 s
Progress: 0 of 35 built (1 building), 154 of 164 downloaded from cache (1 downloading)
42.59 s
Downloading cached lens from https://cache.nix-ci.com
42.59 s
Downloading cached semialign from https://cache.nix-ci.com
42.59 s
Downloading cached witherable from https://cache.nix-ci.com
42.61 s
Downloaded cached quickcheck-instances (5.5 MiB) in 159ms
42.61 s
Progress: 0 of 34 built (1 building), 155 of 164 downloaded from cache (3 downloading)
42.74 s
Downloaded cached witherable (4.6 MiB) in 154ms
42.74 s
Progress: 0 of 33 built (1 building), 156 of 164 downloaded from cache (2 downloading)
42.76 s
Downloaded cached semialign (3.8 MiB) in 168ms
42.76 s
Progress: 0 of 32 built (1 building), 157 of 164 downloaded from cache (1 downloading)
42.76 s
Downloading cached aeson from https://cache.nix-ci.com
43.39 s
Downloaded cached lens (60 MiB) in 802ms
43.39 s
Progress: 0 of 31 built (1 building), 158 of 164 downloaded from cache (1 downloading)
43.39 s
Downloading cached yaya from https://cache.nix-ci.com
43.58 s
[recursion-schemes] Phase: updateAutotoolsGnuConfigScriptsPhase
43.60 s
[recursion-schemes] Phase: configurePhase
43.60 s
[recursion-schemes] configureFlags: --verbose --prefix=/nix/store/ig76jz1m906gjinlmgnpgg50zabbgz0k-recursion-schemes-5.2.3 --libdir=$prefix/lib/$compiler/lib --libsubdir=$abi/$libname --docdir=/nix/store/s78cwxddrc9kiamx98y6grhadir03gym-recursion-schemes-5.2.3-doc/share/doc/recursion-schemes-5.2.3 --with-gcc=gcc --package-db=/build/tmp.NR1NtCvyB9/package.conf.d --ghc-option=-j16 --ghc-option=+RTS --ghc-option=-A64M --ghc-option=-RTS --enable-library-profiling --profiling-detail=exported-functions --disable-profiling --enable-shared --disable-coverage --enable-static --disable-executable-dynamic --enable-tests --disable-benchmarks --enable-library-vanilla --disable-library-for-ghci --enable-split-sections --enable-library-stripping --enable-executable-stripping --ghc-option=-haddock --extra-lib-dirs=/nix/store/pndhkk0l649lm1sj0mxk7cbwq26qd1ra-ncurses-6.6/lib --extra-lib-dirs=/nix/store/0djlg4g0b81w94k3vcaqsxsc2hh4kism-libffi-3.5.2/lib --extra-lib-dirs=/nix/store/md4paia7riiggyrj8p24c7a6vf8w7jz8-elfutils-0.194/lib --extra-lib-dirs=/nix/store/39vv2pf64gd8li48a4hpbhw2crzd8z5p-gmp-with-cxx-6.3.0/lib --extra-lib-dirs=/nix/store/7wwvald8lapkrsr72qanlw8blyn55ifx-numactl-2.0.18/lib
43.61 s
[recursion-schemes] Using Parsec parser
43.61 s
[recursion-schemes] Configuring recursion-schemes-5.2.3...
43.63 s
Downloaded cached yaya (5.4 MiB) in 232ms
43.63 s
Progress: 0 of 30 built (1 building), 159 of 164 downloaded from cache (1 downloading)
43.63 s
Downloading cached yaya-containers from https://cache.nix-ci.com
43.63 s
Downloading cached yaya-quickcheck from https://cache.nix-ci.com
43.63 s
Downloading cached yaya-unsafe from https://cache.nix-ci.com
43.65 s
Downloaded cached aeson (48.5 MiB) in 893ms
43.66 s
Building /nix/store/8y552fad8mx3f3v5hajznj13gghv82b3-pathway-internal-0.0.1.0.drv
43.66 s
Progress: 0 of 29 built (2 building), 160 of 164 downloaded from cache (3 downloading)
43.66 s
Downloading cached path from https://cache.nix-ci.com
43.68 s
Downloaded cached yaya-quickcheck (350 KiB) in 51ms
43.68 s
Progress: 0 of 28 built (2 building), 161 of 164 downloaded from cache (3 downloading)
43.68 s
Downloaded cached yaya-unsafe (1 MiB) in 54ms
43.68 s
Progress: 0 of 27 built (2 building), 162 of 164 downloaded from cache (2 downloading)
43.69 s
Downloaded cached yaya-containers (3.5 MiB) in 60ms
43.69 s
Progress: 0 of 26 built (2 building), 163 of 164 downloaded from cache (1 downloading)
43.83 s
[pathway-internal] Phase: setupCompilerEnvironmentPhase
43.83 s
[pathway-internal] Build with /nix/store/2djpcnj8a25viv1y24h3mziy1gsy3fc6-ghc-9.6.7.
43.95 s
Downloaded cached path (10 MiB) in 285ms
43.95 s
Progress: 0 of 25 built (2 building), 164 of 164 downloaded from cache
43.95 s
[recursion-schemes] Flags chosen: template-haskell=True
43.95 s
[recursion-schemes] Dependency base >=4.9 && <5: using base-4.18.3.0
43.95 s
[recursion-schemes] Dependency comonad >=4 && <6: using comonad-5.0.10
43.95 s
[recursion-schemes] Dependency containers >=0.4.2.1 && <0.9: using containers-0.6.7
43.95 s
[recursion-schemes] Dependency data-fix >=0.3.0 && <0.4: using data-fix-0.3.4
43.95 s
[recursion-schemes] Dependency free >=4 && <6: using free-5.2
43.95 s
[recursion-schemes] Dependency template-haskell >=2.11.0.0 && <2.25: using
43.95 s
[recursion-schemes] template-haskell-2.20.0.0
43.95 s
[recursion-schemes] Dependency th-abstraction >=0.4 && <0.8: using th-abstraction-0.7.2.0
43.95 s
[recursion-schemes] Dependency transformers >=0.4.2.0 && <1: using transformers-0.6.1.0
43.95 s
[recursion-schemes] Dependency HUnit <1.7: using HUnit-1.6.2.0
43.95 s
[recursion-schemes] Dependency base: using base-4.18.3.0
43.95 s
[recursion-schemes] Dependency recursion-schemes: using recursion-schemes-5.2.3
43.95 s
[recursion-schemes] Dependency template-haskell: using template-haskell-2.20.0.0
43.95 s
[recursion-schemes] Dependency transformers >=0.2 && <1: using transformers-0.6.1.0
44.12 s
[pathway-internal] Phase: unpackPhase
44.12 s
[pathway-internal] unpacking source archive /nix/store/hh572hbnzilsldmgcd4h66b9lmbbjblc-internal
44.13 s
[pathway-internal] source root is internal
44.14 s
[pathway-internal] Phase: patchPhase
44.15 s
[pathway-internal] Phase: compileBuildDriverPhase
44.16 s
[pathway-internal] setupCompileFlags: -package-db=/build/tmp.MngyKQfErL/setup-package.conf.d -threaded
44.21 s
[pathway-internal] [1 of 2] Compiling Main ( Setup.hs, /build/tmp.MngyKQfErL/Main.o )
44.27 s
[pathway-internal] [2 of 2] Linking Setup
44.32 s
[recursion-schemes] Source component graph:
44.32 s
[recursion-schemes] component lib
44.32 s
[recursion-schemes] component test:Expr dependency lib
44.32 s
[recursion-schemes] Configured component graph:
44.32 s
[recursion-schemes] component recursion-schemes-5.2.3-8pDM6JvRHWzK73BhqZdt4M
44.32 s
[recursion-schemes] include base-4.18.3.0
44.32 s
[recursion-schemes] include comonad-5.0.10-FoeNAb0slCN189054f362G
44.32 s
[recursion-schemes] include containers-0.6.7
44.32 s
[recursion-schemes] include data-fix-0.3.4-Km7W3xegUhnDtle4ITMHLI
44.32 s
[recursion-schemes] include free-5.2-JIGAPE60T5QGgTP0aJgQJf
44.32 s
[recursion-schemes] include template-haskell-2.20.0.0
44.32 s
[recursion-schemes] include th-abstraction-0.7.2.0-1FzoKRZ0EkPGlXl1TWTPq0
44.32 s
[recursion-schemes] include transformers-0.6.1.0
44.32 s
[recursion-schemes] component recursion-schemes-5.2.3-6zYT1YrOUL76LRPi1H2bPh-Expr
44.32 s
[recursion-schemes] include HUnit-1.6.2.0-F2z2OfQMKSyFedMgK10LEy
44.32 s
[recursion-schemes] include base-4.18.3.0
44.32 s
[recursion-schemes] include recursion-schemes-5.2.3-8pDM6JvRHWzK73BhqZdt4M
44.32 s
[recursion-schemes] include template-haskell-2.20.0.0
44.32 s
[recursion-schemes] include transformers-0.6.1.0
44.32 s
[recursion-schemes] Linked component graph:
44.32 s
[recursion-schemes] unit recursion-schemes-5.2.3-8pDM6JvRHWzK73BhqZdt4M
44.32 s
[recursion-schemes] include base-4.18.3.0
44.32 s
[recursion-schemes] include comonad-5.0.10-FoeNAb0slCN189054f362G
44.32 s
[recursion-schemes] include containers-0.6.7
44.32 s
[recursion-schemes] include data-fix-0.3.4-Km7W3xegUhnDtle4ITMHLI
44.32 s
[recursion-schemes] include free-5.2-JIGAPE60T5QGgTP0aJgQJf
44.32 s
[recursion-schemes] include template-haskell-2.20.0.0
44.32 s
[recursion-schemes] include th-abstraction-0.7.2.0-1FzoKRZ0EkPGlXl1TWTPq0
44.32 s
[recursion-schemes] include transformers-0.6.1.0
44.32 s
[recursion-schemes] Data.Functor.Base=recursion-schemes-5.2.3-8pDM6JvRHWzK73BhqZdt4M:Data.Functor.Base,Data.Functor.Foldable=recursion-schemes-5.2.3-8pDM6JvRHWzK73BhqZdt4M:Data.Functor.Foldable,Data.Functor.Foldable.TH=recursion-schemes-5.2.3-8pDM6JvRHWzK73BhqZdt4M:Data.Functor.Foldable.TH
44.32 s
[recursion-schemes] unit recursion-schemes-5.2.3-6zYT1YrOUL76LRPi1H2bPh-Expr
44.32 s
[recursion-schemes] include HUnit-1.6.2.0-F2z2OfQMKSyFedMgK10LEy
44.32 s
[recursion-schemes] include base-4.18.3.0
44.32 s
[recursion-schemes] include recursion-schemes-5.2.3-8pDM6JvRHWzK73BhqZdt4M
44.32 s
[recursion-schemes] include template-haskell-2.20.0.0
44.32 s
[recursion-schemes] include transformers-0.6.1.0
44.32 s
[recursion-schemes] Ready component graph:
44.32 s
[recursion-schemes] definite recursion-schemes-5.2.3-8pDM6JvRHWzK73BhqZdt4M
44.32 s
[recursion-schemes] depends base-4.18.3.0
44.32 s
[recursion-schemes] depends comonad-5.0.10-FoeNAb0slCN189054f362G
44.32 s
[recursion-schemes] depends containers-0.6.7
44.32 s
[recursion-schemes] depends data-fix-0.3.4-Km7W3xegUhnDtle4ITMHLI
44.32 s
[recursion-schemes] depends free-5.2-JIGAPE60T5QGgTP0aJgQJf
44.32 s
[recursion-schemes] depends template-haskell-2.20.0.0
44.32 s
[recursion-schemes] depends th-abstraction-0.7.2.0-1FzoKRZ0EkPGlXl1TWTPq0
44.32 s
[recursion-schemes] depends transformers-0.6.1.0
44.32 s
[recursion-schemes] definite recursion-schemes-5.2.3-6zYT1YrOUL76LRPi1H2bPh-Expr
44.32 s
[recursion-schemes] depends HUnit-1.6.2.0-F2z2OfQMKSyFedMgK10LEy
44.32 s
[recursion-schemes] depends base-4.18.3.0
44.32 s
[recursion-schemes] depends recursion-schemes-5.2.3-8pDM6JvRHWzK73BhqZdt4M
44.32 s
[recursion-schemes] depends template-haskell-2.20.0.0
44.32 s
[recursion-schemes] depends transformers-0.6.1.0
44.32 s
[recursion-schemes] Using Cabal-3.10.3.0 compiled by ghc-9.6
44.32 s
[recursion-schemes] Using compiler: ghc-9.6.7
44.32 s
[recursion-schemes] Using install prefix:
44.32 s
[recursion-schemes] /nix/store/ig76jz1m906gjinlmgnpgg50zabbgz0k-recursion-schemes-5.2.3
44.32 s
[recursion-schemes] Executables installed in:
44.32 s
[recursion-schemes] /nix/store/ig76jz1m906gjinlmgnpgg50zabbgz0k-recursion-schemes-5.2.3/bin
44.32 s
[recursion-schemes] Libraries installed in:
44.32 s
[recursion-schemes] /nix/store/ig76jz1m906gjinlmgnpgg50zabbgz0k-recursion-schemes-5.2.3/lib/ghc-9.6.7/lib/x86_64-linux-ghc-9.6.7/recursion-schemes-5.2.3-8pDM6JvRHWzK73BhqZdt4M
44.32 s
[recursion-schemes] Dynamic Libraries installed in:
44.32 s
[recursion-schemes] /nix/store/ig76jz1m906gjinlmgnpgg50zabbgz0k-recursion-schemes-5.2.3/lib/ghc-9.6.7/lib/x86_64-linux-ghc-9.6.7
44.32 s
[recursion-schemes] Private executables installed in:
44.32 s
[recursion-schemes] /nix/store/ig76jz1m906gjinlmgnpgg50zabbgz0k-recursion-schemes-5.2.3/libexec/x86_64-linux-ghc-9.6.7/recursion-schemes-5.2.3
44.32 s
[recursion-schemes] Data files installed in:
44.32 s
[recursion-schemes] /nix/store/ig76jz1m906gjinlmgnpgg50zabbgz0k-recursion-schemes-5.2.3/share/x86_64-linux-ghc-9.6.7/recursion-schemes-5.2.3
44.32 s
[recursion-schemes] Documentation installed in:
44.32 s
[recursion-schemes] /nix/store/s78cwxddrc9kiamx98y6grhadir03gym-recursion-schemes-5.2.3-doc/share/doc/recursion-schemes-5.2.3
44.32 s
[recursion-schemes] Configuration files installed in:
44.32 s
[recursion-schemes] /nix/store/ig76jz1m906gjinlmgnpgg50zabbgz0k-recursion-schemes-5.2.3/etc
44.32 s
[recursion-schemes] No alex found
44.32 s
[recursion-schemes] Using ar found on system at:
44.32 s
[recursion-schemes] /nix/store/zjraf40s86y3iwhp626b934r5y6ldkbb-binutils-wrapper-2.46/bin/ar
44.32 s
[recursion-schemes] No c2hs found
44.32 s
[recursion-schemes] No cpphs found
44.32 s
[recursion-schemes] No doctest found
44.32 s
[recursion-schemes] Using gcc version 15.2.0 given by user at:
44.32 s
[recursion-schemes] /nix/store/29qjlshvklnyr67nhpprzgb9igmsfsjj-gcc-wrapper-15.2.0/bin/gcc
44.32 s
[recursion-schemes] Using ghc version 9.6.7 found on system at:
44.32 s
[recursion-schemes] /nix/store/2djpcnj8a25viv1y24h3mziy1gsy3fc6-ghc-9.6.7/bin/ghc
44.32 s
[recursion-schemes] Using ghc-pkg version 9.6.7 found on system at:
44.32 s
[recursion-schemes] /nix/store/2djpcnj8a25viv1y24h3mziy1gsy3fc6-ghc-9.6.7/bin/ghc-pkg-9.6.7
44.32 s
[recursion-schemes] No ghcjs found
44.32 s
[recursion-schemes] No ghcjs-pkg found
44.32 s
[recursion-schemes] No greencard found
44.32 s
[recursion-schemes] Using haddock version 2.29.2 found on system at:
44.32 s
[recursion-schemes] /nix/store/2djpcnj8a25viv1y24h3mziy1gsy3fc6-ghc-9.6.7/bin/haddock-ghc-9.6.7
44.32 s
[recursion-schemes] No happy found
44.32 s
[recursion-schemes] Using haskell-suite found on system at: haskell-suite-dummy-location
44.32 s
[recursion-schemes] Using haskell-suite-pkg found on system at: haskell-suite-pkg-dummy-location
44.33 s
[recursion-schemes] No hmake found
44.33 s
[recursion-schemes] Using hpc version 0.68 found on system at:
44.33 s
[recursion-schemes] /nix/store/2djpcnj8a25viv1y24h3mziy1gsy3fc6-ghc-9.6.7/bin/hpc-ghc-9.6.7
44.33 s
[recursion-schemes] Using hsc2hs version 0.68.9 found on system at:
44.33 s
[recursion-schemes] /nix/store/2djpcnj8a25viv1y24h3mziy1gsy3fc6-ghc-9.6.7/bin/hsc2hs-ghc-9.6.7
44.33 s
[recursion-schemes] Using hscolour version 1.25 found on system at:
44.33 s
[recursion-schemes] /nix/store/2x19jxh5g98bv0s06mdj71c1hmxi54yl-hscolour-1.25/bin/HsColour
44.33 s
[recursion-schemes] No jhc found
44.33 s
[recursion-schemes] Using ld found on system at:
44.33 s
[recursion-schemes] /nix/store/zjraf40s86y3iwhp626b934r5y6ldkbb-binutils-wrapper-2.46/bin/ld.gold
44.33 s
[recursion-schemes] No pkg-config found
44.33 s
[recursion-schemes] Using runghc version 9.6.7 found on system at:
44.33 s
[recursion-schemes] /nix/store/2djpcnj8a25viv1y24h3mziy1gsy3fc6-ghc-9.6.7/bin/runghc-9.6.7
44.33 s
[recursion-schemes] Using strip version 2.46 found on system at:
44.33 s
[recursion-schemes] /nix/store/29qjlshvklnyr67nhpprzgb9igmsfsjj-gcc-wrapper-15.2.0/bin/strip
44.33 s
[recursion-schemes] Using tar found on system at:
44.33 s
[recursion-schemes] /nix/store/z5mq2sam4484prf3kv6v6vjw1m0i7j24-gnutar-1.35/bin/tar
44.33 s
[recursion-schemes] No uhc found
44.61 s
[recursion-schemes] Phase: buildPhase
44.68 s
[recursion-schemes] Preprocessing library for recursion-schemes-5.2.3..
44.68 s
[recursion-schemes] Building library for recursion-schemes-5.2.3..
44.79 s
[recursion-schemes] [1 of 4] Compiling Data.Functor.Base ( src/Data/Functor/Base.hs, dist/build/Data/Functor/Base.o, dist/build/Data/Functor/Base.dyn_o )
45.47 s
[pathway-internal] Phase: updateAutotoolsGnuConfigScriptsPhase
45.49 s
[pathway-internal] Phase: configurePhase
45.50 s
[pathway-internal] configureFlags: --verbose --prefix=/nix/store/yzd2n09shs77c5dafp1cdndz59vkrick-pathway-internal-0.0.1.0 --libdir=$prefix/lib/$compiler/lib --libsubdir=$abi/$libname --docdir=/nix/store/ag820ag39xg1ladli593bpr9hfv3q17m-pathway-internal-0.0.1.0-doc/share/doc/pathway-internal-0.0.1.0 --with-gcc=gcc --package-db=/build/tmp.MngyKQfErL/package.conf.d --ghc-option=-j16 --ghc-option=+RTS --ghc-option=-A64M --ghc-option=-RTS --enable-library-profiling --profiling-detail=exported-functions --disable-profiling --enable-shared --disable-coverage --enable-static --disable-executable-dynamic --enable-tests --disable-benchmarks --enable-library-vanilla --disable-library-for-ghci --enable-split-sections --enable-library-stripping --enable-executable-stripping --ghc-option=-haddock --ghc-options=-Werror --extra-lib-dirs=/nix/store/pndhkk0l649lm1sj0mxk7cbwq26qd1ra-ncurses-6.6/lib --extra-lib-dirs=/nix/store/0djlg4g0b81w94k3vcaqsxsc2hh4kism-libffi-3.5.2/lib --extra-lib-dirs=/nix/store/md4paia7riiggyrj8p24c7a6vf8w7jz8-elfutils-0.194/lib --extra-lib-dirs=/nix/store/39vv2pf64gd8li48a4hpbhw2crzd8z5p-gmp-with-cxx-6.3.0/lib --extra-lib-dirs=/nix/store/7wwvald8lapkrsr72qanlw8blyn55ifx-numactl-2.0.18/lib --extra-lib-dirs=/nix/store/2djpcnj8a25viv1y24h3mziy1gsy3fc6-ghc-9.6.7/lib
45.64 s
[pathway-internal] Using Parsec parser
45.64 s
[pathway-internal] Configuring pathway-internal-0.0.1.0...
45.86 s
[pathway-internal] Flags chosen: noisy-deprecations=True, verify-no-recursion=False
45.86 s
[pathway-internal] Dependency base >=4.14.0 && <4.15 || >=4.15.0 && <4.16 || >=4.16.0 && <4.17 ||
45.86 s
[pathway-internal] >=4.17.0 && <4.18 || >=4.18.0 && <4.19 || >=4.19.0 && <4.20 || >=4.20.0 &&
45.86 s
[pathway-internal] <4.21 || >=4.21.0 && <4.22 || >=4.22.0 && <4.23: using base-4.18.3.0
45.86 s
[pathway-internal] Dependency yaya >=0.6.2 && <0.7 || >=0.7.0 && <0.8: using yaya-0.6.2.3
45.86 s
[pathway-internal] Dependency base >=4.14.0 && <4.15 || >=4.15.0 && <4.16 || >=4.16.0 && <4.17 ||
45.86 s
[pathway-internal] >=4.17.0 && <4.18 || >=4.18.0 && <4.19 || >=4.19.0 && <4.20 || >=4.20.0 &&
45.86 s
[pathway-internal] <4.21 || >=4.21.0 && <4.22 || >=4.22.0 && <4.23: using base-4.18.3.0
45.86 s
[pathway-internal] Dependency doctest >=0.16.3 && <0.17 || >=0.18.1 && <0.19 || >=0.20.1 && <0.21
45.86 s
[pathway-internal] || >=0.21.1 && <0.22 || >=0.22.2 && <0.23 || >=0.24.2 && <0.25 || >=0.25.0 &&
45.86 s
[pathway-internal] <0.26: using doctest-0.24.3
45.86 s
[pathway-internal] Dependency pathway-internal: using pathway-internal-0.0.1.0
46.27 s
[pathway-internal] Source component graph:
46.27 s
[pathway-internal] component lib
46.27 s
[pathway-internal] component test:doctests dependency lib
46.27 s
[pathway-internal] Configured component graph:
46.27 s
[pathway-internal] component pathway-internal-0.0.1.0-1xeSc3z2VhRIotiMz9hdL1
46.27 s
[pathway-internal] include base-4.18.3.0
46.27 s
[pathway-internal] include yaya-0.6.2.3-CucPaROGK6cJio5wwZ3WbL
46.27 s
[pathway-internal] component pathway-internal-0.0.1.0-6311CojyLe2CgpZjTps0ZC-doctests
46.27 s
[pathway-internal] include base-4.18.3.0
46.27 s
[pathway-internal] include doctest-0.24.3-ACQNy8u8jPjC50l4I3tyiL
46.27 s
[pathway-internal] include pathway-internal-0.0.1.0-1xeSc3z2VhRIotiMz9hdL1
46.27 s
[pathway-internal] Linked component graph:
46.27 s
[pathway-internal] unit pathway-internal-0.0.1.0-1xeSc3z2VhRIotiMz9hdL1
46.27 s
[pathway-internal] include base-4.18.3.0
46.27 s
[pathway-internal] include yaya-0.6.2.3-CucPaROGK6cJio5wwZ3WbL
46.27 s
[pathway-internal] Data.Path.Internal=pathway-internal-0.0.1.0-1xeSc3z2VhRIotiMz9hdL1:Data.Path.Internal,Data.Path.Internal.Relativity=pathway-internal-0.0.1.0-1xeSc3z2VhRIotiMz9hdL1:Data.Path.Internal.Relativity,Data.Path.Internal.Type=pathway-internal-0.0.1.0-1xeSc3z2VhRIotiMz9hdL1:Data.Path.Internal.Type
46.27 s
[pathway-internal] unit pathway-internal-0.0.1.0-6311CojyLe2CgpZjTps0ZC-doctests
46.27 s
[pathway-internal] include base-4.18.3.0
46.27 s
[pathway-internal] include doctest-0.24.3-ACQNy8u8jPjC50l4I3tyiL
46.27 s
[pathway-internal] include pathway-internal-0.0.1.0-1xeSc3z2VhRIotiMz9hdL1
46.27 s
[pathway-internal] Ready component graph:
46.27 s
[pathway-internal] definite pathway-internal-0.0.1.0-1xeSc3z2VhRIotiMz9hdL1
46.27 s
[pathway-internal] depends base-4.18.3.0
46.27 s
[pathway-internal] depends yaya-0.6.2.3-CucPaROGK6cJio5wwZ3WbL
46.27 s
[pathway-internal] definite pathway-internal-0.0.1.0-6311CojyLe2CgpZjTps0ZC-doctests
46.27 s
[pathway-internal] depends base-4.18.3.0
46.27 s
[pathway-internal] depends doctest-0.24.3-ACQNy8u8jPjC50l4I3tyiL
46.27 s
[pathway-internal] depends pathway-internal-0.0.1.0-1xeSc3z2VhRIotiMz9hdL1
46.27 s
[pathway-internal] Using Cabal-3.10.3.0 compiled by ghc-9.6
46.27 s
[pathway-internal] Using compiler: ghc-9.6.7
46.27 s
[pathway-internal] Using install prefix:
46.27 s
[pathway-internal] /nix/store/yzd2n09shs77c5dafp1cdndz59vkrick-pathway-internal-0.0.1.0
46.27 s
[pathway-internal] Executables installed in:
46.27 s
[pathway-internal] /nix/store/yzd2n09shs77c5dafp1cdndz59vkrick-pathway-internal-0.0.1.0/bin
46.27 s
[pathway-internal] Libraries installed in:
46.27 s
[pathway-internal] /nix/store/yzd2n09shs77c5dafp1cdndz59vkrick-pathway-internal-0.0.1.0/lib/ghc-9.6.7/lib/x86_64-linux-ghc-9.6.7/pathway-internal-0.0.1.0-1xeSc3z2VhRIotiMz9hdL1
46.27 s
[pathway-internal] Dynamic Libraries installed in:
46.27 s
[pathway-internal] /nix/store/yzd2n09shs77c5dafp1cdndz59vkrick-pathway-internal-0.0.1.0/lib/ghc-9.6.7/lib/x86_64-linux-ghc-9.6.7
46.27 s
[pathway-internal] Private executables installed in:
46.27 s
[pathway-internal] /nix/store/yzd2n09shs77c5dafp1cdndz59vkrick-pathway-internal-0.0.1.0/libexec/x86_64-linux-ghc-9.6.7/pathway-internal-0.0.1.0
46.27 s
[pathway-internal] Data files installed in:
46.27 s
[pathway-internal] /nix/store/yzd2n09shs77c5dafp1cdndz59vkrick-pathway-internal-0.0.1.0/share/x86_64-linux-ghc-9.6.7/pathway-internal-0.0.1.0
46.27 s
[pathway-internal] Documentation installed in:
46.27 s
[pathway-internal] /nix/store/ag820ag39xg1ladli593bpr9hfv3q17m-pathway-internal-0.0.1.0-doc/share/doc/pathway-internal-0.0.1.0
46.27 s
[pathway-internal] Configuration files installed in:
46.27 s
[pathway-internal] /nix/store/yzd2n09shs77c5dafp1cdndz59vkrick-pathway-internal-0.0.1.0/etc
46.27 s
[pathway-internal] No alex found
46.27 s
[pathway-internal] Using ar found on system at:
46.27 s
[pathway-internal] /nix/store/zjraf40s86y3iwhp626b934r5y6ldkbb-binutils-wrapper-2.46/bin/ar
46.27 s
[pathway-internal] No c2hs found
46.27 s
[pathway-internal] No cpphs found
46.27 s
[pathway-internal] Using doctest version 0.24.3 found on system at:
46.27 s
[pathway-internal] /nix/store/s48k56ayjjxwdbz9y7d8mnqwlcjfi1a8-doctest-0.24.3/bin/doctest
46.27 s
[pathway-internal] Using gcc version 15.2.0 given by user at:
46.27 s
[pathway-internal] /nix/store/29qjlshvklnyr67nhpprzgb9igmsfsjj-gcc-wrapper-15.2.0/bin/gcc
46.27 s
[pathway-internal] Using ghc version 9.6.7 found on system at:
46.27 s
[pathway-internal] /nix/store/2djpcnj8a25viv1y24h3mziy1gsy3fc6-ghc-9.6.7/bin/ghc
46.27 s
[pathway-internal] Using ghc-pkg version 9.6.7 found on system at:
46.27 s
[pathway-internal] /nix/store/2djpcnj8a25viv1y24h3mziy1gsy3fc6-ghc-9.6.7/bin/ghc-pkg-9.6.7
46.27 s
[pathway-internal] No ghcjs found
46.27 s
[pathway-internal] No ghcjs-pkg found
46.27 s
[pathway-internal] No greencard found
46.27 s
[pathway-internal] Using haddock version 2.29.2 found on system at:
46.27 s
[pathway-internal] /nix/store/2djpcnj8a25viv1y24h3mziy1gsy3fc6-ghc-9.6.7/bin/haddock-ghc-9.6.7
46.27 s
[pathway-internal] No happy found
46.27 s
[pathway-internal] Using haskell-suite found on system at: haskell-suite-dummy-location
46.27 s
[pathway-internal] Using haskell-suite-pkg found on system at: haskell-suite-pkg-dummy-location
46.27 s
[pathway-internal] No hmake found
46.27 s
[pathway-internal] Using hpc version 0.68 found on system at:
46.27 s
[pathway-internal] /nix/store/2djpcnj8a25viv1y24h3mziy1gsy3fc6-ghc-9.6.7/bin/hpc-ghc-9.6.7
46.27 s
[pathway-internal] Using hsc2hs version 0.68.9 found on system at:
46.27 s
[pathway-internal] /nix/store/2djpcnj8a25viv1y24h3mziy1gsy3fc6-ghc-9.6.7/bin/hsc2hs-ghc-9.6.7
46.27 s
[pathway-internal] Using hscolour version 1.25 found on system at:
46.27 s
[pathway-internal] /nix/store/2x19jxh5g98bv0s06mdj71c1hmxi54yl-hscolour-1.25/bin/HsColour
46.27 s
[pathway-internal] No jhc found
46.27 s
[pathway-internal] Using ld found on system at:
46.27 s
[pathway-internal] /nix/store/zjraf40s86y3iwhp626b934r5y6ldkbb-binutils-wrapper-2.46/bin/ld.gold
46.27 s
[pathway-internal] No pkg-config found
46.27 s
[pathway-internal] Using runghc version 9.6.7 found on system at:
46.27 s
[pathway-internal] /nix/store/2djpcnj8a25viv1y24h3mziy1gsy3fc6-ghc-9.6.7/bin/runghc-9.6.7
46.27 s
[pathway-internal] Using strip version 2.46 found on system at:
46.27 s
[pathway-internal] /nix/store/29qjlshvklnyr67nhpprzgb9igmsfsjj-gcc-wrapper-15.2.0/bin/strip
46.27 s
[pathway-internal] Using tar found on system at:
46.27 s
[pathway-internal] /nix/store/z5mq2sam4484prf3kv6v6vjw1m0i7j24-gnutar-1.35/bin/tar
46.27 s
[pathway-internal] No uhc found
46.31 s
[recursion-schemes] [2 of 4] Compiling Data.Functor.Foldable ( src/Data/Functor/Foldable.hs, dist/build/Data/Functor/Foldable.o, dist/build/Data/Functor/Foldable.dyn_o )
46.67 s
[pathway-internal] Phase: buildPhase
46.74 s
[pathway-internal] Preprocessing library for pathway-internal-0.0.1.0..
46.74 s
[pathway-internal] Building library for pathway-internal-0.0.1.0..
46.81 s
[pathway-internal] [1 of 3] Compiling Data.Path.Internal.Relativity ( src/Data/Path/Internal/Relativity.hs, dist/build/Data/Path/Internal/Relativity.o, dist/build/Data/Path/Internal/Relativity.dyn_o )
47.00 s
[pathway-internal] [2 of 3] Compiling Data.Path.Internal.Type ( src/Data/Path/Internal/Type.hs, dist/build/Data/Path/Internal/Type.o, dist/build/Data/Path/Internal/Type.dyn_o )
47.00 s
[pathway-internal] [3 of 3] Compiling Data.Path.Internal ( src/Data/Path/Internal.hs, dist/build/Data/Path/Internal.o, dist/build/Data/Path/Internal.dyn_o )
47.78 s
[recursion-schemes] [3 of 4] Compiling Data.Functor.Foldable.TH ( src/Data/Functor/Foldable/TH.hs, dist/build/Data/Functor/Foldable/TH.o, dist/build/Data/Functor/Foldable/TH.dyn_o )
47.97 s
[recursion-schemes] [4 of 4] Compiling Paths_recursion_schemes ( dist/build/autogen/Paths_recursion_schemes.hs, dist/build/Paths_recursion_schemes.o, dist/build/Paths_recursion_schemes.dyn_o )
48.19 s
[recursion-schemes] [1 of 4] Compiling Data.Functor.Base ( src/Data/Functor/Base.hs, dist/build/Data/Functor/Base.p_o )
48.28 s
[pathway-internal] [1 of 3] Compiling Data.Path.Internal.Relativity ( src/Data/Path/Internal/Relativity.hs, dist/build/Data/Path/Internal/Relativity.p_o )
48.56 s
[pathway-internal] [2 of 3] Compiling Data.Path.Internal.Type ( src/Data/Path/Internal/Type.hs, dist/build/Data/Path/Internal/Type.p_o )
48.56 s
[pathway-internal] [3 of 3] Compiling Data.Path.Internal ( src/Data/Path/Internal.hs, dist/build/Data/Path/Internal.p_o )
49.65 s
[recursion-schemes] [2 of 4] Compiling Data.Functor.Foldable ( src/Data/Functor/Foldable.hs, dist/build/Data/Functor/Foldable.p_o )
51.10 s
[recursion-schemes] [3 of 4] Compiling Data.Functor.Foldable.TH ( src/Data/Functor/Foldable/TH.hs, dist/build/Data/Functor/Foldable/TH.p_o )
51.21 s
[pathway-internal] Preprocessing test suite 'doctests' for pathway-internal-0.0.1.0..
51.21 s
[pathway-internal] Building test suite 'doctests' for pathway-internal-0.0.1.0..
51.27 s
[pathway-internal] [1 of 2] Compiling Build_doctests ( dist/build/doctests/autogen/Build_doctests.hs, dist/build/doctests/doctests-tmp/Build_doctests.o )
51.38 s
[recursion-schemes] [4 of 4] Compiling Paths_recursion_schemes ( dist/build/autogen/Paths_recursion_schemes.hs, dist/build/Paths_recursion_schemes.p_o )
51.47 s
[pathway-internal] [2 of 2] Compiling Main ( tests/doctests.hs, dist/build/doctests/doctests-tmp/Main.o )
51.74 s
[pathway-internal] [3 of 3] Linking dist/build/doctests/doctests
52.66 s
[recursion-schemes] Preprocessing test suite 'Expr' for recursion-schemes-5.2.3..
52.66 s
[recursion-schemes] Building test suite 'Expr' for recursion-schemes-5.2.3..
52.72 s
[recursion-schemes] [1 of 1] Compiling Main ( examples/Expr.hs, dist/build/Expr/Expr-tmp/Main.o )
54.76 s
[recursion-schemes] [2 of 2] Linking dist/build/Expr/Expr
54.85 s
[pathway-internal] Phase: checkPhase
54.89 s
[pathway-internal] Running 1 test suites...
54.89 s
[pathway-internal] Test suite doctests: RUNNING...
55.14 s
[pathway-internal]
55.14 s
[pathway-internal] on the commandline: warning:
55.14 s
[pathway-internal] -XTemplateHaskell is not allowed in Safe Haskell; ignoring -XTemplateHaskell
55.14 s
[pathway-internal]
55.14 s
[pathway-internal] on the commandline: warning:
55.14 s
[pathway-internal] -XTemplateHaskell is not allowed in Safe Haskell; ignoring -XTemplateHaskell
55.57 s
[pathway-internal] Examples: 0 Tried: 0 Errors: 0 Failures: 0
55.62 s
[recursion-schemes] Phase: checkPhase
55.64 s
[pathway-internal] Test suite doctests: PASS
55.64 s
[pathway-internal] Test suite logged to: dist/test/pathway-internal-0.0.1.0-doctests.log
55.64 s
[pathway-internal] 1 of 1 test suites (1 of 1 test cases) passed.
55.64 s
[recursion-schemes] Running 1 test suites...
55.64 s
[recursion-schemes] Test suite Expr: RUNNING...
55.65 s
[pathway-internal] Phase: haddockPhase
55.67 s
[recursion-schemes] Test suite Expr: PASS
55.67 s
[recursion-schemes] Test suite logged to: dist/test/recursion-schemes-5.2.3-Expr.log
55.67 s
[recursion-schemes] 1 of 1 test suites (1 of 1 test cases) passed.
55.68 s
[recursion-schemes] Phase: haddockPhase
55.81 s
[pathway-internal] Preprocessing library for pathway-internal-0.0.1.0..
55.81 s
[pathway-internal] Running Haddock on library for pathway-internal-0.0.1.0..
55.81 s
[pathway-internal] Warning: The documentation for the following packages are not installed. No
55.81 s
[pathway-internal] links will be generated to these packages: vector-0.13.2.0
55.83 s
[recursion-schemes] Preprocessing library for recursion-schemes-5.2.3..
55.84 s
[recursion-schemes] Running Haddock on library for recursion-schemes-5.2.3..
55.87 s
[pathway-internal] Warning: --source-* options are ignored when --hyperlinked-source is enabled.
55.89 s
[recursion-schemes] Warning: --source-* options are ignored when --hyperlinked-source is enabled.
56.06 s
[pathway-internal] Warning: 'Path' is out of scope.
56.06 s
[pathway-internal] If you qualify the identifier, haddock can try to link it anyway.
56.06 s
[pathway-internal] 50% ( 1 / 2) in 'Data.Path.Internal.Type'
56.06 s
[pathway-internal] Missing documentation for:
56.06 s
[pathway-internal] Module header
56.06 s
[pathway-internal] Warning: 'Path' is out of scope.
56.06 s
[pathway-internal] If you qualify the identifier, haddock can try to link it anyway.
56.06 s
[pathway-internal] Warning: 'True' is out of scope.
56.06 s
[pathway-internal] If you qualify the identifier, haddock can try to link it anyway.
56.06 s
[pathway-internal] Warning: 'False' is out of scope.
56.06 s
[pathway-internal] If you qualify the identifier, haddock can try to link it anyway.
56.06 s
[pathway-internal] Warning: 'Nat' is out of scope.
56.06 s
[pathway-internal] If you qualify the identifier, haddock can try to link it anyway.
56.06 s
[pathway-internal] Warning: 'Maybe' is out of scope.
56.06 s
[pathway-internal] If you qualify the identifier, haddock can try to link it anyway.
56.06 s
[pathway-internal] Warning: 'Nothing' is out of scope.
56.06 s
[pathway-internal] If you qualify the identifier, haddock can try to link it anyway.
56.07 s
[pathway-internal] 50% ( 1 / 2) in 'Data.Path.Internal.Relativity'
56.07 s
[pathway-internal] Missing documentation for:
56.07 s
[pathway-internal] Module header
56.16 s
[recursion-schemes] 80% ( 4 / 5) in 'Data.Functor.Base'
56.16 s
[recursion-schemes] Missing documentation for:
56.16 s
[recursion-schemes] ForestF (src/Data/Functor/Base.hs:153)
56.36 s
[pathway-internal] Warning: 'AnyPath' is out of scope.
56.36 s
[pathway-internal] If you qualify the identifier, haddock can try to link it anyway.
56.36 s
[pathway-internal] Warning: 'toText' is out of scope.
56.36 s
[pathway-internal] If you qualify the identifier, haddock can try to link it anyway.
56.36 s
[pathway-internal] Warning: '</?>' is out of scope.
56.36 s
[pathway-internal] If you qualify the identifier, haddock can try to link it anyway.
56.37 s
[pathway-internal] 66% ( 6 / 9) in 'Data.Path.Internal'
56.37 s
[pathway-internal] Missing documentation for:
56.37 s
[pathway-internal] Module header
56.37 s
[pathway-internal] TotalOps (src/Data/Path/Internal.hs:199)
56.37 s
[pathway-internal] Filename (src/Data/Path/Internal.hs:77)
56.52 s
[recursion-schemes] Warning: 't' is out of scope.
56.52 s
[recursion-schemes] If you qualify the identifier, haddock can try to link it anyway.
56.52 s
[recursion-schemes] Warning: 'a' is out of scope.
56.52 s
[recursion-schemes] If you qualify the identifier, haddock can try to link it anyway.
56.52 s
[recursion-schemes] Warning: 'unfoldr' is out of scope.
56.52 s
[recursion-schemes] If you qualify the identifier, haddock can try to link it anyway.
56.53 s
[recursion-schemes] Warning: 'rollup' is out of scope.
56.53 s
[recursion-schemes] If you qualify the identifier, haddock can try to link it anyway.
56.53 s
[recursion-schemes] Warning: 'Reader' is out of scope.
56.53 s
[recursion-schemes] If you qualify the identifier, haddock can try to link it anyway.
56.53 s
[recursion-schemes] Warning: 'local' is out of scope.
56.53 s
[recursion-schemes] If you qualify the identifier, haddock can try to link it anyway.
56.53 s
[recursion-schemes] 67% ( 50 / 74) in 'Data.Functor.Foldable'
56.53 s
[recursion-schemes] Missing documentation for:
56.53 s
[recursion-schemes] zygo (src/Data/Functor/Foldable.hs:644)
56.53 s
[recursion-schemes] apo (src/Data/Functor/Foldable.hs:335)
56.53 s
[recursion-schemes] futu (src/Data/Functor/Foldable.hs:562)
56.53 s
[recursion-schemes] chrono (src/Data/Functor/Foldable.hs:792)
56.53 s
[recursion-schemes] gpara (src/Data/Functor/Foldable.hs:282)
56.53 s
[recursion-schemes] ghisto (src/Data/Functor/Foldable.hs:783)
56.53 s
[recursion-schemes] gzygo (src/Data/Functor/Foldable.hs:653)
56.53 s
[recursion-schemes] gapo (src/Data/Functor/Foldable.hs:670)
56.53 s
[recursion-schemes] gfutu (src/Data/Functor/Foldable.hs:565)
56.53 s
[recursion-schemes] gchrono (src/Data/Functor/Foldable.hs:795)
56.53 s
[recursion-schemes] gprepro (src/Data/Functor/Foldable.hs:295)
56.53 s
[recursion-schemes] distCata (src/Data/Functor/Foldable.hs:531)
56.53 s
[recursion-schemes] distPara (src/Data/Functor/Foldable.hs:304)
56.53 s
[recursion-schemes] distParaT (src/Data/Functor/Foldable.hs:307)
56.53 s
[recursion-schemes] distHisto (src/Data/Functor/Foldable.hs:786)
56.53 s
[recursion-schemes] distGHisto (src/Data/Functor/Foldable.hs:789)
56.53 s
[recursion-schemes] distZygo (src/Data/Functor/Foldable.hs:647)
56.53 s
[recursion-schemes] distZygoT (src/Data/Functor/Foldable.hs:662)
56.53 s
[recursion-schemes] distAna (src/Data/Functor/Foldable.hs:545)
56.53 s
[recursion-schemes] distApo (src/Data/Functor/Foldable.hs:673)
56.53 s
[recursion-schemes] distGApo (src/Data/Functor/Foldable.hs:676)
56.53 s
[recursion-schemes] distGApoT (src/Data/Functor/Foldable.hs:679)
56.53 s
[recursion-schemes] distFutu (src/Data/Functor/Foldable.hs:568)
56.53 s
[recursion-schemes] distGFutu (src/Data/Functor/Foldable.hs:572)
56.70 s
[recursion-schemes] Warning: 'Cofree' is out of scope.
56.70 s
[recursion-schemes] If you qualify the identifier, haddock can try to link it anyway.
56.70 s
[recursion-schemes] 85% ( 6 / 7) in 'Data.Functor.Foldable.TH'
56.70 s
[recursion-schemes] Missing documentation for:
56.70 s
[recursion-schemes] Module header
57.00 s
[recursion-schemes] Warning: Data.Functor.Foldable: could not find link destinations for:
57.00 s
[recursion-schemes] - Data.Functor.Foldable.GCoerce
59.67 s
[recursion-schemes] Documentation created: dist/doc/html/recursion-schemes/,
59.67 s
[recursion-schemes] dist/doc/html/recursion-schemes/recursion-schemes.txt
59.73 s
[pathway-internal] Documentation created: dist/doc/html/pathway-internal/,
59.73 s
[pathway-internal] dist/doc/html/pathway-internal/pathway-internal.txt
59.74 s
[recursion-schemes] Preprocessing test suite 'Expr' for recursion-schemes-5.2.3..
59.75 s
[recursion-schemes] Phase: installPhase
59.79 s
[recursion-schemes] Installing library in /nix/store/ig76jz1m906gjinlmgnpgg50zabbgz0k-recursion-schemes-5.2.3/lib/ghc-9.6.7/lib/x86_64-linux-ghc-9.6.7/recursion-schemes-5.2.3-8pDM6JvRHWzK73BhqZdt4M
59.80 s
[pathway-internal] Preprocessing test suite 'doctests' for pathway-internal-0.0.1.0..
59.80 s
[pathway-internal] Phase: installPhase
59.87 s
[pathway-internal] Installing library in /nix/store/yzd2n09shs77c5dafp1cdndz59vkrick-pathway-internal-0.0.1.0/lib/ghc-9.6.7/lib/x86_64-linux-ghc-9.6.7/pathway-internal-0.0.1.0-1xeSc3z2VhRIotiMz9hdL1
60.10 s
[recursion-schemes] Phase: fixupPhase
60.12 s
[recursion-schemes] shrinking RPATHs of ELF executables and libraries in /nix/store/ig76jz1m906gjinlmgnpgg50zabbgz0k-recursion-schemes-5.2.3
60.12 s
[recursion-schemes] shrinking /nix/store/ig76jz1m906gjinlmgnpgg50zabbgz0k-recursion-schemes-5.2.3/lib/ghc-9.6.7/lib/x86_64-linux-ghc-9.6.7/libHSrecursion-schemes-5.2.3-8pDM6JvRHWzK73BhqZdt4M-ghc9.6.7.so
60.14 s
[pathway-internal] Phase: fixupPhase
60.14 s
[recursion-schemes] checking for references to /build/ in /nix/store/ig76jz1m906gjinlmgnpgg50zabbgz0k-recursion-schemes-5.2.3...
60.16 s
[pathway-internal] shrinking RPATHs of ELF executables and libraries in /nix/store/yzd2n09shs77c5dafp1cdndz59vkrick-pathway-internal-0.0.1.0
60.16 s
[pathway-internal] shrinking /nix/store/yzd2n09shs77c5dafp1cdndz59vkrick-pathway-internal-0.0.1.0/lib/ghc-9.6.7/lib/x86_64-linux-ghc-9.6.7/libHSpathway-internal-0.0.1.0-1xeSc3z2VhRIotiMz9hdL1-ghc9.6.7.so
60.16 s
[recursion-schemes] patching script interpreter paths in /nix/store/ig76jz1m906gjinlmgnpgg50zabbgz0k-recursion-schemes-5.2.3
60.17 s
[recursion-schemes] stripping (with command strip and flags -S -p) in /nix/store/ig76jz1m906gjinlmgnpgg50zabbgz0k-recursion-schemes-5.2.3/lib
60.18 s
[pathway-internal] checking for references to /build/ in /nix/store/yzd2n09shs77c5dafp1cdndz59vkrick-pathway-internal-0.0.1.0...
60.20 s
[pathway-internal] patching script interpreter paths in /nix/store/yzd2n09shs77c5dafp1cdndz59vkrick-pathway-internal-0.0.1.0
60.21 s
[pathway-internal] stripping (with command strip and flags -S -p) in /nix/store/yzd2n09shs77c5dafp1cdndz59vkrick-pathway-internal-0.0.1.0/lib
60.27 s
[pathway-internal] shrinking RPATHs of ELF executables and libraries in /nix/store/ag820ag39xg1ladli593bpr9hfv3q17m-pathway-internal-0.0.1.0-doc
60.28 s
[pathway-internal] checking for references to /build/ in /nix/store/ag820ag39xg1ladli593bpr9hfv3q17m-pathway-internal-0.0.1.0-doc...
60.30 s
[recursion-schemes] shrinking RPATHs of ELF executables and libraries in /nix/store/s78cwxddrc9kiamx98y6grhadir03gym-recursion-schemes-5.2.3-doc
60.30 s
[pathway-internal] patching script interpreter paths in /nix/store/ag820ag39xg1ladli593bpr9hfv3q17m-pathway-internal-0.0.1.0-doc
60.30 s
[recursion-schemes] checking for references to /build/ in /nix/store/s78cwxddrc9kiamx98y6grhadir03gym-recursion-schemes-5.2.3-doc...
60.32 s
[recursion-schemes] patching script interpreter paths in /nix/store/s78cwxddrc9kiamx98y6grhadir03gym-recursion-schemes-5.2.3-doc
60.39 s
[pathway-internal:post-build] Uploading to cachix cache "sellout": /nix/store/ag820ag39xg1ladli593bpr9hfv3q17m-pathway-internal-0.0.1.0-doc /nix/store/yzd2n09shs77c5dafp1cdndz59vkrick-pathway-internal-0.0.1.0
62.82 s
[pathway-internal:post-build] Pushing 2 paths (156 are already present) using zstd to cache sellout ⏳
62.82 s
[pathway-internal:post-build]
63.72 s
[pathway-internal:post-build] Pushing /nix/store/ag820ag39xg1ladli593bpr9hfv3q17m-pathway-internal-0.0.1.0-doc (576.25 KiB)
63.79 s
[pathway-internal:post-build] Pushing /nix/store/yzd2n09shs77c5dafp1cdndz59vkrick-pathway-internal-0.0.1.0 (2.06 MiB)
66.55 s
[pathway-internal:post-build]
66.55 s
[pathway-internal:post-build] All done.
66.57 s
[pathway-internal:post-build] Uploading to the NixCI cache: /nix/store/ag820ag39xg1ladli593bpr9hfv3q17m-pathway-internal-0.0.1.0-doc /nix/store/yzd2n09shs77c5dafp1cdndz59vkrick-pathway-internal-0.0.1.0
66.61 s
[pathway-internal:post-build] warning: 'warn-short-path-literals' is deprecated, use 'lint-short-path-literals = ignore' instead
66.62 s
[pathway-internal:post-build] copying 2 paths...
66.62 s
[pathway-internal:post-build] copying path '/nix/store/ag820ag39xg1ladli593bpr9hfv3q17m-pathway-internal-0.0.1.0-doc' to 'https://cache.nix-ci.com'...
67.73 s
[pathway-internal:post-build] copying path '/nix/store/yzd2n09shs77c5dafp1cdndz59vkrick-pathway-internal-0.0.1.0' to 'https://cache.nix-ci.com'...
68.60 s
[pathway-internal:post-build] warning: 'warn-short-path-literals' is deprecated, use 'lint-short-path-literals = ignore' instead
69.04 s
[pathway-internal:post-build] copying 1 paths...
69.09 s
[pathway-internal:post-build] copying path '/nix/store/8y552fad8mx3f3v5hajznj13gghv82b3-pathway-internal-0.0.1.0.drv' to 'https://cache.nix-ci.com'...
69.34 s
Uploaded pathway-internal in 8.9s
69.34 s
Progress: 1 of 25 built (1 building), 164 of 164 downloaded from cache
69.34 s
Built pathway-internal in 25.6s
69.38 s
Building /nix/store/696jrxvz13cfil46kjgk3vif176xnycr-pathway-quickcheck-0.0.1.0.drv
69.44 s
[recursion-schemes:post-build] Uploading to cachix cache "sellout": /nix/store/ig76jz1m906gjinlmgnpgg50zabbgz0k-recursion-schemes-5.2.3 /nix/store/s78cwxddrc9kiamx98y6grhadir03gym-recursion-schemes-5.2.3-doc
70.76 s
[recursion-schemes:post-build] Pushing 2 paths (108 are already present) using zstd to cache sellout ⏳
70.76 s
[recursion-schemes:post-build]
71.38 s
[recursion-schemes:post-build] Pushing /nix/store/s78cwxddrc9kiamx98y6grhadir03gym-recursion-schemes-5.2.3-doc (1.92 MiB)
71.42 s
[recursion-schemes:post-build] Pushing /nix/store/ig76jz1m906gjinlmgnpgg50zabbgz0k-recursion-schemes-5.2.3 (6.75 MiB)
72.86 s
[recursion-schemes:post-build]
72.86 s
[recursion-schemes:post-build] All done.
72.87 s
[recursion-schemes:post-build] Uploading to the NixCI cache: /nix/store/ig76jz1m906gjinlmgnpgg50zabbgz0k-recursion-schemes-5.2.3 /nix/store/s78cwxddrc9kiamx98y6grhadir03gym-recursion-schemes-5.2.3-doc
72.91 s
[recursion-schemes:post-build] warning: 'warn-short-path-literals' is deprecated, use 'lint-short-path-literals = ignore' instead
73.06 s
[recursion-schemes:post-build] copying 1 paths...
73.06 s
[recursion-schemes:post-build] copying path '/nix/store/ig76jz1m906gjinlmgnpgg50zabbgz0k-recursion-schemes-5.2.3' to 'https://cache.nix-ci.com'...
75.08 s
[recursion-schemes:post-build] warning: 'warn-short-path-literals' is deprecated, use 'lint-short-path-literals = ignore' instead
75.27 s
[recursion-schemes:post-build] copying 0 paths...
75.36 s
Uploaded recursion-schemes in 5.9s
75.36 s
Progress: 2 of 24 built (1 building), 164 of 164 downloaded from cache
75.36 s
Built recursion-schemes in 33.1s
75.39 s
Building /nix/store/754j7c1fspxqaj8iy1z4k9dkdngr7abl-variant-1.0.2.drv
75.39 s
[pathway-quickcheck] Phase: setupCompilerEnvironmentPhase
75.39 s
[pathway-quickcheck] Build with /nix/store/2djpcnj8a25viv1y24h3mziy1gsy3fc6-ghc-9.6.7.
75.39 s
[pathway-quickcheck] Phase: unpackPhase
75.39 s
[pathway-quickcheck] unpacking source archive /nix/store/2gf0ac3fqqad1lv7r6jqyw4vqvkqcw0q-quickcheck
75.39 s
[pathway-quickcheck] source root is quickcheck
75.39 s
[pathway-quickcheck] Phase: patchPhase
75.39 s
[pathway-quickcheck] Phase: compileBuildDriverPhase
75.39 s
[pathway-quickcheck] setupCompileFlags: -package-db=/build/tmp.GvtKsL5Pl4/setup-package.conf.d -threaded
75.39 s
[pathway-quickcheck] [1 of 2] Compiling Main ( Setup.hs, /build/tmp.GvtKsL5Pl4/Main.o )
75.39 s
[pathway-quickcheck] [2 of 2] Linking Setup
75.39 s
[pathway-quickcheck] Phase: updateAutotoolsGnuConfigScriptsPhase
75.39 s
[pathway-quickcheck] Phase: configurePhase
75.39 s
[pathway-quickcheck] configureFlags: --verbose --prefix=/nix/store/fp53iaincvmnf3s7fd3b5w22wwc5dcgp-pathway-quickcheck-0.0.1.0 --libdir=$prefix/lib/$compiler/lib --libsubdir=$abi/$libname --docdir=/nix/store/sjs4j0y0h7i6xzxpq6lddi10hs26qp0v-pathway-quickcheck-0.0.1.0-doc/share/doc/pathway-quickcheck-0.0.1.0 --with-gcc=gcc --package-db=/build/tmp.GvtKsL5Pl4/package.conf.d --ghc-option=-j16 --ghc-option=+RTS --ghc-option=-A64M --ghc-option=-RTS --enable-library-profiling --profiling-detail=exported-functions --disable-profiling --enable-shared --disable-coverage --enable-static --disable-executable-dynamic --enable-tests --disable-benchmarks --enable-library-vanilla --disable-library-for-ghci --enable-split-sections --enable-library-stripping --enable-executable-stripping --ghc-option=-haddock --ghc-options=-Werror --extra-lib-dirs=/nix/store/pndhkk0l649lm1sj0mxk7cbwq26qd1ra-ncurses-6.6/lib --extra-lib-dirs=/nix/store/0djlg4g0b81w94k3vcaqsxsc2hh4kism-libffi-3.5.2/lib --extra-lib-dirs=/nix/store/md4paia7riiggyrj8p24c7a6vf8w7jz8-elfutils-0.194/lib --extra-lib-dirs=/nix/store/39vv2pf64gd8li48a4hpbhw2crzd8z5p-gmp-with-cxx-6.3.0/lib --extra-lib-dirs=/nix/store/7wwvald8lapkrsr72qanlw8blyn55ifx-numactl-2.0.18/lib --extra-lib-dirs=/nix/store/2djpcnj8a25viv1y24h3mziy1gsy3fc6-ghc-9.6.7/lib
75.39 s
[pathway-quickcheck] Using Parsec parser
75.39 s
[pathway-quickcheck] Configuring pathway-quickcheck-0.0.1.0...
75.39 s
[pathway-quickcheck] Flags chosen: noisy-deprecations=True, verify-no-recursion=False
75.39 s
[pathway-quickcheck] Dependency QuickCheck >=2.14.2 && <2.15 || >=2.15.0 && <2.16 || >=2.16.0 &&
75.39 s
[pathway-quickcheck] <2.17 || >=2.17.1 && <2.18 || >=2.18.0 && <2.19: using QuickCheck-2.15.0.1
75.39 s
[pathway-quickcheck] Dependency base >=4.14.0 && <4.15 || >=4.15.0 && <4.16 || >=4.16.0 && <4.17 ||
75.39 s
[pathway-quickcheck] >=4.17.0 && <4.18 || >=4.18.0 && <4.19 || >=4.19.0 && <4.20 || >=4.20.0 &&
75.39 s
[pathway-quickcheck] <4.21 || >=4.21.0 && <4.22 || >=4.22.0 && <4.23: using base-4.18.3.0
75.39 s
[pathway-quickcheck] Dependency pathway-internal >=0.0.1 && <0.1: using pathway-internal-0.0.1.0
75.39 s
[pathway-quickcheck] Dependency quickcheck-instances >=0.3.26 && <0.5: using
75.39 s
[pathway-quickcheck] quickcheck-instances-0.3.33
75.39 s
[pathway-quickcheck] Dependency yaya >=0.6.2 && <0.7 || >=0.7.0 && <0.8: using yaya-0.6.2.3
75.39 s
[pathway-quickcheck] Dependency yaya-quickcheck >=0.2.0 && <0.3 || >=0.3.0 && <0.4 || >=1.0.0 &&
75.39 s
[pathway-quickcheck] <1.1: using yaya-quickcheck-0.2.0.3
75.39 s
[pathway-quickcheck] Dependency QuickCheck >=2.14.2 && <2.15 || >=2.15.0 && <2.16 || >=2.16.0 &&
75.39 s
[pathway-quickcheck] <2.17 || >=2.17.1 && <2.18 || >=2.18.0 && <2.19: using QuickCheck-2.15.0.1
75.39 s
[pathway-quickcheck] Dependency base >=4.14.0 && <4.15 || >=4.15.0 && <4.16 || >=4.16.0 && <4.17 ||
75.39 s
[pathway-quickcheck] >=4.17.0 && <4.18 || >=4.18.0 && <4.19 || >=4.19.0 && <4.20 || >=4.20.0 &&
75.39 s
[pathway-quickcheck] <4.21 || >=4.21.0 && <4.22 || >=4.22.0 && <4.23: using base-4.18.3.0
75.39 s
[pathway-quickcheck] Dependency doctest >=0.16.3 && <0.17 || >=0.18.1 && <0.19 || >=0.20.1 && <0.21
75.39 s
[pathway-quickcheck] || >=0.21.1 && <0.22 || >=0.22.2 && <0.23 || >=0.24.2 && <0.25 || >=0.25.0 &&
75.39 s
[pathway-quickcheck] <0.26: using doctest-0.24.3
75.39 s
[pathway-quickcheck] Dependency pathway-quickcheck: using pathway-quickcheck-0.0.1.0
75.39 s
[pathway-quickcheck] Source component graph:
75.39 s
[pathway-quickcheck] component lib
75.39 s
[pathway-quickcheck] component test:doctests dependency lib
75.39 s
[pathway-quickcheck] Configured component graph:
75.39 s
[pathway-quickcheck] component pathway-quickcheck-0.0.1.0-AshRja0hbtA8TMtZAUvD3L
75.39 s
[pathway-quickcheck] include QuickCheck-2.15.0.1-Kk0tj2w2Kn3JdS4LSBPwSc
75.39 s
[pathway-quickcheck] include base-4.18.3.0
75.39 s
[pathway-quickcheck] include pathway-internal-0.0.1.0-1xeSc3z2VhRIotiMz9hdL1
75.39 s
[pathway-quickcheck] include quickcheck-instances-0.3.33-GghBJBdLOACBS2nAap0zPT
75.39 s
[pathway-quickcheck] include yaya-0.6.2.3-CucPaROGK6cJio5wwZ3WbL
75.39 s
[pathway-quickcheck] include yaya-quickcheck-0.2.0.3-AJtk8OPD8gA5salsVEt8eP
75.39 s
[pathway-quickcheck] component pathway-quickcheck-0.0.1.0-J9gk1kIBh0R2lEFglipFya-doctests
75.39 s
[pathway-quickcheck] include QuickCheck-2.15.0.1-Kk0tj2w2Kn3JdS4LSBPwSc
75.39 s
[pathway-quickcheck] include base-4.18.3.0
75.39 s
[pathway-quickcheck] include doctest-0.24.3-ACQNy8u8jPjC50l4I3tyiL
75.39 s
[pathway-quickcheck] include pathway-quickcheck-0.0.1.0-AshRja0hbtA8TMtZAUvD3L
75.39 s
[pathway-quickcheck] Linked component graph:
75.39 s
[pathway-quickcheck] unit pathway-quickcheck-0.0.1.0-AshRja0hbtA8TMtZAUvD3L
75.39 s
[pathway-quickcheck] include QuickCheck-2.15.0.1-Kk0tj2w2Kn3JdS4LSBPwSc
75.39 s
[pathway-quickcheck] include base-4.18.3.0
75.39 s
[pathway-quickcheck] include pathway-internal-0.0.1.0-1xeSc3z2VhRIotiMz9hdL1
75.39 s
[pathway-quickcheck] include quickcheck-instances-0.3.33-GghBJBdLOACBS2nAap0zPT
75.39 s
[pathway-quickcheck] include yaya-0.6.2.3-CucPaROGK6cJio5wwZ3WbL
75.39 s
[pathway-quickcheck] include yaya-quickcheck-0.2.0.3-AJtk8OPD8gA5salsVEt8eP
75.39 s
[pathway-quickcheck] Test.Path.QuickCheck=pathway-quickcheck-0.0.1.0-AshRja0hbtA8TMtZAUvD3L:Test.Path.QuickCheck
75.39 s
[pathway-quickcheck] unit pathway-quickcheck-0.0.1.0-J9gk1kIBh0R2lEFglipFya-doctests
75.39 s
[pathway-quickcheck] include QuickCheck-2.15.0.1-Kk0tj2w2Kn3JdS4LSBPwSc
75.39 s
[pathway-quickcheck] include base-4.18.3.0
75.39 s
[pathway-quickcheck] include doctest-0.24.3-ACQNy8u8jPjC50l4I3tyiL
75.39 s
[pathway-quickcheck] include pathway-quickcheck-0.0.1.0-AshRja0hbtA8TMtZAUvD3L
75.39 s
[pathway-quickcheck] Ready component graph:
75.39 s
[pathway-quickcheck] definite pathway-quickcheck-0.0.1.0-AshRja0hbtA8TMtZAUvD3L
75.39 s
[pathway-quickcheck] depends QuickCheck-2.15.0.1-Kk0tj2w2Kn3JdS4LSBPwSc
75.39 s
[pathway-quickcheck] depends base-4.18.3.0
75.39 s
[pathway-quickcheck] depends pathway-internal-0.0.1.0-1xeSc3z2VhRIotiMz9hdL1
75.39 s
[pathway-quickcheck] depends quickcheck-instances-0.3.33-GghBJBdLOACBS2nAap0zPT
75.39 s
[pathway-quickcheck] depends yaya-0.6.2.3-CucPaROGK6cJio5wwZ3WbL
75.39 s
[pathway-quickcheck] depends yaya-quickcheck-0.2.0.3-AJtk8OPD8gA5salsVEt8eP
75.39 s
[pathway-quickcheck] definite pathway-quickcheck-0.0.1.0-J9gk1kIBh0R2lEFglipFya-doctests
75.39 s
[pathway-quickcheck] depends QuickCheck-2.15.0.1-Kk0tj2w2Kn3JdS4LSBPwSc
75.39 s
[pathway-quickcheck] depends base-4.18.3.0
75.39 s
[pathway-quickcheck] depends doctest-0.24.3-ACQNy8u8jPjC50l4I3tyiL
75.39 s
[pathway-quickcheck] depends pathway-quickcheck-0.0.1.0-AshRja0hbtA8TMtZAUvD3L
75.39 s
[pathway-quickcheck] Using Cabal-3.10.3.0 compiled by ghc-9.6
75.39 s
[pathway-quickcheck] Using compiler: ghc-9.6.7
75.39 s
[pathway-quickcheck] Using install prefix:
75.39 s
[pathway-quickcheck] /nix/store/fp53iaincvmnf3s7fd3b5w22wwc5dcgp-pathway-quickcheck-0.0.1.0
75.39 s
[pathway-quickcheck] Executables installed in:
75.39 s
[pathway-quickcheck] /nix/store/fp53iaincvmnf3s7fd3b5w22wwc5dcgp-pathway-quickcheck-0.0.1.0/bin
75.39 s
[pathway-quickcheck] Libraries installed in:
75.39 s
[pathway-quickcheck] /nix/store/fp53iaincvmnf3s7fd3b5w22wwc5dcgp-pathway-quickcheck-0.0.1.0/lib/ghc-9.6.7/lib/x86_64-linux-ghc-9.6.7/pathway-quickcheck-0.0.1.0-AshRja0hbtA8TMtZAUvD3L
75.39 s
[pathway-quickcheck] Dynamic Libraries installed in:
75.39 s
[pathway-quickcheck] /nix/store/fp53iaincvmnf3s7fd3b5w22wwc5dcgp-pathway-quickcheck-0.0.1.0/lib/ghc-9.6.7/lib/x86_64-linux-ghc-9.6.7
75.39 s
[pathway-quickcheck] Private executables installed in:
75.39 s
[pathway-quickcheck] /nix/store/fp53iaincvmnf3s7fd3b5w22wwc5dcgp-pathway-quickcheck-0.0.1.0/libexec/x86_64-linux-ghc-9.6.7/pathway-quickcheck-0.0.1.0
75.39 s
[pathway-quickcheck] Data files installed in:
75.39 s
[pathway-quickcheck] /nix/store/fp53iaincvmnf3s7fd3b5w22wwc5dcgp-pathway-quickcheck-0.0.1.0/share/x86_64-linux-ghc-9.6.7/pathway-quickcheck-0.0.1.0
75.39 s
[pathway-quickcheck] Documentation installed in:
75.39 s
[pathway-quickcheck] /nix/store/sjs4j0y0h7i6xzxpq6lddi10hs26qp0v-pathway-quickcheck-0.0.1.0-doc/share/doc/pathway-quickcheck-0.0.1.0
75.39 s
[pathway-quickcheck] Configuration files installed in:
75.39 s
[pathway-quickcheck] /nix/store/fp53iaincvmnf3s7fd3b5w22wwc5dcgp-pathway-quickcheck-0.0.1.0/etc
75.39 s
[pathway-quickcheck] No alex found
75.39 s
[pathway-quickcheck] Using ar found on system at:
75.39 s
[pathway-quickcheck] /nix/store/zjraf40s86y3iwhp626b934r5y6ldkbb-binutils-wrapper-2.46/bin/ar
75.39 s
[pathway-quickcheck] No c2hs found
75.39 s
[pathway-quickcheck] No cpphs found
75.39 s
[pathway-quickcheck] Using doctest version 0.24.3 found on system at:
75.39 s
[pathway-quickcheck] /nix/store/s48k56ayjjxwdbz9y7d8mnqwlcjfi1a8-doctest-0.24.3/bin/doctest
75.39 s
[pathway-quickcheck] Using gcc version 15.2.0 given by user at:
75.39 s
[pathway-quickcheck] /nix/store/29qjlshvklnyr67nhpprzgb9igmsfsjj-gcc-wrapper-15.2.0/bin/gcc
75.39 s
[pathway-quickcheck] Using ghc version 9.6.7 found on system at:
75.39 s
[pathway-quickcheck] /nix/store/2djpcnj8a25viv1y24h3mziy1gsy3fc6-ghc-9.6.7/bin/ghc
75.39 s
[pathway-quickcheck] Using ghc-pkg version 9.6.7 found on system at:
75.39 s
[pathway-quickcheck] /nix/store/2djpcnj8a25viv1y24h3mziy1gsy3fc6-ghc-9.6.7/bin/ghc-pkg-9.6.7
75.39 s
[pathway-quickcheck] No ghcjs found
75.39 s
[pathway-quickcheck] No ghcjs-pkg found
75.39 s
[pathway-quickcheck] No greencard found
75.39 s
[pathway-quickcheck] Using haddock version 2.29.2 found on system at:
75.39 s
[pathway-quickcheck] /nix/store/2djpcnj8a25viv1y24h3mziy1gsy3fc6-ghc-9.6.7/bin/haddock-ghc-9.6.7
75.39 s
[pathway-quickcheck] No happy found
75.39 s
[pathway-quickcheck] Using haskell-suite found on system at: haskell-suite-dummy-location
75.39 s
[pathway-quickcheck] Using haskell-suite-pkg found on system at: haskell-suite-pkg-dummy-location
75.39 s
[pathway-quickcheck] No hmake found
75.39 s
[pathway-quickcheck] Using hpc version 0.68 found on system at:
75.39 s
[pathway-quickcheck] /nix/store/2djpcnj8a25viv1y24h3mziy1gsy3fc6-ghc-9.6.7/bin/hpc-ghc-9.6.7
75.39 s
[pathway-quickcheck] Using hsc2hs version 0.68.9 found on system at:
75.39 s
[pathway-quickcheck] /nix/store/2djpcnj8a25viv1y24h3mziy1gsy3fc6-ghc-9.6.7/bin/hsc2hs-ghc-9.6.7
75.39 s
[pathway-quickcheck] Using hscolour version 1.25 found on system at:
75.39 s
[pathway-quickcheck] /nix/store/2x19jxh5g98bv0s06mdj71c1hmxi54yl-hscolour-1.25/bin/HsColour
75.39 s
[pathway-quickcheck] No jhc found
75.39 s
[pathway-quickcheck] Using ld found on system at:
75.39 s
[pathway-quickcheck] /nix/store/zjraf40s86y3iwhp626b934r5y6ldkbb-binutils-wrapper-2.46/bin/ld.gold
75.39 s
[pathway-quickcheck] No pkg-config found
75.39 s
[pathway-quickcheck] Using runghc version 9.6.7 found on system at:
75.39 s
[pathway-quickcheck] /nix/store/2djpcnj8a25viv1y24h3mziy1gsy3fc6-ghc-9.6.7/bin/runghc-9.6.7
75.39 s
[pathway-quickcheck] Using strip version 2.46 found on system at:
75.39 s
[pathway-quickcheck] /nix/store/29qjlshvklnyr67nhpprzgb9igmsfsjj-gcc-wrapper-15.2.0/bin/strip
75.39 s
[pathway-quickcheck] Using tar found on system at:
75.39 s
[pathway-quickcheck] /nix/store/z5mq2sam4484prf3kv6v6vjw1m0i7j24-gnutar-1.35/bin/tar
75.39 s
[pathway-quickcheck] No uhc found
75.39 s
[pathway-quickcheck] Phase: buildPhase
75.39 s
[pathway-quickcheck] Preprocessing library for pathway-quickcheck-0.0.1.0..
75.39 s
[pathway-quickcheck] Building library for pathway-quickcheck-0.0.1.0..
75.39 s
[pathway-quickcheck] [1 of 1] Compiling Test.Path.QuickCheck ( src/Test/Path/QuickCheck.hs, dist/build/Test/Path/QuickCheck.o, dist/build/Test/Path/QuickCheck.dyn_o )
75.39 s
[pathway-quickcheck] [1 of 1] Compiling Test.Path.QuickCheck ( src/Test/Path/QuickCheck.hs, dist/build/Test/Path/QuickCheck.p_o )
75.51 s
[variant] Phase: setupCompilerEnvironmentPhase
75.52 s
[variant] Build with /nix/store/2djpcnj8a25viv1y24h3mziy1gsy3fc6-ghc-9.6.7.
75.77 s
[variant] Phase: unpackPhase
75.78 s
[variant] unpacking source archive /nix/store/ywxqzfscvssw7qcpd0arvv7sam2661yd-variant-1.0.2.tar.gz
75.79 s
[variant] source root is variant-1.0.2
75.79 s
[variant] setting SOURCE_DATE_EPOCH to timestamp 1000000000 of file "variant-1.0.2/variant.cabal"
75.80 s
[variant] Phase: patchPhase
75.82 s
[variant] Phase: compileBuildDriverPhase
75.82 s
[variant] setupCompileFlags: -package-db=/build/tmp.fl91onRFiX/setup-package.conf.d -threaded
75.86 s
[pathway-quickcheck] Preprocessing test suite 'doctests' for pathway-quickcheck-0.0.1.0..
75.86 s
[pathway-quickcheck] Building test suite 'doctests' for pathway-quickcheck-0.0.1.0..
75.87 s
[variant] [1 of 2] Compiling Main ( /nix/store/4mdp8nhyfddh7bllbi7xszz7k9955n79-Setup.hs, /build/tmp.fl91onRFiX/Main.o )
75.92 s
[variant] [2 of 2] Linking Setup
75.94 s
[pathway-quickcheck] [1 of 2] Compiling Build_doctests ( dist/build/doctests/autogen/Build_doctests.hs, dist/build/doctests/doctests-tmp/Build_doctests.o )
76.15 s
[pathway-quickcheck] [2 of 2] Compiling Main ( tests/doctests.hs, dist/build/doctests/doctests-tmp/Main.o )
76.41 s
[pathway-quickcheck] [3 of 3] Linking dist/build/doctests/doctests
77.14 s
[variant] Phase: updateAutotoolsGnuConfigScriptsPhase
77.16 s
[variant] Phase: configurePhase
77.16 s
[variant] configureFlags: --verbose --prefix=/nix/store/s6hpyhz1yhlx8nsfhs74gfj3yaggpch4-variant-1.0.2 --libdir=$prefix/lib/$compiler/lib --libsubdir=$abi/$libname --docdir=/nix/store/2cvmww7s971xlggklxl415wbq1iq3iqb-variant-1.0.2-doc/share/doc/variant-1.0.2 --with-gcc=gcc --package-db=/build/tmp.fl91onRFiX/package.conf.d --ghc-option=-j16 --ghc-option=+RTS --ghc-option=-A64M --ghc-option=-RTS --enable-library-profiling --profiling-detail=exported-functions --disable-profiling --enable-shared --disable-coverage --enable-static --disable-executable-dynamic --enable-tests --disable-benchmarks --enable-library-vanilla --disable-library-for-ghci --enable-split-sections --enable-library-stripping --enable-executable-stripping --ghc-option=-haddock --extra-lib-dirs=/nix/store/pndhkk0l649lm1sj0mxk7cbwq26qd1ra-ncurses-6.6/lib --extra-lib-dirs=/nix/store/0djlg4g0b81w94k3vcaqsxsc2hh4kism-libffi-3.5.2/lib --extra-lib-dirs=/nix/store/md4paia7riiggyrj8p24c7a6vf8w7jz8-elfutils-0.194/lib --extra-lib-dirs=/nix/store/39vv2pf64gd8li48a4hpbhw2crzd8z5p-gmp-with-cxx-6.3.0/lib --extra-lib-dirs=/nix/store/7wwvald8lapkrsr72qanlw8blyn55ifx-numactl-2.0.18/lib
77.17 s
[variant] Using Parsec parser
77.17 s
[variant] Configuring variant-1.0.2...
77.51 s
[variant] Flags chosen: unliftio=True
77.51 s
[variant] Dependency base >=4.9 && <5: using base-4.18.3.0
77.51 s
[variant] Dependency deepseq: using deepseq-1.4.8.1
77.51 s
[variant] Dependency exceptions >=0.9: using exceptions-0.10.7
77.51 s
[variant] Dependency mtl >=2.2: using mtl-2.3.1
77.51 s
[variant] Dependency recursion-schemes: using recursion-schemes-5.2.3
77.51 s
[variant] Dependency template-haskell: using template-haskell-2.20.0.0
77.51 s
[variant] Dependency transformers: using transformers-0.6.1.0
77.51 s
[variant] Dependency unliftio-core >=0.2: using unliftio-core-0.2.1.0
77.51 s
[variant] Dependency base >=4.9 && <5.0: using base-4.18.3.0
77.51 s
[variant] Dependency tasty >=0.11: using tasty-1.5.4
77.51 s
[variant] Dependency tasty-quickcheck >=0.8: using tasty-quickcheck-0.11.1
77.51 s
[variant] Dependency variant: using variant-1.0.2
77.91 s
[variant] Source component graph:
77.91 s
[variant] component lib
77.91 s
[variant] component test:tests dependency lib
77.91 s
[variant] Configured component graph:
77.91 s
[variant] component variant-1.0.2-5mfzNb7m7hb5BmRsuehY4I
77.91 s
[variant] include base-4.18.3.0
77.91 s
[variant] include deepseq-1.4.8.1
77.91 s
[variant] include exceptions-0.10.7
77.91 s
[variant] include mtl-2.3.1
77.91 s
[variant] include recursion-schemes-5.2.3-8pDM6JvRHWzK73BhqZdt4M
77.91 s
[variant] include template-haskell-2.20.0.0
77.91 s
[variant] include transformers-0.6.1.0
77.91 s
[variant] include unliftio-core-0.2.1.0-CtDanxECkbwJ3FHnCY1MPO
77.91 s
[variant] component variant-1.0.2-9N8N9kc3mN2LKx0ASY4qN-tests
77.91 s
[variant] include base-4.18.3.0
77.91 s
[variant] include tasty-1.5.4-GEwaY1r8lpoH5nBVMG6oXR
77.91 s
[variant] include tasty-quickcheck-0.11.1-1iIWpxzO6QI9YSBUNYDV04
77.91 s
[variant] include variant-1.0.2-5mfzNb7m7hb5BmRsuehY4I
77.91 s
[variant] Linked component graph:
77.91 s
[variant] unit variant-1.0.2-5mfzNb7m7hb5BmRsuehY4I
77.91 s
[variant] include base-4.18.3.0
77.91 s
[variant] include deepseq-1.4.8.1
77.91 s
[variant] include exceptions-0.10.7
77.91 s
[variant] include mtl-2.3.1
77.91 s
[variant] include recursion-schemes-5.2.3-8pDM6JvRHWzK73BhqZdt4M
77.91 s
[variant] include template-haskell-2.20.0.0
77.91 s
[variant] include transformers-0.6.1.0
77.91 s
[variant] include unliftio-core-0.2.1.0-CtDanxECkbwJ3FHnCY1MPO
77.91 s
[variant] Data.Variant=variant-1.0.2-5mfzNb7m7hb5BmRsuehY4I:Data.Variant,Data.Variant.ContFlow=variant-1.0.2-5mfzNb7m7hb5BmRsuehY4I:Data.Variant.ContFlow,Data.Variant.EADT=variant-1.0.2-5mfzNb7m7hb5BmRsuehY4I:Data.Variant.EADT,Data.Variant.EADT.TH=variant-1.0.2-5mfzNb7m7hb5BmRsuehY4I:Data.Variant.EADT.TH,Data.Variant.EGADT=variant-1.0.2-5mfzNb7m7hb5BmRsuehY4I:Data.Variant.EGADT,Data.Variant.Excepts=variant-1.0.2-5mfzNb7m7hb5BmRsuehY4I:Data.Variant.Excepts,Data.Variant.Functor=variant-1.0.2-5mfzNb7m7hb5BmRsuehY4I:Data.Variant.Functor,Data.Variant.Syntax=variant-1.0.2-5mfzNb7m7hb5BmRsuehY4I:Data.Variant.Syntax,Data.Variant.Tuple=variant-1.0.2-5mfzNb7m7hb5BmRsuehY4I:Data.Variant.Tuple,Data.Variant.Types=variant-1.0.2-5mfzNb7m7hb5BmRsuehY4I:Data.Variant.Types,Data.Variant.VEither=variant-1.0.2-5mfzNb7m7hb5BmRsuehY4I:Data.Variant.VEither,Data.Variant.VariantF=variant-1.0.2-5mfzNb7m7hb5BmRsuehY4I:Data.Variant.VariantF
77.91 s
[variant] unit variant-1.0.2-9N8N9kc3mN2LKx0ASY4qN-tests
77.91 s
[variant] include base-4.18.3.0
77.91 s
[variant] include tasty-1.5.4-GEwaY1r8lpoH5nBVMG6oXR
77.91 s
[variant] include tasty-quickcheck-0.11.1-1iIWpxzO6QI9YSBUNYDV04
77.91 s
[variant] include variant-1.0.2-5mfzNb7m7hb5BmRsuehY4I
77.91 s
[variant] Ready component graph:
77.91 s
[variant] definite variant-1.0.2-5mfzNb7m7hb5BmRsuehY4I
77.91 s
[variant] depends base-4.18.3.0
77.91 s
[variant] depends deepseq-1.4.8.1
77.91 s
[variant] depends exceptions-0.10.7
77.91 s
[variant] depends mtl-2.3.1
77.91 s
[variant] depends recursion-schemes-5.2.3-8pDM6JvRHWzK73BhqZdt4M
77.91 s
[variant] depends template-haskell-2.20.0.0
77.91 s
[variant] depends transformers-0.6.1.0
77.91 s
[variant] depends unliftio-core-0.2.1.0-CtDanxECkbwJ3FHnCY1MPO
77.91 s
[variant] definite variant-1.0.2-9N8N9kc3mN2LKx0ASY4qN-tests
77.91 s
[variant] depends base-4.18.3.0
77.91 s
[variant] depends tasty-1.5.4-GEwaY1r8lpoH5nBVMG6oXR
77.91 s
[variant] depends tasty-quickcheck-0.11.1-1iIWpxzO6QI9YSBUNYDV04
77.91 s
[variant] depends variant-1.0.2-5mfzNb7m7hb5BmRsuehY4I
77.91 s
[variant] Using Cabal-3.10.3.0 compiled by ghc-9.6
77.91 s
[variant] Using compiler: ghc-9.6.7
77.91 s
[variant] Using install prefix:
77.91 s
[variant] /nix/store/s6hpyhz1yhlx8nsfhs74gfj3yaggpch4-variant-1.0.2
77.91 s
[variant] Executables installed in:
77.91 s
[variant] /nix/store/s6hpyhz1yhlx8nsfhs74gfj3yaggpch4-variant-1.0.2/bin
77.91 s
[variant] Libraries installed in:
77.91 s
[variant] /nix/store/s6hpyhz1yhlx8nsfhs74gfj3yaggpch4-variant-1.0.2/lib/ghc-9.6.7/lib/x86_64-linux-ghc-9.6.7/variant-1.0.2-5mfzNb7m7hb5BmRsuehY4I
77.91 s
[variant] Dynamic Libraries installed in:
77.91 s
[variant] /nix/store/s6hpyhz1yhlx8nsfhs74gfj3yaggpch4-variant-1.0.2/lib/ghc-9.6.7/lib/x86_64-linux-ghc-9.6.7
77.91 s
[variant] Private executables installed in:
77.91 s
[variant] /nix/store/s6hpyhz1yhlx8nsfhs74gfj3yaggpch4-variant-1.0.2/libexec/x86_64-linux-ghc-9.6.7/variant-1.0.2
77.91 s
[variant] Data files installed in:
77.91 s
[variant] /nix/store/s6hpyhz1yhlx8nsfhs74gfj3yaggpch4-variant-1.0.2/share/x86_64-linux-ghc-9.6.7/variant-1.0.2
77.91 s
[variant] Documentation installed in:
77.91 s
[variant] /nix/store/2cvmww7s971xlggklxl415wbq1iq3iqb-variant-1.0.2-doc/share/doc/variant-1.0.2
77.91 s
[variant] Configuration files installed in:
77.91 s
[variant] /nix/store/s6hpyhz1yhlx8nsfhs74gfj3yaggpch4-variant-1.0.2/etc
77.91 s
[variant] No alex found
77.91 s
[variant] Using ar found on system at:
77.91 s
[variant] /nix/store/zjraf40s86y3iwhp626b934r5y6ldkbb-binutils-wrapper-2.46/bin/ar
77.91 s
[variant] No c2hs found
77.91 s
[variant] No cpphs found
77.91 s
[variant] No doctest found
77.91 s
[variant] Using gcc version 15.2.0 given by user at:
77.91 s
[variant] /nix/store/29qjlshvklnyr67nhpprzgb9igmsfsjj-gcc-wrapper-15.2.0/bin/gcc
77.91 s
[variant] Using ghc version 9.6.7 found on system at:
77.91 s
[variant] /nix/store/2djpcnj8a25viv1y24h3mziy1gsy3fc6-ghc-9.6.7/bin/ghc
77.91 s
[variant] Using ghc-pkg version 9.6.7 found on system at:
77.91 s
[variant] /nix/store/2djpcnj8a25viv1y24h3mziy1gsy3fc6-ghc-9.6.7/bin/ghc-pkg-9.6.7
77.91 s
[variant] No ghcjs found
77.91 s
[variant] No ghcjs-pkg found
77.91 s
[variant] No greencard found
77.91 s
[variant] Using haddock version 2.29.2 found on system at:
77.91 s
[variant] /nix/store/2djpcnj8a25viv1y24h3mziy1gsy3fc6-ghc-9.6.7/bin/haddock-ghc-9.6.7
77.91 s
[variant] No happy found
77.91 s
[variant] Using haskell-suite found on system at: haskell-suite-dummy-location
77.91 s
[variant] Using haskell-suite-pkg found on system at: haskell-suite-pkg-dummy-location
77.91 s
[variant] No hmake found
77.91 s
[variant] Using hpc version 0.68 found on system at:
77.91 s
[variant] /nix/store/2djpcnj8a25viv1y24h3mziy1gsy3fc6-ghc-9.6.7/bin/hpc-ghc-9.6.7
77.91 s
[variant] Using hsc2hs version 0.68.9 found on system at:
77.91 s
[variant] /nix/store/2djpcnj8a25viv1y24h3mziy1gsy3fc6-ghc-9.6.7/bin/hsc2hs-ghc-9.6.7
77.91 s
[variant] Using hscolour version 1.25 found on system at:
77.91 s
[variant] /nix/store/2x19jxh5g98bv0s06mdj71c1hmxi54yl-hscolour-1.25/bin/HsColour
77.91 s
[variant] No jhc found
77.91 s
[variant] Using ld found on system at:
77.91 s
[variant] /nix/store/zjraf40s86y3iwhp626b934r5y6ldkbb-binutils-wrapper-2.46/bin/ld.gold
77.91 s
[variant] No pkg-config found
77.91 s
[variant] Using runghc version 9.6.7 found on system at:
77.91 s
[variant] /nix/store/2djpcnj8a25viv1y24h3mziy1gsy3fc6-ghc-9.6.7/bin/runghc-9.6.7
77.91 s
[variant] Using strip version 2.46 found on system at:
77.91 s
[variant] /nix/store/29qjlshvklnyr67nhpprzgb9igmsfsjj-gcc-wrapper-15.2.0/bin/strip
77.91 s
[variant] Using tar found on system at:
77.91 s
[variant] /nix/store/z5mq2sam4484prf3kv6v6vjw1m0i7j24-gnutar-1.35/bin/tar
77.91 s
[variant] No uhc found
78.25 s
[variant] Phase: buildPhase
78.32 s
[variant] Preprocessing library for variant-1.0.2..
78.32 s
[variant] Building library for variant-1.0.2..
78.58 s
[variant] [ 1 of 12] Compiling Data.Variant.Functor ( src/lib/Data/Variant/Functor.hs, dist/build/Data/Variant/Functor.o, dist/build/Data/Variant/Functor.dyn_o )
78.79 s
[variant] [ 2 of 12] Compiling Data.Variant.Types ( src/lib/Data/Variant/Types.hs, dist/build/Data/Variant/Types.o, dist/build/Data/Variant/Types.dyn_o )
78.79 s
[variant] [ 3 of 12] Compiling Data.Variant.Tuple ( src/lib/Data/Variant/Tuple.hs, dist/build/Data/Variant/Tuple.o, dist/build/Data/Variant/Tuple.dyn_o )
79.34 s
[variant] [ 4 of 12] Compiling Data.Variant.ContFlow ( src/lib/Data/Variant/ContFlow.hs, dist/build/Data/Variant/ContFlow.o, dist/build/Data/Variant/ContFlow.dyn_o )
79.40 s
[variant] [ 5 of 12] Compiling Data.Variant ( src/lib/Data/Variant.hs, dist/build/Data/Variant.o, dist/build/Data/Variant.dyn_o )
79.58 s
[pathway-quickcheck] Phase: checkPhase
79.62 s
[pathway-quickcheck] Running 1 test suites...
79.62 s
[pathway-quickcheck] Test suite doctests: RUNNING...
79.92 s
[pathway-quickcheck]
79.92 s
[pathway-quickcheck] on the commandline: warning:
79.93 s
[pathway-quickcheck] -XTemplateHaskell is not allowed in Safe Haskell; ignoring -XTemplateHaskell
80.12 s
[pathway-quickcheck] Examples: 0 Tried: 0 Errors: 0 Failures: 0
80.17 s
[pathway-quickcheck] Test suite doctests: PASS
80.17 s
[pathway-quickcheck] Test suite logged to: dist/test/pathway-quickcheck-0.0.1.0-doctests.log
80.17 s
[pathway-quickcheck] 1 of 1 test suites (1 of 1 test cases) passed.
80.18 s
[pathway-quickcheck] Phase: haddockPhase
80.35 s
[pathway-quickcheck] Preprocessing library for pathway-quickcheck-0.0.1.0..
80.45 s
[pathway-quickcheck] Running Haddock on library for pathway-quickcheck-0.0.1.0..
80.45 s
[pathway-quickcheck] Warning: The documentation for the following packages are not installed. No
80.45 s
[pathway-quickcheck] links will be generated to these packages: vector-0.13.2.0
80.45 s
[pathway-quickcheck] Warning: --source-* options are ignored when --hyperlinked-source is enabled.
80.69 s
[pathway-quickcheck] 0% ( 0 / 3) in 'Test.Path.QuickCheck'
80.69 s
[pathway-quickcheck] Missing documentation for:
80.69 s
[pathway-quickcheck] Module header
80.69 s
[pathway-quickcheck] arbitraryNonEmptyText (src/Test/Path/QuickCheck.hs:32)
80.69 s
[pathway-quickcheck] arbitraryPath (src/Test/Path/QuickCheck.hs:38)
81.38 s
[variant] [ 6 of 12] Compiling Data.Variant.Syntax ( src/lib/Data/Variant/Syntax.hs, dist/build/Data/Variant/Syntax.o, dist/build/Data/Variant/Syntax.dyn_o )
81.42 s
[variant] [ 7 of 12] Compiling Data.Variant.VEither ( src/lib/Data/Variant/VEither.hs, dist/build/Data/Variant/VEither.o, dist/build/Data/Variant/VEither.dyn_o )
81.65 s
[variant] [ 8 of 12] Compiling Data.Variant.Excepts ( src/lib/Data/Variant/Excepts.hs, dist/build/Data/Variant/Excepts.o, dist/build/Data/Variant/Excepts.dyn_o )
82.21 s
[variant] [ 9 of 12] Compiling Data.Variant.VariantF ( src/lib/Data/Variant/VariantF.hs, dist/build/Data/Variant/VariantF.o, dist/build/Data/Variant/VariantF.dyn_o )
82.21 s
[variant] [10 of 12] Compiling Data.Variant.EGADT ( src/lib/Data/Variant/EGADT.hs, dist/build/Data/Variant/EGADT.o, dist/build/Data/Variant/EGADT.dyn_o )
82.21 s
[variant] [11 of 12] Compiling Data.Variant.EADT ( src/lib/Data/Variant/EADT.hs, dist/build/Data/Variant/EADT.o, dist/build/Data/Variant/EADT.dyn_o )
82.21 s
[variant] [12 of 12] Compiling Data.Variant.EADT.TH ( src/lib/Data/Variant/EADT/TH.hs, dist/build/Data/Variant/EADT/TH.o, dist/build/Data/Variant/EADT/TH.dyn_o )
82.60 s
[variant] [ 1 of 12] Compiling Data.Variant.Functor ( src/lib/Data/Variant/Functor.hs, dist/build/Data/Variant/Functor.p_o )
82.91 s
[variant] [ 2 of 12] Compiling Data.Variant.Types ( src/lib/Data/Variant/Types.hs, dist/build/Data/Variant/Types.p_o )
82.91 s
[variant] [ 3 of 12] Compiling Data.Variant.Tuple ( src/lib/Data/Variant/Tuple.hs, dist/build/Data/Variant/Tuple.p_o )
83.49 s
[variant] [ 4 of 12] Compiling Data.Variant.ContFlow ( src/lib/Data/Variant/ContFlow.hs, dist/build/Data/Variant/ContFlow.p_o )
83.67 s
[variant] [ 5 of 12] Compiling Data.Variant ( src/lib/Data/Variant.hs, dist/build/Data/Variant.p_o )
83.71 s
[pathway-quickcheck] Documentation created: dist/doc/html/pathway-quickcheck/,
83.71 s
[pathway-quickcheck] dist/doc/html/pathway-quickcheck/pathway-quickcheck.txt
83.76 s
[pathway-quickcheck] Preprocessing test suite 'doctests' for pathway-quickcheck-0.0.1.0..
83.78 s
[pathway-quickcheck] Phase: installPhase
83.85 s
[pathway-quickcheck] Installing library in /nix/store/fp53iaincvmnf3s7fd3b5w22wwc5dcgp-pathway-quickcheck-0.0.1.0/lib/ghc-9.6.7/lib/x86_64-linux-ghc-9.6.7/pathway-quickcheck-0.0.1.0-AshRja0hbtA8TMtZAUvD3L
84.08 s
[pathway-quickcheck] Phase: fixupPhase
84.10 s
[pathway-quickcheck] shrinking RPATHs of ELF executables and libraries in /nix/store/fp53iaincvmnf3s7fd3b5w22wwc5dcgp-pathway-quickcheck-0.0.1.0
84.10 s
[pathway-quickcheck] shrinking /nix/store/fp53iaincvmnf3s7fd3b5w22wwc5dcgp-pathway-quickcheck-0.0.1.0/lib/ghc-9.6.7/lib/x86_64-linux-ghc-9.6.7/libHSpathway-quickcheck-0.0.1.0-AshRja0hbtA8TMtZAUvD3L-ghc9.6.7.so
84.12 s
[pathway-quickcheck] checking for references to /build/ in /nix/store/fp53iaincvmnf3s7fd3b5w22wwc5dcgp-pathway-quickcheck-0.0.1.0...
84.15 s
[pathway-quickcheck] patching script interpreter paths in /nix/store/fp53iaincvmnf3s7fd3b5w22wwc5dcgp-pathway-quickcheck-0.0.1.0
84.15 s
[pathway-quickcheck] stripping (with command strip and flags -S -p) in /nix/store/fp53iaincvmnf3s7fd3b5w22wwc5dcgp-pathway-quickcheck-0.0.1.0/lib
84.20 s
[pathway-quickcheck] shrinking RPATHs of ELF executables and libraries in /nix/store/sjs4j0y0h7i6xzxpq6lddi10hs26qp0v-pathway-quickcheck-0.0.1.0-doc
84.20 s
[pathway-quickcheck] checking for references to /build/ in /nix/store/sjs4j0y0h7i6xzxpq6lddi10hs26qp0v-pathway-quickcheck-0.0.1.0-doc...
84.22 s
[pathway-quickcheck] patching script interpreter paths in /nix/store/sjs4j0y0h7i6xzxpq6lddi10hs26qp0v-pathway-quickcheck-0.0.1.0-doc
84.33 s
[pathway-quickcheck:post-build] Uploading to cachix cache "sellout": /nix/store/fp53iaincvmnf3s7fd3b5w22wwc5dcgp-pathway-quickcheck-0.0.1.0 /nix/store/sjs4j0y0h7i6xzxpq6lddi10hs26qp0v-pathway-quickcheck-0.0.1.0-doc
85.91 s
[pathway-quickcheck:post-build] Pushing 2 paths (182 are already present) using zstd to cache sellout ⏳
85.91 s
[pathway-quickcheck:post-build]
86.52 s
[pathway-quickcheck:post-build] Pushing /nix/store/fp53iaincvmnf3s7fd3b5w22wwc5dcgp-pathway-quickcheck-0.0.1.0 (179.84 KiB)
86.74 s
[pathway-quickcheck:post-build] Pushing /nix/store/sjs4j0y0h7i6xzxpq6lddi10hs26qp0v-pathway-quickcheck-0.0.1.0-doc (216.88 KiB)
88.84 s
[pathway-quickcheck:post-build]
88.84 s
[pathway-quickcheck:post-build] All done.
88.86 s
[pathway-quickcheck:post-build] Uploading to the NixCI cache: /nix/store/fp53iaincvmnf3s7fd3b5w22wwc5dcgp-pathway-quickcheck-0.0.1.0 /nix/store/sjs4j0y0h7i6xzxpq6lddi10hs26qp0v-pathway-quickcheck-0.0.1.0-doc
88.90 s
[pathway-quickcheck:post-build] warning: 'warn-short-path-literals' is deprecated, use 'lint-short-path-literals = ignore' instead
88.93 s
[pathway-quickcheck:post-build] copying 2 paths...
88.93 s
[pathway-quickcheck:post-build] copying path '/nix/store/sjs4j0y0h7i6xzxpq6lddi10hs26qp0v-pathway-quickcheck-0.0.1.0-doc' to 'https://cache.nix-ci.com'...
89.38 s
[pathway-quickcheck:post-build] copying path '/nix/store/fp53iaincvmnf3s7fd3b5w22wwc5dcgp-pathway-quickcheck-0.0.1.0' to 'https://cache.nix-ci.com'...
89.72 s
[pathway-quickcheck:post-build] warning: 'warn-short-path-literals' is deprecated, use 'lint-short-path-literals = ignore' instead
90.03 s
[pathway-quickcheck:post-build] copying 1 paths...
90.03 s
[pathway-quickcheck:post-build] copying path '/nix/store/696jrxvz13cfil46kjgk3vif176xnycr-pathway-quickcheck-0.0.1.0.drv' to 'https://cache.nix-ci.com'...
90.33 s
Uploaded pathway-quickcheck in 6.0s
90.33 s
Progress: 3 of 24 built (1 building), 164 of 164 downloaded from cache
90.33 s
Built pathway-quickcheck in 20.9s
90.38 s
Building /nix/store/637ggyh20kxdjvvmz5y584504iswaad7-pathway-0.0.1.0.drv
90.38 s
[variant] [ 6 of 12] Compiling Data.Variant.Syntax ( src/lib/Data/Variant/Syntax.hs, dist/build/Data/Variant/Syntax.p_o )
90.38 s
[variant] [ 7 of 12] Compiling Data.Variant.VEither ( src/lib/Data/Variant/VEither.hs, dist/build/Data/Variant/VEither.p_o )
90.38 s
[variant] [ 8 of 12] Compiling Data.Variant.Excepts ( src/lib/Data/Variant/Excepts.hs, dist/build/Data/Variant/Excepts.p_o )
90.38 s
[variant] [ 9 of 12] Compiling Data.Variant.VariantF ( src/lib/Data/Variant/VariantF.hs, dist/build/Data/Variant/VariantF.p_o )
90.38 s
[variant] [10 of 12] Compiling Data.Variant.EGADT ( src/lib/Data/Variant/EGADT.hs, dist/build/Data/Variant/EGADT.p_o )
90.38 s
[variant] [11 of 12] Compiling Data.Variant.EADT ( src/lib/Data/Variant/EADT.hs, dist/build/Data/Variant/EADT.p_o )
90.38 s
[variant] [12 of 12] Compiling Data.Variant.EADT.TH ( src/lib/Data/Variant/EADT/TH.hs, dist/build/Data/Variant/EADT/TH.p_o )
90.38 s
[variant] Preprocessing test suite 'tests' for variant-1.0.2..
90.38 s
[variant] Building test suite 'tests' for variant-1.0.2..
90.38 s
[variant] [1 of 3] Compiling EADT ( src/tests/EADT.hs, dist/build/tests/tests-tmp/EADT.o )
90.38 s
[variant] [2 of 3] Compiling Variant ( src/tests/Variant.hs, dist/build/tests/tests-tmp/Variant.o )
90.38 s
[variant] [3 of 3] Compiling Main ( src/tests/Main.hs, dist/build/tests/tests-tmp/Main.o )
90.38 s
[variant] [4 of 4] Linking dist/build/tests/tests
90.58 s
[pathway] Phase: setupCompilerEnvironmentPhase
90.59 s
[pathway] Build with /nix/store/2djpcnj8a25viv1y24h3mziy1gsy3fc6-ghc-9.6.7.
90.78 s
[variant] Phase: checkPhase
90.81 s
[variant] Running 1 test suites...
90.81 s
[variant] Test suite tests: RUNNING...
90.82 s
[variant] utils-variant
90.82 s
[variant] Variant
90.82 s
[variant] get by index (match): OK
90.82 s
[variant] +++ OK, passed 100 tests.
90.82 s
[variant] get by index (dont' match): OK
90.82 s
[variant] +++ OK, passed 100 tests.
90.82 s
[variant] pattern V: set: OK
90.82 s
[variant] +++ OK, passed 100 tests.
90.82 s
[variant] pattern V: match: OK
90.82 s
[variant] +++ OK, passed 100 tests.
90.82 s
[variant] pattern V: match2: OK
90.82 s
[variant] +++ OK, passed 100 tests.
90.82 s
[variant] pattern V: type application: OK
90.82 s
[variant] +++ OK, passed 100 tests.
90.82 s
[variant] get by type (match): OK
90.82 s
[variant] +++ OK, passed 100 tests.
90.82 s
[variant] get by type (don't match): OK
90.82 s
[variant] +++ OK, passed 100 tests.
90.82 s
[variant] variant equality (match): OK
90.82 s
[variant] +++ OK, passed 100 tests.
90.82 s
[variant] variant equality (don't match): OK
90.82 s
[variant] +++ OK, passed 100 tests.
90.82 s
[variant] update by index (match): OK
90.82 s
[variant] +++ OK, passed 100 tests.
90.82 s
[variant] update by index (don't match): OK
90.82 s
[variant] +++ OK, passed 100 tests.
90.82 s
[variant] update by type (match): OK
90.82 s
[variant] +++ OK, passed 100 tests.
90.82 s
[variant] update by type (don't match): OK
90.82 s
[variant] +++ OK, passed 100 tests.
90.82 s
[variant] update/fold by index (match): OK
90.82 s
[variant] +++ OK, passed 100 tests.
90.82 s
[variant] update/fold by index (don't match): OK
90.82 s
[variant] +++ OK, passed 100 tests.
90.82 s
[variant] Convert single variant: OK
90.82 s
[variant] +++ OK, passed 100 tests.
90.82 s
[variant] Lift Either: Left: OK
90.82 s
[variant] +++ OK, passed 100 tests.
90.82 s
[variant] Lift Either: Right: OK
90.82 s
[variant] +++ OK, passed 100 tests.
90.82 s
[variant] To Either: Left: OK
90.82 s
[variant] +++ OK, passed 100 tests.
90.82 s
[variant] To Either: Right: OK
90.82 s
[variant] +++ OK, passed 100 tests.
90.82 s
[variant] popVariantHead (match): OK
90.82 s
[variant] +++ OK, passed 100 tests.
90.82 s
[variant] popVariantHead (don't match): OK
90.82 s
[variant] +++ OK, passed 100 tests.
90.82 s
[variant] popVariantAt (match): OK
90.82 s
[variant] +++ OK, passed 100 tests.
90.82 s
[variant] popVariantAt (don't match): OK
90.82 s
[variant] +++ OK, passed 100 tests.
90.82 s
[variant] popVariant (match): OK
90.82 s
[variant] +++ OK, passed 100 tests.
90.82 s
[variant] popVariant (match): OK
90.82 s
[variant] +++ OK, passed 100 tests.
90.82 s
[variant] popVariant (don't match): OK
90.82 s
[variant] +++ OK, passed 100 tests.
90.82 s
[variant] prependVariant: OK
90.82 s
[variant] +++ OK, passed 100 tests.
90.82 s
[variant] appendVariant: OK
90.82 s
[variant] +++ OK, passed 100 tests.
90.82 s
[variant] alterVariant: OK
90.82 s
[variant] +++ OK, passed 100 tests.
90.82 s
[variant] alterVariant: OK
90.82 s
[variant] +++ OK, passed 100 tests.
90.82 s
[variant] traverseVariant: OK
90.82 s
[variant] +++ OK, passed 100 tests.
90.82 s
[variant] traverseVariant: OK
90.82 s
[variant] +++ OK, passed 100 tests.
90.82 s
[variant] liftVariant: OK
90.82 s
[variant] +++ OK, passed 100 tests.
90.82 s
[variant] splitVariant: OK
90.82 s
[variant] +++ OK, passed 100 tests.
90.82 s
[variant] splitVariant2: OK
90.82 s
[variant] +++ OK, passed 100 tests.
90.82 s
[variant] toCont: OK
90.82 s
[variant] +++ OK, passed 100 tests.
90.82 s
[variant] EADT
90.82 s
[variant] eadtPattern: match: OK
90.82 s
[variant] +++ OK, passed 100 tests.
90.82 s
[variant] eadtInfixPattern: match: OK
90.82 s
[variant] +++ OK, passed 100 tests.
90.82 s
[variant] catamorphism: constraint: OK
90.82 s
[variant] +++ OK, passed 100 tests.
90.82 s
[variant] anamorphism: numbersTo: OK
90.82 s
[variant] +++ OK, passed 100 tests.
90.82 s
[variant] apomorphism: numbersToMin5: OK
90.82 s
[variant] +++ OK, passed 100 tests.
90.82 s
[variant]
90.82 s
[variant] All 43 tests passed (0.00s)
90.83 s
[variant] Test suite tests: PASS
90.83 s
[variant] Test suite logged to: dist/test/variant-1.0.2-tests.log
90.83 s
[variant] 1 of 1 test suites (1 of 1 test cases) passed.
90.84 s
[variant] Phase: haddockPhase
90.96 s
[pathway] Phase: unpackPhase
90.97 s
[pathway] unpacking source archive /nix/store/pa5a8cacmsk7qi3b0gb3q0vn9a8b0nwv-pathway
91.02 s
[pathway] source root is pathway
91.02 s
[pathway] Phase: patchPhase
91.02 s
[variant] Preprocessing library for variant-1.0.2..
91.02 s
[pathway] Phase: compileBuildDriverPhase
91.02 s
[variant] Running Haddock on library for variant-1.0.2..
91.02 s
[pathway] setupCompileFlags: -package-db=/build/tmp.QV3qnch6ZR/setup-package.conf.d -threaded
91.05 s
[variant] Warning: --source-* options are ignored when --hyperlinked-source is enabled.
91.06 s
[pathway] [1 of 2] Compiling Main ( Setup.hs, /build/tmp.QV3qnch6ZR/Main.o )
91.11 s
[pathway] [2 of 2] Linking Setup
91.35 s
[variant] Warning: 'a' is out of scope.
91.35 s
[variant] If you qualify the identifier, haddock can try to link it anyway.
91.35 s
[variant] Warning: 'l' is out of scope.
91.35 s
[variant] If you qualify the identifier, haddock can try to link it anyway.
91.35 s
[variant] 95% ( 23 / 24) in 'Data.Variant.Types'
91.35 s
[variant] Missing documentation for:
91.36 s
[variant] Module header
91.39 s
[variant] 40% ( 37 / 91) in 'Data.Variant.Functor'
91.39 s
[variant] Missing documentation for:
91.39 s
[variant] BottomUpT (src/lib/Data/Variant/Functor.hs:78)
91.39 s
[variant] BottomUpOrigT (src/lib/Data/Variant/Functor.hs:79)
91.39 s
[variant] TopDownStopT (src/lib/Data/Variant/Functor.hs:80)
91.39 s
[variant] distPara
91.39 s
[variant] distParaT
91.39 s
[variant] distCata
91.39 s
[variant] distAna
91.39 s
[variant] futu
91.39 s
[variant] gfutu
91.39 s
[variant] distFutu
91.39 s
[variant] distGFutu
91.39 s
[variant] zygo
91.39 s
[variant] distZygo
91.39 s
[variant] gzygo
91.39 s
[variant] distZygoT
91.39 s
[variant] gapo
91.39 s
[variant] distApo
91.39 s
[variant] distGApo
91.39 s
[variant] distGApoT
91.39 s
[variant] ghisto
91.39 s
[variant] distHisto
91.39 s
[variant] distGHisto
91.39 s
[variant] chrono
91.39 s
[variant] gchrono
91.39 s
[variant] Algebra (src/lib/Data/Variant/Functor.hs:106)
91.39 s
[variant] CoAlgebra (src/lib/Data/Variant/Functor.hs:107)
91.39 s
[variant] RAlgebra (src/lib/Data/Variant/Functor.hs:108)
91.39 s
[variant] RCoAlgebra (src/lib/Data/Variant/Functor.hs:109)
91.39 s
[variant] ~> (src/lib/Data/Variant/Functor.hs:117)
91.39 s
[variant] NatM (src/lib/Data/Variant/Functor.hs:118)
91.39 s
[variant] HBase (src/lib/Data/Variant/Functor.hs:120)
91.39 s
[variant] HAlgebra (src/lib/Data/Variant/Functor.hs:122)
91.39 s
[variant] HAlgebraM (src/lib/Data/Variant/Functor.hs:123)
91.39 s
[variant] HGAlgebra (src/lib/Data/Variant/Functor.hs:124)
91.39 s
[variant] HGAlgebraM (src/lib/Data/Variant/Functor.hs:125)
91.39 s
[variant] HCoalgebra (src/lib/Data/Variant/Functor.hs:127)
91.39 s
[variant] HCoalgebraM (src/lib/Data/Variant/Functor.hs:128)
91.39 s
[variant] HGCoalgebra (src/lib/Data/Variant/Functor.hs:129)
91.39 s
[variant] HGCoalgebraM (src/lib/Data/Variant/Functor.hs:130)
91.39 s
[variant] HFunctor (src/lib/Data/Variant/Functor.hs:132)
91.39 s
[variant] HFoldable (src/lib/Data/Variant/Functor.hs:135)
91.39 s
[variant] HTraversable (src/lib/Data/Variant/Functor.hs:138)
91.39 s
[variant] HRecursive (src/lib/Data/Variant/Functor.hs:141)
91.39 s
[variant] HCorecursive (src/lib/Data/Variant/Functor.hs:147)
91.39 s
[variant] hhylo (src/lib/Data/Variant/Functor.hs:153)
91.39 s
[variant] hcataM (src/lib/Data/Variant/Functor.hs:156)
91.39 s
[variant] hlambek (src/lib/Data/Variant/Functor.hs:159)
91.39 s
[variant] hpara (src/lib/Data/Variant/Functor.hs:162)
91.39 s
[variant] hparaM (src/lib/Data/Variant/Functor.hs:165)
91.39 s
[variant] hanaM (src/lib/Data/Variant/Functor.hs:168)
91.39 s
[variant] hcolambek (src/lib/Data/Variant/Functor.hs:171)
91.39 s
[variant] hapo (src/lib/Data/Variant/Functor.hs:174)
91.39 s
[variant] hapoM (src/lib/Data/Variant/Functor.hs:180)
91.39 s
[variant] hhyloM (src/lib/Data/Variant/Functor.hs:186)
91.49 s
[variant] 84% ( 16 / 19) in 'Data.Variant.Tuple'
91.49 s
[variant] Missing documentation for:
91.49 s
[variant] TypeReps (src/lib/Data/Variant/Tuple.hs:535)
91.49 s
[variant] TupleTail (src/lib/Data/Variant/Tuple.hs:263)
91.49 s
[variant] TupleCons (src/lib/Data/Variant/Tuple.hs:288)
91.80 s
[variant] 90% ( 10 / 11) in 'Data.Variant.ContFlow'
91.80 s
[variant] Missing documentation for:
91.80 s
[variant] ToMultiCont (src/lib/Data/Variant/ContFlow.hs:78)
92.04 s
[variant] Warning: 'V' is ambiguous. It is defined
92.04 s
[variant] * at src/lib/Data/Variant.hs:635:1
92.04 s
[variant] * at src/lib/Data/Variant.hs:623:1
92.04 s
[variant] You may be able to disambiguate the identifier by qualifying it or
92.04 s
[variant] by specifying the type/value namespace explicitly.
92.04 s
[variant] Defaulting to the one defined at src/lib/Data/Variant.hs:623:1
92.04 s
[variant] Warning: 'variantToTuple' is out of scope.
92.04 s
[variant] If you qualify the identifier, haddock can try to link it anyway.
92.04 s
[variant] Warning: 'variantToHList' is out of scope.
92.04 s
[variant] If you qualify the identifier, haddock can try to link it anyway.
92.04 s
[variant] Warning: 'x' is out of scope.
92.04 s
[variant] If you qualify the identifier, haddock can try to link it anyway.
92.04 s
[variant] Warning: 'xs' is out of scope.
92.04 s
[variant] If you qualify the identifier, haddock can try to link it anyway.
92.05 s
[variant] 84% ( 73 / 86) in 'Data.Variant'
92.05 s
[variant] Missing documentation for:
92.05 s
[variant] ReplaceAll (src/lib/Data/Variant.hs:1325)
92.05 s
[variant] MapVariant (src/lib/Data/Variant.hs:1321)
92.05 s
[variant] AlterVariant (src/lib/Data/Variant.hs:1469)
92.05 s
[variant] TraverseVariant (src/lib/Data/Variant.hs:1510)
92.05 s
[variant] ReduceVariant (src/lib/Data/Variant.hs:1554)
92.05 s
[variant] Flattenable (src/lib/Data/Variant.hs:1660)
92.05 s
[variant] FlattenVariant (src/lib/Data/Variant.hs:1655)
92.05 s
[variant] ExtractM (src/lib/Data/Variant.hs:1684)
92.05 s
[variant] JoinVariant (src/lib/Data/Variant.hs:1688)
92.05 s
[variant] SplitVariant (src/lib/Data/Variant.hs:1128)
92.05 s
[variant] ContVariant (src/lib/Data/Variant.hs:1767)
92.05 s
[variant] liftVariant' (src/lib/Data/Variant.hs:1616)
92.05 s
[variant] PopVariant (src/lib/Data/Variant.hs:1103)
92.36 s
[pathway] Phase: updateAutotoolsGnuConfigScriptsPhase
92.38 s
[pathway] Phase: configurePhase
92.38 s
[pathway] configureFlags: --verbose --prefix=/nix/store/n2c4i080vb4f8m531ghf1a183p8iyxdb-pathway-0.0.1.0 --libdir=$prefix/lib/$compiler/lib --libsubdir=$abi/$libname --docdir=/nix/store/rmcvgnasdhlsx1h5hr025ds4d45651h7-pathway-0.0.1.0-doc/share/doc/pathway-0.0.1.0 --with-gcc=gcc --package-db=/build/tmp.QV3qnch6ZR/package.conf.d --ghc-option=-j16 --ghc-option=+RTS --ghc-option=-A64M --ghc-option=-RTS --enable-library-profiling --profiling-detail=exported-functions --disable-profiling --enable-shared --disable-coverage --enable-static --disable-executable-dynamic --enable-tests --disable-benchmarks --enable-library-vanilla --disable-library-for-ghci --enable-split-sections --enable-library-stripping --enable-executable-stripping --ghc-option=-haddock --ghc-options=-Werror --extra-lib-dirs=/nix/store/pndhkk0l649lm1sj0mxk7cbwq26qd1ra-ncurses-6.6/lib --extra-lib-dirs=/nix/store/0djlg4g0b81w94k3vcaqsxsc2hh4kism-libffi-3.5.2/lib --extra-lib-dirs=/nix/store/md4paia7riiggyrj8p24c7a6vf8w7jz8-elfutils-0.194/lib --extra-lib-dirs=/nix/store/39vv2pf64gd8li48a4hpbhw2crzd8z5p-gmp-with-cxx-6.3.0/lib --extra-lib-dirs=/nix/store/7wwvald8lapkrsr72qanlw8blyn55ifx-numactl-2.0.18/lib --extra-lib-dirs=/nix/store/2djpcnj8a25viv1y24h3mziy1gsy3fc6-ghc-9.6.7/lib
92.39 s
[pathway] Using Parsec parser
92.39 s
[pathway] Configuring pathway-0.0.1.0...
92.78 s
[pathway] Flags chosen: noisy-deprecations=True, verify-no-recursion=False
92.78 s
[pathway] Dependency base >=4.14.0 && <4.15 || >=4.15.0 && <4.16 || >=4.16.0 && <4.17 ||
92.78 s
[pathway] >=4.17.0 && <4.18 || >=4.18.0 && <4.19 || >=4.19.0 && <4.20 || >=4.20.0 &&
92.78 s
[pathway] <4.21 || >=4.21.0 && <4.22 || >=4.22.0 && <4.23: using base-4.18.3.0
92.78 s
[pathway] Dependency containers >=0.6.2 && <0.9: using containers-0.6.7
92.78 s
[pathway] Dependency extra >=1.5 && <1.6 || >=1.7.7 && <1.8 || >=1.8.1 && <1.9: using
92.78 s
[pathway] extra-1.8.1
92.78 s
[pathway] Dependency megaparsec >=9.0.1 && <9.1 || >=9.2.1 && <9.3 || >=9.5.0 && <9.6 ||
92.78 s
[pathway] >=9.7.0 && <9.8 || >=9.8.1 && <9.9: using megaparsec-9.7.0
92.78 s
[pathway] Dependency pathway-internal >=0.0.1 && <0.1: using pathway-internal-0.0.1.0
92.78 s
[pathway] Dependency template-haskell >=2.16.0 && <2.17 || >=2.17.0 && <2.18 || >=2.18.0
92.78 s
[pathway] && <2.19 || >=2.19.0 && <2.20 || >=2.20.0 && <2.21 || >=2.21.0 && <2.22 ||
92.78 s
[pathway] >=2.22.0 && <2.23 || >=2.23.0 && <2.24 || >=2.24.0 && <2.25: using
92.78 s
[pathway] template-haskell-2.20.0.0
92.78 s
[pathway] Dependency text >=1.2.3 && <1.3 || >=2.0.2 && <2.2: using text-2.0.2
92.78 s
[pathway] Dependency yaya >=0.6.2 && <0.7 || >=0.7.0 && <0.8: using yaya-0.6.2.3
92.78 s
[pathway] Dependency yaya-containers >=0.1.2 && <0.2 || >=0.2.0 && <0.3: using
92.78 s
[pathway] yaya-containers-0.1.2.2
92.78 s
[pathway] Dependency yaya-unsafe >=0.4.1 && <0.5 || >=0.5.0 && <0.6: using
92.78 s
[pathway] yaya-unsafe-0.4.1.4
92.78 s
[pathway] Dependency QuickCheck >=2.14.2 && <2.15 || >=2.15.0 && <2.16 || >=2.16.0 &&
92.78 s
[pathway] <2.17 || >=2.17.1 && <2.18 || >=2.18.0 && <2.19: using QuickCheck-2.15.0.1
92.78 s
[pathway] Dependency base >=4.14.0 && <4.15 || >=4.15.0 && <4.16 || >=4.16.0 && <4.17 ||
92.78 s
[pathway] >=4.17.0 && <4.18 || >=4.18.0 && <4.19 || >=4.19.0 && <4.20 || >=4.20.0 &&
92.78 s
[pathway] <4.21 || >=4.21.0 && <4.22 || >=4.22.0 && <4.23: using base-4.18.3.0
92.78 s
[pathway] Dependency doctest >=0.16.3 && <0.17 || >=0.18.1 && <0.19 || >=0.20.1 && <0.21
92.78 s
[pathway] || >=0.21.1 && <0.22 || >=0.22.2 && <0.23 || >=0.24.2 && <0.25 || >=0.25.0 &&
92.78 s
[pathway] <0.26: using doctest-0.24.3
92.78 s
[pathway] Dependency pathway: using pathway-0.0.1.0
92.78 s
[pathway] Dependency pathway-quickcheck >=0.0.1 && <0.1: using
92.78 s
[pathway] pathway-quickcheck-0.0.1.0
93.10 s
[variant] Warning: 'V' is ambiguous. It is defined
93.10 s
[variant] * at src/lib/Data/Variant.hs:635:1
93.10 s
[variant] * at src/lib/Data/Variant.hs:623:1
93.10 s
[variant] You may be able to disambiguate the identifier by qualifying it or
93.10 s
[variant] by specifying the type/value namespace explicitly.
93.10 s
[variant] Defaulting to the one defined at src/lib/Data/Variant.hs:623:1
93.10 s
[variant] 25% ( 1 / 4) in 'Data.Variant.Syntax'
93.10 s
[variant] Missing documentation for:
93.10 s
[variant] >>= (src/lib/Data/Variant/Syntax.hs:99)
93.10 s
[variant] >> (src/lib/Data/Variant/Syntax.hs:104)
93.10 s
[variant] return (src/lib/Data/Variant/Syntax.hs:107)
93.12 s
[variant] Warning: 'V' is ambiguous. It is defined
93.12 s
[variant] * at src/lib/Data/Variant.hs:635:1
93.12 s
[variant] * at src/lib/Data/Variant.hs:623:1
93.12 s
[variant] You may be able to disambiguate the identifier by qualifying it or
93.12 s
[variant] by specifying the type/value namespace explicitly.
93.12 s
[variant] Defaulting to the one defined at src/lib/Data/Variant.hs:623:1
93.12 s
[variant] 93% ( 15 / 16) in 'Data.Variant.VEither'
93.12 s
[variant] Missing documentation for:
93.12 s
[variant] VEitherLift (src/lib/Data/Variant/VEither.hs:253)
93.21 s
[pathway] Source component graph:
93.21 s
[pathway] component lib
93.21 s
[pathway] component test:doctests dependency lib
93.21 s
[pathway] Configured component graph:
93.21 s
[pathway] component pathway-0.0.1.0-5VJXWbvreBAfybP2NROr3
93.21 s
[pathway] include base-4.18.3.0
93.21 s
[pathway] include containers-0.6.7
93.21 s
[pathway] include extra-1.8.1-FU1frm3XcM88A49dBkmtgI
93.21 s
[pathway] include megaparsec-9.7.0-EpAk7LLR2KBGAKafJPbXz1
93.21 s
[pathway] include pathway-internal-0.0.1.0-1xeSc3z2VhRIotiMz9hdL1
93.21 s
[pathway] include template-haskell-2.20.0.0
93.21 s
[pathway] include text-2.0.2
93.21 s
[pathway] include yaya-0.6.2.3-CucPaROGK6cJio5wwZ3WbL
93.21 s
[pathway] include yaya-containers-0.1.2.2-1JrrM1omnOS8uSDEFmQyvA
93.21 s
[pathway] include yaya-unsafe-0.4.1.4-6JqwKKTzglx2DDEO7d29gG
93.21 s
[pathway] component pathway-0.0.1.0-D1KwH7kvj0u879oud07opv-doctests
93.21 s
[pathway] include QuickCheck-2.15.0.1-Kk0tj2w2Kn3JdS4LSBPwSc
93.21 s
[pathway] include base-4.18.3.0
93.21 s
[pathway] include doctest-0.24.3-ACQNy8u8jPjC50l4I3tyiL
93.21 s
[pathway] include pathway-0.0.1.0-5VJXWbvreBAfybP2NROr3
93.21 s
[pathway] include pathway-quickcheck-0.0.1.0-AshRja0hbtA8TMtZAUvD3L
93.21 s
[pathway] Linked component graph:
93.21 s
[pathway] unit pathway-0.0.1.0-5VJXWbvreBAfybP2NROr3
93.21 s
[pathway] include base-4.18.3.0
93.21 s
[pathway] include containers-0.6.7
93.21 s
[pathway] include extra-1.8.1-FU1frm3XcM88A49dBkmtgI
93.21 s
[pathway] include megaparsec-9.7.0-EpAk7LLR2KBGAKafJPbXz1
93.21 s
[pathway] include pathway-internal-0.0.1.0-1xeSc3z2VhRIotiMz9hdL1
93.21 s
[pathway] include template-haskell-2.20.0.0
93.21 s
[pathway] include text-2.0.2
93.21 s
[pathway] include yaya-0.6.2.3-CucPaROGK6cJio5wwZ3WbL
93.21 s
[pathway] include yaya-containers-0.1.2.2-1JrrM1omnOS8uSDEFmQyvA
93.21 s
[pathway] include yaya-unsafe-0.4.1.4-6JqwKKTzglx2DDEO7d29gG
93.21 s
[pathway] Data.Path=pathway-0.0.1.0-5VJXWbvreBAfybP2NROr3:Data.Path,Data.Path.Directory=pathway-0.0.1.0-5VJXWbvreBAfybP2NROr3:Data.Path.Directory,Data.Path.File=pathway-0.0.1.0-5VJXWbvreBAfybP2NROr3:Data.Path.File,Data.Path.Format=pathway-0.0.1.0-5VJXWbvreBAfybP2NROr3:Data.Path.Format,Data.Path.Parser=pathway-0.0.1.0-5VJXWbvreBAfybP2NROr3:Data.Path.Parser,Data.Path.Relativity=pathway-0.0.1.0-5VJXWbvreBAfybP2NROr3:Data.Path.Relativity,Data.Path.TH=pathway-0.0.1.0-5VJXWbvreBAfybP2NROr3:Data.Path.TH,Data.Path.Type=pathway-0.0.1.0-5VJXWbvreBAfybP2NROr3:Data.Path.Type
93.21 s
[pathway] unit pathway-0.0.1.0-D1KwH7kvj0u879oud07opv-doctests
93.21 s
[pathway] include QuickCheck-2.15.0.1-Kk0tj2w2Kn3JdS4LSBPwSc
93.21 s
[pathway] include base-4.18.3.0
93.21 s
[pathway] include doctest-0.24.3-ACQNy8u8jPjC50l4I3tyiL
93.21 s
[pathway] include pathway-0.0.1.0-5VJXWbvreBAfybP2NROr3
93.21 s
[pathway] include pathway-quickcheck-0.0.1.0-AshRja0hbtA8TMtZAUvD3L
93.21 s
[pathway] Ready component graph:
93.21 s
[pathway] definite pathway-0.0.1.0-5VJXWbvreBAfybP2NROr3
93.21 s
[pathway] depends base-4.18.3.0
93.21 s
[pathway] depends containers-0.6.7
93.21 s
[pathway] depends extra-1.8.1-FU1frm3XcM88A49dBkmtgI
93.21 s
[pathway] depends megaparsec-9.7.0-EpAk7LLR2KBGAKafJPbXz1
93.21 s
[pathway] depends pathway-internal-0.0.1.0-1xeSc3z2VhRIotiMz9hdL1
93.21 s
[pathway] depends template-haskell-2.20.0.0
93.21 s
[pathway] depends text-2.0.2
93.21 s
[pathway] depends yaya-0.6.2.3-CucPaROGK6cJio5wwZ3WbL
93.21 s
[pathway] depends yaya-containers-0.1.2.2-1JrrM1omnOS8uSDEFmQyvA
93.21 s
[pathway] depends yaya-unsafe-0.4.1.4-6JqwKKTzglx2DDEO7d29gG
93.21 s
[pathway] definite pathway-0.0.1.0-D1KwH7kvj0u879oud07opv-doctests
93.21 s
[pathway] depends QuickCheck-2.15.0.1-Kk0tj2w2Kn3JdS4LSBPwSc
93.21 s
[pathway] depends base-4.18.3.0
93.21 s
[pathway] depends doctest-0.24.3-ACQNy8u8jPjC50l4I3tyiL
93.21 s
[pathway] depends pathway-0.0.1.0-5VJXWbvreBAfybP2NROr3
93.21 s
[pathway] depends pathway-quickcheck-0.0.1.0-AshRja0hbtA8TMtZAUvD3L
93.21 s
[pathway] Using Cabal-3.10.3.0 compiled by ghc-9.6
93.21 s
[pathway] Using compiler: ghc-9.6.7
93.21 s
[pathway] Using install prefix:
93.21 s
[pathway] /nix/store/n2c4i080vb4f8m531ghf1a183p8iyxdb-pathway-0.0.1.0
93.21 s
[pathway] Executables installed in:
93.21 s
[pathway] /nix/store/n2c4i080vb4f8m531ghf1a183p8iyxdb-pathway-0.0.1.0/bin
93.21 s
[pathway] Libraries installed in:
93.21 s
[pathway] /nix/store/n2c4i080vb4f8m531ghf1a183p8iyxdb-pathway-0.0.1.0/lib/ghc-9.6.7/lib/x86_64-linux-ghc-9.6.7/pathway-0.0.1.0-5VJXWbvreBAfybP2NROr3
93.21 s
[pathway] Dynamic Libraries installed in:
93.21 s
[pathway] /nix/store/n2c4i080vb4f8m531ghf1a183p8iyxdb-pathway-0.0.1.0/lib/ghc-9.6.7/lib/x86_64-linux-ghc-9.6.7
93.21 s
[pathway] Private executables installed in:
93.21 s
[pathway] /nix/store/n2c4i080vb4f8m531ghf1a183p8iyxdb-pathway-0.0.1.0/libexec/x86_64-linux-ghc-9.6.7/pathway-0.0.1.0
93.21 s
[pathway] Data files installed in:
93.21 s
[pathway] /nix/store/n2c4i080vb4f8m531ghf1a183p8iyxdb-pathway-0.0.1.0/share/x86_64-linux-ghc-9.6.7/pathway-0.0.1.0
93.21 s
[pathway] Documentation installed in:
93.21 s
[pathway] /nix/store/rmcvgnasdhlsx1h5hr025ds4d45651h7-pathway-0.0.1.0-doc/share/doc/pathway-0.0.1.0
93.21 s
[pathway] Configuration files installed in:
93.21 s
[pathway] /nix/store/n2c4i080vb4f8m531ghf1a183p8iyxdb-pathway-0.0.1.0/etc
93.21 s
[pathway] No alex found
93.21 s
[pathway] Using ar found on system at:
93.21 s
[pathway] /nix/store/zjraf40s86y3iwhp626b934r5y6ldkbb-binutils-wrapper-2.46/bin/ar
93.21 s
[pathway] No c2hs found
93.21 s
[pathway] No cpphs found
93.21 s
[pathway] Using doctest version 0.24.3 found on system at:
93.21 s
[pathway] /nix/store/s48k56ayjjxwdbz9y7d8mnqwlcjfi1a8-doctest-0.24.3/bin/doctest
93.21 s
[pathway] Using gcc version 15.2.0 given by user at:
93.21 s
[pathway] /nix/store/29qjlshvklnyr67nhpprzgb9igmsfsjj-gcc-wrapper-15.2.0/bin/gcc
93.21 s
[pathway] Using ghc version 9.6.7 found on system at:
93.21 s
[pathway] /nix/store/2djpcnj8a25viv1y24h3mziy1gsy3fc6-ghc-9.6.7/bin/ghc
93.21 s
[pathway] Using ghc-pkg version 9.6.7 found on system at:
93.21 s
[pathway] /nix/store/2djpcnj8a25viv1y24h3mziy1gsy3fc6-ghc-9.6.7/bin/ghc-pkg-9.6.7
93.21 s
[pathway] No ghcjs found
93.21 s
[pathway] No ghcjs-pkg found
93.21 s
[pathway] No greencard found
93.21 s
[pathway] Using haddock version 2.29.2 found on system at:
93.21 s
[pathway] /nix/store/2djpcnj8a25viv1y24h3mziy1gsy3fc6-ghc-9.6.7/bin/haddock-ghc-9.6.7
93.21 s
[pathway] No happy found
93.21 s
[pathway] Using haskell-suite found on system at: haskell-suite-dummy-location
93.21 s
[pathway] Using haskell-suite-pkg found on system at: haskell-suite-pkg-dummy-location
93.21 s
[pathway] No hmake found
93.21 s
[pathway] Using hpc version 0.68 found on system at:
93.21 s
[pathway] /nix/store/2djpcnj8a25viv1y24h3mziy1gsy3fc6-ghc-9.6.7/bin/hpc-ghc-9.6.7
93.21 s
[pathway] Using hsc2hs version 0.68.9 found on system at:
93.21 s
[pathway] /nix/store/2djpcnj8a25viv1y24h3mziy1gsy3fc6-ghc-9.6.7/bin/hsc2hs-ghc-9.6.7
93.21 s
[pathway] Using hscolour version 1.25 found on system at:
93.21 s
[pathway] /nix/store/2x19jxh5g98bv0s06mdj71c1hmxi54yl-hscolour-1.25/bin/HsColour
93.21 s
[pathway] No jhc found
93.21 s
[pathway] Using ld found on system at:
93.21 s
[pathway] /nix/store/zjraf40s86y3iwhp626b934r5y6ldkbb-binutils-wrapper-2.46/bin/ld.gold
93.21 s
[pathway] No pkg-config found
93.21 s
[pathway] Using runghc version 9.6.7 found on system at:
93.21 s
[pathway] /nix/store/2djpcnj8a25viv1y24h3mziy1gsy3fc6-ghc-9.6.7/bin/runghc-9.6.7
93.21 s
[pathway] Using strip version 2.46 found on system at:
93.21 s
[pathway] /nix/store/29qjlshvklnyr67nhpprzgb9igmsfsjj-gcc-wrapper-15.2.0/bin/strip
93.21 s
[pathway] Using tar found on system at:
93.21 s
[pathway] /nix/store/z5mq2sam4484prf3kv6v6vjw1m0i7j24-gnutar-1.35/bin/tar
93.21 s
[pathway] No uhc found
93.25 s
[variant] 84% ( 28 / 33) in 'Data.Variant.Excepts'
93.25 s
[variant] Missing documentation for:
93.25 s
[variant] Excepts (src/lib/Data/Variant/Excepts.hs:145)
93.25 s
[variant] injectExcepts (src/lib/Data/Variant/Excepts.hs:161)
93.25 s
[variant] withExcepts (src/lib/Data/Variant/Excepts.hs:173)
93.25 s
[variant] withExcepts_ (src/lib/Data/Variant/Excepts.hs:166)
93.25 s
[variant] mapExcepts (src/lib/Data/Variant/Excepts.hs:184)
93.28 s
[variant] 65% ( 21 / 32) in 'Data.Variant.VariantF'
93.28 s
[variant] Missing documentation for:
93.28 s
[variant] appendVariantF (src/lib/Data/Variant/VariantF.hs:241)
93.28 s
[variant] prependVariantF (src/lib/Data/Variant/VariantF.hs:246)
93.28 s
[variant] MapVariantF (src/lib/Data/Variant/VariantF.hs:284)
93.28 s
[variant] PopVariantF (src/lib/Data/Variant/VariantF.hs:270)
93.28 s
[variant] SplitVariantF (src/lib/Data/Variant/VariantF.hs:307)
93.28 s
[variant] BottomUpF (src/lib/Data/Variant/VariantF.hs:357)
93.28 s
[variant] BottomUp (src/lib/Data/Variant/VariantF.hs:360)
93.28 s
[variant] BottomUpOrig (src/lib/Data/Variant/VariantF.hs:383)
93.28 s
[variant] BottomUpOrigF (src/lib/Data/Variant/VariantF.hs:380)
93.28 s
[variant] TopDownStop (src/lib/Data/Variant/VariantF.hs:407)
93.28 s
[variant] TopDownStopF (src/lib/Data/Variant/VariantF.hs:404)
93.45 s
[variant] 30% ( 3 / 10) in 'Data.Variant.EGADT'
93.45 s
[variant] Missing documentation for:
93.45 s
[variant] Module header
93.45 s
[variant] HVariantF (src/lib/Data/Variant/EGADT.hs:130)
93.45 s
[variant] toHVariantAt (src/lib/Data/Variant/EGADT.hs:133)
93.45 s
[variant] fromHVariantAt (src/lib/Data/Variant/EGADT.hs:140)
93.45 s
[variant] :<! (src/lib/Data/Variant/EGADT.hs:157)
93.45 s
[variant] MemberAtIndex (src/lib/Data/Variant/EGADT.hs:160)
93.45 s
[variant] :<<! (src/lib/Data/Variant/EGADT.hs:163)
93.45 s
[variant] Warning: 'f' is out of scope.
93.45 s
[variant] If you qualify the identifier, haddock can try to link it anyway.
93.45 s
[variant] Warning: 'xs' is out of scope.
93.45 s
[variant] If you qualify the identifier, haddock can try to link it anyway.
93.45 s
[variant] Warning: 'x' is out of scope.
93.45 s
[variant] If you qualify the identifier, haddock can try to link it anyway.
93.45 s
[variant] 93% ( 14 / 15) in 'Data.Variant.EADT'
93.45 s
[variant] Missing documentation for:
93.45 s
[variant] EADTShow (src/lib/Data/Variant/EADT.hs:182)
93.60 s
[variant] Warning: 'forall' is out of scope.
93.60 s
[variant] If you qualify the identifier, haddock can try to link it anyway.
93.61 s
[variant] 100% ( 5 / 5) in 'Data.Variant.EADT.TH'
93.67 s
[pathway] Phase: buildPhase
93.76 s
[pathway] Preprocessing library for pathway-0.0.1.0..
93.76 s
[pathway] Building library for pathway-0.0.1.0..
93.79 s
[variant] Warning: Data.Variant.Types: could not find link destinations for:
93.79 s
[variant] - Data.Variant.Types.IndexesOf'
93.79 s
[variant] - Data.Variant.Types.MemberAtIndex
93.79 s
[variant] - Data.Variant.Types.MaybeIndexOf'
93.79 s
[variant] - Data.Variant.Types.IndexOf'
93.79 s
[variant] - Data.Variant.Types.Reverse'
93.79 s
[variant] - Data.Variant.Types.Nub'
93.79 s
[variant] - Data.Variant.Types.Product'
93.79 s
[variant] - Data.Variant.Types.Length'
93.79 s
[variant] - Data.Variant.Types.Index'
93.80 s
[variant] Warning: Data.Variant.Tuple: could not find link destinations for:
93.80 s
[variant] - Data.Variant.Tuple.TupleFun
93.81 s
[variant] Warning: Data.Variant: could not find link destinations for:
93.81 s
[variant] - Data.Variant.Types.MemberAtIndex
93.81 s
[variant] - Data.Variant.toFlattenVariant
93.81 s
[variant] - Data.Variant.reduceVariant'
93.81 s
[variant] - Data.Variant.traverseVariant'
93.81 s
[variant] - Data.Variant.alterVariant'
93.81 s
[variant] - Data.Variant.MapVariantIndexes
93.81 s
[variant] - Data.Variant.splitVariant'
93.81 s
[variant] - Data.Variant.ShowTypeList
93.81 s
[variant] - Data.Variant.ShowVariantValue
93.83 s
[variant] Warning: Data.Variant.EADT: could not find link destinations for:
93.83 s
[variant] - Data.Variant.EADT.EADTF'
93.89 s
[pathway] [1 of 8] Compiling Data.Path.Format ( src/Data/Path/Format.hs, dist/build/Data/Path/Format.o, dist/build/Data/Path/Format.dyn_o )
93.99 s
[pathway] [2 of 8] Compiling Data.Path.Relativity ( src/Data/Path/Relativity.hs, dist/build/Data/Path/Relativity.o, dist/build/Data/Path/Relativity.dyn_o )
93.99 s
[pathway] [3 of 8] Compiling Data.Path.Type ( src/Data/Path/Type.hs, dist/build/Data/Path/Type.o, dist/build/Data/Path/Type.dyn_o )
93.99 s
[pathway] [4 of 8] Compiling Data.Path.File ( src/Data/Path/File.hs, dist/build/Data/Path/File.o, dist/build/Data/Path/File.dyn_o )
94.02 s
[pathway] [5 of 8] Compiling Data.Path.Directory ( src/Data/Path/Directory.hs, dist/build/Data/Path/Directory.o, dist/build/Data/Path/Directory.dyn_o )
94.10 s
[pathway] [6 of 8] Compiling Data.Path ( src/Data/Path.hs, dist/build/Data/Path.o, dist/build/Data/Path.dyn_o )
95.29 s
[pathway] [7 of 8] Compiling Data.Path.Parser ( src/Data/Path/Parser.hs, dist/build/Data/Path/Parser.o, dist/build/Data/Path/Parser.dyn_o )
95.47 s
[pathway] [8 of 8] Compiling Data.Path.TH ( src/Data/Path/TH.hs, dist/build/Data/Path/TH.o, dist/build/Data/Path/TH.dyn_o )
95.81 s
[pathway] [1 of 8] Compiling Data.Path.Format ( src/Data/Path/Format.hs, dist/build/Data/Path/Format.p_o )
96.05 s
[pathway] [2 of 8] Compiling Data.Path.Relativity ( src/Data/Path/Relativity.hs, dist/build/Data/Path/Relativity.p_o )
96.05 s
[pathway] [3 of 8] Compiling Data.Path.Type ( src/Data/Path/Type.hs, dist/build/Data/Path/Type.p_o )
96.17 s
[pathway] [4 of 8] Compiling Data.Path.File ( src/Data/Path/File.hs, dist/build/Data/Path/File.p_o )
96.27 s
[pathway] [5 of 8] Compiling Data.Path.Directory ( src/Data/Path/Directory.hs, dist/build/Data/Path/Directory.p_o )
96.28 s
[pathway] [6 of 8] Compiling Data.Path ( src/Data/Path.hs, dist/build/Data/Path.p_o )
96.83 s
[variant] Documentation created: dist/doc/html/variant/,
96.83 s
[variant] dist/doc/html/variant/variant.txt
96.89 s
[variant] Preprocessing test suite 'tests' for variant-1.0.2..
96.91 s
[variant] Phase: installPhase
97.00 s
[variant] Installing library in /nix/store/s6hpyhz1yhlx8nsfhs74gfj3yaggpch4-variant-1.0.2/lib/ghc-9.6.7/lib/x86_64-linux-ghc-9.6.7/variant-1.0.2-5mfzNb7m7hb5BmRsuehY4I
97.45 s
[variant] Phase: fixupPhase
97.47 s
[variant] shrinking RPATHs of ELF executables and libraries in /nix/store/s6hpyhz1yhlx8nsfhs74gfj3yaggpch4-variant-1.0.2
97.48 s
[pathway] [7 of 8] Compiling Data.Path.Parser ( src/Data/Path/Parser.hs, dist/build/Data/Path/Parser.p_o )
97.48 s
[variant] shrinking /nix/store/s6hpyhz1yhlx8nsfhs74gfj3yaggpch4-variant-1.0.2/lib/ghc-9.6.7/lib/x86_64-linux-ghc-9.6.7/libHSvariant-1.0.2-5mfzNb7m7hb5BmRsuehY4I-ghc9.6.7.so
97.49 s
[variant] checking for references to /build/ in /nix/store/s6hpyhz1yhlx8nsfhs74gfj3yaggpch4-variant-1.0.2...
97.53 s
[variant] patching script interpreter paths in /nix/store/s6hpyhz1yhlx8nsfhs74gfj3yaggpch4-variant-1.0.2
97.54 s
[variant] stripping (with command strip and flags -S -p) in /nix/store/s6hpyhz1yhlx8nsfhs74gfj3yaggpch4-variant-1.0.2/lib
97.67 s
[variant] shrinking RPATHs of ELF executables and libraries in /nix/store/2cvmww7s971xlggklxl415wbq1iq3iqb-variant-1.0.2-doc
97.69 s
[variant] checking for references to /build/ in /nix/store/2cvmww7s971xlggklxl415wbq1iq3iqb-variant-1.0.2-doc...
97.71 s
[variant] patching script interpreter paths in /nix/store/2cvmww7s971xlggklxl415wbq1iq3iqb-variant-1.0.2-doc
97.82 s
[variant:post-build] Uploading to cachix cache "sellout": /nix/store/2cvmww7s971xlggklxl415wbq1iq3iqb-variant-1.0.2-doc /nix/store/s6hpyhz1yhlx8nsfhs74gfj3yaggpch4-variant-1.0.2
98.66 s
[variant:post-build] Pushing 2 paths (112 are already present) using zstd to cache sellout ⏳
98.66 s
[variant:post-build]
99.19 s
[variant:post-build] Pushing /nix/store/s6hpyhz1yhlx8nsfhs74gfj3yaggpch4-variant-1.0.2 (11.04 MiB)
99.27 s
[variant:post-build] Pushing /nix/store/2cvmww7s971xlggklxl415wbq1iq3iqb-variant-1.0.2-doc (4.53 MiB)
101.09 s
[variant:post-build]
101.14 s
[variant:post-build] All done.
101.14 s
[variant:post-build] Uploading to the NixCI cache: /nix/store/2cvmww7s971xlggklxl415wbq1iq3iqb-variant-1.0.2-doc /nix/store/s6hpyhz1yhlx8nsfhs74gfj3yaggpch4-variant-1.0.2
101.15 s
[variant:post-build] warning: 'warn-short-path-literals' is deprecated, use 'lint-short-path-literals = ignore' instead
101.40 s
[variant:post-build] copying 2 paths...
101.40 s
[variant:post-build] copying path '/nix/store/2cvmww7s971xlggklxl415wbq1iq3iqb-variant-1.0.2-doc' to 'https://cache.nix-ci.com'...
102.29 s
[variant:post-build] copying path '/nix/store/s6hpyhz1yhlx8nsfhs74gfj3yaggpch4-variant-1.0.2' to 'https://cache.nix-ci.com'...
104.44 s
[variant:post-build] warning: 'warn-short-path-literals' is deprecated, use 'lint-short-path-literals = ignore' instead
104.76 s
[variant:post-build] copying 1 paths...
104.76 s
[variant:post-build] copying path '/nix/store/754j7c1fspxqaj8iy1z4k9dkdngr7abl-variant-1.0.2.drv' to 'https://cache.nix-ci.com'...
105.04 s
Uploaded variant in 7.2s
105.04 s
Progress: 4 of 23 built (1 building), 164 of 164 downloaded from cache
105.04 s
Built variant in 29.6s
105.05 s
[pathway] [8 of 8] Compiling Data.Path.TH ( src/Data/Path/TH.hs, dist/build/Data/Path/TH.p_o )
105.05 s
[pathway] Preprocessing test suite 'doctests' for pathway-0.0.1.0..
105.05 s
[pathway] Building test suite 'doctests' for pathway-0.0.1.0..
105.05 s
[pathway] [1 of 2] Compiling Build_doctests ( dist/build/doctests/autogen/Build_doctests.hs, dist/build/doctests/doctests-tmp/Build_doctests.o )
105.05 s
[pathway] [2 of 2] Compiling Main ( tests/doctests.hs, dist/build/doctests/doctests-tmp/Main.o )
105.05 s
[pathway] [3 of 3] Linking dist/build/doctests/doctests
105.05 s
[pathway] Phase: checkPhase
105.05 s
[pathway] Running 1 test suites...
105.05 s
[pathway] Test suite doctests: RUNNING...
105.05 s
[pathway]
105.05 s
[pathway] on the commandline: warning:
105.05 s
[pathway] -XTemplateHaskell is not allowed in Safe Haskell; ignoring -XTemplateHaskell
105.05 s
[pathway]
105.05 s
[pathway] on the commandline: warning:
105.05 s
[pathway] -XTemplateHaskell is not allowed in Safe Haskell; ignoring -XTemplateHaskell
105.05 s
[pathway]
105.05 s
[pathway] on the commandline: warning:
105.05 s
[pathway] -XTemplateHaskell is not allowed in Safe Haskell; ignoring -XTemplateHaskell
105.05 s
[pathway]
105.05 s
[pathway] on the commandline: warning:
105.05 s
[pathway] -XTemplateHaskell is not allowed in Safe Haskell; ignoring -XTemplateHaskell
105.05 s
[pathway]
105.05 s
[pathway] on the commandline: warning:
105.05 s
[pathway] -XTemplateHaskell is not allowed in Safe Haskell; ignoring -XTemplateHaskell
105.05 s
[pathway]
105.05 s
[pathway] on the commandline: warning:
105.05 s
[pathway] -XTemplateHaskell is not allowed in Safe Haskell; ignoring -XTemplateHaskell
105.05 s
[pathway]
105.05 s
[pathway] on the commandline: warning:
105.05 s
[pathway] -XTemplateHaskell is not allowed in Safe Haskell; ignoring -XTemplateHaskell
105.05 s
[pathway]
105.05 s
[pathway] on the commandline: warning:
105.05 s
[pathway] -XTemplateHaskell is not allowed in Safe Haskell; ignoring -XTemplateHaskell
105.05 s
[pathway]
105.05 s
[pathway] on the commandline: warning:
105.05 s
[pathway] -XTemplateHaskell is not allowed in Safe Haskell; ignoring -XTemplateHaskell
105.05 s
[pathway]
105.05 s
[pathway] on the commandline: warning:
105.05 s
[pathway] -XTemplateHaskell is not allowed in Safe Haskell; ignoring -XTemplateHaskell
105.05 s
[pathway]
105.05 s
[pathway] on the commandline: warning:
105.05 s
[pathway] -XTemplateHaskell is not allowed in Safe Haskell; ignoring -XTemplateHaskell
105.59 s
[pathway] Examples: 53 Tried: 53 Errors: 0 Failures: 0
105.65 s
[pathway] Test suite doctests: PASS
105.65 s
[pathway] Test suite logged to: dist/test/pathway-0.0.1.0-doctests.log
105.65 s
[pathway] 1 of 1 test suites (1 of 1 test cases) passed.
105.67 s
[pathway] Phase: haddockPhase
105.82 s
[pathway] Preprocessing library for pathway-0.0.1.0..
105.82 s
[pathway] Running Haddock on library for pathway-0.0.1.0..
105.82 s
[pathway] Warning: The documentation for the following packages are not installed. No
105.82 s
[pathway] links will be generated to these packages: vector-0.13.2.0
105.87 s
[pathway] Warning: --source-* options are ignored when --hyperlinked-source is enabled.
106.03 s
[pathway] 50% ( 1 / 2) in 'Data.Path.Type'
106.04 s
[pathway] Missing documentation for:
106.04 s
[pathway] Module header
106.04 s
[pathway] 50% ( 1 / 2) in 'Data.Path.Relativity'
106.04 s
[pathway] Missing documentation for:
106.04 s
[pathway] Module header
106.06 s
[pathway] 20% ( 1 / 5) in 'Data.Path.Format'
106.06 s
[pathway] Missing documentation for:
106.06 s
[pathway] Module header
106.06 s
[pathway] Format (src/Data/Path/Format.hs:25)
106.06 s
[pathway] posix (src/Data/Path/Format.hs:37)
106.06 s
[pathway] windows (src/Data/Path/Format.hs:47)
106.10 s
[pathway] 0% ( 0 / 3) in 'Data.Path.File'
106.10 s
[pathway] Missing documentation for:
106.10 s
[pathway] Module header
106.10 s
[pathway] basename (src/Data/Path/File.hs:20)
106.17 s
[pathway] directory (src/Data/Path/File.hs:23)
106.17 s
[pathway] Warning: '<$>' is out of scope.
106.17 s
[pathway] If you qualify the identifier, haddock can try to link it anyway.
106.17 s
[pathway] 36% ( 4 / 11) in 'Data.Path.Directory'
106.17 s
[pathway] Missing documentation for:
106.17 s
[pathway] Module header
106.17 s
[pathway] isCurrent (src/Data/Path/Directory.hs:93)
106.17 s
[pathway] root (src/Data/Path/Directory.hs:104)
106.17 s
[pathway] isRoot (src/Data/Path/Directory.hs:107)
106.17 s
[pathway] descendThrough (src/Data/Path/Directory.hs:96)
106.17 s
[pathway] descendTo (src/Data/Path/Directory.hs:100)
106.17 s
[pathway] selectFile (src/Data/Path/Directory.hs:110)
106.31 s
[pathway] Warning: 'None' is out of scope.
106.31 s
[pathway] If you qualify the identifier, haddock can try to link it anyway.
106.31 s
[pathway] Warning: '../' is out of scope.
106.31 s
[pathway] If you qualify the identifier, haddock can try to link it anyway.
106.31 s
[pathway] 55% ( 16 / 29) in 'Data.Path'
106.31 s
[pathway] Missing documentation for:
106.31 s
[pathway] Anchored (src/Data/Path.hs:660)
106.31 s
[pathway] Filename
106.31 s
[pathway] Pathy (src/Data/Path.hs:203)
106.31 s
[pathway] RelOps (src/Data/Path.hs:227)
106.31 s
[pathway] Relative (src/Data/Path.hs:174)
106.31 s
[pathway] Substible (src/Data/Path.hs:608)
106.31 s
[pathway] Typey (src/Data/Path.hs:190)
106.31 s
[pathway] escapeComponent (src/Data/Path.hs:622)
106.31 s
[pathway] forgetRelativity (src/Data/Path.hs:732)
106.31 s
[pathway] forgetType (src/Data/Path.hs:735)
106.31 s
[pathway] reparent (src/Data/Path.hs:381)
106.31 s
[pathway] replace (src/Data/Path.hs:609)
106.31 s
[pathway] strengthen (src/Data/Path.hs:655)
106.44 s
[pathway] Warning: 'parse' is out of scope.
106.44 s
[pathway] If you qualify the identifier, haddock can try to link it anyway.
106.44 s
[pathway] Warning: 'local' is out of scope.
106.44 s
[pathway] If you qualify the identifier, haddock can try to link it anyway.
106.44 s
[pathway] 100% ( 3 / 3) in 'Data.Path.Parser'
106.47 s
[pathway] Warning: 'IsString' is out of scope.
106.47 s
[pathway] If you qualify the identifier, haddock can try to link it anyway.
106.47 s
[pathway] 50% ( 2 / 4) in 'Data.Path.TH'
106.47 s
[pathway] Missing documentation for:
106.47 s
[pathway] Module header
106.47 s
[pathway] path (src/Data/Path/TH.hs:81)
106.65 s
[pathway] Warning: Data.Path: could not find link destinations for:
106.65 s
[pathway] - Data.Path.Routable
106.65 s
[pathway] - Data.Path.generalizeType
106.65 s
[pathway] - Data.Path.generalizeRelativity
106.65 s
[pathway] Warning: Data.Path.Parser: could not find link destinations for:
106.65 s
[pathway] - Data.Path.Parser.anchor
110.08 s
[pathway] Documentation created: dist/doc/html/pathway/,
110.08 s
[pathway] dist/doc/html/pathway/pathway.txt
110.13 s
[pathway] Preprocessing test suite 'doctests' for pathway-0.0.1.0..
110.14 s
[pathway] Phase: installPhase
110.22 s
[pathway] Installing library in /nix/store/n2c4i080vb4f8m531ghf1a183p8iyxdb-pathway-0.0.1.0/lib/ghc-9.6.7/lib/x86_64-linux-ghc-9.6.7/pathway-0.0.1.0-5VJXWbvreBAfybP2NROr3
110.56 s
[pathway] Phase: fixupPhase
110.58 s
[pathway] shrinking RPATHs of ELF executables and libraries in /nix/store/n2c4i080vb4f8m531ghf1a183p8iyxdb-pathway-0.0.1.0
110.59 s
[pathway] shrinking /nix/store/n2c4i080vb4f8m531ghf1a183p8iyxdb-pathway-0.0.1.0/lib/ghc-9.6.7/lib/x86_64-linux-ghc-9.6.7/libHSpathway-0.0.1.0-5VJXWbvreBAfybP2NROr3-ghc9.6.7.so
110.61 s
[pathway] checking for references to /build/ in /nix/store/n2c4i080vb4f8m531ghf1a183p8iyxdb-pathway-0.0.1.0...
110.64 s
[pathway] patching script interpreter paths in /nix/store/n2c4i080vb4f8m531ghf1a183p8iyxdb-pathway-0.0.1.0
110.64 s
[pathway] stripping (with command strip and flags -S -p) in /nix/store/n2c4i080vb4f8m531ghf1a183p8iyxdb-pathway-0.0.1.0/lib
110.73 s
[pathway] shrinking RPATHs of ELF executables and libraries in /nix/store/rmcvgnasdhlsx1h5hr025ds4d45651h7-pathway-0.0.1.0-doc
110.74 s
[pathway] checking for references to /build/ in /nix/store/rmcvgnasdhlsx1h5hr025ds4d45651h7-pathway-0.0.1.0-doc...
110.76 s
[pathway] patching script interpreter paths in /nix/store/rmcvgnasdhlsx1h5hr025ds4d45651h7-pathway-0.0.1.0-doc
110.86 s
[pathway:post-build] Uploading to cachix cache "sellout": /nix/store/n2c4i080vb4f8m531ghf1a183p8iyxdb-pathway-0.0.1.0 /nix/store/rmcvgnasdhlsx1h5hr025ds4d45651h7-pathway-0.0.1.0-doc
112.84 s
[pathway:post-build] Pushing 2 paths (176 are already present) using zstd to cache sellout ⏳
112.84 s
[pathway:post-build]
113.92 s
[pathway:post-build] Pushing /nix/store/n2c4i080vb4f8m531ghf1a183p8iyxdb-pathway-0.0.1.0 (2.69 MiB)
113.99 s
[pathway:post-build] Pushing /nix/store/rmcvgnasdhlsx1h5hr025ds4d45651h7-pathway-0.0.1.0-doc (1.31 MiB)
115.96 s
[pathway:post-build]
115.96 s
[pathway:post-build] All done.
115.98 s
[pathway:post-build] Uploading to the NixCI cache: /nix/store/n2c4i080vb4f8m531ghf1a183p8iyxdb-pathway-0.0.1.0 /nix/store/rmcvgnasdhlsx1h5hr025ds4d45651h7-pathway-0.0.1.0-doc
116.02 s
[pathway:post-build] warning: 'warn-short-path-literals' is deprecated, use 'lint-short-path-literals = ignore' instead
116.04 s
[pathway:post-build] copying 2 paths...
116.04 s
[pathway:post-build] copying path '/nix/store/rmcvgnasdhlsx1h5hr025ds4d45651h7-pathway-0.0.1.0-doc' to 'https://cache.nix-ci.com'...
116.66 s
[pathway:post-build] copying path '/nix/store/n2c4i080vb4f8m531ghf1a183p8iyxdb-pathway-0.0.1.0' to 'https://cache.nix-ci.com'...
117.82 s
[pathway:post-build] warning: 'warn-short-path-literals' is deprecated, use 'lint-short-path-literals = ignore' instead
118.12 s
[pathway:post-build] copying 1 paths...
118.12 s
[pathway:post-build] copying path '/nix/store/637ggyh20kxdjvvmz5y584504iswaad7-pathway-0.0.1.0.drv' to 'https://cache.nix-ci.com'...
118.40 s
Uploaded pathway in 7.5s
118.40 s
Progress: 5 of 23 built, 164 of 164 downloaded from cache
118.40 s
Built pathway in 28.0s
118.45 s
Building /nix/store/i2i51zcdhkj5dda2sw64pbjnxc51rx15-pathway-compat-base-0.0.1.0.drv
118.48 s
Building /nix/store/1a1zhdpxrnvrqjv9cb62ab7sqgp68aya-pathway-path-0.0.1.0.drv
118.63 s
[pathway-compat-base] Phase: setupCompilerEnvironmentPhase
118.64 s
[pathway-compat-base] Build with /nix/store/2djpcnj8a25viv1y24h3mziy1gsy3fc6-ghc-9.6.7.
118.70 s
[pathway-path] Phase: setupCompilerEnvironmentPhase
118.71 s
[pathway-path] Build with /nix/store/2djpcnj8a25viv1y24h3mziy1gsy3fc6-ghc-9.6.7.
118.96 s
[pathway-compat-base] Phase: unpackPhase
118.96 s
[pathway-compat-base] unpacking source archive /nix/store/jp1y9x3k1hawidjahld0khzrh2cvz0r5-base
119.01 s
[pathway-compat-base] source root is base
119.01 s
[pathway-compat-base] Phase: patchPhase
119.01 s
[pathway-compat-base] Phase: compileBuildDriverPhase
119.01 s
[pathway-compat-base] setupCompileFlags: -package-db=/build/tmp.OEU0n89ra8/setup-package.conf.d -threaded
119.04 s
[pathway-compat-base] [1 of 2] Compiling Main ( Setup.hs, /build/tmp.OEU0n89ra8/Main.o )
119.10 s
[pathway-compat-base] [2 of 2] Linking Setup
119.10 s
[pathway-path] Phase: unpackPhase
119.10 s
[pathway-path] unpacking source archive /nix/store/dcipmpfk1s5nwm3262d98w9iys6pr502-path
119.11 s
[pathway-path] source root is path
119.12 s
[pathway-path] Phase: patchPhase
119.13 s
[pathway-path] Phase: compileBuildDriverPhase
119.14 s
[pathway-path] setupCompileFlags: -package-db=/build/tmp.25vli1fh3J/setup-package.conf.d -threaded
119.19 s
[pathway-path] [1 of 2] Compiling Main ( Setup.hs, /build/tmp.25vli1fh3J/Main.o )
119.24 s
[pathway-path] [2 of 2] Linking Setup
120.29 s
[pathway-compat-base] Phase: updateAutotoolsGnuConfigScriptsPhase
120.31 s
[pathway-compat-base] Phase: configurePhase
120.31 s
[pathway-compat-base] configureFlags: --verbose --prefix=/nix/store/z78mi47kq8pq7r41r4x4hlrfnjdp1ah2-pathway-compat-base-0.0.1.0 --libdir=$prefix/lib/$compiler/lib --libsubdir=$abi/$libname --docdir=/nix/store/nbcy4fh8968i75x5bzlmrdxvb3hnk0ng-pathway-compat-base-0.0.1.0-doc/share/doc/pathway-compat-base-0.0.1.0 --with-gcc=gcc --package-db=/build/tmp.OEU0n89ra8/package.conf.d --ghc-option=-j16 --ghc-option=+RTS --ghc-option=-A64M --ghc-option=-RTS --enable-library-profiling --profiling-detail=exported-functions --disable-profiling --enable-shared --disable-coverage --enable-static --disable-executable-dynamic --enable-tests --disable-benchmarks --enable-library-vanilla --disable-library-for-ghci --enable-split-sections --enable-library-stripping --enable-executable-stripping --ghc-option=-haddock --ghc-options=-Werror --extra-lib-dirs=/nix/store/pndhkk0l649lm1sj0mxk7cbwq26qd1ra-ncurses-6.6/lib --extra-lib-dirs=/nix/store/0djlg4g0b81w94k3vcaqsxsc2hh4kism-libffi-3.5.2/lib --extra-lib-dirs=/nix/store/md4paia7riiggyrj8p24c7a6vf8w7jz8-elfutils-0.194/lib --extra-lib-dirs=/nix/store/39vv2pf64gd8li48a4hpbhw2crzd8z5p-gmp-with-cxx-6.3.0/lib --extra-lib-dirs=/nix/store/7wwvald8lapkrsr72qanlw8blyn55ifx-numactl-2.0.18/lib --extra-lib-dirs=/nix/store/2djpcnj8a25viv1y24h3mziy1gsy3fc6-ghc-9.6.7/lib
120.32 s
[pathway-compat-base] Using Parsec parser
120.32 s
[pathway-compat-base] Configuring pathway-compat-base-0.0.1.0...
120.44 s
[pathway-path] Phase: updateAutotoolsGnuConfigScriptsPhase
120.46 s
[pathway-path] Phase: configurePhase
120.46 s
[pathway-path] configureFlags: --verbose --prefix=/nix/store/j4xi61dicaq36akl1fdhmsrz1dmylp5r-pathway-path-0.0.1.0 --libdir=$prefix/lib/$compiler/lib --libsubdir=$abi/$libname --docdir=/nix/store/z2mj3fsbq710z7q8pms9i5ylna4f647i-pathway-path-0.0.1.0-doc/share/doc/pathway-path-0.0.1.0 --with-gcc=gcc --package-db=/build/tmp.25vli1fh3J/package.conf.d --ghc-option=-j16 --ghc-option=+RTS --ghc-option=-A64M --ghc-option=-RTS --enable-library-profiling --profiling-detail=exported-functions --disable-profiling --enable-shared --disable-coverage --enable-static --disable-executable-dynamic --enable-tests --disable-benchmarks --enable-library-vanilla --disable-library-for-ghci --enable-split-sections --enable-library-stripping --enable-executable-stripping --ghc-option=-haddock --ghc-options=-Werror --extra-lib-dirs=/nix/store/pndhkk0l649lm1sj0mxk7cbwq26qd1ra-ncurses-6.6/lib --extra-lib-dirs=/nix/store/0djlg4g0b81w94k3vcaqsxsc2hh4kism-libffi-3.5.2/lib --extra-lib-dirs=/nix/store/md4paia7riiggyrj8p24c7a6vf8w7jz8-elfutils-0.194/lib --extra-lib-dirs=/nix/store/39vv2pf64gd8li48a4hpbhw2crzd8z5p-gmp-with-cxx-6.3.0/lib --extra-lib-dirs=/nix/store/7wwvald8lapkrsr72qanlw8blyn55ifx-numactl-2.0.18/lib --extra-lib-dirs=/nix/store/2djpcnj8a25viv1y24h3mziy1gsy3fc6-ghc-9.6.7/lib
120.47 s
[pathway-path] Using Parsec parser
120.47 s
[pathway-path] Configuring pathway-path-0.0.1.0...
120.69 s
[pathway-compat-base] Flags chosen: noisy-deprecations=True, verify-no-recursion=False
120.69 s
[pathway-compat-base] Dependency base >=4.14.0 && <4.15 || >=4.15.0 && <4.16 || >=4.16.0 && <4.17 ||
120.69 s
[pathway-compat-base] >=4.17.0 && <4.18 || >=4.18.0 && <4.19 || >=4.19.0 && <4.20 || >=4.20.0 &&
120.69 s
[pathway-compat-base] <4.21 || >=4.21.0 && <4.22 || >=4.22.0 && <4.23: using base-4.18.3.0
120.69 s
[pathway-compat-base] Dependency exceptions: using exceptions-0.10.7
120.69 s
[pathway-compat-base] Dependency megaparsec >=9.0.1 && <9.1 || >=9.2.1 && <9.3 || >=9.5.0 && <9.6 ||
120.69 s
[pathway-compat-base] >=9.7.0 && <9.8: using megaparsec-9.7.0
120.69 s
[pathway-compat-base] Dependency pathway >=0.0.1 && <0.1: using pathway-0.0.1.0
120.69 s
[pathway-compat-base] Dependency variant: using variant-1.0.2
120.69 s
[pathway-compat-base] Dependency base >=4.14.0 && <4.15 || >=4.15.0 && <4.16 || >=4.16.0 && <4.17 ||
120.69 s
[pathway-compat-base] >=4.17.0 && <4.18 || >=4.18.0 && <4.19 || >=4.19.0 && <4.20 || >=4.20.0 &&
120.69 s
[pathway-compat-base] <4.21 || >=4.21.0 && <4.22 || >=4.22.0 && <4.23: using base-4.18.3.0
120.69 s
[pathway-compat-base] Dependency doctest >=0.16.3 && <0.17 || >=0.18.1 && <0.19 || >=0.20.1 && <0.21
120.69 s
[pathway-compat-base] || >=0.21.1 && <0.22 || >=0.22.2 && <0.23 || >=0.24.2 && <0.25: using
120.69 s
[pathway-compat-base] doctest-0.24.3
120.69 s
[pathway-compat-base] Dependency pathway-compat-base: using pathway-compat-base-0.0.1.0
120.85 s
[pathway-path] Flags chosen: noisy-deprecations=True, verify-no-recursion=False
120.85 s
[pathway-path] Dependency base >=4.14.0 && <4.15 || >=4.15.0 && <4.16 || >=4.16.0 && <4.17 ||
120.85 s
[pathway-path] >=4.17.0 && <4.18 || >=4.18.0 && <4.19 || >=4.19.0 && <4.20 || >=4.20.0 &&
120.85 s
[pathway-path] <4.21 || >=4.21.0 && <4.22 || >=4.22.0 && <4.23: using base-4.18.3.0
120.85 s
[pathway-path] Dependency filepath >=1.4.2 && <1.5 || >=1.5.2 && <1.6: using
120.85 s
[pathway-path] filepath-1.4.301.0
120.85 s
[pathway-path] Dependency path >=0.9.0 && <0.10: using path-0.9.6
120.85 s
[pathway-path] Dependency pathway >=0.0.1 && <0.1: using pathway-0.0.1.0
120.85 s
[pathway-path] Dependency pathway-internal >=0.0.1 && <0.1: using pathway-internal-0.0.1.0
120.85 s
[pathway-path] Dependency yaya >=0.6.2 && <0.7 || >=0.7.0 && <0.8: using yaya-0.6.2.3
120.85 s
[pathway-path] Dependency yaya-unsafe >=0.4.1 && <0.5 || >=0.5.0 && <0.6: using
120.85 s
[pathway-path] yaya-unsafe-0.4.1.4
120.85 s
[pathway-path] Dependency QuickCheck >=2.14.2 && <2.15 || >=2.15.0 && <2.16 || >=2.16.0 &&
120.85 s
[pathway-path] <2.17 || >=2.17.1 && <2.18 || >=2.18.0 && <2.19: using QuickCheck-2.15.0.1
120.85 s
[pathway-path] Dependency base >=4.14.0 && <4.15 || >=4.15.0 && <4.16 || >=4.16.0 && <4.17 ||
120.85 s
[pathway-path] >=4.17.0 && <4.18 || >=4.18.0 && <4.19 || >=4.19.0 && <4.20 || >=4.20.0 &&
120.85 s
[pathway-path] <4.21 || >=4.21.0 && <4.22 || >=4.22.0 && <4.23: using base-4.18.3.0
120.85 s
[pathway-path] Dependency doctest >=0.16.3 && <0.17 || >=0.18.1 && <0.19 || >=0.20.1 && <0.21
120.85 s
[pathway-path] || >=0.21.1 && <0.22 || >=0.22.2 && <0.23 || >=0.24.2 && <0.25 || >=0.25.0 &&
120.85 s
[pathway-path] <0.26: using doctest-0.24.3
120.85 s
[pathway-path] Dependency pathway-path: using pathway-path-0.0.1.0
120.85 s
[pathway-path] Dependency pathway-quickcheck >=0.0.1 && <0.1: using
120.85 s
[pathway-path] pathway-quickcheck-0.0.1.0
121.07 s
[pathway-compat-base] Source component graph:
121.07 s
[pathway-compat-base] component lib
121.07 s
[pathway-compat-base] component test:doctests dependency lib
121.07 s
[pathway-compat-base] Configured component graph:
121.07 s
[pathway-compat-base] component pathway-compat-base-0.0.1.0-E02izPYkwmmGdAPlQBKjbP
121.07 s
[pathway-compat-base] include base-4.18.3.0
121.07 s
[pathway-compat-base] include exceptions-0.10.7
121.07 s
[pathway-compat-base] include megaparsec-9.7.0-EpAk7LLR2KBGAKafJPbXz1
121.07 s
[pathway-compat-base] include pathway-0.0.1.0-5VJXWbvreBAfybP2NROr3
121.07 s
[pathway-compat-base] include variant-1.0.2-5mfzNb7m7hb5BmRsuehY4I
121.07 s
[pathway-compat-base] component pathway-compat-base-0.0.1.0-SkQnKen4bt6IgQL39Z6Bu-doctests
121.07 s
[pathway-compat-base] include base-4.18.3.0
121.07 s
[pathway-compat-base] include doctest-0.24.3-ACQNy8u8jPjC50l4I3tyiL
121.07 s
[pathway-compat-base] include pathway-compat-base-0.0.1.0-E02izPYkwmmGdAPlQBKjbP
121.07 s
[pathway-compat-base] Linked component graph:
121.07 s
[pathway-compat-base] unit pathway-compat-base-0.0.1.0-E02izPYkwmmGdAPlQBKjbP
121.07 s
[pathway-compat-base] include base-4.18.3.0
121.07 s
[pathway-compat-base] include exceptions-0.10.7
121.07 s
[pathway-compat-base] include megaparsec-9.7.0-EpAk7LLR2KBGAKafJPbXz1
121.07 s
[pathway-compat-base] include pathway-0.0.1.0-5VJXWbvreBAfybP2NROr3
121.07 s
[pathway-compat-base] include variant-1.0.2-5mfzNb7m7hb5BmRsuehY4I
121.07 s
[pathway-compat-base] Common=pathway-compat-base-0.0.1.0-E02izPYkwmmGdAPlQBKjbP:Common,System.Environment.DropIn=pathway-compat-base-0.0.1.0-E02izPYkwmmGdAPlQBKjbP:System.Environment.DropIn,System.Environment.Overlay=pathway-compat-base-0.0.1.0-E02izPYkwmmGdAPlQBKjbP:System.Environment.Overlay,System.Environment.Pathway=pathway-compat-base-0.0.1.0-E02izPYkwmmGdAPlQBKjbP:System.Environment.Pathway,System.Environment.Thin=pathway-compat-base-0.0.1.0-E02izPYkwmmGdAPlQBKjbP:System.Environment.Thin,System.IO.Caught=pathway-compat-base-0.0.1.0-E02izPYkwmmGdAPlQBKjbP:System.IO.Caught,System.IO.DropIn=pathway-compat-base-0.0.1.0-E02izPYkwmmGdAPlQBKjbP:System.IO.DropIn,System.IO.Error.Caught=pathway-compat-base-0.0.1.0-E02izPYkwmmGdAPlQBKjbP:System.IO.Error.Caught,System.IO.Error.DropIn=pathway-compat-base-0.0.1.0-E02izPYkwmmGdAPlQBKjbP:System.IO.Error.DropIn,System.IO.Error.Overlay=pathway-compat-base-0.0.1.0-E02izPYkwmmGdAPlQBKjbP:System.IO.Error.Overlay,System.IO.Error.Pathway=pathway-compat-base-0.0.1.0-E02izPYkwmmGdAPlQBKjbP:System.IO.Error.Pathway,System.IO.Error.Thin=pathway-compat-base-0.0.1.0-E02izPYkwmmGdAPlQBKjbP:System.IO.Error.Thin,System.IO.Overlay=pathway-compat-base-0.0.1.0-E02izPYkwmmGdAPlQBKjbP:System.IO.Overlay,System.IO.Pathway=pathway-compat-base-0.0.1.0-E02izPYkwmmGdAPlQBKjbP:System.IO.Pathway,System.IO.Thin=pathway-compat-base-0.0.1.0-E02izPYkwmmGdAPlQBKjbP:System.IO.Thin
121.07 s
[pathway-compat-base] unit pathway-compat-base-0.0.1.0-SkQnKen4bt6IgQL39Z6Bu-doctests
121.07 s
[pathway-compat-base] include base-4.18.3.0
121.07 s
[pathway-compat-base] include doctest-0.24.3-ACQNy8u8jPjC50l4I3tyiL
121.07 s
[pathway-compat-base] include pathway-compat-base-0.0.1.0-E02izPYkwmmGdAPlQBKjbP
121.07 s
[pathway-compat-base] Ready component graph:
121.07 s
[pathway-compat-base] definite pathway-compat-base-0.0.1.0-E02izPYkwmmGdAPlQBKjbP
121.07 s
[pathway-compat-base] depends base-4.18.3.0
121.07 s
[pathway-compat-base] depends exceptions-0.10.7
121.07 s
[pathway-compat-base] depends megaparsec-9.7.0-EpAk7LLR2KBGAKafJPbXz1
121.07 s
[pathway-compat-base] depends pathway-0.0.1.0-5VJXWbvreBAfybP2NROr3
121.07 s
[pathway-compat-base] depends variant-1.0.2-5mfzNb7m7hb5BmRsuehY4I
121.07 s
[pathway-compat-base] definite pathway-compat-base-0.0.1.0-SkQnKen4bt6IgQL39Z6Bu-doctests
121.07 s
[pathway-compat-base] depends base-4.18.3.0
121.07 s
[pathway-compat-base] depends doctest-0.24.3-ACQNy8u8jPjC50l4I3tyiL
121.07 s
[pathway-compat-base] depends pathway-compat-base-0.0.1.0-E02izPYkwmmGdAPlQBKjbP
121.07 s
[pathway-compat-base] Using Cabal-3.10.3.0 compiled by ghc-9.6
121.07 s
[pathway-compat-base] Using compiler: ghc-9.6.7
121.07 s
[pathway-compat-base] Using install prefix:
121.07 s
[pathway-compat-base] /nix/store/z78mi47kq8pq7r41r4x4hlrfnjdp1ah2-pathway-compat-base-0.0.1.0
121.07 s
[pathway-compat-base] Executables installed in:
121.07 s
[pathway-compat-base] /nix/store/z78mi47kq8pq7r41r4x4hlrfnjdp1ah2-pathway-compat-base-0.0.1.0/bin
121.07 s
[pathway-compat-base] Libraries installed in:
121.07 s
[pathway-compat-base] /nix/store/z78mi47kq8pq7r41r4x4hlrfnjdp1ah2-pathway-compat-base-0.0.1.0/lib/ghc-9.6.7/lib/x86_64-linux-ghc-9.6.7/pathway-compat-base-0.0.1.0-E02izPYkwmmGdAPlQBKjbP
121.07 s
[pathway-compat-base] Dynamic Libraries installed in:
121.07 s
[pathway-compat-base] /nix/store/z78mi47kq8pq7r41r4x4hlrfnjdp1ah2-pathway-compat-base-0.0.1.0/lib/ghc-9.6.7/lib/x86_64-linux-ghc-9.6.7
121.07 s
[pathway-compat-base] Private executables installed in:
121.07 s
[pathway-compat-base] /nix/store/z78mi47kq8pq7r41r4x4hlrfnjdp1ah2-pathway-compat-base-0.0.1.0/libexec/x86_64-linux-ghc-9.6.7/pathway-compat-base-0.0.1.0
121.07 s
[pathway-compat-base] Data files installed in:
121.07 s
[pathway-compat-base] /nix/store/z78mi47kq8pq7r41r4x4hlrfnjdp1ah2-pathway-compat-base-0.0.1.0/share/x86_64-linux-ghc-9.6.7/pathway-compat-base-0.0.1.0
121.07 s
[pathway-compat-base] Documentation installed in:
121.07 s
[pathway-compat-base] /nix/store/nbcy4fh8968i75x5bzlmrdxvb3hnk0ng-pathway-compat-base-0.0.1.0-doc/share/doc/pathway-compat-base-0.0.1.0
121.07 s
[pathway-compat-base] Configuration files installed in:
121.07 s
[pathway-compat-base] /nix/store/z78mi47kq8pq7r41r4x4hlrfnjdp1ah2-pathway-compat-base-0.0.1.0/etc
121.07 s
[pathway-compat-base] No alex found
121.07 s
[pathway-compat-base] Using ar found on system at:
121.07 s
[pathway-compat-base] /nix/store/zjraf40s86y3iwhp626b934r5y6ldkbb-binutils-wrapper-2.46/bin/ar
121.07 s
[pathway-compat-base] No c2hs found
121.07 s
[pathway-compat-base] No cpphs found
121.07 s
[pathway-compat-base] Using doctest version 0.24.3 found on system at:
121.07 s
[pathway-compat-base] /nix/store/s48k56ayjjxwdbz9y7d8mnqwlcjfi1a8-doctest-0.24.3/bin/doctest
121.08 s
[pathway-compat-base] Using gcc version 15.2.0 given by user at:
121.08 s
[pathway-compat-base] /nix/store/29qjlshvklnyr67nhpprzgb9igmsfsjj-gcc-wrapper-15.2.0/bin/gcc
121.08 s
[pathway-compat-base] Using ghc version 9.6.7 found on system at:
121.08 s
[pathway-compat-base] /nix/store/2djpcnj8a25viv1y24h3mziy1gsy3fc6-ghc-9.6.7/bin/ghc
121.08 s
[pathway-compat-base] Using ghc-pkg version 9.6.7 found on system at:
121.08 s
[pathway-compat-base] /nix/store/2djpcnj8a25viv1y24h3mziy1gsy3fc6-ghc-9.6.7/bin/ghc-pkg-9.6.7
121.08 s
[pathway-compat-base] No ghcjs found
121.08 s
[pathway-compat-base] No ghcjs-pkg found
121.08 s
[pathway-compat-base] No greencard found
121.08 s
[pathway-compat-base] Using haddock version 2.29.2 found on system at:
121.08 s
[pathway-compat-base] /nix/store/2djpcnj8a25viv1y24h3mziy1gsy3fc6-ghc-9.6.7/bin/haddock-ghc-9.6.7
121.08 s
[pathway-compat-base] No happy found
121.08 s
[pathway-compat-base] Using haskell-suite found on system at: haskell-suite-dummy-location
121.08 s
[pathway-compat-base] Using haskell-suite-pkg found on system at: haskell-suite-pkg-dummy-location
121.08 s
[pathway-compat-base] No hmake found
121.08 s
[pathway-compat-base] Using hpc version 0.68 found on system at:
121.08 s
[pathway-compat-base] /nix/store/2djpcnj8a25viv1y24h3mziy1gsy3fc6-ghc-9.6.7/bin/hpc-ghc-9.6.7
121.08 s
[pathway-compat-base] Using hsc2hs version 0.68.9 found on system at:
121.08 s
[pathway-compat-base] /nix/store/2djpcnj8a25viv1y24h3mziy1gsy3fc6-ghc-9.6.7/bin/hsc2hs-ghc-9.6.7
121.08 s
[pathway-compat-base] Using hscolour version 1.25 found on system at:
121.08 s
[pathway-compat-base] /nix/store/2x19jxh5g98bv0s06mdj71c1hmxi54yl-hscolour-1.25/bin/HsColour
121.08 s
[pathway-compat-base] No jhc found
121.08 s
[pathway-compat-base] Using ld found on system at:
121.08 s
[pathway-compat-base] /nix/store/zjraf40s86y3iwhp626b934r5y6ldkbb-binutils-wrapper-2.46/bin/ld.gold
121.08 s
[pathway-compat-base] No pkg-config found
121.08 s
[pathway-compat-base] Using runghc version 9.6.7 found on system at:
121.08 s
[pathway-compat-base] /nix/store/2djpcnj8a25viv1y24h3mziy1gsy3fc6-ghc-9.6.7/bin/runghc-9.6.7
121.08 s
[pathway-compat-base] Using strip version 2.46 found on system at:
121.08 s
[pathway-compat-base] /nix/store/29qjlshvklnyr67nhpprzgb9igmsfsjj-gcc-wrapper-15.2.0/bin/strip
121.08 s
[pathway-compat-base] Using tar found on system at:
121.08 s
[pathway-compat-base] /nix/store/z5mq2sam4484prf3kv6v6vjw1m0i7j24-gnutar-1.35/bin/tar
121.08 s
[pathway-compat-base] No uhc found
121.24 s
[pathway-path] Source component graph:
121.24 s
[pathway-path] component lib
121.24 s
[pathway-path] component test:doctests dependency lib
121.24 s
[pathway-path] Configured component graph:
121.24 s
[pathway-path] component pathway-path-0.0.1.0-5PyJm6pqzGL3pUA6djS91m
121.24 s
[pathway-path] include base-4.18.3.0
121.24 s
[pathway-path] include filepath-1.4.301.0
121.24 s
[pathway-path] include path-0.9.6-Bvd10GuXHuXHFsKgTfTvD
121.24 s
[pathway-path] include pathway-0.0.1.0-5VJXWbvreBAfybP2NROr3
121.24 s
[pathway-path] include pathway-internal-0.0.1.0-1xeSc3z2VhRIotiMz9hdL1
121.24 s
[pathway-path] include yaya-0.6.2.3-CucPaROGK6cJio5wwZ3WbL
121.24 s
[pathway-path] include yaya-unsafe-0.4.1.4-6JqwKKTzglx2DDEO7d29gG
121.24 s
[pathway-path] component pathway-path-0.0.1.0-cPEcB6HRE14DzUZAi4EQk-doctests
121.24 s
[pathway-path] include QuickCheck-2.15.0.1-Kk0tj2w2Kn3JdS4LSBPwSc
121.24 s
[pathway-path] include base-4.18.3.0
121.24 s
[pathway-path] include doctest-0.24.3-ACQNy8u8jPjC50l4I3tyiL
121.24 s
[pathway-path] include pathway-path-0.0.1.0-5PyJm6pqzGL3pUA6djS91m
121.24 s
[pathway-path] include pathway-quickcheck-0.0.1.0-AshRja0hbtA8TMtZAUvD3L
121.24 s
[pathway-path] Linked component graph:
121.24 s
[pathway-path] unit pathway-path-0.0.1.0-5PyJm6pqzGL3pUA6djS91m
121.24 s
[pathway-path] include base-4.18.3.0
121.24 s
[pathway-path] include filepath-1.4.301.0
121.24 s
[pathway-path] include path-0.9.6-Bvd10GuXHuXHFsKgTfTvD
121.24 s
[pathway-path] include pathway-0.0.1.0-5VJXWbvreBAfybP2NROr3
121.24 s
[pathway-path] include pathway-internal-0.0.1.0-1xeSc3z2VhRIotiMz9hdL1
121.24 s
[pathway-path] include yaya-0.6.2.3-CucPaROGK6cJio5wwZ3WbL
121.24 s
[pathway-path] include yaya-unsafe-0.4.1.4-6JqwKKTzglx2DDEO7d29gG
121.24 s
[pathway-path] Data.Path.Integration.Path=pathway-path-0.0.1.0-5PyJm6pqzGL3pUA6djS91m:Data.Path.Integration.Path
121.24 s
[pathway-path] unit pathway-path-0.0.1.0-cPEcB6HRE14DzUZAi4EQk-doctests
121.24 s
[pathway-path] include QuickCheck-2.15.0.1-Kk0tj2w2Kn3JdS4LSBPwSc
121.24 s
[pathway-path] include base-4.18.3.0
121.24 s
[pathway-path] include doctest-0.24.3-ACQNy8u8jPjC50l4I3tyiL
121.24 s
[pathway-path] include pathway-path-0.0.1.0-5PyJm6pqzGL3pUA6djS91m
121.24 s
[pathway-path] include pathway-quickcheck-0.0.1.0-AshRja0hbtA8TMtZAUvD3L
121.24 s
[pathway-path] Ready component graph:
121.24 s
[pathway-path] definite pathway-path-0.0.1.0-5PyJm6pqzGL3pUA6djS91m
121.24 s
[pathway-path] depends base-4.18.3.0
121.24 s
[pathway-path] depends filepath-1.4.301.0
121.24 s
[pathway-path] depends path-0.9.6-Bvd10GuXHuXHFsKgTfTvD
121.24 s
[pathway-path] depends pathway-0.0.1.0-5VJXWbvreBAfybP2NROr3
121.24 s
[pathway-path] depends pathway-internal-0.0.1.0-1xeSc3z2VhRIotiMz9hdL1
121.24 s
[pathway-path] depends yaya-0.6.2.3-CucPaROGK6cJio5wwZ3WbL
121.24 s
[pathway-path] depends yaya-unsafe-0.4.1.4-6JqwKKTzglx2DDEO7d29gG
121.24 s
[pathway-path] definite pathway-path-0.0.1.0-cPEcB6HRE14DzUZAi4EQk-doctests
121.24 s
[pathway-path] depends QuickCheck-2.15.0.1-Kk0tj2w2Kn3JdS4LSBPwSc
121.24 s
[pathway-path] depends base-4.18.3.0
121.24 s
[pathway-path] depends doctest-0.24.3-ACQNy8u8jPjC50l4I3tyiL
121.24 s
[pathway-path] depends pathway-path-0.0.1.0-5PyJm6pqzGL3pUA6djS91m
121.24 s
[pathway-path] depends pathway-quickcheck-0.0.1.0-AshRja0hbtA8TMtZAUvD3L
121.24 s
[pathway-path] Using Cabal-3.10.3.0 compiled by ghc-9.6
121.24 s
[pathway-path] Using compiler: ghc-9.6.7
121.24 s
[pathway-path] Using install prefix:
121.24 s
[pathway-path] /nix/store/j4xi61dicaq36akl1fdhmsrz1dmylp5r-pathway-path-0.0.1.0
121.24 s
[pathway-path] Executables installed in:
121.24 s
[pathway-path] /nix/store/j4xi61dicaq36akl1fdhmsrz1dmylp5r-pathway-path-0.0.1.0/bin
121.24 s
[pathway-path] Libraries installed in:
121.24 s
[pathway-path] /nix/store/j4xi61dicaq36akl1fdhmsrz1dmylp5r-pathway-path-0.0.1.0/lib/ghc-9.6.7/lib/x86_64-linux-ghc-9.6.7/pathway-path-0.0.1.0-5PyJm6pqzGL3pUA6djS91m
121.24 s
[pathway-path] Dynamic Libraries installed in:
121.24 s
[pathway-path] /nix/store/j4xi61dicaq36akl1fdhmsrz1dmylp5r-pathway-path-0.0.1.0/lib/ghc-9.6.7/lib/x86_64-linux-ghc-9.6.7
121.24 s
[pathway-path] Private executables installed in:
121.24 s
[pathway-path] /nix/store/j4xi61dicaq36akl1fdhmsrz1dmylp5r-pathway-path-0.0.1.0/libexec/x86_64-linux-ghc-9.6.7/pathway-path-0.0.1.0
121.24 s
[pathway-path] Data files installed in:
121.24 s
[pathway-path] /nix/store/j4xi61dicaq36akl1fdhmsrz1dmylp5r-pathway-path-0.0.1.0/share/x86_64-linux-ghc-9.6.7/pathway-path-0.0.1.0
121.24 s
[pathway-path] Documentation installed in:
121.24 s
[pathway-path] /nix/store/z2mj3fsbq710z7q8pms9i5ylna4f647i-pathway-path-0.0.1.0-doc/share/doc/pathway-path-0.0.1.0
121.25 s
[pathway-path] Configuration files installed in:
121.25 s
[pathway-path] /nix/store/j4xi61dicaq36akl1fdhmsrz1dmylp5r-pathway-path-0.0.1.0/etc
121.25 s
[pathway-path] No alex found
121.25 s
[pathway-path] Using ar found on system at:
121.25 s
[pathway-path] /nix/store/zjraf40s86y3iwhp626b934r5y6ldkbb-binutils-wrapper-2.46/bin/ar
121.25 s
[pathway-path] No c2hs found
121.25 s
[pathway-path] No cpphs found
121.25 s
[pathway-path] Using doctest version 0.24.3 found on system at:
121.25 s
[pathway-path] /nix/store/s48k56ayjjxwdbz9y7d8mnqwlcjfi1a8-doctest-0.24.3/bin/doctest
121.25 s
[pathway-path] Using gcc version 15.2.0 given by user at:
121.25 s
[pathway-path] /nix/store/29qjlshvklnyr67nhpprzgb9igmsfsjj-gcc-wrapper-15.2.0/bin/gcc
121.25 s
[pathway-path] Using ghc version 9.6.7 found on system at:
121.25 s
[pathway-path] /nix/store/2djpcnj8a25viv1y24h3mziy1gsy3fc6-ghc-9.6.7/bin/ghc
121.25 s
[pathway-path] Using ghc-pkg version 9.6.7 found on system at:
121.25 s
[pathway-path] /nix/store/2djpcnj8a25viv1y24h3mziy1gsy3fc6-ghc-9.6.7/bin/ghc-pkg-9.6.7
121.25 s
[pathway-path] No ghcjs found
121.25 s
[pathway-path] No ghcjs-pkg found
121.25 s
[pathway-path] No greencard found
121.25 s
[pathway-path] Using haddock version 2.29.2 found on system at:
121.25 s
[pathway-path] /nix/store/2djpcnj8a25viv1y24h3mziy1gsy3fc6-ghc-9.6.7/bin/haddock-ghc-9.6.7
121.25 s
[pathway-path] No happy found
121.25 s
[pathway-path] Using haskell-suite found on system at: haskell-suite-dummy-location
121.25 s
[pathway-path] Using haskell-suite-pkg found on system at: haskell-suite-pkg-dummy-location
121.25 s
[pathway-path] No hmake found
121.25 s
[pathway-path] Using hpc version 0.68 found on system at:
121.25 s
[pathway-path] /nix/store/2djpcnj8a25viv1y24h3mziy1gsy3fc6-ghc-9.6.7/bin/hpc-ghc-9.6.7
121.25 s
[pathway-path] Using hsc2hs version 0.68.9 found on system at:
121.25 s
[pathway-path] /nix/store/2djpcnj8a25viv1y24h3mziy1gsy3fc6-ghc-9.6.7/bin/hsc2hs-ghc-9.6.7
121.25 s
[pathway-path] Using hscolour version 1.25 found on system at:
121.25 s
[pathway-path] /nix/store/2x19jxh5g98bv0s06mdj71c1hmxi54yl-hscolour-1.25/bin/HsColour
121.25 s
[pathway-path] No jhc found
121.25 s
[pathway-path] Using ld found on system at:
121.25 s
[pathway-path] /nix/store/zjraf40s86y3iwhp626b934r5y6ldkbb-binutils-wrapper-2.46/bin/ld.gold
121.25 s
[pathway-path] No pkg-config found
121.25 s
[pathway-path] Using runghc version 9.6.7 found on system at:
121.25 s
[pathway-path] /nix/store/2djpcnj8a25viv1y24h3mziy1gsy3fc6-ghc-9.6.7/bin/runghc-9.6.7
121.25 s
[pathway-path] Using strip version 2.46 found on system at:
121.25 s
[pathway-path] /nix/store/29qjlshvklnyr67nhpprzgb9igmsfsjj-gcc-wrapper-15.2.0/bin/strip
121.25 s
[pathway-path] Using tar found on system at:
121.25 s
[pathway-path] /nix/store/z5mq2sam4484prf3kv6v6vjw1m0i7j24-gnutar-1.35/bin/tar
121.25 s
[pathway-path] No uhc found
121.48 s
[pathway-compat-base] Phase: buildPhase
121.56 s
[pathway-compat-base] Preprocessing library for pathway-compat-base-0.0.1.0..
121.56 s
[pathway-compat-base] Building library for pathway-compat-base-0.0.1.0..
121.71 s
[pathway-compat-base] [ 1 of 15] Compiling Common ( src/Common.hs, dist/build/Common.o, dist/build/Common.dyn_o )
121.71 s
[pathway-path] Phase: buildPhase
121.79 s
[pathway-path] Preprocessing library for pathway-path-0.0.1.0..
121.79 s
[pathway-path] Building library for pathway-path-0.0.1.0..
121.86 s
[pathway-path] [1 of 1] Compiling Data.Path.Integration.Path ( src/Data/Path/Integration/Path.hs, dist/build/Data/Path/Integration/Path.o, dist/build/Data/Path/Integration/Path.dyn_o )
122.17 s
[pathway-compat-base] [ 2 of 15] Compiling System.Environment.Thin ( src/System/Environment/Thin.hs, dist/build/System/Environment/Thin.o, dist/build/System/Environment/Thin.dyn_o )
122.24 s
[pathway-path] [1 of 1] Compiling Data.Path.Integration.Path ( src/Data/Path/Integration/Path.hs, dist/build/Data/Path/Integration/Path.p_o )
122.24 s
[pathway-compat-base] [ 3 of 15] Compiling System.Environment.Pathway ( src/System/Environment/Pathway.hs, dist/build/System/Environment/Pathway.o, dist/build/System/Environment/Pathway.dyn_o )
122.27 s
[pathway-compat-base] [ 4 of 15] Compiling System.Environment.Overlay ( src/System/Environment/Overlay.hs, dist/build/System/Environment/Overlay.o, dist/build/System/Environment/Overlay.dyn_o )
122.30 s
[pathway-compat-base] [ 5 of 15] Compiling System.Environment.DropIn ( src/System/Environment/DropIn.hs, dist/build/System/Environment/DropIn.o, dist/build/System/Environment/DropIn.dyn_o )
122.33 s
[pathway-compat-base] [ 6 of 15] Compiling System.IO.Error.Caught ( src/System/IO/Error/Caught.hs, dist/build/System/IO/Error/Caught.o, dist/build/System/IO/Error/Caught.dyn_o )
122.33 s
[pathway-compat-base] [ 7 of 15] Compiling System.IO.Error.Thin ( src/System/IO/Error/Thin.hs, dist/build/System/IO/Error/Thin.o, dist/build/System/IO/Error/Thin.dyn_o )
122.33 s
[pathway-compat-base] [ 8 of 15] Compiling System.IO.Error.Pathway ( src/System/IO/Error/Pathway.hs, dist/build/System/IO/Error/Pathway.o, dist/build/System/IO/Error/Pathway.dyn_o )
122.33 s
[pathway-compat-base] [ 9 of 15] Compiling System.IO.Error.Overlay ( src/System/IO/Error/Overlay.hs, dist/build/System/IO/Error/Overlay.o, dist/build/System/IO/Error/Overlay.dyn_o )
122.33 s
[pathway-compat-base] [10 of 15] Compiling System.IO.Error.DropIn ( src/System/IO/Error/DropIn.hs, dist/build/System/IO/Error/DropIn.o, dist/build/System/IO/Error/DropIn.dyn_o )
122.33 s
[pathway-compat-base] [11 of 15] Compiling System.IO.Thin ( src/System/IO/Thin.hs, dist/build/System/IO/Thin.o, dist/build/System/IO/Thin.dyn_o )
122.33 s
[pathway-compat-base] [12 of 15] Compiling System.IO.Overlay ( src/System/IO/Overlay.hs, dist/build/System/IO/Overlay.o, dist/build/System/IO/Overlay.dyn_o )
122.34 s
[pathway-compat-base] [13 of 15] Compiling System.IO.DropIn ( src/System/IO/DropIn.hs, dist/build/System/IO/DropIn.o, dist/build/System/IO/DropIn.dyn_o )
122.37 s
[pathway-compat-base] [14 of 15] Compiling System.IO.Caught ( src/System/IO/Caught.hs, dist/build/System/IO/Caught.o, dist/build/System/IO/Caught.dyn_o )
122.38 s
[pathway-compat-base] [15 of 15] Compiling System.IO.Pathway ( src/System/IO/Pathway.hs, dist/build/System/IO/Pathway.o, dist/build/System/IO/Pathway.dyn_o )
122.65 s
[pathway-compat-base] [ 1 of 15] Compiling Common ( src/Common.hs, dist/build/Common.p_o )
123.15 s
[pathway-compat-base] [ 2 of 15] Compiling System.Environment.Thin ( src/System/Environment/Thin.hs, dist/build/System/Environment/Thin.p_o )
123.31 s
[pathway-compat-base] [ 3 of 15] Compiling System.Environment.Pathway ( src/System/Environment/Pathway.hs, dist/build/System/Environment/Pathway.p_o )
123.47 s
[pathway-compat-base] [ 4 of 15] Compiling System.Environment.Overlay ( src/System/Environment/Overlay.hs, dist/build/System/Environment/Overlay.p_o )
123.50 s
[pathway-compat-base] [ 5 of 15] Compiling System.Environment.DropIn ( src/System/Environment/DropIn.hs, dist/build/System/Environment/DropIn.p_o )
123.66 s
[pathway-compat-base] [ 6 of 15] Compiling System.IO.Error.Caught ( src/System/IO/Error/Caught.hs, dist/build/System/IO/Error/Caught.p_o )
123.66 s
[pathway-compat-base] [ 7 of 15] Compiling System.IO.Error.Thin ( src/System/IO/Error/Thin.hs, dist/build/System/IO/Error/Thin.p_o )
123.66 s
[pathway-compat-base] [ 8 of 15] Compiling System.IO.Error.Pathway ( src/System/IO/Error/Pathway.hs, dist/build/System/IO/Error/Pathway.p_o )
123.66 s
[pathway-compat-base] [ 9 of 15] Compiling System.IO.Error.Overlay ( src/System/IO/Error/Overlay.hs, dist/build/System/IO/Error/Overlay.p_o )
123.66 s
[pathway-compat-base] [10 of 15] Compiling System.IO.Error.DropIn ( src/System/IO/Error/DropIn.hs, dist/build/System/IO/Error/DropIn.p_o )
123.66 s
[pathway-compat-base] [11 of 15] Compiling System.IO.Thin ( src/System/IO/Thin.hs, dist/build/System/IO/Thin.p_o )
123.66 s
[pathway-compat-base] [12 of 15] Compiling System.IO.Overlay ( src/System/IO/Overlay.hs, dist/build/System/IO/Overlay.p_o )
123.66 s
[pathway-compat-base] [13 of 15] Compiling System.IO.DropIn ( src/System/IO/DropIn.hs, dist/build/System/IO/DropIn.p_o )
123.75 s
[pathway-compat-base] [14 of 15] Compiling System.IO.Caught ( src/System/IO/Caught.hs, dist/build/System/IO/Caught.p_o )
123.75 s
[pathway-compat-base] [15 of 15] Compiling System.IO.Pathway ( src/System/IO/Pathway.hs, dist/build/System/IO/Pathway.p_o )
124.61 s
[pathway-path] Preprocessing test suite 'doctests' for pathway-path-0.0.1.0..
124.61 s
[pathway-path] Building test suite 'doctests' for pathway-path-0.0.1.0..
124.72 s
[pathway-path] [1 of 2] Compiling Build_doctests ( dist/build/doctests/autogen/Build_doctests.hs, dist/build/doctests/doctests-tmp/Build_doctests.o )
124.91 s
[pathway-path] [2 of 2] Compiling Main ( tests/doctests.hs, dist/build/doctests/doctests-tmp/Main.o )
125.19 s
[pathway-path] [3 of 3] Linking dist/build/doctests/doctests
125.68 s
[pathway-compat-base] Preprocessing test suite 'doctests' for pathway-compat-base-0.0.1.0..
125.68 s
[pathway-compat-base] Building test suite 'doctests' for pathway-compat-base-0.0.1.0..
125.75 s
[pathway-compat-base] [1 of 2] Compiling Build_doctests ( dist/build/doctests/autogen/Build_doctests.hs, dist/build/doctests/doctests-tmp/Build_doctests.o )
125.98 s
[pathway-compat-base] [2 of 2] Compiling Main ( tests/doctests.hs, dist/build/doctests/doctests-tmp/Main.o )
126.24 s
[pathway-compat-base] [3 of 3] Linking dist/build/doctests/doctests
128.65 s
[pathway-path] Phase: checkPhase
128.70 s
[pathway-path] Running 1 test suites...
128.70 s
[pathway-path] Test suite doctests: RUNNING...
129.25 s
[pathway-path] Examples: 0 Tried: 0 Errors: 0 Failures: 0
129.29 s
[pathway-path] Test suite doctests: PASS
129.29 s
[pathway-path] Test suite logged to: dist/test/pathway-path-0.0.1.0-doctests.log
129.29 s
[pathway-path] 1 of 1 test suites (1 of 1 test cases) passed.
129.31 s
[pathway-path] Phase: haddockPhase
129.48 s
[pathway-path] Preprocessing library for pathway-path-0.0.1.0..
129.48 s
[pathway-path] Running Haddock on library for pathway-path-0.0.1.0..
129.48 s
[pathway-path] Warning: The documentation for the following packages are not installed. No
129.48 s
[pathway-path] links will be generated to these packages: path-0.9.6, path-0.9.6,
129.48 s
[pathway-path] vector-0.13.2.0
129.54 s
[pathway-path] Warning: --source-* options are ignored when --hyperlinked-source is enabled.
129.69 s
[pathway-compat-base] Phase: checkPhase
129.76 s
[pathway-compat-base] Running 1 test suites...
129.76 s
[pathway-compat-base] Test suite doctests: RUNNING...
129.93 s
[pathway-path] Warning: 'AmbiguousPath' is out of scope.
129.93 s
[pathway-path] If you qualify the identifier, haddock can try to link it anyway.
129.94 s
[pathway-path] 100% ( 1 / 1) in 'Data.Path.Integration.Path'
129.96 s
[pathway-path] Warning: Data.Path.Integration.Path: could not find link destinations for:
129.96 s
[pathway-path] - Path.Internal.Posix.Path
129.96 s
[pathway-path] - Path.Posix.Abs
129.96 s
[pathway-path] - Path.Posix.Dir
129.96 s
[pathway-path] - Path.Posix.File
129.96 s
[pathway-path] - Path.Posix.Rel
129.96 s
[pathway-path] - Path.Posix.SomeBase
130.18 s
[pathway-compat-base]
130.18 s
[pathway-compat-base] on the commandline: warning:
130.18 s
[pathway-compat-base] -XTemplateHaskell is not allowed in Safe Haskell; ignoring -XTemplateHaskell
130.18 s
[pathway-compat-base]
130.18 s
[pathway-compat-base] on the commandline: warning:
130.18 s
[pathway-compat-base] -XTemplateHaskell is not allowed in Safe Haskell; ignoring -XTemplateHaskell
130.18 s
[pathway-compat-base]
130.18 s
[pathway-compat-base] on the commandline: warning:
130.18 s
[pathway-compat-base] -XTemplateHaskell is not allowed in Safe Haskell; ignoring -XTemplateHaskell
130.18 s
[pathway-compat-base]
130.18 s
[pathway-compat-base] on the commandline: warning:
130.18 s
[pathway-compat-base] -XTemplateHaskell is not allowed in Safe Haskell; ignoring -XTemplateHaskell
130.21 s
[pathway-compat-base]
130.21 s
[pathway-compat-base] on the commandline: warning:
130.21 s
[pathway-compat-base] -XTemplateHaskell is not allowed in Safe Haskell; ignoring -XTemplateHaskell
130.21 s
[pathway-compat-base]
130.21 s
[pathway-compat-base] on the commandline: warning:
130.21 s
[pathway-compat-base] -XTemplateHaskell is not allowed in Safe Haskell; ignoring -XTemplateHaskell
130.21 s
[pathway-compat-base]
130.21 s
[pathway-compat-base] on the commandline: warning:
130.21 s
[pathway-compat-base] -XTemplateHaskell is not allowed in Safe Haskell; ignoring -XTemplateHaskell
130.21 s
[pathway-compat-base]
130.21 s
[pathway-compat-base] on the commandline: warning:
130.21 s
[pathway-compat-base] -XTemplateHaskell is not allowed in Safe Haskell; ignoring -XTemplateHaskell
130.21 s
[pathway-compat-base]
130.21 s
[pathway-compat-base] on the commandline: warning:
130.21 s
[pathway-compat-base] -XTemplateHaskell is not allowed in Safe Haskell; ignoring -XTemplateHaskell
130.21 s
[pathway-compat-base]
130.21 s
[pathway-compat-base] on the commandline: warning:
130.21 s
[pathway-compat-base] -XTemplateHaskell is not allowed in Safe Haskell; ignoring -XTemplateHaskell
130.21 s
[pathway-compat-base]
130.21 s
[pathway-compat-base] on the commandline: warning:
130.21 s
[pathway-compat-base] -XTemplateHaskell is not allowed in Safe Haskell; ignoring -XTemplateHaskell
130.21 s
[pathway-compat-base]
130.21 s
[pathway-compat-base] on the commandline: warning:
130.21 s
[pathway-compat-base] -XTemplateHaskell is not allowed in Safe Haskell; ignoring -XTemplateHaskell
130.21 s
[pathway-compat-base]
130.21 s
[pathway-compat-base] on the commandline: warning:
130.21 s
[pathway-compat-base] -XTemplateHaskell is not allowed in Safe Haskell; ignoring -XTemplateHaskell
130.21 s
[pathway-compat-base]
130.21 s
[pathway-compat-base] on the commandline: warning:
130.21 s
[pathway-compat-base] -XTemplateHaskell is not allowed in Safe Haskell; ignoring -XTemplateHaskell
130.24 s
[pathway-compat-base]
130.24 s
[pathway-compat-base] on the commandline: warning:
130.24 s
[pathway-compat-base] -XTemplateHaskell is not allowed in Safe Haskell; ignoring -XTemplateHaskell
130.24 s
[pathway-compat-base]
130.24 s
[pathway-compat-base] on the commandline: warning:
130.24 s
[pathway-compat-base] -XTemplateHaskell is not allowed in Safe Haskell; ignoring -XTemplateHaskell
130.24 s
[pathway-compat-base]
130.24 s
[pathway-compat-base] on the commandline: warning:
130.24 s
[pathway-compat-base] -XTemplateHaskell is not allowed in Safe Haskell; ignoring -XTemplateHaskell
130.24 s
[pathway-compat-base]
130.24 s
[pathway-compat-base] on the commandline: warning:
130.24 s
[pathway-compat-base] -XTemplateHaskell is not allowed in Safe Haskell; ignoring -XTemplateHaskell
130.24 s
[pathway-compat-base]
130.24 s
[pathway-compat-base] on the commandline: warning:
130.24 s
[pathway-compat-base] -XTemplateHaskell is not allowed in Safe Haskell; ignoring -XTemplateHaskell
130.24 s
[pathway-compat-base]
130.24 s
[pathway-compat-base] on the commandline: warning:
130.24 s
[pathway-compat-base] -XTemplateHaskell is not allowed in Safe Haskell; ignoring -XTemplateHaskell
130.24 s
[pathway-compat-base]
130.24 s
[pathway-compat-base] on the commandline: warning:
130.24 s
[pathway-compat-base] -XTemplateHaskell is not allowed in Safe Haskell; ignoring -XTemplateHaskell
130.25 s
[pathway-compat-base]
130.25 s
[pathway-compat-base] on the commandline: warning:
130.25 s
[pathway-compat-base] -XTemplateHaskell is not allowed in Safe Haskell; ignoring -XTemplateHaskell
130.25 s
[pathway-compat-base]
130.25 s
[pathway-compat-base] on the commandline: warning:
130.25 s
[pathway-compat-base] -XTemplateHaskell is not allowed in Safe Haskell; ignoring -XTemplateHaskell
130.74 s
[pathway-compat-base] Examples: 0 Tried: 0 Errors: 0 Failures: 0
130.81 s
[pathway-compat-base] Test suite doctests: PASS
130.81 s
[pathway-compat-base] Test suite logged to: dist/test/pathway-compat-base-0.0.1.0-doctests.log
130.81 s
[pathway-compat-base] 1 of 1 test suites (1 of 1 test cases) passed.
130.82 s
[pathway-compat-base] Phase: haddockPhase
130.98 s
[pathway-compat-base] Preprocessing library for pathway-compat-base-0.0.1.0..
130.99 s
[pathway-compat-base] Running Haddock on library for pathway-compat-base-0.0.1.0..
130.99 s
[pathway-compat-base] Warning: The documentation for the following packages are not installed. No
130.99 s
[pathway-compat-base] links will be generated to these packages: vector-0.13.2.0
131.04 s
[pathway-compat-base] Warning: --source-* options are ignored when --hyperlinked-source is enabled.
131.32 s
[pathway-compat-base] 90% ( 10 / 11) in 'System.IO.Error.Caught'
131.32 s
[pathway-compat-base] Missing documentation for:
131.32 s
[pathway-compat-base] AlreadyInUseError (src/System/IO/Error/Caught.hs:103)
131.51 s
[pathway-compat-base] Warning: '</?>' is out of scope.
131.51 s
[pathway-compat-base] If you qualify the identifier, haddock can try to link it anyway.
131.51 s
[pathway-compat-base] Warning: '<$>' is out of scope.
131.51 s
[pathway-compat-base] If you qualify the identifier, haddock can try to link it anyway.
131.51 s
[pathway-compat-base] Warning: 'getCurrentDirectory' is out of scope.
131.51 s
[pathway-compat-base] If you qualify the identifier, haddock can try to link it anyway.
131.51 s
[pathway-compat-base] Warning: 'makeRelativeToCurrentDirectory' is out of scope.
131.51 s
[pathway-compat-base] If you qualify the identifier, haddock can try to link it anyway.
131.51 s
[pathway-compat-base] Warning: 'IOError' is out of scope.
131.51 s
[pathway-compat-base] If you qualify the identifier, haddock can try to link it anyway.
131.51 s
[pathway-compat-base] 14% ( 1 / 7) in 'Common'
131.51 s
[pathway-compat-base] Missing documentation for:
131.51 s
[pathway-compat-base] InternalFailure (src/Common.hs:69)
131.51 s
[pathway-compat-base] toPathRep (src/Common.hs:84)
131.51 s
[pathway-compat-base] fromPathRep (src/Common.hs:87)
131.51 s
[pathway-compat-base] handleAnchoredPath (src/Common.hs:93)
131.51 s
[pathway-compat-base] absFileFromPathRep (src/Common.hs:100)
131.51 s
[pathway-compat-base] fileFromPathRep (src/Common.hs:114)
131.53 s
[pathway-compat-base] Warning: '</?>' is out of scope.
131.53 s
[pathway-compat-base] If you qualify the identifier, haddock can try to link it anyway.
131.53 s
[pathway-compat-base] Warning: 'getCurrentDirectory' is out of scope.
131.53 s
[pathway-compat-base] 0% ( 0 / 5) in 'System.IO.Error.Thin'
131.53 s
[pathway-compat-base] If you qualify the identifier, haddock can try to link it anyway.
131.53 s
[pathway-compat-base] Missing documentation for:
131.53 s
[pathway-compat-base] Module header
131.53 s
[pathway-compat-base] mkIOError (src/System/IO/Error/Thin.hs:23)
131.53 s
[pathway-compat-base] Warning: 'makeRelativeToCurrentDirectory' is out of scope.
131.53 s
[pathway-compat-base] If you qualify the identifier, haddock can try to link it anyway.
131.53 s
[pathway-compat-base] annotateIOError (src/System/IO/Error/Thin.hs:31)
131.53 s
[pathway-compat-base] Warning: 'IOError' is out of scope.
131.53 s
[pathway-compat-base] ioeGetFileName (src/System/IO/Error/Thin.hs:35)
131.53 s
[pathway-compat-base] If you qualify the identifier, haddock can try to link it anyway.
131.53 s
[pathway-compat-base] ioeSetFileName (src/System/IO/Error/Thin.hs:41)
131.53 s
[pathway-compat-base] Warning: 'Anchored' is out of scope.
131.53 s
[pathway-compat-base] If you qualify the identifier, haddock can try to link it anyway.
131.53 s
[pathway-compat-base] 33% ( 1 / 3) in 'System.Environment.Thin'
131.53 s
[pathway-compat-base] Missing documentation for:
131.53 s
[pathway-compat-base] executablePath (src/System/Environment/Thin.hs:52)
131.53 s
[pathway-compat-base] getExecutablePath (src/System/Environment/Thin.hs:61)
131.54 s
[pathway-compat-base] 100% ( 11 / 11) in 'System.Environment.Pathway'
131.54 s
[pathway-compat-base] 0% ( 0 / 2) in 'System.IO.Error.Overlay'
131.54 s
[pathway-compat-base] Missing documentation for:
131.54 s
[pathway-compat-base] Module header
131.54 s
[pathway-compat-base] ioeGetFileName (src/System/IO/Error/Overlay.hs:20)
131.54 s
[pathway-compat-base] 0% ( 0 / 13) in 'System.IO.Thin'
131.54 s
[pathway-compat-base] Missing documentation for:
131.54 s
[pathway-compat-base] Module header
131.54 s
[pathway-compat-base] withFile (src/System/IO/Thin.hs:31)
131.54 s
[pathway-compat-base] openFile (src/System/IO/Thin.hs:34)
131.54 s
[pathway-compat-base] readFile (src/System/IO/Thin.hs:37)
131.54 s
[pathway-compat-base] readFile' (src/System/IO/Thin.hs:40)
131.54 s
[pathway-compat-base] writeFile (src/System/IO/Thin.hs:43)
131.54 s
[pathway-compat-base] appendFile (src/System/IO/Thin.hs:46)
131.54 s
[pathway-compat-base] withBinaryFile (src/System/IO/Thin.hs:49)
131.54 s
[pathway-compat-base] openBinaryFile (src/System/IO/Thin.hs:52)
131.54 s
[pathway-compat-base] openTempFile (src/System/IO/Thin.hs:55)
131.54 s
[pathway-compat-base] openBinaryTempFile (src/System/IO/Thin.hs:69)
131.54 s
[pathway-compat-base] openTempFileWithDefaultPermissions (src/System/IO/Thin.hs:84)
131.54 s
[pathway-compat-base] openBinaryTempFileWithDefaultPermissions (src/System/IO/Thin.hs:93)
131.55 s
[pathway-compat-base] 76% ( 36 / 47) in 'System.IO.Error.DropIn'
131.55 s
[pathway-compat-base] Missing documentation for:
131.55 s
[pathway-compat-base] ioeGetErrorType
131.55 s
[pathway-compat-base] ioeGetErrorString
131.55 s
[pathway-compat-base] ioeGetLocation
131.55 s
[pathway-compat-base] ioeGetHandle
131.55 s
[pathway-compat-base] ioeSetErrorType
131.55 s
[pathway-compat-base] ioeSetErrorString
131.55 s
[pathway-compat-base] ioeSetLocation
131.55 s
[pathway-compat-base] ioeSetHandle
131.55 s
[pathway-compat-base] mkIOError (src/System/IO/Error/Thin.hs:23)
131.55 s
[pathway-compat-base] ioeSetFileName (src/System/IO/Error/Thin.hs:41)
131.55 s
[pathway-compat-base] annotateIOError (src/System/IO/Error/Thin.hs:31)
131.55 s
[pathway-compat-base] Warning: '</?>' is out of scope.
131.55 s
[pathway-compat-base] If you qualify the identifier, haddock can try to link it anyway.
131.55 s
[pathway-compat-base] Warning: 'getCurrentDirectory' is out of scope.
131.55 s
[pathway-compat-base] If you qualify the identifier, haddock can try to link it anyway.
131.55 s
[pathway-compat-base] Warning: 'makeRelativeToCurrentDirectory' is out of scope.
131.55 s
[pathway-compat-base] If you qualify the identifier, haddock can try to link it anyway.
131.55 s
[pathway-compat-base] Warning: 'IOError' is out of scope.
131.55 s
[pathway-compat-base] If you qualify the identifier, haddock can try to link it anyway.
131.55 s
[pathway-compat-base] 33% ( 1 / 3) in 'System.Environment.Overlay'
131.55 s
[pathway-compat-base] Missing documentation for:
131.55 s
[pathway-compat-base] executablePath (src/System/Environment/Overlay.hs:50)
131.55 s
[pathway-compat-base] getExecutablePath (src/System/Environment/Overlay.hs:54)
131.55 s
[pathway-compat-base] 82% ( 37 / 45) in 'System.IO.Error.Pathway'
131.55 s
[pathway-compat-base] Missing documentation for:
131.55 s
[pathway-compat-base] ioeGetErrorType
131.55 s
[pathway-compat-base] ioeGetErrorString
131.55 s
[pathway-compat-base] ioeGetLocation
131.55 s
[pathway-compat-base] ioeGetHandle
131.55 s
[pathway-compat-base] ioeSetErrorType
131.55 s
[pathway-compat-base] ioeSetErrorString
131.55 s
[pathway-compat-base] ioeSetLocation
131.55 s
[pathway-compat-base] ioeSetHandle
131.55 s
[pathway-compat-base] 0% ( 0 / 5) in 'System.IO.Overlay'
131.55 s
[pathway-compat-base] Missing documentation for:
131.55 s
[pathway-compat-base] Module header
131.55 s
[pathway-compat-base] openTempFile (src/System/IO/Overlay.hs:22)
131.55 s
[pathway-compat-base] openBinaryTempFile (src/System/IO/Overlay.hs:26)
131.55 s
[pathway-compat-base] openTempFileWithDefaultPermissions (src/System/IO/Overlay.hs:32)
131.55 s
[pathway-compat-base] openBinaryTempFileWithDefaultPermissions (src/System/IO/Overlay.hs:37)
131.55 s
[pathway-compat-base] 100% ( 11 / 11) in 'System.Environment.DropIn'
131.57 s
[pathway-compat-base] 80% ( 73 / 91) in 'System.IO.DropIn'
131.57 s
[pathway-compat-base] Missing documentation for:
131.57 s
[pathway-compat-base] HandlePosn
131.57 s
[pathway-compat-base] stdout
131.57 s
[pathway-compat-base] stdin
131.57 s
[pathway-compat-base] stderr
131.57 s
[pathway-compat-base] hPutBufNonBlocking
131.57 s
[pathway-compat-base] hIsOpen
131.57 s
[pathway-compat-base] hIsClosed
131.57 s
[pathway-compat-base] hIsReadable
131.57 s
[pathway-compat-base] hIsWritable
131.57 s
[pathway-compat-base] hIsSeekable
131.57 s
[pathway-compat-base] openFile (src/System/IO/Thin.hs:34)
131.57 s
[pathway-compat-base] readFile' (src/System/IO/Thin.hs:40)
131.57 s
[pathway-compat-base] writeFile (src/System/IO/Thin.hs:43)
131.57 s
[pathway-compat-base] withFile (src/System/IO/Thin.hs:31)
131.57 s
[pathway-compat-base] openBinaryFile (src/System/IO/Thin.hs:52)
131.57 s
[pathway-compat-base] withBinaryFile (src/System/IO/Thin.hs:49)
131.57 s
[pathway-compat-base] readFile (src/System/IO/Thin.hs:37)
131.57 s
[pathway-compat-base] appendFile (src/System/IO/Thin.hs:46)
131.57 s
[pathway-compat-base] 20% ( 1 / 5) in 'System.IO.Caught'
131.57 s
[pathway-compat-base] Missing documentation for:
131.57 s
[pathway-compat-base] Module header
131.57 s
[pathway-compat-base] OpenFileFailure (src/System/IO/Caught.hs:38)
131.57 s
[pathway-compat-base] openFile (src/System/IO/Caught.hs:48)
131.57 s
[pathway-compat-base] recoverOpenFileFailure (src/System/IO/Caught.hs:40)
131.58 s
[pathway-compat-base] 77% ( 73 / 94) in 'System.IO.Pathway'
131.58 s
[pathway-compat-base] Missing documentation for:
131.58 s
[pathway-compat-base] HandlePosn
131.58 s
[pathway-compat-base] stdout
131.58 s
[pathway-compat-base] stdin
131.58 s
[pathway-compat-base] stderr
131.58 s
[pathway-compat-base] hPutBufNonBlocking
131.58 s
[pathway-compat-base] hIsOpen
131.58 s
[pathway-compat-base] hIsClosed
131.58 s
[pathway-compat-base] hIsReadable
131.58 s
[pathway-compat-base] hIsWritable
131.58 s
[pathway-compat-base] hIsSeekable
131.58 s
[pathway-compat-base] readFile' (src/System/IO/Thin.hs:40)
131.58 s
[pathway-compat-base] writeFile (src/System/IO/Thin.hs:43)
131.58 s
[pathway-compat-base] withFile (src/System/IO/Thin.hs:31)
131.58 s
[pathway-compat-base] openBinaryFile (src/System/IO/Thin.hs:52)
131.58 s
[pathway-compat-base] withBinaryFile (src/System/IO/Thin.hs:49)
131.58 s
[pathway-compat-base] readFile (src/System/IO/Thin.hs:37)
131.58 s
[pathway-compat-base] appendFile (src/System/IO/Thin.hs:46)
131.58 s
[pathway-compat-base] openTempFile (src/System/IO/Thin.hs:55)
131.58 s
[pathway-compat-base] openBinaryTempFile (src/System/IO/Thin.hs:69)
131.58 s
[pathway-compat-base] openTempFileWithDefaultPermissions (src/System/IO/Thin.hs:84)
131.58 s
[pathway-compat-base] openBinaryTempFileWithDefaultPermissions (src/System/IO/Thin.hs:93)
133.76 s
[pathway-path] Documentation created: dist/doc/html/pathway-path/,
133.76 s
[pathway-path] dist/doc/html/pathway-path/pathway-path.txt
133.81 s
[pathway-path] Preprocessing test suite 'doctests' for pathway-path-0.0.1.0..
133.83 s
[pathway-path] Phase: installPhase
133.91 s
[pathway-path] Installing library in /nix/store/j4xi61dicaq36akl1fdhmsrz1dmylp5r-pathway-path-0.0.1.0/lib/ghc-9.6.7/lib/x86_64-linux-ghc-9.6.7/pathway-path-0.0.1.0-5PyJm6pqzGL3pUA6djS91m
134.14 s
[pathway-path] Phase: fixupPhase
134.15 s
[pathway-path] shrinking RPATHs of ELF executables and libraries in /nix/store/j4xi61dicaq36akl1fdhmsrz1dmylp5r-pathway-path-0.0.1.0
134.16 s
[pathway-path] shrinking /nix/store/j4xi61dicaq36akl1fdhmsrz1dmylp5r-pathway-path-0.0.1.0/lib/ghc-9.6.7/lib/x86_64-linux-ghc-9.6.7/libHSpathway-path-0.0.1.0-5PyJm6pqzGL3pUA6djS91m-ghc9.6.7.so
134.18 s
[pathway-path] checking for references to /build/ in /nix/store/j4xi61dicaq36akl1fdhmsrz1dmylp5r-pathway-path-0.0.1.0...
134.21 s
[pathway-path] patching script interpreter paths in /nix/store/j4xi61dicaq36akl1fdhmsrz1dmylp5r-pathway-path-0.0.1.0
134.22 s
[pathway-path] stripping (with command strip and flags -S -p) in /nix/store/j4xi61dicaq36akl1fdhmsrz1dmylp5r-pathway-path-0.0.1.0/lib
134.26 s
[pathway-path] shrinking RPATHs of ELF executables and libraries in /nix/store/z2mj3fsbq710z7q8pms9i5ylna4f647i-pathway-path-0.0.1.0-doc
134.27 s
[pathway-path] checking for references to /build/ in /nix/store/z2mj3fsbq710z7q8pms9i5ylna4f647i-pathway-path-0.0.1.0-doc...
134.29 s
[pathway-path] patching script interpreter paths in /nix/store/z2mj3fsbq710z7q8pms9i5ylna4f647i-pathway-path-0.0.1.0-doc
134.39 s
[pathway-path:post-build] Uploading to cachix cache "sellout": /nix/store/j4xi61dicaq36akl1fdhmsrz1dmylp5r-pathway-path-0.0.1.0 /nix/store/z2mj3fsbq710z7q8pms9i5ylna4f647i-pathway-path-0.0.1.0-doc
136.06 s
[pathway-path:post-build] Pushing 2 paths (207 are already present) using zstd to cache sellout ⏳
136.06 s
[pathway-path:post-build]
136.89 s
[pathway-path:post-build] Pushing /nix/store/z2mj3fsbq710z7q8pms9i5ylna4f647i-pathway-path-0.0.1.0-doc (263.45 KiB)
136.95 s
[pathway-path:post-build] Pushing /nix/store/j4xi61dicaq36akl1fdhmsrz1dmylp5r-pathway-path-0.0.1.0 (217.70 KiB)
138.55 s
[pathway-path:post-build]
138.55 s
[pathway-path:post-build] All done.
138.57 s
[pathway-path:post-build] Uploading to the NixCI cache: /nix/store/j4xi61dicaq36akl1fdhmsrz1dmylp5r-pathway-path-0.0.1.0 /nix/store/z2mj3fsbq710z7q8pms9i5ylna4f647i-pathway-path-0.0.1.0-doc
138.61 s
[pathway-path:post-build] warning: 'warn-short-path-literals' is deprecated, use 'lint-short-path-literals = ignore' instead
138.63 s
[pathway-path:post-build] copying 2 paths...
138.63 s
[pathway-path:post-build] copying path '/nix/store/z2mj3fsbq710z7q8pms9i5ylna4f647i-pathway-path-0.0.1.0-doc' to 'https://cache.nix-ci.com'...
139.15 s
[pathway-path:post-build] copying path '/nix/store/j4xi61dicaq36akl1fdhmsrz1dmylp5r-pathway-path-0.0.1.0' to 'https://cache.nix-ci.com'...
139.51 s
[pathway-path:post-build] warning: 'warn-short-path-literals' is deprecated, use 'lint-short-path-literals = ignore' instead
139.82 s
[pathway-path:post-build] copying 1 paths...
139.82 s
[pathway-path:post-build] copying path '/nix/store/1a1zhdpxrnvrqjv9cb62ab7sqgp68aya-pathway-path-0.0.1.0.drv' to 'https://cache.nix-ci.com'...
140.09 s
Uploaded pathway-path in 5.7s
140.09 s
Progress: 6 of 22 built (1 building), 164 of 164 downloaded from cache
140.09 s
Built pathway-path in 21.6s
140.09 s
[pathway-compat-base] Documentation created: dist/doc/html/pathway-compat-base/,
140.09 s
[pathway-compat-base] dist/doc/html/pathway-compat-base/pathway-compat-base.txt
140.09 s
[pathway-compat-base] Preprocessing test suite 'doctests' for pathway-compat-base-0.0.1.0..
140.09 s
[pathway-compat-base] Phase: installPhase
140.09 s
[pathway-compat-base] Installing library in /nix/store/z78mi47kq8pq7r41r4x4hlrfnjdp1ah2-pathway-compat-base-0.0.1.0/lib/ghc-9.6.7/lib/x86_64-linux-ghc-9.6.7/pathway-compat-base-0.0.1.0-E02izPYkwmmGdAPlQBKjbP
140.09 s
[pathway-compat-base] Phase: fixupPhase
140.09 s
[pathway-compat-base] shrinking RPATHs of ELF executables and libraries in /nix/store/z78mi47kq8pq7r41r4x4hlrfnjdp1ah2-pathway-compat-base-0.0.1.0
140.09 s
[pathway-compat-base] shrinking /nix/store/z78mi47kq8pq7r41r4x4hlrfnjdp1ah2-pathway-compat-base-0.0.1.0/lib/ghc-9.6.7/lib/x86_64-linux-ghc-9.6.7/libHSpathway-compat-base-0.0.1.0-E02izPYkwmmGdAPlQBKjbP-ghc9.6.7.so
140.09 s
[pathway-compat-base] checking for references to /build/ in /nix/store/z78mi47kq8pq7r41r4x4hlrfnjdp1ah2-pathway-compat-base-0.0.1.0...
140.09 s
[pathway-compat-base] patching script interpreter paths in /nix/store/z78mi47kq8pq7r41r4x4hlrfnjdp1ah2-pathway-compat-base-0.0.1.0
140.09 s
[pathway-compat-base] stripping (with command strip and flags -S -p) in /nix/store/z78mi47kq8pq7r41r4x4hlrfnjdp1ah2-pathway-compat-base-0.0.1.0/lib
140.09 s
[pathway-compat-base] shrinking RPATHs of ELF executables and libraries in /nix/store/nbcy4fh8968i75x5bzlmrdxvb3hnk0ng-pathway-compat-base-0.0.1.0-doc
140.09 s
[pathway-compat-base] checking for references to /build/ in /nix/store/nbcy4fh8968i75x5bzlmrdxvb3hnk0ng-pathway-compat-base-0.0.1.0-doc...
140.09 s
[pathway-compat-base] patching script interpreter paths in /nix/store/nbcy4fh8968i75x5bzlmrdxvb3hnk0ng-pathway-compat-base-0.0.1.0-doc
140.17 s
[pathway-compat-base:post-build] Uploading to cachix cache "sellout": /nix/store/nbcy4fh8968i75x5bzlmrdxvb3hnk0ng-pathway-compat-base-0.0.1.0-doc /nix/store/z78mi47kq8pq7r41r4x4hlrfnjdp1ah2-pathway-compat-base-0.0.1.0
142.06 s
[pathway-compat-base:post-build] Pushing 2 paths (186 are already present) using zstd to cache sellout ⏳
142.06 s
[pathway-compat-base:post-build]
142.92 s
[pathway-compat-base:post-build] Pushing /nix/store/nbcy4fh8968i75x5bzlmrdxvb3hnk0ng-pathway-compat-base-0.0.1.0-doc (1.85 MiB)
142.93 s
[pathway-compat-base:post-build] Pushing /nix/store/z78mi47kq8pq7r41r4x4hlrfnjdp1ah2-pathway-compat-base-0.0.1.0 (2.00 MiB)
145.35 s
[pathway-compat-base:post-build]
145.35 s
[pathway-compat-base:post-build] All done.
145.37 s
[pathway-compat-base:post-build] Uploading to the NixCI cache: /nix/store/nbcy4fh8968i75x5bzlmrdxvb3hnk0ng-pathway-compat-base-0.0.1.0-doc /nix/store/z78mi47kq8pq7r41r4x4hlrfnjdp1ah2-pathway-compat-base-0.0.1.0
145.41 s
[pathway-compat-base:post-build] warning: 'warn-short-path-literals' is deprecated, use 'lint-short-path-literals = ignore' instead
145.43 s
[pathway-compat-base:post-build] copying 2 paths...
145.43 s
[pathway-compat-base:post-build] copying path '/nix/store/nbcy4fh8968i75x5bzlmrdxvb3hnk0ng-pathway-compat-base-0.0.1.0-doc' to 'https://cache.nix-ci.com'...
146.05 s
[pathway-compat-base:post-build] copying path '/nix/store/z78mi47kq8pq7r41r4x4hlrfnjdp1ah2-pathway-compat-base-0.0.1.0' to 'https://cache.nix-ci.com'...
146.68 s
[pathway-compat-base:post-build] warning: 'warn-short-path-literals' is deprecated, use 'lint-short-path-literals = ignore' instead
146.99 s
[pathway-compat-base:post-build] copying 1 paths...
146.99 s
[pathway-compat-base:post-build] copying path '/nix/store/i2i51zcdhkj5dda2sw64pbjnxc51rx15-pathway-compat-base-0.0.1.0.drv' to 'https://cache.nix-ci.com'...
147.26 s
Uploaded pathway-compat-base in 7.1s
147.26 s
Progress: 7 of 21 built, 164 of 164 downloaded from cache
147.26 s
Built pathway-compat-base in 28.8s
147.31 s
Building /nix/store/6lbsvjysc8745w76x16kfxcnc6z3dmn1-pathway-compat-filepath-0.0.1.0.drv
147.54 s
[pathway-compat-filepath] Phase: setupCompilerEnvironmentPhase
147.54 s
[pathway-compat-filepath] Build with /nix/store/2djpcnj8a25viv1y24h3mziy1gsy3fc6-ghc-9.6.7.
147.88 s
[pathway-compat-filepath] Phase: unpackPhase
147.89 s
[pathway-compat-filepath] unpacking source archive /nix/store/99h2nwiw8z9r3kqrm9kdhv4k4sf61d7w-filepath
147.89 s
[pathway-compat-filepath] source root is filepath
147.91 s
[pathway-compat-filepath] Phase: patchPhase
147.92 s
[pathway-compat-filepath] Phase: compileBuildDriverPhase
147.92 s
[pathway-compat-filepath] setupCompileFlags: -package-db=/build/tmp.oq9eww1tzu/setup-package.conf.d -threaded
147.97 s
[pathway-compat-filepath] [1 of 2] Compiling Main ( Setup.hs, /build/tmp.oq9eww1tzu/Main.o )
148.03 s
[pathway-compat-filepath] [2 of 2] Linking Setup
149.32 s
[pathway-compat-filepath] Phase: updateAutotoolsGnuConfigScriptsPhase
149.34 s
[pathway-compat-filepath] Phase: configurePhase
149.34 s
[pathway-compat-filepath] configureFlags: --verbose --prefix=/nix/store/764l5kra2q49626jx0rg4mkpkja5c8jz-pathway-compat-filepath-0.0.1.0 --libdir=$prefix/lib/$compiler/lib --libsubdir=$abi/$libname --docdir=/nix/store/5iwzgix3zvg58nzmgb744x9xh6gy8ijk-pathway-compat-filepath-0.0.1.0-doc/share/doc/pathway-compat-filepath-0.0.1.0 --with-gcc=gcc --package-db=/build/tmp.oq9eww1tzu/package.conf.d --ghc-option=-j16 --ghc-option=+RTS --ghc-option=-A64M --ghc-option=-RTS --enable-library-profiling --profiling-detail=exported-functions --disable-profiling --enable-shared --disable-coverage --enable-static --disable-executable-dynamic --enable-tests --disable-benchmarks --enable-library-vanilla --disable-library-for-ghci --enable-split-sections --enable-library-stripping --enable-executable-stripping --ghc-option=-haddock --ghc-options=-Werror --extra-lib-dirs=/nix/store/pndhkk0l649lm1sj0mxk7cbwq26qd1ra-ncurses-6.6/lib --extra-lib-dirs=/nix/store/0djlg4g0b81w94k3vcaqsxsc2hh4kism-libffi-3.5.2/lib --extra-lib-dirs=/nix/store/md4paia7riiggyrj8p24c7a6vf8w7jz8-elfutils-0.194/lib --extra-lib-dirs=/nix/store/39vv2pf64gd8li48a4hpbhw2crzd8z5p-gmp-with-cxx-6.3.0/lib --extra-lib-dirs=/nix/store/7wwvald8lapkrsr72qanlw8blyn55ifx-numactl-2.0.18/lib --extra-lib-dirs=/nix/store/2djpcnj8a25viv1y24h3mziy1gsy3fc6-ghc-9.6.7/lib
149.36 s
[pathway-compat-filepath] Using Parsec parser
149.36 s
[pathway-compat-filepath] Configuring pathway-compat-filepath-0.0.1.0...
149.74 s
[pathway-compat-filepath] Flags chosen: noisy-deprecations=True, verify-no-recursion=False
149.74 s
[pathway-compat-filepath] Dependency base >=4.14.0 && <4.15 || >=4.15.0 && <4.16 || >=4.16.0 && <4.17 ||
149.74 s
[pathway-compat-filepath] >=4.17.0 && <4.18 || >=4.18.0 && <4.19 || >=4.19.0 && <4.20 || >=4.20.0 &&
149.74 s
[pathway-compat-filepath] <4.21 || >=4.21.0 && <4.22 || >=4.22.0 && <4.23: using base-4.18.3.0
149.74 s
[pathway-compat-filepath] Dependency extra: using extra-1.8.1
149.74 s
[pathway-compat-filepath] Dependency filepath >=1.4.2 && <1.5 || >=1.5.0 && <1.6: using
149.74 s
[pathway-compat-filepath] filepath-1.4.301.0
149.74 s
[pathway-compat-filepath] Dependency megaparsec >=9.0.1 && <9.1 || >=9.2.1 && <9.3 || >=9.5.0 && <9.6 ||
149.74 s
[pathway-compat-filepath] >=9.7.0 && <9.8: using megaparsec-9.7.0
149.74 s
[pathway-compat-filepath] Dependency pathway >=0.0.1 && <0.1: using pathway-0.0.1.0
149.74 s
[pathway-compat-filepath] Dependency pathway-compat-base >=0.0.1 && <0.1: using
149.74 s
[pathway-compat-filepath] pathway-compat-base-0.0.1.0
149.74 s
[pathway-compat-filepath] Dependency pathway-internal >=0.0.1 && <0.1: using pathway-internal-0.0.1.0
149.74 s
[pathway-compat-filepath] Dependency base >=4.14.0 && <4.15 || >=4.15.0 && <4.16 || >=4.16.0 && <4.17 ||
149.74 s
[pathway-compat-filepath] >=4.17.0 && <4.18 || >=4.18.0 && <4.19 || >=4.19.0 && <4.20 || >=4.20.0 &&
149.74 s
[pathway-compat-filepath] <4.21 || >=4.21.0 && <4.22 || >=4.22.0 && <4.23: using base-4.18.3.0
149.74 s
[pathway-compat-filepath] Dependency doctest >=0.16.3 && <0.17 || >=0.18.1 && <0.19 || >=0.20.1 && <0.21
149.74 s
[pathway-compat-filepath] || >=0.21.1 && <0.22 || >=0.22.2 && <0.23 || >=0.24.2 && <0.25: using
149.74 s
[pathway-compat-filepath] doctest-0.24.3
149.74 s
[pathway-compat-filepath] Dependency pathway-compat-filepath: using pathway-compat-filepath-0.0.1.0
150.16 s
[pathway-compat-filepath] Source component graph:
150.16 s
[pathway-compat-filepath] component lib
150.16 s
[pathway-compat-filepath] component test:doctests dependency lib
150.16 s
[pathway-compat-filepath] Configured component graph:
150.16 s
[pathway-compat-filepath] component pathway-compat-filepath-0.0.1.0-4Le08sqZwwxHUIaNWPZcs2
150.16 s
[pathway-compat-filepath] include base-4.18.3.0
150.16 s
[pathway-compat-filepath] include extra-1.8.1-FU1frm3XcM88A49dBkmtgI
150.16 s
[pathway-compat-filepath] include filepath-1.4.301.0
150.16 s
[pathway-compat-filepath] include megaparsec-9.7.0-EpAk7LLR2KBGAKafJPbXz1
150.16 s
[pathway-compat-filepath] include pathway-0.0.1.0-5VJXWbvreBAfybP2NROr3
150.16 s
[pathway-compat-filepath] include pathway-compat-base-0.0.1.0-E02izPYkwmmGdAPlQBKjbP
150.16 s
[pathway-compat-filepath] include pathway-internal-0.0.1.0-1xeSc3z2VhRIotiMz9hdL1
150.16 s
[pathway-compat-filepath] component pathway-compat-filepath-0.0.1.0-1CRX2L8nW586DbgyNTab4-doctests
150.16 s
[pathway-compat-filepath] include base-4.18.3.0
150.16 s
[pathway-compat-filepath] include doctest-0.24.3-ACQNy8u8jPjC50l4I3tyiL
150.16 s
[pathway-compat-filepath] include pathway-compat-filepath-0.0.1.0-4Le08sqZwwxHUIaNWPZcs2
150.16 s
[pathway-compat-filepath] Linked component graph:
150.16 s
[pathway-compat-filepath] unit pathway-compat-filepath-0.0.1.0-4Le08sqZwwxHUIaNWPZcs2
150.16 s
[pathway-compat-filepath] include base-4.18.3.0
150.16 s
[pathway-compat-filepath] include extra-1.8.1-FU1frm3XcM88A49dBkmtgI
150.16 s
[pathway-compat-filepath] include filepath-1.4.301.0
150.16 s
[pathway-compat-filepath] include megaparsec-9.7.0-EpAk7LLR2KBGAKafJPbXz1
150.16 s
[pathway-compat-filepath] include pathway-0.0.1.0-5VJXWbvreBAfybP2NROr3
150.16 s
[pathway-compat-filepath] include pathway-compat-base-0.0.1.0-E02izPYkwmmGdAPlQBKjbP
150.16 s
[pathway-compat-filepath] include pathway-internal-0.0.1.0-1xeSc3z2VhRIotiMz9hdL1
150.16 s
[pathway-compat-filepath] Common.FilePath=pathway-compat-filepath-0.0.1.0-4Le08sqZwwxHUIaNWPZcs2:Common.FilePath,Common.OsPath=pathway-compat-filepath-0.0.1.0-4Le08sqZwwxHUIaNWPZcs2:Common.OsPath,System.FilePath=pathway-compat-filepath-0.0.1.0-4Le08sqZwwxHUIaNWPZcs2:System.FilePath,System.FilePath.Overlay=pathway-compat-filepath-0.0.1.0-4Le08sqZwwxHUIaNWPZcs2:System.FilePath.Overlay,System.FilePath.Pathway=pathway-compat-filepath-0.0.1.0-4Le08sqZwwxHUIaNWPZcs2:System.FilePath.Pathway,System.FilePath.Thin=pathway-compat-filepath-0.0.1.0-4Le08sqZwwxHUIaNWPZcs2:System.FilePath.Thin,System.OsPath=pathway-compat-filepath-0.0.1.0-4Le08sqZwwxHUIaNWPZcs2:System.OsPath,System.OsPath.Overlay=pathway-compat-filepath-0.0.1.0-4Le08sqZwwxHUIaNWPZcs2:System.OsPath.Overlay,System.OsPath.Pathway=pathway-compat-filepath-0.0.1.0-4Le08sqZwwxHUIaNWPZcs2:System.OsPath.Pathway,System.OsPath.Thin=pathway-compat-filepath-0.0.1.0-4Le08sqZwwxHUIaNWPZcs2:System.OsPath.Thin
150.16 s
[pathway-compat-filepath] unit pathway-compat-filepath-0.0.1.0-1CRX2L8nW586DbgyNTab4-doctests
150.16 s
[pathway-compat-filepath] include base-4.18.3.0
150.16 s
[pathway-compat-filepath] include doctest-0.24.3-ACQNy8u8jPjC50l4I3tyiL
150.16 s
[pathway-compat-filepath] include pathway-compat-filepath-0.0.1.0-4Le08sqZwwxHUIaNWPZcs2
150.16 s
[pathway-compat-filepath] Ready component graph:
150.16 s
[pathway-compat-filepath] definite pathway-compat-filepath-0.0.1.0-4Le08sqZwwxHUIaNWPZcs2
150.16 s
[pathway-compat-filepath] depends base-4.18.3.0
150.16 s
[pathway-compat-filepath] depends extra-1.8.1-FU1frm3XcM88A49dBkmtgI
150.16 s
[pathway-compat-filepath] depends filepath-1.4.301.0
150.16 s
[pathway-compat-filepath] depends megaparsec-9.7.0-EpAk7LLR2KBGAKafJPbXz1
150.16 s
[pathway-compat-filepath] depends pathway-0.0.1.0-5VJXWbvreBAfybP2NROr3
150.16 s
[pathway-compat-filepath] depends pathway-compat-base-0.0.1.0-E02izPYkwmmGdAPlQBKjbP
150.16 s
[pathway-compat-filepath] depends pathway-internal-0.0.1.0-1xeSc3z2VhRIotiMz9hdL1
150.16 s
[pathway-compat-filepath] definite pathway-compat-filepath-0.0.1.0-1CRX2L8nW586DbgyNTab4-doctests
150.16 s
[pathway-compat-filepath] depends base-4.18.3.0
150.16 s
[pathway-compat-filepath] depends doctest-0.24.3-ACQNy8u8jPjC50l4I3tyiL
150.16 s
[pathway-compat-filepath] depends pathway-compat-filepath-0.0.1.0-4Le08sqZwwxHUIaNWPZcs2
150.16 s
[pathway-compat-filepath] Using Cabal-3.10.3.0 compiled by ghc-9.6
150.16 s
[pathway-compat-filepath] Using compiler: ghc-9.6.7
150.16 s
[pathway-compat-filepath] Using install prefix:
150.16 s
[pathway-compat-filepath] /nix/store/764l5kra2q49626jx0rg4mkpkja5c8jz-pathway-compat-filepath-0.0.1.0
150.16 s
[pathway-compat-filepath] Executables installed in:
150.16 s
[pathway-compat-filepath] /nix/store/764l5kra2q49626jx0rg4mkpkja5c8jz-pathway-compat-filepath-0.0.1.0/bin
150.16 s
[pathway-compat-filepath] Libraries installed in:
150.16 s
[pathway-compat-filepath] /nix/store/764l5kra2q49626jx0rg4mkpkja5c8jz-pathway-compat-filepath-0.0.1.0/lib/ghc-9.6.7/lib/x86_64-linux-ghc-9.6.7/pathway-compat-filepath-0.0.1.0-4Le08sqZwwxHUIaNWPZcs2
150.16 s
[pathway-compat-filepath] Dynamic Libraries installed in:
150.16 s
[pathway-compat-filepath] /nix/store/764l5kra2q49626jx0rg4mkpkja5c8jz-pathway-compat-filepath-0.0.1.0/lib/ghc-9.6.7/lib/x86_64-linux-ghc-9.6.7
150.16 s
[pathway-compat-filepath] Private executables installed in:
150.16 s
[pathway-compat-filepath] /nix/store/764l5kra2q49626jx0rg4mkpkja5c8jz-pathway-compat-filepath-0.0.1.0/libexec/x86_64-linux-ghc-9.6.7/pathway-compat-filepath-0.0.1.0
150.16 s
[pathway-compat-filepath] Data files installed in:
150.16 s
[pathway-compat-filepath] /nix/store/764l5kra2q49626jx0rg4mkpkja5c8jz-pathway-compat-filepath-0.0.1.0/share/x86_64-linux-ghc-9.6.7/pathway-compat-filepath-0.0.1.0
150.16 s
[pathway-compat-filepath] Documentation installed in:
150.16 s
[pathway-compat-filepath] /nix/store/5iwzgix3zvg58nzmgb744x9xh6gy8ijk-pathway-compat-filepath-0.0.1.0-doc/share/doc/pathway-compat-filepath-0.0.1.0
150.16 s
[pathway-compat-filepath] Configuration files installed in:
150.16 s
[pathway-compat-filepath] /nix/store/764l5kra2q49626jx0rg4mkpkja5c8jz-pathway-compat-filepath-0.0.1.0/etc
150.16 s
[pathway-compat-filepath] No alex found
150.16 s
[pathway-compat-filepath] Using ar found on system at:
150.16 s
[pathway-compat-filepath] /nix/store/zjraf40s86y3iwhp626b934r5y6ldkbb-binutils-wrapper-2.46/bin/ar
150.16 s
[pathway-compat-filepath] No c2hs found
150.16 s
[pathway-compat-filepath] No cpphs found
150.16 s
[pathway-compat-filepath] Using doctest version 0.24.3 found on system at:
150.16 s
[pathway-compat-filepath] /nix/store/s48k56ayjjxwdbz9y7d8mnqwlcjfi1a8-doctest-0.24.3/bin/doctest
150.16 s
[pathway-compat-filepath] Using gcc version 15.2.0 given by user at:
150.16 s
[pathway-compat-filepath] /nix/store/29qjlshvklnyr67nhpprzgb9igmsfsjj-gcc-wrapper-15.2.0/bin/gcc
150.16 s
[pathway-compat-filepath] Using ghc version 9.6.7 found on system at:
150.16 s
[pathway-compat-filepath] /nix/store/2djpcnj8a25viv1y24h3mziy1gsy3fc6-ghc-9.6.7/bin/ghc
150.16 s
[pathway-compat-filepath] Using ghc-pkg version 9.6.7 found on system at:
150.16 s
[pathway-compat-filepath] /nix/store/2djpcnj8a25viv1y24h3mziy1gsy3fc6-ghc-9.6.7/bin/ghc-pkg-9.6.7
150.16 s
[pathway-compat-filepath] No ghcjs found
150.16 s
[pathway-compat-filepath] No ghcjs-pkg found
150.16 s
[pathway-compat-filepath] No greencard found
150.16 s
[pathway-compat-filepath] Using haddock version 2.29.2 found on system at:
150.16 s
[pathway-compat-filepath] /nix/store/2djpcnj8a25viv1y24h3mziy1gsy3fc6-ghc-9.6.7/bin/haddock-ghc-9.6.7
150.16 s
[pathway-compat-filepath] No happy found
150.16 s
[pathway-compat-filepath] Using haskell-suite found on system at: haskell-suite-dummy-location
150.16 s
[pathway-compat-filepath] Using haskell-suite-pkg found on system at: haskell-suite-pkg-dummy-location
150.16 s
[pathway-compat-filepath] No hmake found
150.16 s
[pathway-compat-filepath] Using hpc version 0.68 found on system at:
150.16 s
[pathway-compat-filepath] /nix/store/2djpcnj8a25viv1y24h3mziy1gsy3fc6-ghc-9.6.7/bin/hpc-ghc-9.6.7
150.16 s
[pathway-compat-filepath] Using hsc2hs version 0.68.9 found on system at:
150.16 s
[pathway-compat-filepath] /nix/store/2djpcnj8a25viv1y24h3mziy1gsy3fc6-ghc-9.6.7/bin/hsc2hs-ghc-9.6.7
150.16 s
[pathway-compat-filepath] Using hscolour version 1.25 found on system at:
150.16 s
[pathway-compat-filepath] /nix/store/2x19jxh5g98bv0s06mdj71c1hmxi54yl-hscolour-1.25/bin/HsColour
150.16 s
[pathway-compat-filepath] No jhc found
150.16 s
[pathway-compat-filepath] Using ld found on system at:
150.16 s
[pathway-compat-filepath] /nix/store/zjraf40s86y3iwhp626b934r5y6ldkbb-binutils-wrapper-2.46/bin/ld.gold
150.16 s
[pathway-compat-filepath] No pkg-config found
150.16 s
[pathway-compat-filepath] Using runghc version 9.6.7 found on system at:
150.16 s
[pathway-compat-filepath] /nix/store/2djpcnj8a25viv1y24h3mziy1gsy3fc6-ghc-9.6.7/bin/runghc-9.6.7
150.16 s
[pathway-compat-filepath] Using strip version 2.46 found on system at:
150.16 s
[pathway-compat-filepath] /nix/store/29qjlshvklnyr67nhpprzgb9igmsfsjj-gcc-wrapper-15.2.0/bin/strip
150.16 s
[pathway-compat-filepath] Using tar found on system at:
150.16 s
[pathway-compat-filepath] /nix/store/z5mq2sam4484prf3kv6v6vjw1m0i7j24-gnutar-1.35/bin/tar
150.16 s
[pathway-compat-filepath] No uhc found
150.63 s
[pathway-compat-filepath] Phase: buildPhase
150.72 s
[pathway-compat-filepath] Preprocessing library for pathway-compat-filepath-0.0.1.0..
150.72 s
[pathway-compat-filepath] Building library for pathway-compat-filepath-0.0.1.0..
150.81 s
[pathway-compat-filepath] [ 1 of 10] Compiling Common.FilePath ( src/Common/FilePath.hs, dist/build/Common/FilePath.o, dist/build/Common/FilePath.dyn_o )
151.10 s
[pathway-compat-filepath] [ 2 of 10] Compiling Common.OsPath ( src/Common/OsPath.hs, dist/build/Common/OsPath.o, dist/build/Common/OsPath.dyn_o )
151.10 s
[pathway-compat-filepath]
151.10 s
[pathway-compat-filepath] src/Common/OsPath.hs:87:23: error : [ GHC-76037 ]
151.10 s
[pathway-compat-filepath] Not in scope: ‘O.unsafeEncodeUtf’
151.10 s
[pathway-compat-filepath] NB: the module ‘System.OsPath’ does not export ‘unsafeEncodeUtf’.
151.10 s
[pathway-compat-filepath] |
151.10 s
[pathway-compat-filepath] 87 | Format.parent = O.unsafeEncodeUtf "..",
151.10 s
[pathway-compat-filepath] | ^^^^^^^^^^^^^^^^^
151.10 s
[pathway-compat-filepath] [ 3 of 10] Compiling System.FilePath.Thin ( src/System/FilePath/Thin.hs, dist/build/System/FilePath/Thin.o, dist/build/System/FilePath/Thin.dyn_o )
151.25 s
[pathway-compat-filepath] [ 4 of 10] Compiling System.FilePath.Pathway ( src/System/FilePath/Pathway.hs, dist/build/System/FilePath/Pathway.o, dist/build/System/FilePath/Pathway.dyn_o )
151.28 s
[pathway-compat-filepath] [ 5 of 10] Compiling System.FilePath.Overlay ( src/System/FilePath/Overlay.hs, dist/build/System/FilePath/Overlay.o, dist/build/System/FilePath/Overlay.dyn_o )
151.30 s
[pathway-compat-filepath] [ 6 of 10] Compiling System.FilePath ( src/System/FilePath.hs, dist/build/System/FilePath.o, dist/build/System/FilePath.dyn_o )
151.43 s
Progress: 7 of 19 built (1 failed), 164 of 164 downloaded from cache
151.43 s
Failed to build pathway-compat-filepath after 4.1s
151.43 s
error: Cannot build '/nix/store/6lbsvjysc8745w76x16kfxcnc6z3dmn1-pathway-compat-filepath-0.0.1.0.drv '.
151.43 s
Reason: builder failed with exit code 1 .
151.43 s
Output paths:
151.43 s
/nix/store/5iwzgix3zvg58nzmgb744x9xh6gy8ijk-pathway-compat-filepath-0.0.1.0-doc
151.43 s
/nix/store/764l5kra2q49626jx0rg4mkpkja5c8jz-pathway-compat-filepath-0.0.1.0
151.43 s
Last 151 log lines:
151.43 s
> Running phase: setupCompilerEnvironmentPhase
151.43 s
> Build with /nix/store/2djpcnj8a25viv1y24h3mziy1gsy3fc6-ghc-9.6.7.
151.43 s
> Running phase: unpackPhase
151.43 s
> unpacking source archive /nix/store/99h2nwiw8z9r3kqrm9kdhv4k4sf61d7w-filepath
151.43 s
> source root is filepath
151.43 s
> Running phase: patchPhase
151.43 s
> Running phase: compileBuildDriverPhase
151.43 s
> setupCompileFlags: -package-db=/build/tmp.oq9eww1tzu/setup-package.conf.d -threaded
151.43 s
> [1 of 2] Compiling Main ( Setup.hs, /build/tmp.oq9eww1tzu/Main.o )
151.43 s
> [2 of 2] Linking Setup
151.43 s
> Running phase: updateAutotoolsGnuConfigScriptsPhase
151.43 s
> Running phase: configurePhase
151.43 s
> configureFlags: --verbose --prefix=/nix/store/764l5kra2q49626jx0rg4mkpkja5c8jz-pathway-compat-filepath-0.0.1.0 --libdir=$prefix/lib/$compiler/lib --libsubdir=$abi/$libname --docdir=/nix/store/5iwzgix3zvg58nzmgb744x9xh6gy8ijk-pathway-compat-filepath-0.0.1.0-doc/share/doc/pathway-compat-filepath-0.0.1.0 --with-gcc=gcc --package-db=/build/tmp.oq9eww1tzu/package.conf.d --ghc-option=-j16 --ghc-option=+RTS --ghc-option=-A64M --ghc-option=-RTS --enable-library-profiling --profiling-detail=exported-functions --disable-profiling --enable-shared --disable-coverage --enable-static --disable-executable-dynamic --enable-tests --disable-benchmarks --enable-library-vanilla --disable-library-for-ghci --enable-split-sections --enable-library-stripping --enable-executable-stripping --ghc-option=-haddock --ghc-options=-Werror --extra-lib-dirs=/nix/store/pndhkk0l649lm1sj0mxk7cbwq26qd1ra-ncurses-6.6/lib --extra-lib-dirs=/nix/store/0djlg4g0b81w94k3vcaqsxsc2hh4kism-libffi-3.5.2/lib --extra-lib-dirs=/nix/store/md4paia7riiggyrj8p24c7a6vf8w7jz8-elfutils-0.194/lib --extra-lib-dirs=/nix/store/39vv2pf64gd8li48a4hpbhw2crzd8z5p-gmp-with-cxx-6.3.0/lib --extra-lib-dirs=/nix/store/7wwvald8lapkrsr72qanlw8blyn55ifx-numactl-2.0.18/lib --extra-lib-dirs=/nix/store/2djpcnj8a25viv1y24h3mziy1gsy3fc6-ghc-9.6.7/lib
151.43 s
> Using Parsec parser
151.43 s
> Configuring pathway-compat-filepath-0.0.1.0...
151.43 s
> Flags chosen: noisy-deprecations=True, verify-no-recursion=False
151.43 s
> Dependency base >=4.14.0 && <4.15 || >=4.15.0 && <4.16 || >=4.16.0 && <4.17 ||
151.43 s
> >=4.17.0 && <4.18 || >=4.18.0 && <4.19 || >=4.19.0 && <4.20 || >=4.20.0 &&
151.43 s
> <4.21 || >=4.21.0 && <4.22 || >=4.22.0 && <4.23: using base-4.18.3.0
151.43 s
> Dependency extra: using extra-1.8.1
151.43 s
> Dependency filepath >=1.4.2 && <1.5 || >=1.5.0 && <1.6: using
151.43 s
> filepath-1.4.301.0
151.43 s
> Dependency megaparsec >=9.0.1 && <9.1 || >=9.2.1 && <9.3 || >=9.5.0 && <9.6 ||
151.43 s
> >=9.7.0 && <9.8: using megaparsec-9.7.0
151.43 s
> Dependency pathway >=0.0.1 && <0.1: using pathway-0.0.1.0
151.43 s
> Dependency pathway-compat-base >=0.0.1 && <0.1: using
151.43 s
> pathway-compat-base-0.0.1.0
151.43 s
> Dependency pathway-internal >=0.0.1 && <0.1: using pathway-internal-0.0.1.0
151.43 s
> Dependency base >=4.14.0 && <4.15 || >=4.15.0 && <4.16 || >=4.16.0 && <4.17 ||
151.43 s
> >=4.17.0 && <4.18 || >=4.18.0 && <4.19 || >=4.19.0 && <4.20 || >=4.20.0 &&
151.43 s
> <4.21 || >=4.21.0 && <4.22 || >=4.22.0 && <4.23: using base-4.18.3.0
151.43 s
> Dependency doctest >=0.16.3 && <0.17 || >=0.18.1 && <0.19 || >=0.20.1 && <0.21
151.43 s
> || >=0.21.1 && <0.22 || >=0.22.2 && <0.23 || >=0.24.2 && <0.25: using
151.43 s
> doctest-0.24.3
151.43 s
> Dependency pathway-compat-filepath: using pathway-compat-filepath-0.0.1.0
151.43 s
> Source component graph:
151.43 s
> component lib
151.43 s
> component test:doctests dependency lib
151.43 s
> Configured component graph:
151.43 s
> component pathway-compat-filepath-0.0.1.0-4Le08sqZwwxHUIaNWPZcs2
151.43 s
> include base-4.18.3.0
151.43 s
> include extra-1.8.1-FU1frm3XcM88A49dBkmtgI
151.43 s
> include filepath-1.4.301.0
151.43 s
> include megaparsec-9.7.0-EpAk7LLR2KBGAKafJPbXz1
151.43 s
> include pathway-0.0.1.0-5VJXWbvreBAfybP2NROr3
151.43 s
> include pathway-compat-base-0.0.1.0-E02izPYkwmmGdAPlQBKjbP
151.43 s
> include pathway-internal-0.0.1.0-1xeSc3z2VhRIotiMz9hdL1
151.43 s
> component pathway-compat-filepath-0.0.1.0-1CRX2L8nW586DbgyNTab4-doctests
151.43 s
> include base-4.18.3.0
151.43 s
> include doctest-0.24.3-ACQNy8u8jPjC50l4I3tyiL
151.43 s
> include pathway-compat-filepath-0.0.1.0-4Le08sqZwwxHUIaNWPZcs2
151.43 s
> Linked component graph:
151.43 s
> unit pathway-compat-filepath-0.0.1.0-4Le08sqZwwxHUIaNWPZcs2
151.43 s
> include base-4.18.3.0
151.43 s
> include extra-1.8.1-FU1frm3XcM88A49dBkmtgI
151.43 s
> include filepath-1.4.301.0
151.43 s
> include megaparsec-9.7.0-EpAk7LLR2KBGAKafJPbXz1
151.43 s
> include pathway-0.0.1.0-5VJXWbvreBAfybP2NROr3
151.43 s
> include pathway-compat-base-0.0.1.0-E02izPYkwmmGdAPlQBKjbP
151.43 s
> include pathway-internal-0.0.1.0-1xeSc3z2VhRIotiMz9hdL1
151.43 s
> Common.FilePath=pathway-compat-filepath-0.0.1.0-4Le08sqZwwxHUIaNWPZcs2:Common.FilePath,Common.OsPath=pathway-compat-filepath-0.0.1.0-4Le08sqZwwxHUIaNWPZcs2:Common.OsPath,System.FilePath=pathway-compat-filepath-0.0.1.0-4Le08sqZwwxHUIaNWPZcs2:System.FilePath,System.FilePath.Overlay=pathway-compat-filepath-0.0.1.0-4Le08sqZwwxHUIaNWPZcs2:System.FilePath.Overlay,System.FilePath.Pathway=pathway-compat-filepath-0.0.1.0-4Le08sqZwwxHUIaNWPZcs2:System.FilePath.Pathway,System.FilePath.Thin=pathway-compat-filepath-0.0.1.0-4Le08sqZwwxHUIaNWPZcs2:System.FilePath.Thin,System.OsPath=pathway-compat-filepath-0.0.1.0-4Le08sqZwwxHUIaNWPZcs2:System.OsPath,System.OsPath.Overlay=pathway-compat-filepath-0.0.1.0-4Le08sqZwwxHUIaNWPZcs2:System.OsPath.Overlay,System.OsPath.Pathway=pathway-compat-filepath-0.0.1.0-4Le08sqZwwxHUIaNWPZcs2:System.OsPath.Pathway,System.OsPath.Thin=pathway-compat-filepath-0.0.1.0-4Le08sqZwwxHUIaNWPZcs2:System.OsPath.Thin
151.43 s
> unit pathway-compat-filepath-0.0.1.0-1CRX2L8nW586DbgyNTab4-doctests
151.43 s
> include base-4.18.3.0
151.43 s
> include doctest-0.24.3-ACQNy8u8jPjC50l4I3tyiL
151.43 s
> include pathway-compat-filepath-0.0.1.0-4Le08sqZwwxHUIaNWPZcs2
151.43 s
> Ready component graph:
151.43 s
> definite pathway-compat-filepath-0.0.1.0-4Le08sqZwwxHUIaNWPZcs2
151.43 s
> depends base-4.18.3.0
151.43 s
> depends extra-1.8.1-FU1frm3XcM88A49dBkmtgI
151.43 s
> depends filepath-1.4.301.0
151.43 s
> depends megaparsec-9.7.0-EpAk7LLR2KBGAKafJPbXz1
151.43 s
> depends pathway-0.0.1.0-5VJXWbvreBAfybP2NROr3
151.43 s
> depends pathway-compat-base-0.0.1.0-E02izPYkwmmGdAPlQBKjbP
151.43 s
> depends pathway-internal-0.0.1.0-1xeSc3z2VhRIotiMz9hdL1
151.43 s
> definite pathway-compat-filepath-0.0.1.0-1CRX2L8nW586DbgyNTab4-doctests
151.43 s
> depends base-4.18.3.0
151.43 s
> depends doctest-0.24.3-ACQNy8u8jPjC50l4I3tyiL
151.43 s
> depends pathway-compat-filepath-0.0.1.0-4Le08sqZwwxHUIaNWPZcs2
151.43 s
> Using Cabal-3.10.3.0 compiled by ghc-9.6
151.43 s
> Using compiler: ghc-9.6.7
151.43 s
> Using install prefix:
151.43 s
> /nix/store/764l5kra2q49626jx0rg4mkpkja5c8jz-pathway-compat-filepath-0.0.1.0
151.43 s
> Executables installed in:
151.43 s
> /nix/store/764l5kra2q49626jx0rg4mkpkja5c8jz-pathway-compat-filepath-0.0.1.0/bin
151.43 s
> Libraries installed in:
151.43 s
> /nix/store/764l5kra2q49626jx0rg4mkpkja5c8jz-pathway-compat-filepath-0.0.1.0/lib/ghc-9.6.7/lib/x86_64-linux-ghc-9.6.7/pathway-compat-filepath-0.0.1.0-4Le08sqZwwxHUIaNWPZcs2
151.43 s
> Dynamic Libraries installed in:
151.43 s
> /nix/store/764l5kra2q49626jx0rg4mkpkja5c8jz-pathway-compat-filepath-0.0.1.0/lib/ghc-9.6.7/lib/x86_64-linux-ghc-9.6.7
151.43 s
> Private executables installed in:
151.43 s
> /nix/store/764l5kra2q49626jx0rg4mkpkja5c8jz-pathway-compat-filepath-0.0.1.0/libexec/x86_64-linux-ghc-9.6.7/pathway-compat-filepath-0.0.1.0
151.43 s
> Data files installed in:
151.43 s
> /nix/store/764l5kra2q49626jx0rg4mkpkja5c8jz-pathway-compat-filepath-0.0.1.0/share/x86_64-linux-ghc-9.6.7/pathway-compat-filepath-0.0.1.0
151.43 s
> Documentation installed in:
151.43 s
> /nix/store/5iwzgix3zvg58nzmgb744x9xh6gy8ijk-pathway-compat-filepath-0.0.1.0-doc/share/doc/pathway-compat-filepath-0.0.1.0
151.43 s
> Configuration files installed in:
151.43 s
> /nix/store/764l5kra2q49626jx0rg4mkpkja5c8jz-pathway-compat-filepath-0.0.1.0/etc
151.43 s
> No alex found
151.43 s
> Using ar found on system at:
151.43 s
> /nix/store/zjraf40s86y3iwhp626b934r5y6ldkbb-binutils-wrapper-2.46/bin/ar
151.43 s
> No c2hs found
151.43 s
> No cpphs found
151.43 s
> Using doctest version 0.24.3 found on system at:
151.43 s
> /nix/store/s48k56ayjjxwdbz9y7d8mnqwlcjfi1a8-doctest-0.24.3/bin/doctest
151.43 s
> Using gcc version 15.2.0 given by user at:
151.43 s
> /nix/store/29qjlshvklnyr67nhpprzgb9igmsfsjj-gcc-wrapper-15.2.0/bin/gcc
151.43 s
> Using ghc version 9.6.7 found on system at:
151.43 s
> /nix/store/2djpcnj8a25viv1y24h3mziy1gsy3fc6-ghc-9.6.7/bin/ghc
151.43 s
> Using ghc-pkg version 9.6.7 found on system at:
151.43 s
> /nix/store/2djpcnj8a25viv1y24h3mziy1gsy3fc6-ghc-9.6.7/bin/ghc-pkg-9.6.7
151.43 s
> No ghcjs found
151.43 s
> No ghcjs-pkg found
151.43 s
> No greencard found
151.43 s
> Using haddock version 2.29.2 found on system at:
151.43 s
> /nix/store/2djpcnj8a25viv1y24h3mziy1gsy3fc6-ghc-9.6.7/bin/haddock-ghc-9.6.7
151.43 s
> No happy found
151.43 s
> Using haskell-suite found on system at: haskell-suite-dummy-location
151.43 s
> Using haskell-suite-pkg found on system at: haskell-suite-pkg-dummy-location
151.43 s
> No hmake found
151.43 s
> Using hpc version 0.68 found on system at:
151.43 s
> /nix/store/2djpcnj8a25viv1y24h3mziy1gsy3fc6-ghc-9.6.7/bin/hpc-ghc-9.6.7
151.43 s
> Using hsc2hs version 0.68.9 found on system at:
151.43 s
> /nix/store/2djpcnj8a25viv1y24h3mziy1gsy3fc6-ghc-9.6.7/bin/hsc2hs-ghc-9.6.7
151.43 s
> Using hscolour version 1.25 found on system at:
151.43 s
> /nix/store/2x19jxh5g98bv0s06mdj71c1hmxi54yl-hscolour-1.25/bin/HsColour
151.43 s
> No jhc found
151.43 s
> Using ld found on system at:
151.43 s
> /nix/store/zjraf40s86y3iwhp626b934r5y6ldkbb-binutils-wrapper-2.46/bin/ld.gold
151.43 s
> No pkg-config found
151.43 s
> Using runghc version 9.6.7 found on system at:
151.43 s
> /nix/store/2djpcnj8a25viv1y24h3mziy1gsy3fc6-ghc-9.6.7/bin/runghc-9.6.7
151.43 s
> Using strip version 2.46 found on system at:
151.43 s
> /nix/store/29qjlshvklnyr67nhpprzgb9igmsfsjj-gcc-wrapper-15.2.0/bin/strip
151.43 s
> Using tar found on system at:
151.43 s
> /nix/store/z5mq2sam4484prf3kv6v6vjw1m0i7j24-gnutar-1.35/bin/tar
151.43 s
> No uhc found
151.43 s
> Running phase: buildPhase
151.43 s
> Preprocessing library for pathway-compat-filepath-0.0.1.0..
151.43 s
> Building library for pathway-compat-filepath-0.0.1.0..
151.43 s
> [ 1 of 10] Compiling Common.FilePath ( src/Common/FilePath.hs, dist/build/Common/FilePath.o, dist/build/Common/FilePath.dyn_o )
151.43 s
> [ 2 of 10] Compiling Common.OsPath ( src/Common/OsPath.hs, dist/build/Common/OsPath.o, dist/build/Common/OsPath.dyn_o )
151.43 s
>
151.43 s
> src/Common/OsPath.hs:87:23: error : [ GHC-76037 ]
151.43 s
> Not in scope: ‘O.unsafeEncodeUtf’
151.43 s
> NB: the module ‘System.OsPath’ does not export ‘unsafeEncodeUtf’.
151.43 s
> |
151.43 s
> 87 | Format.parent = O.unsafeEncodeUtf "..",
151.43 s
> | ^^^^^^^^^^^^^^^^^
151.43 s
> [ 3 of 10] Compiling System.FilePath.Thin ( src/System/FilePath/Thin.hs, dist/build/System/FilePath/Thin.o, dist/build/System/FilePath/Thin.dyn_o )
151.43 s
> [ 4 of 10] Compiling System.FilePath.Pathway ( src/System/FilePath/Pathway.hs, dist/build/System/FilePath/Pathway.o, dist/build/System/FilePath/Pathway.dyn_o )
151.43 s
> [ 5 of 10] Compiling System.FilePath.Overlay ( src/System/FilePath/Overlay.hs, dist/build/System/FilePath/Overlay.o, dist/build/System/FilePath/Overlay.dyn_o )
151.43 s
> [ 6 of 10] Compiling System.FilePath ( src/System/FilePath.hs, dist/build/System/FilePath.o, dist/build/System/FilePath.dyn_o )
151.43 s
For full logs, run:
151.43 s
nix log /nix/store/6lbsvjysc8745w76x16kfxcnc6z3dmn1-pathway-compat-filepath-0.0.1.0.drv
151.43 s
error: Cannot build '/nix/store/6lbsvjysc8745w76x16kfxcnc6z3dmn1-pathway-compat-filepath-0.0.1.0.drv '.
151.43 s
Reason: builder failed with exit code 1 .
151.43 s
Output paths:
151.43 s
/nix/store/5iwzgix3zvg58nzmgb744x9xh6gy8ijk-pathway-compat-filepath-0.0.1.0-doc
151.43 s
/nix/store/764l5kra2q49626jx0rg4mkpkja5c8jz-pathway-compat-filepath-0.0.1.0
151.43 s
Last 151 log lines:
151.43 s
> Running phase: setupCompilerEnvironmentPhase
151.43 s
> Build with /nix/store/2djpcnj8a25viv1y24h3mziy1gsy3fc6-ghc-9.6.7.
151.43 s
> Running phase: unpackPhase
151.43 s
> unpacking source archive /nix/store/99h2nwiw8z9r3kqrm9kdhv4k4sf61d7w-filepath
151.43 s
> source root is filepath
151.43 s
> Running phase: patchPhase
151.43 s
> Running phase: compileBuildDriverPhase
151.43 s
> setupCompileFlags: -package-db=/build/tmp.oq9eww1tzu/setup-package.conf.d -threaded
151.43 s
> [1 of 2] Compiling Main ( Setup.hs, /build/tmp.oq9eww1tzu/Main.o )
151.43 s
> [2 of 2] Linking Setup
151.43 s
> Running phase: updateAutotoolsGnuConfigScriptsPhase
151.43 s
> Running phase: configurePhase
151.43 s
> configureFlags: --verbose --prefix=/nix/store/764l5kra2q49626jx0rg4mkpkja5c8jz-pathway-compat-filepath-0.0.1.0 --libdir=$prefix/lib/$compiler/lib --libsubdir=$abi/$libname --docdir=/nix/store/5iwzgix3zvg58nzmgb744x9xh6gy8ijk-pathway-compat-filepath-0.0.1.0-doc/share/doc/pathway-compat-filepath-0.0.1.0 --with-gcc=gcc --package-db=/build/tmp.oq9eww1tzu/package.conf.d --ghc-option=-j16 --ghc-option=+RTS --ghc-option=-A64M --ghc-option=-RTS --enable-library-profiling --profiling-detail=exported-functions --disable-profiling --enable-shared --disable-coverage --enable-static --disable-executable-dynamic --enable-tests --disable-benchmarks --enable-library-vanilla --disable-library-for-ghci --enable-split-sections --enable-library-stripping --enable-executable-stripping --ghc-option=-haddock --ghc-options=-Werror --extra-lib-dirs=/nix/store/pndhkk0l649lm1sj0mxk7cbwq26qd1ra-ncurses-6.6/lib --extra-lib-dirs=/nix/store/0djlg4g0b81w94k3vcaqsxsc2hh4kism-libffi-3.5.2/lib --extra-lib-dirs=/nix/store/md4paia7riiggyrj8p24c7a6vf8w7jz8-elfutils-0.194/lib --extra-lib-dirs=/nix/store/39vv2pf64gd8li48a4hpbhw2crzd8z5p-gmp-with-cxx-6.3.0/lib --extra-lib-dirs=/nix/store/7wwvald8lapkrsr72qanlw8blyn55ifx-numactl-2.0.18/lib --extra-lib-dirs=/nix/store/2djpcnj8a25viv1y24h3mziy1gsy3fc6-ghc-9.6.7/lib
151.43 s
> Using Parsec parser
151.43 s
> Configuring pathway-compat-filepath-0.0.1.0...
151.43 s
> Flags chosen: noisy-deprecations=True, verify-no-recursion=False
151.43 s
> Dependency base >=4.14.0 && <4.15 || >=4.15.0 && <4.16 || >=4.16.0 && <4.17 ||
151.43 s
> >=4.17.0 && <4.18 || >=4.18.0 && <4.19 || >=4.19.0 && <4.20 || >=4.20.0 &&
151.43 s
> <4.21 || >=4.21.0 && <4.22 || >=4.22.0 && <4.23: using base-4.18.3.0
151.43 s
> Dependency extra: using extra-1.8.1
151.43 s
> Dependency filepath >=1.4.2 && <1.5 || >=1.5.0 && <1.6: using
151.43 s
> filepath-1.4.301.0
151.43 s
> Dependency megaparsec >=9.0.1 && <9.1 || >=9.2.1 && <9.3 || >=9.5.0 && <9.6 ||
151.43 s
> >=9.7.0 && <9.8: using megaparsec-9.7.0
151.43 s
> Dependency pathway >=0.0.1 && <0.1: using pathway-0.0.1.0
151.43 s
> Dependency pathway-compat-base >=0.0.1 && <0.1: using
151.43 s
> pathway-compat-base-0.0.1.0
151.43 s
> Dependency pathway-internal >=0.0.1 && <0.1: using pathway-internal-0.0.1.0
151.43 s
> Dependency base >=4.14.0 && <4.15 || >=4.15.0 && <4.16 || >=4.16.0 && <4.17 ||
151.43 s
> >=4.17.0 && <4.18 || >=4.18.0 && <4.19 || >=4.19.0 && <4.20 || >=4.20.0 &&
151.43 s
> <4.21 || >=4.21.0 && <4.22 || >=4.22.0 && <4.23: using base-4.18.3.0
151.43 s
> Dependency doctest >=0.16.3 && <0.17 || >=0.18.1 && <0.19 || >=0.20.1 && <0.21
151.43 s
> || >=0.21.1 && <0.22 || >=0.22.2 && <0.23 || >=0.24.2 && <0.25: using
151.43 s
> doctest-0.24.3
151.43 s
> Dependency pathway-compat-filepath: using pathway-compat-filepath-0.0.1.0
151.43 s
> Source component graph:
151.43 s
> component lib
151.43 s
> component test:doctests dependency lib
151.43 s
> Configured component graph:
151.43 s
> component pathway-compat-filepath-0.0.1.0-4Le08sqZwwxHUIaNWPZcs2
151.43 s
> include base-4.18.3.0
151.43 s
> include extra-1.8.1-FU1frm3XcM88A49dBkmtgI
151.43 s
> include filepath-1.4.301.0
151.43 s
> include megaparsec-9.7.0-EpAk7LLR2KBGAKafJPbXz1
151.43 s
> include pathway-0.0.1.0-5VJXWbvreBAfybP2NROr3
151.43 s
> include pathway-compat-base-0.0.1.0-E02izPYkwmmGdAPlQBKjbP
151.43 s
> include pathway-internal-0.0.1.0-1xeSc3z2VhRIotiMz9hdL1
151.43 s
> component pathway-compat-filepath-0.0.1.0-1CRX2L8nW586DbgyNTab4-doctests
151.43 s
> include base-4.18.3.0
151.43 s
> include doctest-0.24.3-ACQNy8u8jPjC50l4I3tyiL
151.43 s
> include pathway-compat-filepath-0.0.1.0-4Le08sqZwwxHUIaNWPZcs2
151.43 s
> Linked component graph:
151.43 s
> unit pathway-compat-filepath-0.0.1.0-4Le08sqZwwxHUIaNWPZcs2
151.43 s
> include base-4.18.3.0
151.43 s
> include extra-1.8.1-FU1frm3XcM88A49dBkmtgI
151.43 s
> include filepath-1.4.301.0
151.43 s
> include megaparsec-9.7.0-EpAk7LLR2KBGAKafJPbXz1
151.43 s
> include pathway-0.0.1.0-5VJXWbvreBAfybP2NROr3
151.43 s
> include pathway-compat-base-0.0.1.0-E02izPYkwmmGdAPlQBKjbP
151.43 s
> include pathway-internal-0.0.1.0-1xeSc3z2VhRIotiMz9hdL1
151.43 s
> Common.FilePath=pathway-compat-filepath-0.0.1.0-4Le08sqZwwxHUIaNWPZcs2:Common.FilePath,Common.OsPath=pathway-compat-filepath-0.0.1.0-4Le08sqZwwxHUIaNWPZcs2:Common.OsPath,System.FilePath=pathway-compat-filepath-0.0.1.0-4Le08sqZwwxHUIaNWPZcs2:System.FilePath,System.FilePath.Overlay=pathway-compat-filepath-0.0.1.0-4Le08sqZwwxHUIaNWPZcs2:System.FilePath.Overlay,System.FilePath.Pathway=pathway-compat-filepath-0.0.1.0-4Le08sqZwwxHUIaNWPZcs2:System.FilePath.Pathway,System.FilePath.Thin=pathway-compat-filepath-0.0.1.0-4Le08sqZwwxHUIaNWPZcs2:System.FilePath.Thin,System.OsPath=pathway-compat-filepath-0.0.1.0-4Le08sqZwwxHUIaNWPZcs2:System.OsPath,System.OsPath.Overlay=pathway-compat-filepath-0.0.1.0-4Le08sqZwwxHUIaNWPZcs2:System.OsPath.Overlay,System.OsPath.Pathway=pathway-compat-filepath-0.0.1.0-4Le08sqZwwxHUIaNWPZcs2:System.OsPath.Pathway,System.OsPath.Thin=pathway-compat-filepath-0.0.1.0-4Le08sqZwwxHUIaNWPZcs2:System.OsPath.Thin
151.43 s
> unit pathway-compat-filepath-0.0.1.0-1CRX2L8nW586DbgyNTab4-doctests
151.43 s
> include base-4.18.3.0
151.43 s
> include doctest-0.24.3-ACQNy8u8jPjC50l4I3tyiL
151.43 s
> include pathway-compat-filepath-0.0.1.0-4Le08sqZwwxHUIaNWPZcs2
151.43 s
> Ready component graph:
151.43 s
> definite pathway-compat-filepath-0.0.1.0-4Le08sqZwwxHUIaNWPZcs2
151.43 s
> depends base-4.18.3.0
151.43 s
> depends extra-1.8.1-FU1frm3XcM88A49dBkmtgI
151.43 s
> depends filepath-1.4.301.0
151.43 s
> depends megaparsec-9.7.0-EpAk7LLR2KBGAKafJPbXz1
151.43 s
> depends pathway-0.0.1.0-5VJXWbvreBAfybP2NROr3
151.43 s
> depends pathway-compat-base-0.0.1.0-E02izPYkwmmGdAPlQBKjbP
151.43 s
> depends pathway-internal-0.0.1.0-1xeSc3z2VhRIotiMz9hdL1
151.43 s
> definite pathway-compat-filepath-0.0.1.0-1CRX2L8nW586DbgyNTab4-doctests
151.43 s
> depends base-4.18.3.0
151.43 s
> depends doctest-0.24.3-ACQNy8u8jPjC50l4I3tyiL
151.43 s
> depends pathway-compat-filepath-0.0.1.0-4Le08sqZwwxHUIaNWPZcs2
151.43 s
> Using Cabal-3.10.3.0 compiled by ghc-9.6
151.43 s
> Using compiler: ghc-9.6.7
151.43 s
> Using install prefix:
151.43 s
> /nix/store/764l5kra2q49626jx0rg4mkpkja5c8jz-pathway-compat-filepath-0.0.1.0
151.43 s
> Executables installed in:
151.43 s
> /nix/store/764l5kra2q49626jx0rg4mkpkja5c8jz-pathway-compat-filepath-0.0.1.0/bin
151.43 s
> Libraries installed in:
151.43 s
> /nix/store/764l5kra2q49626jx0rg4mkpkja5c8jz-pathway-compat-filepath-0.0.1.0/lib/ghc-9.6.7/lib/x86_64-linux-ghc-9.6.7/pathway-compat-filepath-0.0.1.0-4Le08sqZwwxHUIaNWPZcs2
151.43 s
> Dynamic Libraries installed in:
151.43 s
> /nix/store/764l5kra2q49626jx0rg4mkpkja5c8jz-pathway-compat-filepath-0.0.1.0/lib/ghc-9.6.7/lib/x86_64-linux-ghc-9.6.7
151.43 s
> Private executables installed in:
151.43 s
> /nix/store/764l5kra2q49626jx0rg4mkpkja5c8jz-pathway-compat-filepath-0.0.1.0/libexec/x86_64-linux-ghc-9.6.7/pathway-compat-filepath-0.0.1.0
151.43 s
> Data files installed in:
151.43 s
> /nix/store/764l5kra2q49626jx0rg4mkpkja5c8jz-pathway-compat-filepath-0.0.1.0/share/x86_64-linux-ghc-9.6.7/pathway-compat-filepath-0.0.1.0
151.43 s
> Documentation installed in:
151.43 s
> /nix/store/5iwzgix3zvg58nzmgb744x9xh6gy8ijk-pathway-compat-filepath-0.0.1.0-doc/share/doc/pathway-compat-filepath-0.0.1.0
151.43 s
> Configuration files installed in:
151.43 s
> /nix/store/764l5kra2q49626jx0rg4mkpkja5c8jz-pathway-compat-filepath-0.0.1.0/etc
151.43 s
> No alex found
151.43 s
> Using ar found on system at:
151.43 s
> /nix/store/zjraf40s86y3iwhp626b934r5y6ldkbb-binutils-wrapper-2.46/bin/ar
151.43 s
> No c2hs found
151.43 s
> No cpphs found
151.43 s
> Using doctest version 0.24.3 found on system at:
151.43 s
> /nix/store/s48k56ayjjxwdbz9y7d8mnqwlcjfi1a8-doctest-0.24.3/bin/doctest
151.43 s
> Using gcc version 15.2.0 given by user at:
151.43 s
> /nix/store/29qjlshvklnyr67nhpprzgb9igmsfsjj-gcc-wrapper-15.2.0/bin/gcc
151.43 s
> Using ghc version 9.6.7 found on system at:
151.43 s
> /nix/store/2djpcnj8a25viv1y24h3mziy1gsy3fc6-ghc-9.6.7/bin/ghc
151.43 s
> Using ghc-pkg version 9.6.7 found on system at:
151.43 s
> /nix/store/2djpcnj8a25viv1y24h3mziy1gsy3fc6-ghc-9.6.7/bin/ghc-pkg-9.6.7
151.43 s
> No ghcjs found
151.43 s
> No ghcjs-pkg found
151.43 s
> No greencard found
151.43 s
> Using haddock version 2.29.2 found on system at:
151.43 s
> /nix/store/2djpcnj8a25viv1y24h3mziy1gsy3fc6-ghc-9.6.7/bin/haddock-ghc-9.6.7
151.43 s
> No happy found
151.43 s
> Using haskell-suite found on system at: haskell-suite-dummy-location
151.43 s
> Using haskell-suite-pkg found on system at: haskell-suite-pkg-dummy-location
151.43 s
> No hmake found
151.43 s
> Using hpc version 0.68 found on system at:
151.43 s
> /nix/store/2djpcnj8a25viv1y24h3mziy1gsy3fc6-ghc-9.6.7/bin/hpc-ghc-9.6.7
151.43 s
> Using hsc2hs version 0.68.9 found on system at:
151.43 s
> /nix/store/2djpcnj8a25viv1y24h3mziy1gsy3fc6-ghc-9.6.7/bin/hsc2hs-ghc-9.6.7
151.43 s
> Using hscolour version 1.25 found on system at:
151.43 s
> /nix/store/2x19jxh5g98bv0s06mdj71c1hmxi54yl-hscolour-1.25/bin/HsColour
151.43 s
> No jhc found
151.43 s
> Using ld found on system at:
151.43 s
> /nix/store/zjraf40s86y3iwhp626b934r5y6ldkbb-binutils-wrapper-2.46/bin/ld.gold
151.43 s
> No pkg-config found
151.43 s
> Using runghc version 9.6.7 found on system at:
151.43 s
> /nix/store/2djpcnj8a25viv1y24h3mziy1gsy3fc6-ghc-9.6.7/bin/runghc-9.6.7
151.43 s
> Using strip version 2.46 found on system at:
151.43 s
> /nix/store/29qjlshvklnyr67nhpprzgb9igmsfsjj-gcc-wrapper-15.2.0/bin/strip
151.43 s
> Using tar found on system at:
151.43 s
> /nix/store/z5mq2sam4484prf3kv6v6vjw1m0i7j24-gnutar-1.35/bin/tar
151.43 s
> No uhc found
151.43 s
> Running phase: buildPhase
151.43 s
> Preprocessing library for pathway-compat-filepath-0.0.1.0..
151.43 s
> Building library for pathway-compat-filepath-0.0.1.0..
151.43 s
> [ 1 of 10] Compiling Common.FilePath ( src/Common/FilePath.hs, dist/build/Common/FilePath.o, dist/build/Common/FilePath.dyn_o )
151.43 s
> [ 2 of 10] Compiling Common.OsPath ( src/Common/OsPath.hs, dist/build/Common/OsPath.o, dist/build/Common/OsPath.dyn_o )
151.43 s
>
151.43 s
> src/Common/OsPath.hs:87:23: error : [ GHC-76037 ]
151.43 s
> Not in scope: ‘O.unsafeEncodeUtf’
151.43 s
> NB: the module ‘System.OsPath’ does not export ‘unsafeEncodeUtf’.
151.43 s
> |
151.43 s
> 87 | Format.parent = O.unsafeEncodeUtf "..",
151.43 s
> | ^^^^^^^^^^^^^^^^^
151.43 s
> [ 3 of 10] Compiling System.FilePath.Thin ( src/System/FilePath/Thin.hs, dist/build/System/FilePath/Thin.o, dist/build/System/FilePath/Thin.dyn_o )
151.43 s
> [ 4 of 10] Compiling System.FilePath.Pathway ( src/System/FilePath/Pathway.hs, dist/build/System/FilePath/Pathway.o, dist/build/System/FilePath/Pathway.dyn_o )
151.43 s
> [ 5 of 10] Compiling System.FilePath.Overlay ( src/System/FilePath/Overlay.hs, dist/build/System/FilePath/Overlay.o, dist/build/System/FilePath/Overlay.dyn_o )
151.43 s
> [ 6 of 10] Compiling System.FilePath ( src/System/FilePath.hs, dist/build/System/FilePath.o, dist/build/System/FilePath.dyn_o )
151.43 s
For full logs, run:
151.43 s
nix log /nix/store/6lbsvjysc8745w76x16kfxcnc6z3dmn1-pathway-compat-filepath-0.0.1.0.drv
151.43 s
error: Cannot build '/nix/store/15amzai96gbkbw8ki5aqxjagszksngpy-ghc-9.6.7-with-packages.drv '.
151.43 s
Reason: 1 dependency failed .
151.43 s
Output paths:
151.43 s
/nix/store/c9rdwlynzyxpqg75121cvf9fs84wkml0-ghc-9.6.7-with-packages
151.43 s
error: Cannot build '/nix/store/7h0g3cqs6ihlynr2zbkb1xsf66z51p79-pathway-compat-directory-0.0.1.0.drv '.
151.43 s
Reason: 1 dependency failed .
151.43 s
Output paths:
151.43 s
/nix/store/5ph59krlmy1j5pb4bqv13kyip87kwlb4-pathway-compat-directory-0.0.1.0-doc
151.43 s
/nix/store/jvfwq5drdz4dfv77mfg7wmih89crga4n-pathway-compat-directory-0.0.1.0
151.43 s
error: Cannot build '/nix/store/hyxnk0w8mpqcckn0l495qmq2cj738c7x-pathway-compat-file-io-0.0.1.0.drv '.
151.43 s
Reason: 1 dependency failed .
151.43 s
Output paths:
151.43 s
/nix/store/9nawsjhb50jgbl9pk2ykqq81cw368xn4-pathway-compat-file-io-0.0.1.0
151.43 s
/nix/store/m4klvjgcra6aric0842xyhflbilss5r3-pathway-compat-file-io-0.0.1.0-doc
151.43 s
error: Cannot build '/nix/store/iqmmyravwrm8b6mmi8zdaa7fsik96wj9-pathway-compat-temporary-0.0.1.0.drv '.
151.43 s
Reason: 1 dependency failed .
151.43 s
Output paths:
151.43 s
/nix/store/1nx5g5kv75zy0b6bbhpflr4ix5amzpks-pathway-compat-temporary-0.0.1.0-doc
151.43 s
/nix/store/i7q9b3mdhsximybdby6v6ld258j1vi7b-pathway-compat-temporary-0.0.1.0
151.43 s
error: Cannot build '/nix/store/i5j580l1byqm5dzrmn7bxxzcfrcccf6a-pathway-system-0.0.1.0.drv '.
151.43 s
Reason: 1 dependency failed .
151.43 s
Output paths:
151.43 s
/nix/store/2rywy7mz3hgj3ywg15pnxzvl3vi1b4qr-pathway-system-0.0.1.0-doc
151.43 s
/nix/store/dm52i2x1n1scfl6r969670gda0fx8jdi-pathway-system-0.0.1.0
151.43 s
error: Build failed due to failed dependency
151.43 s
error: Cannot build '/nix/store/fn9mpsk06vd9aliww84rsblz7y1qxq9d-all-packages.drv '.
151.43 s
Reason: 1 dependency failed .
151.43 s
Output paths:
151.43 s
/nix/store/vk0p0n8lb2zl3arnni10fs8hd4sg5qli-all-packages
151.44 s
Build failed due to failed dependency
151.47 s
Build failed.