build packages.x86_64-linux.ghc967_all

Reproduce this run
Original Run
  1. 0.88 s $ /nix/store/9ypz3flqsrl5xl495mm8h645gadjsxi1-coreutils-9.11/bin/timeout --kill-after=15s 7200s /nix/store/23zk8sgzamrbmj1fday15szf7f2279s8-nix-2.34.7/bin/nix --extra-experimental-features nix-command --extra-experimental-features flakes --log-format internal-json build --no-link --print-out-paths git+https://github.com/sellout/pathway?ref=more-system&rev=48808d129e08f84a9d17c382758a97ce6d627392&shallow=1#packages.x86_64-linux.ghc967_all --print-build-logs
  2. 0.89 s warning: ignoring untrusted flake configuration setting 'allow-import-from-derivation'.
  3. 0.89 s Pass '--accept-flake-config' to trust it
  4. 0.89 s warning: ignoring untrusted flake configuration setting 'extra-experimental-features'.
  5. 0.89 s Pass '--accept-flake-config' to trust it
  6. 0.89 s warning: ignoring untrusted flake configuration setting 'extra-substituters'.
  7. 0.89 s Pass '--accept-flake-config' to trust it
  8. 0.89 s warning: ignoring untrusted flake configuration setting 'extra-trusted-public-keys'.
  9. 0.89 s Pass '--accept-flake-config' to trust it
  10. 0.89 s warning: ignoring untrusted flake configuration setting 'sandbox'.
  11. 0.89 s Pass '--accept-flake-config' to trust it
  12. 0.89 s warning: ignoring untrusted flake configuration setting 'use-registries'.
  13. 0.89 s Pass '--accept-flake-config' to trust it
  14. 1.60 s
  15. 1.63 s Building /nix/store/azflsmd2jzvhys1shmvz771mqgg9kgph-cabal2nix-pathway.drv
  16. 1.70 s [cabal2nix-pathway:post-build] Uploading to cachix cache "sellout": /nix/store/hmk6bm32b8wh54crrvnc4vppd86zv3xc-cabal2nix-pathway
  17. 2.92 s [cabal2nix-pathway:post-build] Nothing to push - all store paths are already on Cachix.
  18. 2.93 s [cabal2nix-pathway:post-build] Uploading to the NixCI cache: /nix/store/hmk6bm32b8wh54crrvnc4vppd86zv3xc-cabal2nix-pathway
  19. 2.97 s [cabal2nix-pathway:post-build] warning: 'warn-short-path-literals' is deprecated, use 'lint-short-path-literals = ignore' instead
  20. 3.14 s [cabal2nix-pathway:post-build] copying 1 paths...
  21. 3.14 s [cabal2nix-pathway:post-build] copying path '/nix/store/hmk6bm32b8wh54crrvnc4vppd86zv3xc-cabal2nix-pathway' to 'https://cache.nix-ci.com'...
  22. 4.59 s [cabal2nix-pathway:post-build] warning: 'warn-short-path-literals' is deprecated, use 'lint-short-path-literals = ignore' instead
  23. 4.71 s [cabal2nix-pathway:post-build] copying 0 paths...
  24. 4.73 s Uploaded cabal2nix-pathway in 3.0s
  25. 4.73 s Progress: 1 of 2 built
  26. 4.73 s Built cabal2nix-pathway in 3.0s
  27. 4.73 s Progress: 2 of 2 built
  28. 4.73 s
  29. 4.76 s Building /nix/store/mkcq0casbmnkwqv7l0bmyim03j7bfc92-cabal2nix-pathway-compat-base.drv
  30. 4.83 s [cabal2nix-pathway-compat-base:post-build] Uploading to cachix cache "sellout": /nix/store/lwnw3kya6qnl3k6j0nv5wd8hf8wy6zh3-cabal2nix-pathway-compat-base
  31. 6.46 s [cabal2nix-pathway-compat-base:post-build] Nothing to push - all store paths are already on Cachix.
  32. 6.48 s [cabal2nix-pathway-compat-base:post-build] Uploading to the NixCI cache: /nix/store/lwnw3kya6qnl3k6j0nv5wd8hf8wy6zh3-cabal2nix-pathway-compat-base
  33. 6.52 s [cabal2nix-pathway-compat-base:post-build] warning: 'warn-short-path-literals' is deprecated, use 'lint-short-path-literals = ignore' instead
  34. 6.67 s [cabal2nix-pathway-compat-base:post-build] copying 1 paths...
  35. 6.67 s [cabal2nix-pathway-compat-base:post-build] copying path '/nix/store/lwnw3kya6qnl3k6j0nv5wd8hf8wy6zh3-cabal2nix-pathway-compat-base' to 'https://cache.nix-ci.com'...
  36. 6.85 s [cabal2nix-pathway-compat-base:post-build] warning: 'warn-short-path-literals' is deprecated, use 'lint-short-path-literals = ignore' instead
  37. 6.96 s [cabal2nix-pathway-compat-base:post-build] copying 0 paths...
  38. 6.98 s Uploaded cabal2nix-pathway-compat-base in 2.1s
  39. 6.98 s Progress: 1 of 2 built
  40. 6.98 s Built cabal2nix-pathway-compat-base in 2.2s
  41. 6.98 s Progress: 2 of 2 built
  42. 6.98 s
  43. 7.01 s Building /nix/store/2fsvrv3qwdlq0d1xlvf87a8babzw1jps-cabal2nix-pathway-compat-directory.drv
  44. 7.08 s [cabal2nix-pathway-compat-directory:post-build] Uploading to cachix cache "sellout": /nix/store/zs1jar2ncbrddx15l3av8phyy0fcylcz-cabal2nix-pathway-compat-directory
  45. 8.27 s [cabal2nix-pathway-compat-directory:post-build] Nothing to push - all store paths are already on Cachix.
  46. 8.29 s [cabal2nix-pathway-compat-directory:post-build] Uploading to the NixCI cache: /nix/store/zs1jar2ncbrddx15l3av8phyy0fcylcz-cabal2nix-pathway-compat-directory
  47. 8.33 s [cabal2nix-pathway-compat-directory:post-build] warning: 'warn-short-path-literals' is deprecated, use 'lint-short-path-literals = ignore' instead
  48. 8.47 s [cabal2nix-pathway-compat-directory:post-build] copying 1 paths...
  49. 8.47 s [cabal2nix-pathway-compat-directory:post-build] copying path '/nix/store/zs1jar2ncbrddx15l3av8phyy0fcylcz-cabal2nix-pathway-compat-directory' to 'https://cache.nix-ci.com'...
  50. 8.59 s [cabal2nix-pathway-compat-directory:post-build] warning: 'warn-short-path-literals' is deprecated, use 'lint-short-path-literals = ignore' instead
  51. 8.70 s [cabal2nix-pathway-compat-directory:post-build] copying 0 paths...
  52. 8.72 s Uploaded cabal2nix-pathway-compat-directory in 1.6s
  53. 8.72 s Progress: 1 of 2 built
  54. 8.72 s Built cabal2nix-pathway-compat-directory in 1.7s
  55. 8.72 s Progress: 2 of 2 built
  56. 8.72 s
  57. 8.74 s Building /nix/store/ygyxsv8dfc5daf78imdvl1jllvsp959w-cabal2nix-pathway-compat-file-io.drv
  58. 8.81 s [cabal2nix-pathway-compat-file-io:post-build] Uploading to cachix cache "sellout": /nix/store/z6mfqdd362lh72kgwqvcizlyjikipg73-cabal2nix-pathway-compat-file-io
  59. 10.18 s [cabal2nix-pathway-compat-file-io:post-build] Nothing to push - all store paths are already on Cachix.
  60. 10.20 s [cabal2nix-pathway-compat-file-io:post-build] Uploading to the NixCI cache: /nix/store/z6mfqdd362lh72kgwqvcizlyjikipg73-cabal2nix-pathway-compat-file-io
  61. 10.24 s [cabal2nix-pathway-compat-file-io:post-build] warning: 'warn-short-path-literals' is deprecated, use 'lint-short-path-literals = ignore' instead
  62. 10.38 s [cabal2nix-pathway-compat-file-io:post-build] copying 1 paths...
  63. 10.38 s [cabal2nix-pathway-compat-file-io:post-build] copying path '/nix/store/z6mfqdd362lh72kgwqvcizlyjikipg73-cabal2nix-pathway-compat-file-io' to 'https://cache.nix-ci.com'...
  64. 10.53 s [cabal2nix-pathway-compat-file-io:post-build] warning: 'warn-short-path-literals' is deprecated, use 'lint-short-path-literals = ignore' instead
  65. 10.66 s [cabal2nix-pathway-compat-file-io:post-build] copying 0 paths...
  66. 10.68 s Uploaded cabal2nix-pathway-compat-file-io in 1.8s
  67. 10.68 s Progress: 1 of 2 built
  68. 10.68 s Built cabal2nix-pathway-compat-file-io in 1.9s
  69. 10.68 s Progress: 2 of 2 built
  70. 10.68 s
  71. 10.72 s Building /nix/store/k5c3wsf0d94jdddmndn8fm3bzjnl5kjg-cabal2nix-pathway-compat-filepath.drv
  72. 10.78 s [cabal2nix-pathway-compat-filepath:post-build] Uploading to cachix cache "sellout": /nix/store/ah41s3sp9kdgpk827bzbzr3rfaq2dl1q-cabal2nix-pathway-compat-filepath
  73. 11.78 s [cabal2nix-pathway-compat-filepath:post-build] Nothing to push - all store paths are already on Cachix.
  74. 11.79 s [cabal2nix-pathway-compat-filepath:post-build] Uploading to the NixCI cache: /nix/store/ah41s3sp9kdgpk827bzbzr3rfaq2dl1q-cabal2nix-pathway-compat-filepath
  75. 11.84 s [cabal2nix-pathway-compat-filepath:post-build] warning: 'warn-short-path-literals' is deprecated, use 'lint-short-path-literals = ignore' instead
  76. 12.26 s [cabal2nix-pathway-compat-filepath:post-build] copying 1 paths...
  77. 12.26 s [cabal2nix-pathway-compat-filepath:post-build] copying path '/nix/store/ah41s3sp9kdgpk827bzbzr3rfaq2dl1q-cabal2nix-pathway-compat-filepath' to 'https://cache.nix-ci.com'...
  78. 12.72 s [cabal2nix-pathway-compat-filepath:post-build] warning: 'warn-short-path-literals' is deprecated, use 'lint-short-path-literals = ignore' instead
  79. 12.81 s [cabal2nix-pathway-compat-filepath:post-build] copying 0 paths...
  80. 12.84 s Uploaded cabal2nix-pathway-compat-filepath in 2.0s
  81. 12.84 s Progress: 1 of 2 built
  82. 12.84 s Built cabal2nix-pathway-compat-filepath in 2.1s
  83. 12.84 s Progress: 2 of 2 built
  84. 12.84 s
  85. 12.86 s Building /nix/store/cla88vw008rd6npjlq15h0izmwab4m66-cabal2nix-pathway-compat-temporary.drv
  86. 12.94 s [cabal2nix-pathway-compat-temporary:post-build] Uploading to cachix cache "sellout": /nix/store/mj9ghbj8v9923xg2jfdcc9prwzz029m1-cabal2nix-pathway-compat-temporary
  87. 13.97 s [cabal2nix-pathway-compat-temporary:post-build] Nothing to push - all store paths are already on Cachix.
  88. 13.98 s [cabal2nix-pathway-compat-temporary:post-build] Uploading to the NixCI cache: /nix/store/mj9ghbj8v9923xg2jfdcc9prwzz029m1-cabal2nix-pathway-compat-temporary
  89. 14.03 s [cabal2nix-pathway-compat-temporary:post-build] warning: 'warn-short-path-literals' is deprecated, use 'lint-short-path-literals = ignore' instead
  90. 14.20 s [cabal2nix-pathway-compat-temporary:post-build] copying 1 paths...
  91. 14.20 s [cabal2nix-pathway-compat-temporary:post-build] copying path '/nix/store/mj9ghbj8v9923xg2jfdcc9prwzz029m1-cabal2nix-pathway-compat-temporary' to 'https://cache.nix-ci.com'...
  92. 14.32 s [cabal2nix-pathway-compat-temporary:post-build] warning: 'warn-short-path-literals' is deprecated, use 'lint-short-path-literals = ignore' instead
  93. 14.43 s [cabal2nix-pathway-compat-temporary:post-build] copying 0 paths...
  94. 14.45 s Uploaded cabal2nix-pathway-compat-temporary in 1.5s
  95. 14.45 s Progress: 1 of 2 built
  96. 14.45 s Built cabal2nix-pathway-compat-temporary in 1.5s
  97. 14.45 s Progress: 2 of 2 built
  98. 14.46 s
  99. 14.49 s Building /nix/store/gz820x0mfaffy57iyaa44iyh3hw8cn8i-cabal2nix-pathway-internal.drv
  100. 14.56 s [cabal2nix-pathway-internal:post-build] Uploading to cachix cache "sellout": /nix/store/wy464rj81ghg6v4w0g3k8rq9zrnpl2cj-cabal2nix-pathway-internal
  101. 16.29 s [cabal2nix-pathway-internal:post-build] Nothing to push - all store paths are already on Cachix.
  102. 16.31 s [cabal2nix-pathway-internal:post-build] Uploading to the NixCI cache: /nix/store/wy464rj81ghg6v4w0g3k8rq9zrnpl2cj-cabal2nix-pathway-internal
  103. 16.35 s [cabal2nix-pathway-internal:post-build] warning: 'warn-short-path-literals' is deprecated, use 'lint-short-path-literals = ignore' instead
  104. 16.50 s [cabal2nix-pathway-internal:post-build] copying 1 paths...
  105. 16.50 s [cabal2nix-pathway-internal:post-build] copying path '/nix/store/wy464rj81ghg6v4w0g3k8rq9zrnpl2cj-cabal2nix-pathway-internal' to 'https://cache.nix-ci.com'...
  106. 16.66 s [cabal2nix-pathway-internal:post-build] warning: 'warn-short-path-literals' is deprecated, use 'lint-short-path-literals = ignore' instead
  107. 16.77 s [cabal2nix-pathway-internal:post-build] copying 0 paths...
  108. 16.79 s Uploaded cabal2nix-pathway-internal in 2.2s
  109. 16.79 s Progress: 1 of 2 built
  110. 16.79 s Built cabal2nix-pathway-internal in 2.3s
  111. 16.79 s Progress: 2 of 2 built
  112. 16.79 s
  113. 16.82 s Building /nix/store/a21biizdb0prcqypkqfg42cfxnzppxaz-cabal2nix-pathway-path.drv
  114. 16.90 s [cabal2nix-pathway-path:post-build] Uploading to cachix cache "sellout": /nix/store/dng29xvvsd260n64gh7yv68fqvydf4x6-cabal2nix-pathway-path
  115. 18.31 s [cabal2nix-pathway-path:post-build] Nothing to push - all store paths are already on Cachix.
  116. 18.33 s [cabal2nix-pathway-path:post-build] Uploading to the NixCI cache: /nix/store/dng29xvvsd260n64gh7yv68fqvydf4x6-cabal2nix-pathway-path
  117. 18.37 s [cabal2nix-pathway-path:post-build] warning: 'warn-short-path-literals' is deprecated, use 'lint-short-path-literals = ignore' instead
  118. 18.53 s [cabal2nix-pathway-path:post-build] copying 1 paths...
  119. 18.53 s [cabal2nix-pathway-path:post-build] copying path '/nix/store/dng29xvvsd260n64gh7yv68fqvydf4x6-cabal2nix-pathway-path' to 'https://cache.nix-ci.com'...
  120. 18.64 s [cabal2nix-pathway-path:post-build] warning: 'warn-short-path-literals' is deprecated, use 'lint-short-path-literals = ignore' instead
  121. 18.75 s [cabal2nix-pathway-path:post-build] copying 0 paths...
  122. 18.77 s Uploaded cabal2nix-pathway-path in 1.8s
  123. 18.77 s Progress: 1 of 2 built
  124. 18.77 s Built cabal2nix-pathway-path in 1.9s
  125. 18.77 s Progress: 2 of 2 built
  126. 18.77 s
  127. 18.79 s Building /nix/store/skqxdwaakc9h0zqh4wl936796xd0vmy7-cabal2nix-pathway-quickcheck.drv
  128. 18.86 s [cabal2nix-pathway-quickcheck:post-build] Uploading to cachix cache "sellout": /nix/store/k5v97rih5i5gf19x9y4cnzfns9m69j4x-cabal2nix-pathway-quickcheck
  129. 20.61 s [cabal2nix-pathway-quickcheck:post-build] Nothing to push - all store paths are already on Cachix.
  130. 20.63 s [cabal2nix-pathway-quickcheck:post-build] Uploading to the NixCI cache: /nix/store/k5v97rih5i5gf19x9y4cnzfns9m69j4x-cabal2nix-pathway-quickcheck
  131. 20.67 s [cabal2nix-pathway-quickcheck:post-build] warning: 'warn-short-path-literals' is deprecated, use 'lint-short-path-literals = ignore' instead
  132. 20.81 s [cabal2nix-pathway-quickcheck:post-build] copying 1 paths...
  133. 20.81 s [cabal2nix-pathway-quickcheck:post-build] copying path '/nix/store/k5v97rih5i5gf19x9y4cnzfns9m69j4x-cabal2nix-pathway-quickcheck' to 'https://cache.nix-ci.com'...
  134. 20.98 s [cabal2nix-pathway-quickcheck:post-build] warning: 'warn-short-path-literals' is deprecated, use 'lint-short-path-literals = ignore' instead
  135. 21.10 s [cabal2nix-pathway-quickcheck:post-build] copying 0 paths...
  136. 21.12 s Uploaded cabal2nix-pathway-quickcheck in 2.2s
  137. 21.12 s Progress: 1 of 2 built
  138. 21.12 s Built cabal2nix-pathway-quickcheck in 2.3s
  139. 21.12 s Progress: 2 of 2 built
  140. 21.13 s
  141. 21.15 s Building /nix/store/9cb7snqyf9gacxgpglz7dd6s30dk3ja2-cabal2nix-pathway-system.drv
  142. 21.23 s [cabal2nix-pathway-system:post-build] Uploading to cachix cache "sellout": /nix/store/j5h8c28bs9jp1rbvl8my0zlf10kr9n9l-cabal2nix-pathway-system
  143. 22.58 s [cabal2nix-pathway-system:post-build] Nothing to push - all store paths are already on Cachix.
  144. 22.60 s [cabal2nix-pathway-system:post-build] Uploading to the NixCI cache: /nix/store/j5h8c28bs9jp1rbvl8my0zlf10kr9n9l-cabal2nix-pathway-system
  145. 24.92 s [cabal2nix-pathway-system:post-build] warning: 'warn-short-path-literals' is deprecated, use 'lint-short-path-literals = ignore' instead
  146. 24.92 s [cabal2nix-pathway-system:post-build] copying 1 paths...
  147. 24.92 s [cabal2nix-pathway-system:post-build] copying path '/nix/store/j5h8c28bs9jp1rbvl8my0zlf10kr9n9l-cabal2nix-pathway-system' to 'https://cache.nix-ci.com'...
  148. 24.92 s [cabal2nix-pathway-system:post-build] warning: 'warn-short-path-literals' is deprecated, use 'lint-short-path-literals = ignore' instead
  149. 24.92 s [cabal2nix-pathway-system:post-build] copying 0 paths...
  150. 24.92 s Uploaded cabal2nix-pathway-system in 3.7s
  151. 24.92 s Progress: 1 of 2 built
  152. 24.92 s Built cabal2nix-pathway-system in 3.7s
  153. 24.92 s Progress: 2 of 2 built
  154. 24.92 s
  155. 26.72 s Downloading cached colour-2.3.7-data from https://cache.nix-ci.com
  156. 26.73 s Downloading cached ghc-9.6.7-doc from https://cache.nix-ci.com
  157. 26.73 s Downloading cached hscolour from https://cache.nix-ci.com
  158. 26.75 s Downloaded cached colour-2.3.7-data (2696 B) in 21ms
  159. 26.75 s Progress: 0 of 103 built, 1 of 174 downloaded from cache (2 downloading)
  160. 26.77 s Downloaded cached hscolour (2.5 MiB) in 37ms
  161. 26.77 s Progress: 0 of 103 built, 2 of 174 downloaded from cache (1 downloading)
  162. 28.42 s Downloaded cached ghc-9.6.7-doc (658.5 MiB) in 1.6s
  163. 28.42 s Progress: 0 of 102 built, 3 of 174 downloaded from cache
  164. 28.42 s Downloading cached OneTuple-0.4.2.1-doc from https://cache.nix-ci.com
  165. 28.43 s Downloading cached StateVar-1.2.2-doc from https://cache.nix-ci.com
  166. 28.43 s Downloading cached assoc-1.1.1-doc from https://cache.nix-ci.com
  167. 28.43 s Downloading cached base-orphans-0.9.4-doc from https://cache.nix-ci.com
  168. 28.43 s Downloading cached cabal-doctest-1.0.12-doc from https://cache.nix-ci.com
  169. 28.43 s Downloading cached call-stack-0.4.0-doc from https://cache.nix-ci.com
  170. 28.43 s Downloading cached character-ps-0.1-doc from https://cache.nix-ci.com
  171. 28.43 s Downloading cached clock-0.8.4-doc from https://cache.nix-ci.com
  172. 28.43 s Downloading cached code-page-0.2.1-doc from https://cache.nix-ci.com
  173. 28.43 s Downloading cached colour-2.3.7-doc from https://cache.nix-ci.com
  174. 28.43 s Downloading cached dlist-1.0-doc from https://cache.nix-ci.com
  175. 28.43 s Downloading cached file-io-0.1.6-doc from https://cache.nix-ci.com
  176. 28.43 s Downloading cached ghc from https://cache.nix-ci.com
  177. 28.43 s Downloading cached ghc-paths-0.1.0.12-doc from https://cache.nix-ci.com
  178. 28.43 s Downloading cached indexed-traversable-0.1.4-doc from https://cache.nix-ci.com
  179. 28.43 s Downloading cached integer-logarithms-1.0.5-doc from https://cache.nix-ci.com
  180. 29.03 s Downloaded cached OneTuple-0.4.2.1-doc (211 KiB) in 615ms
  181. 29.03 s Progress: 0 of 101 built, 4 of 174 downloaded from cache (15 downloading)
  182. 29.03 s Downloaded cached StateVar-1.2.2-doc (299 KiB) in 604ms
  183. 29.03 s Progress: 0 of 101 built, 5 of 174 downloaded from cache (15 downloading)
  184. 29.04 s Downloading cached old-locale-1.0.0.7-doc from https://cache.nix-ci.com
  185. 29.04 s Downloading cached os-string-2.0.10-doc from https://cache.nix-ci.com
  186. 29.04 s Downloaded cached call-stack-0.4.0-doc (173 KiB) in 607ms
  187. 29.04 s Progress: 0 of 101 built, 6 of 174 downloaded from cache (15 downloading)
  188. 29.04 s Downloading cached contravariant-1.5.6-doc from https://cache.nix-ci.com
  189. 29.04 s Downloaded cached cabal-doctest-1.0.12-doc (357 KiB) in 608ms
  190. 29.04 s Progress: 0 of 101 built, 7 of 174 downloaded from cache (15 downloading)
  191. 29.04 s Downloading cached parallel-3.2.2.0-doc from https://cache.nix-ci.com
  192. 29.04 s Downloaded cached file-io-0.1.6-doc (675 KiB) in 608ms
  193. 29.04 s Progress: 0 of 101 built, 8 of 174 downloaded from cache (15 downloading)
  194. 29.04 s Downloading cached parser-combinators-1.3.1-doc from https://cache.nix-ci.com
  195. 29.04 s Downloaded cached assoc-1.1.1-doc (189 KiB) in 612ms
  196. 29.04 s Progress: 0 of 101 built, 9 of 174 downloaded from cache (15 downloading)
  197. 29.04 s Downloading cached prettyprinter-1.7.1-doc from https://cache.nix-ci.com
  198. 29.04 s Downloaded cached clock-0.8.4-doc (482 KiB) in 614ms
  199. 29.04 s Progress: 0 of 101 built, 10 of 174 downloaded from cache (15 downloading)
  200. 29.04 s Downloading cached primitive-0.9.1.0-doc from https://cache.nix-ci.com
  201. 29.05 s Downloaded cached integer-logarithms-1.0.5-doc (353 KiB) in 617ms
  202. 29.05 s Progress: 0 of 101 built, 11 of 174 downloaded from cache (15 downloading)
  203. 29.05 s Downloading cached extra-1.8.1-doc from https://cache.nix-ci.com
  204. 29.05 s Downloaded cached character-ps-0.1-doc (1 MiB) in 619ms
  205. 29.05 s Progress: 0 of 101 built, 12 of 174 downloaded from cache (15 downloading)
  206. 29.05 s Downloading cached reflection-2.1.9-doc from https://cache.nix-ci.com
  207. 29.05 s Downloaded cached ghc-paths-0.1.0.12-doc (121 KiB) in 621ms
  208. 29.05 s Progress: 0 of 101 built, 13 of 174 downloaded from cache (15 downloading)
  209. 29.05 s Downloaded cached code-page-0.2.1-doc (276 KiB) in 621ms
  210. 29.05 s Downloading cached splitmix-0.1.3.2-doc from https://cache.nix-ci.com
  211. 29.05 s Progress: 0 of 101 built, 14 of 174 downloaded from cache (15 downloading)
  212. 29.05 s Downloading cached syb-0.7.2.4-doc from https://cache.nix-ci.com
  213. 29.05 s Downloaded cached base-orphans-0.9.4-doc (1.2 MiB) in 623ms
  214. 29.05 s Progress: 0 of 101 built, 15 of 174 downloaded from cache (15 downloading)
  215. 29.05 s Downloaded cached dlist-1.0-doc (533 KiB) in 623ms
  216. 29.05 s Downloading cached tagged-0.8.9-doc from https://cache.nix-ci.com
  217. 29.05 s Progress: 0 of 101 built, 16 of 174 downloaded from cache (15 downloading)
  218. 29.05 s Downloading cached th-abstraction-0.7.2.0-doc from https://cache.nix-ci.com
  219. 29.06 s Downloaded cached indexed-traversable-0.1.4-doc (1.1 MiB) in 626ms
  220. 29.06 s Progress: 0 of 101 built, 17 of 174 downloaded from cache (15 downloading)
  221. 29.06 s Downloading cached th-compat-0.1.7-doc from https://cache.nix-ci.com
  222. 29.06 s Downloaded cached colour-2.3.7-doc (2 MiB) in 628ms
  223. 29.06 s Progress: 0 of 101 built, 18 of 174 downloaded from cache (15 downloading)
  224. 29.06 s Downloading cached transformers-base-0.4.6.1-doc from https://cache.nix-ci.com
  225. 29.10 s Downloaded cached old-locale-1.0.0.7-doc (161 KiB) in 60ms
  226. 29.10 s Progress: 0 of 101 built, 19 of 174 downloaded from cache (15 downloading)
  227. 29.10 s Downloading cached ansi-terminal-types-1.1.3-doc from https://cache.nix-ci.com
  228. 29.10 s Downloaded cached contravariant-1.5.6-doc (933 KiB) in 62ms
  229. 29.10 s Progress: 0 of 101 built, 20 of 174 downloaded from cache (15 downloading)
  230. 29.10 s Downloading cached old-time-1.1.1.0-doc from https://cache.nix-ci.com
  231. 29.10 s Downloaded cached parser-combinators-1.3.1-doc (901 KiB) in 64ms
  232. 29.10 s Progress: 0 of 101 built, 21 of 174 downloaded from cache (15 downloading)
  233. 29.10 s Downloading cached transformers-compat-0.7.2-doc from https://cache.nix-ci.com
  234. 29.11 s Downloaded cached reflection-2.1.9-doc (568 KiB) in 61ms
  235. 29.11 s Progress: 0 of 101 built, 22 of 174 downloaded from cache (15 downloading)
  236. 29.11 s Downloading cached unliftio-core-0.2.1.0-doc from https://cache.nix-ci.com
  237. 29.11 s Downloaded cached splitmix-0.1.3.2-doc (550 KiB) in 60ms
  238. 29.11 s Progress: 0 of 101 built, 23 of 174 downloaded from cache (15 downloading)
  239. 29.11 s Downloading cached vector-stream-0.1.0.1-doc from https://cache.nix-ci.com
  240. 29.11 s Downloaded cached os-string-2.0.10-doc (3.5 MiB) in 76ms
  241. 29.11 s Progress: 0 of 101 built, 24 of 174 downloaded from cache (15 downloading)
  242. 29.11 s Downloading cached random-1.2.1.3-doc from https://cache.nix-ci.com
  243. 29.12 s Downloaded cached parallel-3.2.2.0-doc (1010 KiB) in 78ms
  244. 29.12 s Downloaded cached prettyprinter-1.7.1-doc (2.9 MiB) in 73ms
  245. 29.12 s Progress: 0 of 101 built, 25 of 174 downloaded from cache (15 downloading)
  246. 29.12 s Downloading cached hashable-1.5.1.0-doc from https://cache.nix-ci.com
  247. 29.12 s Progress: 0 of 101 built, 26 of 174 downloaded from cache (15 downloading)
  248. 29.12 s Downloaded cached th-abstraction-0.7.2.0-doc (2 MiB) in 64ms
  249. 29.12 s Progress: 0 of 101 built, 27 of 174 downloaded from cache (14 downloading)
  250. 29.12 s Downloaded cached transformers-base-0.4.6.1-doc (179 KiB) in 61ms
  251. 29.12 s Progress: 0 of 101 built, 28 of 174 downloaded from cache (13 downloading)
  252. 29.12 s Downloaded cached th-compat-0.1.7-doc (544 KiB) in 64ms
  253. 29.12 s Progress: 0 of 101 built, 29 of 174 downloaded from cache (12 downloading)
  254. 29.12 s Downloading cached network-uri-2.6.4.2-doc from https://cache.nix-ci.com
  255. 29.12 s Downloaded cached syb-0.7.2.4-doc (1.2 MiB) in 71ms
  256. 29.12 s Progress: 0 of 101 built, 30 of 174 downloaded from cache (12 downloading)
  257. 29.12 s Downloaded cached primitive-0.9.1.0-doc (5.3 MiB) in 79ms
  258. 29.12 s Progress: 0 of 101 built, 31 of 174 downloaded from cache (11 downloading)
  259. 29.13 s Downloading cached integer-conversion-0.1.1-doc from https://cache.nix-ci.com
  260. 29.13 s Downloaded cached extra-1.8.1-doc (3 MiB) in 78ms
  261. 29.13 s Progress: 0 of 101 built, 32 of 174 downloaded from cache (11 downloading)
  262. 29.26 s Downloaded cached tagged-0.8.9-doc (602 KiB) in 206ms
  263. 29.26 s Progress: 0 of 101 built, 33 of 174 downloaded from cache (10 downloading)
  264. 29.26 s Downloading cached distributive-0.6.3-doc from https://cache.nix-ci.com
  265. 30.01 s Downloaded cached ansi-terminal-types-1.1.3-doc (659 KiB) in 909ms
  266. 30.01 s Progress: 0 of 101 built, 34 of 174 downloaded from cache (10 downloading)
  267. 30.01 s Downloading cached ansi-terminal-1.1.5-doc from https://cache.nix-ci.com
  268. 30.01 s Downloaded cached unliftio-core-0.2.1.0-doc (246 KiB) in 895ms
  269. 30.01 s Progress: 0 of 101 built, 35 of 174 downloaded from cache (10 downloading)
  270. 30.01 s Downloaded cached old-time-1.1.1.0-doc (536 KiB) in 905ms
  271. 30.01 s Progress: 0 of 101 built, 36 of 174 downloaded from cache (9 downloading)
  272. 30.01 s Downloaded cached integer-conversion-0.1.1-doc (240 KiB) in 884ms
  273. 30.01 s Progress: 0 of 101 built, 37 of 174 downloaded from cache (8 downloading)
  274. 30.01 s Downloaded cached transformers-compat-0.7.2-doc (1.9 MiB) in 907ms
  275. 30.01 s Progress: 0 of 101 built, 38 of 174 downloaded from cache (7 downloading)
  276. 30.01 s Downloaded cached distributive-0.6.3-doc (484 KiB) in 752ms
  277. 30.01 s Progress: 0 of 101 built, 39 of 174 downloaded from cache (6 downloading)
  278. 30.01 s Downloaded cached hashable-1.5.1.0-doc (1.2 MiB) in 895ms
  279. 30.01 s Downloading cached comonad-5.0.10-doc from https://cache.nix-ci.com
  280. 30.01 s Progress: 0 of 101 built, 40 of 174 downloaded from cache (6 downloading)
  281. 30.01 s Downloaded cached vector-stream-0.1.0.1-doc (1.5 MiB) in 901ms
  282. 30.01 s Downloading cached case-insensitive-1.2.1.0-doc from https://cache.nix-ci.com
  283. 30.01 s Downloading cached data-fix-0.3.4-doc from https://cache.nix-ci.com
  284. 30.01 s Downloading cached scientific-0.3.8.1-doc from https://cache.nix-ci.com
  285. 30.01 s Downloading cached text-short-0.1.6.1-doc from https://cache.nix-ci.com
  286. 30.01 s Downloading cached these-1.2.1-doc from https://cache.nix-ci.com
  287. 30.01 s Downloading cached time-compat-1.9.9-doc from https://cache.nix-ci.com
  288. 30.02 s Progress: 0 of 101 built, 41 of 174 downloaded from cache (12 downloading)
  289. 30.02 s Downloading cached unordered-containers-0.2.20.1-doc from https://cache.nix-ci.com
  290. 30.02 s Downloaded cached network-uri-2.6.4.2-doc (1 MiB) in 895ms
  291. 30.02 s Progress: 0 of 101 built, 42 of 174 downloaded from cache (11 downloading)
  292. 30.02 s Downloaded cached random-1.2.1.3-doc (2.5 MiB) in 906ms
  293. 30.02 s Progress: 0 of 101 built, 43 of 174 downloaded from cache (10 downloading)
  294. 30.02 s Downloading cached temporary-1.3-doc from https://cache.nix-ci.com
  295. 30.02 s Downloading cached QuickCheck-2.15.0.1-doc from https://cache.nix-ci.com
  296. 30.02 s Downloading cached uuid-types-1.0.6.1-doc from https://cache.nix-ci.com
  297. 30.07 s Downloaded cached ansi-terminal-1.1.5-doc (868 KiB) in 63ms
  298. 30.07 s Progress: 0 of 101 built, 44 of 174 downloaded from cache (12 downloading)
  299. 30.07 s Downloading cached prettyprinter-ansi-terminal-1.1.3-doc from https://cache.nix-ci.com
  300. 30.07 s Downloaded cached these-1.2.1-doc (1000 KiB) in 56ms
  301. 30.07 s Progress: 0 of 101 built, 45 of 174 downloaded from cache (12 downloading)
  302. 30.07 s Downloading cached strict-0.5.1-doc from https://cache.nix-ci.com
  303. 30.07 s Downloaded cached comonad-5.0.10-doc (1.4 MiB) in 59ms
  304. 30.07 s Progress: 0 of 101 built, 46 of 174 downloaded from cache (12 downloading)
  305. 30.07 s Downloaded cached data-fix-0.3.4-doc (418 KiB) in 58ms
  306. 30.07 s Downloading cached bifunctors-5.6.3-doc from https://cache.nix-ci.com
  307. 30.07 s Progress: 0 of 101 built, 47 of 174 downloaded from cache (12 downloading)
  308. 30.08 s Downloaded cached temporary-1.3-doc (237 KiB) in 56ms
  309. 30.08 s Progress: 0 of 101 built, 48 of 174 downloaded from cache (11 downloading)
  310. 30.08 s Downloading cached doctest-0.24.3-doc from https://cache.nix-ci.com
  311. 30.08 s Downloaded cached text-short-0.1.6.1-doc (1.1 MiB) in 65ms
  312. 30.08 s Progress: 0 of 101 built, 49 of 174 downloaded from cache (11 downloading)
  313. 30.08 s Downloaded cached scientific-0.3.8.1-doc (988 KiB) in 70ms
  314. 30.08 s Progress: 0 of 101 built, 50 of 174 downloaded from cache (10 downloading)
  315. 30.09 s Downloaded cached case-insensitive-1.2.1.0-doc (271 KiB) in 72ms
  316. 30.09 s Progress: 0 of 101 built, 51 of 174 downloaded from cache (9 downloading)
  317. 30.09 s Downloading cached megaparsec-9.7.0-doc from https://cache.nix-ci.com
  318. 30.09 s Downloaded cached time-compat-1.9.9-doc (2.4 MiB) in 76ms
  319. 30.09 s Progress: 0 of 101 built, 52 of 174 downloaded from cache (9 downloading)
  320. 30.09 s Downloading cached text-iso8601-0.1.1.1-doc from https://cache.nix-ci.com
  321. 30.10 s Downloaded cached unordered-containers-0.2.20.1-doc (4.5 MiB) in 81ms
  322. 30.10 s Progress: 0 of 101 built, 53 of 174 downloaded from cache (9 downloading)
  323. 30.10 s Downloaded cached uuid-types-1.0.6.1-doc (596 KiB) in 76ms
  324. 30.10 s Downloading cached indexed-traversable-instances-0.1.2.1-doc from https://cache.nix-ci.com
  325. 30.10 s Progress: 0 of 101 built, 54 of 174 downloaded from cache (9 downloading)
  326. 30.11 s Downloaded cached QuickCheck-2.15.0.1-doc (6.2 MiB) in 89ms
  327. 30.11 s Progress: 0 of 101 built, 55 of 174 downloaded from cache (8 downloading)
  328. 32.49 s Downloaded cached prettyprinter-ansi-terminal-1.1.3-doc (517 KiB) in 2.4s
  329. 32.49 s Progress: 0 of 101 built, 56 of 174 downloaded from cache (7 downloading)
  330. 32.49 s Downloading cached optparse-applicative-0.18.1.0-doc from https://cache.nix-ci.com
  331. 32.50 s Downloaded cached indexed-traversable-instances-0.1.2.1-doc (186 KiB) in 2.4s
  332. 32.50 s Progress: 0 of 101 built, 57 of 174 downloaded from cache (7 downloading)
  333. 32.50 s Downloading cached witherable-0.5-doc from https://cache.nix-ci.com
  334. 32.50 s Downloaded cached strict-0.5.1-doc (1.5 MiB) in 2.4s
  335. 32.50 s Progress: 0 of 101 built, 58 of 174 downloaded from cache (7 downloading)
  336. 32.50 s Downloading cached quickcheck-instances-0.3.33-doc from https://cache.nix-ci.com
  337. 32.50 s Downloaded cached text-iso8601-0.1.1.1-doc (572 KiB) in 2.4s
  338. 32.50 s Progress: 0 of 101 built, 59 of 174 downloaded from cache (7 downloading)
  339. 32.50 s Downloaded cached doctest-0.24.3-doc (1.6 MiB) in 2.4s
  340. 32.50 s Progress: 0 of 101 built, 60 of 174 downloaded from cache (6 downloading)
  341. 32.51 s Downloaded cached bifunctors-5.6.3-doc (3.4 MiB) in 2.4s
  342. 32.51 s Progress: 0 of 101 built, 61 of 174 downloaded from cache (5 downloading)
  343. 32.51 s Downloading cached profunctors-5.6.3-doc from https://cache.nix-ci.com
  344. 32.51 s Downloading cached semigroupoids-6.0.2-doc from https://cache.nix-ci.com
  345. 32.52 s Downloaded cached witherable-0.5-doc (1.1 MiB) in 20ms
  346. 32.52 s Progress: 0 of 101 built, 62 of 174 downloaded from cache (6 downloading)
  347. 32.52 s Downloaded cached megaparsec-9.7.0-doc (5 MiB) in 2.4s
  348. 32.52 s Progress: 0 of 101 built, 63 of 174 downloaded from cache (5 downloading)
  349. 32.52 s Downloaded cached optparse-applicative-0.18.1.0-doc (3.8 MiB) in 25ms
  350. 32.52 s Progress: 0 of 101 built, 64 of 174 downloaded from cache (4 downloading)
  351. 32.52 s Downloading cached tasty-1.5.4-doc from https://cache.nix-ci.com
  352. 32.52 s Downloaded cached quickcheck-instances-0.3.33-doc (1.5 MiB) in 21ms
  353. 32.52 s Progress: 0 of 101 built, 65 of 174 downloaded from cache (4 downloading)
  354. 32.54 s Downloaded cached semigroupoids-6.0.2-doc (5.6 MiB) in 25ms
  355. 32.54 s Progress: 0 of 101 built, 66 of 174 downloaded from cache (3 downloading)
  356. 32.54 s Downloading cached semialign-1.3.1.1-doc from https://cache.nix-ci.com
  357. 32.54 s Downloaded cached profunctors-5.6.3-doc (4.9 MiB) in 26ms
  358. 32.54 s Progress: 0 of 101 built, 67 of 174 downloaded from cache (3 downloading)
  359. 32.54 s Downloading cached either-5.0.3-doc from https://cache.nix-ci.com
  360. 32.54 s Downloading cached free-5.2-doc from https://cache.nix-ci.com
  361. 32.54 s Downloading cached invariant-0.6.5-doc from https://cache.nix-ci.com
  362. 32.54 s Downloaded cached tasty-1.5.4-doc (3.2 MiB) in 20ms
  363. 32.54 s Progress: 0 of 101 built, 68 of 174 downloaded from cache (5 downloading)
  364. 32.56 s Downloaded cached semialign-1.3.1.1-doc (1.3 MiB) in 17ms
  365. 32.56 s Progress: 0 of 101 built, 69 of 174 downloaded from cache (4 downloading)
  366. 32.56 s Downloading cached aeson-2.2.4.1-doc from https://cache.nix-ci.com
  367. 32.56 s Downloaded cached invariant-0.6.5-doc (2.1 MiB) in 20ms
  368. 32.56 s Progress: 0 of 101 built, 70 of 174 downloaded from cache (4 downloading)
  369. 32.56 s Downloaded cached either-5.0.3-doc (447 KiB) in 21ms
  370. 32.56 s Progress: 0 of 101 built, 71 of 174 downloaded from cache (3 downloading)
  371. 32.57 s Downloaded cached free-5.2-doc (5.8 MiB) in 29ms
  372. 32.57 s Progress: 0 of 101 built, 72 of 174 downloaded from cache (2 downloading)
  373. 32.57 s Downloading cached adjunctions-4.4.4-doc from https://cache.nix-ci.com
  374. 32.57 s Downloading cached recursion-schemes-5.2.3-doc from https://cache.nix-ci.com
  375. 32.59 s Downloaded cached recursion-schemes-5.2.3-doc (1.9 MiB) in 15ms
  376. 32.59 s Progress: 0 of 101 built, 73 of 174 downloaded from cache (3 downloading)
  377. 32.59 s Downloading cached variant-1.0.2-doc from https://cache.nix-ci.com
  378. 32.59 s Downloaded cached adjunctions-4.4.4-doc (1.9 MiB) in 18ms
  379. 32.59 s Progress: 0 of 101 built, 74 of 174 downloaded from cache (3 downloading)
  380. 32.59 s Downloading cached kan-extensions-5.2.8-doc from https://cache.nix-ci.com
  381. 32.61 s Downloaded cached aeson-2.2.4.1-doc (13.9 MiB) in 49ms
  382. 32.61 s Progress: 0 of 101 built, 75 of 174 downloaded from cache (3 downloading)
  383. 32.61 s Downloaded cached variant-1.0.2-doc (4.5 MiB) in 23ms
  384. 32.61 s Progress: 0 of 101 built, 76 of 174 downloaded from cache (2 downloading)
  385. 32.62 s Downloaded cached kan-extensions-5.2.8-doc (2.2 MiB) in 26ms
  386. 32.62 s Progress: 0 of 101 built, 77 of 174 downloaded from cache (1 downloading)
  387. 32.62 s Downloading cached lens-5.3.6-doc from https://cache.nix-ci.com
  388. 32.71 s Downloaded cached lens-5.3.6-doc (33.4 MiB) in 91ms
  389. 32.71 s Progress: 0 of 101 built, 78 of 174 downloaded from cache (1 downloading)
  390. 32.71 s Downloading cached yaya-0.6.2.3-doc from https://cache.nix-ci.com
  391. 32.72 s Downloaded cached yaya-0.6.2.3-doc (2.9 MiB) in 16ms
  392. 32.72 s Progress: 0 of 101 built, 79 of 174 downloaded from cache (1 downloading)
  393. 32.72 s Downloading cached pathway-internal-0.0.1.0-doc from https://cache.nix-ci.com
  394. 32.72 s Downloading cached yaya-containers-0.1.2.2-doc from https://cache.nix-ci.com
  395. 32.72 s Downloading cached yaya-quickcheck-0.2.0.3-doc from https://cache.nix-ci.com
  396. 32.72 s Downloading cached yaya-unsafe-0.4.1.4-doc from https://cache.nix-ci.com
  397. 32.74 s Downloaded cached yaya-quickcheck-0.2.0.3-doc (268 KiB) in 11ms
  398. 32.74 s Progress: 0 of 101 built, 80 of 174 downloaded from cache (4 downloading)
  399. 32.74 s Downloaded cached yaya-containers-0.1.2.2-doc (1014 KiB) in 15ms
  400. 32.74 s Progress: 0 of 101 built, 81 of 174 downloaded from cache (3 downloading)
  401. 32.74 s Downloaded cached yaya-unsafe-0.4.1.4-doc (654 KiB) in 15ms
  402. 32.74 s Progress: 0 of 101 built, 82 of 174 downloaded from cache (2 downloading)
  403. 32.74 s Downloaded cached pathway-internal-0.0.1.0-doc (576 KiB) in 17ms
  404. 32.74 s Progress: 0 of 101 built, 83 of 174 downloaded from cache (1 downloading)
  405. 32.74 s Downloading cached pathway-0.0.1.0-doc from https://cache.nix-ci.com
  406. 32.74 s Downloading cached pathway-quickcheck-0.0.1.0-doc from https://cache.nix-ci.com
  407. 32.75 s Downloaded cached pathway-quickcheck-0.0.1.0-doc (216 KiB) in 9ms
  408. 32.75 s Progress: 0 of 100 built, 84 of 174 downloaded from cache (2 downloading)
  409. 32.75 s Downloaded cached pathway-0.0.1.0-doc (1.3 MiB) in 11ms
  410. 32.75 s Progress: 0 of 99 built, 85 of 174 downloaded from cache (1 downloading)
  411. 32.75 s Downloading cached pathway-compat-base-0.0.1.0-doc from https://cache.nix-ci.com
  412. 32.75 s Downloading cached pathway-path-0.0.1.0-doc from https://cache.nix-ci.com
  413. 32.76 s Downloaded cached pathway-path-0.0.1.0-doc (263 KiB) in 8ms
  414. 32.76 s Progress: 0 of 98 built, 86 of 174 downloaded from cache (2 downloading)
  415. 32.77 s Downloaded cached pathway-compat-base-0.0.1.0-doc (1.8 MiB) in 15ms
  416. 32.77 s Progress: 0 of 97 built, 87 of 174 downloaded from cache (1 downloading)
  417. 33.61 s Downloaded cached ghc (1.7 GiB) in 5.1s
  418. 33.61 s Progress: 0 of 96 built, 88 of 174 downloaded from cache
  419. 33.66 s Downloading cached OneTuple from https://cache.nix-ci.com
  420. 33.66 s Downloading cached StateVar from https://cache.nix-ci.com
  421. 33.66 s Downloading cached assoc from https://cache.nix-ci.com
  422. 33.66 s Downloading cached base-orphans from https://cache.nix-ci.com
  423. 33.66 s Downloading cached cabal-doctest from https://cache.nix-ci.com
  424. 33.66 s Downloading cached call-stack from https://cache.nix-ci.com
  425. 33.66 s Downloading cached character-ps from https://cache.nix-ci.com
  426. 33.66 s Downloading cached clock from https://cache.nix-ci.com
  427. 33.66 s Downloading cached code-page from https://cache.nix-ci.com
  428. 33.66 s Downloading cached colour from https://cache.nix-ci.com
  429. 33.66 s Downloading cached dlist from https://cache.nix-ci.com
  430. 33.66 s Downloading cached file-io from https://cache.nix-ci.com
  431. 33.66 s Downloading cached ghc-paths from https://cache.nix-ci.com
  432. 33.66 s Downloading cached indexed-traversable from https://cache.nix-ci.com
  433. 33.66 s Downloading cached integer-logarithms from https://cache.nix-ci.com
  434. 33.66 s Downloading cached old-locale from https://cache.nix-ci.com
  435. 33.68 s Downloaded cached StateVar (382 KiB) in 14ms
  436. 33.68 s Progress: 0 of 95 built, 89 of 174 downloaded from cache (15 downloading)
  437. 33.68 s Downloading cached os-string from https://cache.nix-ci.com
  438. 33.68 s Downloaded cached OneTuple (75 KiB) in 15ms
  439. 33.68 s Downloaded cached assoc (171 KiB) in 15ms
  440. 33.68 s Progress: 0 of 94 built, 90 of 174 downloaded from cache (15 downloading)
  441. 33.68 s Downloading cached contravariant from https://cache.nix-ci.com
  442. 33.68 s Progress: 0 of 93 built, 91 of 174 downloaded from cache (15 downloading)
  443. 33.68 s Downloaded cached call-stack (281 KiB) in 15ms
  444. 33.68 s Downloading cached parallel from https://cache.nix-ci.com
  445. 33.68 s Progress: 0 of 92 built, 92 of 174 downloaded from cache (15 downloading)
  446. 33.68 s Downloading cached parser-combinators from https://cache.nix-ci.com
  447. 33.68 s Downloaded cached base-orphans (2 MiB) in 16ms
  448. 33.68 s Progress: 0 of 91 built, 93 of 174 downloaded from cache (15 downloading)
  449. 33.68 s Downloading cached prettyprinter from https://cache.nix-ci.com
  450. 33.68 s Downloaded cached old-locale (529 KiB) in 17ms
  451. 33.68 s Progress: 0 of 90 built, 94 of 174 downloaded from cache (15 downloading)
  452. 33.68 s Downloading cached primitive from https://cache.nix-ci.com
  453. 33.68 s Downloaded cached cabal-doctest (768 KiB) in 21ms
  454. 33.68 s Progress: 0 of 89 built, 95 of 174 downloaded from cache (15 downloading)
  455. 33.68 s Downloading cached old-time from https://cache.nix-ci.com
  456. 33.68 s Downloaded cached code-page (366 KiB) in 21ms
  457. 33.68 s Progress: 0 of 88 built, 96 of 174 downloaded from cache (15 downloading)
  458. 33.68 s Downloading cached reflection from https://cache.nix-ci.com
  459. 33.68 s Downloaded cached dlist (1.4 MiB) in 22ms
  460. 33.68 s Progress: 0 of 88 built, 97 of 174 downloaded from cache (15 downloading)
  461. 33.68 s Downloading cached splitmix from https://cache.nix-ci.com
  462. 33.68 s Downloaded cached ghc-paths (101 KiB) in 22ms
  463. 33.68 s Progress: 0 of 87 built, 98 of 174 downloaded from cache (15 downloading)
  464. 33.68 s Downloading cached syb from https://cache.nix-ci.com
  465. 33.69 s Downloaded cached character-ps (2.2 MiB) in 27ms
  466. 33.69 s Progress: 0 of 87 built, 99 of 174 downloaded from cache (15 downloading)
  467. 33.69 s Downloading cached tagged from https://cache.nix-ci.com
  468. 33.69 s Downloaded cached clock (1.8 MiB) in 28ms
  469. 33.69 s Downloaded cached file-io (1.1 MiB) in 28ms
  470. 33.69 s Progress: 0 of 86 built, 100 of 174 downloaded from cache (15 downloading)
  471. 33.69 s Downloading cached th-abstraction from https://cache.nix-ci.com
  472. 33.69 s Progress: 0 of 85 built, 101 of 174 downloaded from cache (15 downloading)
  473. 33.69 s Downloading cached extra from https://cache.nix-ci.com
  474. 33.69 s Downloaded cached indexed-traversable (3.9 MiB) in 29ms
  475. 33.69 s Progress: 0 of 84 built, 102 of 174 downloaded from cache (15 downloading)
  476. 33.69 s Downloading cached th-compat from https://cache.nix-ci.com
  477. 33.69 s Downloaded cached integer-logarithms (912 KiB) in 31ms
  478. 33.69 s Progress: 0 of 83 built, 103 of 174 downloaded from cache (15 downloading)
  479. 33.69 s Downloading cached transformers-compat from https://cache.nix-ci.com
  480. 33.70 s Downloaded cached parallel (1.4 MiB) in 19ms
  481. 33.70 s Progress: 0 of 82 built, 104 of 174 downloaded from cache (15 downloading)
  482. 33.70 s Downloading cached unliftio-core from https://cache.nix-ci.com
  483. 33.70 s Downloaded cached contravariant (1.9 MiB) in 21ms
  484. 33.70 s Progress: 0 of 81 built, 105 of 174 downloaded from cache (15 downloading)
  485. 33.70 s Downloading cached vector-stream from https://cache.nix-ci.com
  486. 33.70 s Downloaded cached parser-combinators (1.8 MiB) in 26ms
  487. 33.70 s Progress: 0 of 80 built, 106 of 174 downloaded from cache (15 downloading)
  488. 33.72 s Downloaded cached colour (5.5 MiB) in 56ms
  489. 33.72 s Progress: 0 of 79 built, 107 of 174 downloaded from cache (14 downloading)
  490. 33.72 s Downloading cached ansi-terminal-types from https://cache.nix-ci.com
  491. 33.72 s Downloaded cached splitmix (881 KiB) in 38ms
  492. 33.72 s Progress: 0 of 78 built, 108 of 174 downloaded from cache (14 downloading)
  493. 33.72 s Downloaded cached old-time (2.3 MiB) in 40ms
  494. 33.72 s Downloading cached random from https://cache.nix-ci.com
  495. 33.72 s Progress: 0 of 77 built, 109 of 174 downloaded from cache (14 downloading)
  496. 33.73 s Downloaded cached os-string (5.9 MiB) in 56ms
  497. 33.73 s Progress: 0 of 76 built, 110 of 174 downloaded from cache (13 downloading)
  498. 33.73 s Downloaded cached tagged (1.7 MiB) in 44ms
  499. 33.73 s Downloaded cached th-compat (569 KiB) in 42ms
  500. 33.73 s Downloading cached hashable from https://cache.nix-ci.com
  501. 33.73 s Progress: 0 of 75 built, 111 of 174 downloaded from cache (13 downloading)
  502. 33.73 s Progress: 0 of 75 built, 112 of 174 downloaded from cache (12 downloading)
  503. 33.74 s Downloading cached distributive from https://cache.nix-ci.com
  504. 33.74 s Downloading cached network-uri from https://cache.nix-ci.com
  505. 33.74 s Downloaded cached unliftio-core (390 KiB) in 40ms
  506. 33.74 s Progress: 0 of 73 built, 113 of 174 downloaded from cache (13 downloading)
  507. 33.74 s Downloaded cached syb (2.8 MiB) in 54ms
  508. 33.74 s Progress: 0 of 72 built, 114 of 174 downloaded from cache (12 downloading)
  509. 33.76 s Downloaded cached vector-stream (3.1 MiB) in 58ms
  510. 33.76 s Progress: 0 of 72 built, 115 of 174 downloaded from cache (11 downloading)
  511. 33.76 s Downloaded cached reflection (6 MiB) in 75ms
  512. 33.76 s Progress: 0 of 71 built, 116 of 174 downloaded from cache (10 downloading)
  513. 33.76 s Downloaded cached transformers-compat (3.4 MiB) in 70ms
  514. 33.76 s Progress: 0 of 70 built, 117 of 174 downloaded from cache (9 downloading)
  515. 33.77 s Downloading cached transformers-base from https://cache.nix-ci.com
  516. 33.77 s Downloaded cached primitive (8.7 MiB) in 86ms
  517. 33.77 s Downloaded cached prettyprinter (8.6 MiB) in 88ms
  518. 33.77 s Progress: 0 of 69 built, 118 of 174 downloaded from cache (9 downloading)
  519. 33.77 s Downloading cached integer-conversion from https://cache.nix-ci.com
  520. 33.77 s Progress: 0 of 68 built, 119 of 174 downloaded from cache (9 downloading)
  521. 33.77 s Downloaded cached distributive (1.2 MiB) in 32ms
  522. 33.77 s Progress: 0 of 67 built, 120 of 174 downloaded from cache (8 downloading)
  523. 33.77 s Downloading cached comonad from https://cache.nix-ci.com
  524. 33.77 s Downloaded cached th-abstraction (5.7 MiB) in 80ms
  525. 33.77 s Progress: 0 of 66 built, 121 of 174 downloaded from cache (8 downloading)
  526. 33.77 s Downloaded cached ansi-terminal-types (3.3 MiB) in 50ms
  527. 33.77 s Progress: 0 of 65 built, 122 of 174 downloaded from cache (7 downloading)
  528. 33.77 s Downloading cached ansi-terminal from https://cache.nix-ci.com
  529. 33.77 s Downloaded cached extra (4.2 MiB) in 81ms
  530. 33.77 s Progress: 0 of 64 built, 123 of 174 downloaded from cache (7 downloading)
  531. 33.77 s Downloaded cached hashable (3.3 MiB) in 40ms
  532. 33.77 s Progress: 0 of 63 built, 124 of 174 downloaded from cache (6 downloading)
  533. 33.78 s Downloading cached case-insensitive from https://cache.nix-ci.com
  534. 33.78 s Downloading cached data-fix from https://cache.nix-ci.com
  535. 33.78 s Downloading cached scientific from https://cache.nix-ci.com
  536. 33.78 s Downloading cached text-short from https://cache.nix-ci.com
  537. 33.78 s Downloading cached these from https://cache.nix-ci.com
  538. 33.78 s Downloading cached time-compat from https://cache.nix-ci.com
  539. 33.78 s Downloading cached unordered-containers from https://cache.nix-ci.com
  540. 33.78 s Downloaded cached network-uri (4.8 MiB) in 42ms
  541. 33.78 s Progress: 0 of 62 built, 125 of 174 downloaded from cache (12 downloading)
  542. 33.78 s Downloaded cached random (8.9 MiB) in 60ms
  543. 33.78 s Progress: 0 of 61 built, 126 of 174 downloaded from cache (11 downloading)
  544. 33.78 s Downloading cached QuickCheck from https://cache.nix-ci.com
  545. 33.78 s Downloading cached temporary from https://cache.nix-ci.com
  546. 33.78 s Downloading cached uuid-types from https://cache.nix-ci.com
  547. 33.81 s Downloaded cached transformers-base (649 KiB) in 46ms
  548. 33.81 s Progress: 0 of 60 built, 127 of 174 downloaded from cache (13 downloading)
  549. 33.82 s Downloaded cached temporary (305 KiB) in 35ms
  550. 33.82 s Downloaded cached integer-conversion (193 KiB) in 53ms
  551. 33.82 s Progress: 0 of 59 built, 128 of 174 downloaded from cache (12 downloading)
  552. 33.82 s Downloading cached doctest from https://cache.nix-ci.com
  553. 33.82 s Progress: 0 of 58 built, 129 of 174 downloaded from cache (12 downloading)
  554. 33.83 s Downloaded cached data-fix (1.1 MiB) in 49ms
  555. 33.83 s Progress: 0 of 57 built, 130 of 174 downloaded from cache (11 downloading)
  556. 33.83 s Downloaded cached case-insensitive (947 KiB) in 49ms
  557. 33.83 s Progress: 0 of 56 built, 131 of 174 downloaded from cache (10 downloading)
  558. 33.83 s Downloaded cached ansi-terminal (1.2 MiB) in 60ms
  559. 33.83 s Progress: 0 of 55 built, 132 of 174 downloaded from cache (9 downloading)
  560. 33.83 s Downloading cached prettyprinter-ansi-terminal from https://cache.nix-ci.com
  561. 33.83 s Downloaded cached uuid-types (1.6 MiB) in 50ms
  562. 33.84 s Progress: 0 of 54 built, 133 of 174 downloaded from cache (9 downloading)
  563. 33.84 s Downloaded cached text-short (1.7 MiB) in 60ms
  564. 33.84 s Progress: 0 of 53 built, 134 of 174 downloaded from cache (8 downloading)
  565. 33.84 s Downloaded cached comonad (3.2 MiB) in 72ms
  566. 33.84 s Progress: 0 of 52 built, 135 of 174 downloaded from cache (7 downloading)
  567. 33.84 s Downloading cached bifunctors from https://cache.nix-ci.com
  568. 33.84 s Downloaded cached these (3.1 MiB) in 66ms
  569. 33.84 s Progress: 0 of 51 built, 136 of 174 downloaded from cache (7 downloading)
  570. 33.84 s Downloading cached strict from https://cache.nix-ci.com
  571. 33.84 s Downloaded cached scientific (2.9 MiB) in 68ms
  572. 33.84 s Downloaded cached time-compat (3 MiB) in 68ms
  573. 33.84 s Progress: 0 of 50 built, 137 of 174 downloaded from cache (7 downloading)
  574. 33.84 s Downloading cached megaparsec from https://cache.nix-ci.com
  575. 33.84 s Progress: 0 of 49 built, 138 of 174 downloaded from cache (7 downloading)
  576. 33.84 s Downloading cached text-iso8601 from https://cache.nix-ci.com
  577. 33.88 s Downloaded cached unordered-containers (9.4 MiB) in 104ms
  578. 33.88 s Progress: 0 of 48 built, 139 of 174 downloaded from cache (7 downloading)
  579. 33.88 s Downloaded cached prettyprinter-ansi-terminal (1.4 MiB) in 49ms
  580. 33.88 s Progress: 0 of 47 built, 140 of 174 downloaded from cache (6 downloading)
  581. 33.88 s Downloading cached optparse-applicative from https://cache.nix-ci.com
  582. 33.91 s Downloaded cached text-iso8601 (2.9 MiB) in 61ms
  583. 33.91 s Progress: 0 of 46 built, 141 of 174 downloaded from cache (6 downloading)
  584. 33.92 s Downloaded cached strict (5.2 MiB) in 75ms
  585. 33.92 s Progress: 0 of 45 built, 142 of 174 downloaded from cache (5 downloading)
  586. 33.93 s Downloaded cached QuickCheck (20.1 MiB) in 143ms
  587. 33.93 s Progress: 0 of 44 built, 143 of 174 downloaded from cache (4 downloading)
  588. 33.96 s Downloaded cached megaparsec (15.4 MiB) in 113ms
  589. 33.96 s Progress: 0 of 43 built, 144 of 174 downloaded from cache (3 downloading)
  590. 33.96 s Downloaded cached bifunctors (16 MiB) in 117ms
  591. 33.96 s Progress: 0 of 42 built, 145 of 174 downloaded from cache (2 downloading)
  592. 33.96 s Downloading cached profunctors from https://cache.nix-ci.com
  593. 33.96 s Downloading cached semigroupoids from https://cache.nix-ci.com
  594. 33.96 s Downloaded cached optparse-applicative (8.7 MiB) in 79ms
  595. 33.96 s Progress: 0 of 41 built, 146 of 174 downloaded from cache (3 downloading)
  596. 33.96 s Downloading cached tasty from https://cache.nix-ci.com
  597. 34.03 s Downloaded cached profunctors (10.7 MiB) in 71ms
  598. 34.03 s Progress: 0 of 40 built, 147 of 174 downloaded from cache (3 downloading)
  599. 34.03 s Downloading cached invariant from https://cache.nix-ci.com
  600. 34.04 s Downloaded cached tasty (9.6 MiB) in 82ms
  601. 34.04 s Progress: 0 of 39 built, 148 of 174 downloaded from cache (3 downloading)
  602. 34.05 s Downloading cached vector from https://cache.nix-ci.com
  603. 34.05 s Downloaded cached semigroupoids (12.2 MiB) in 87ms
  604. 34.05 s Progress: 0 of 38 built, 149 of 174 downloaded from cache (3 downloading)
  605. 34.05 s Downloading cached either from https://cache.nix-ci.com
  606. 34.05 s Downloading cached free from https://cache.nix-ci.com
  607. 34.08 s Downloaded cached either (891 KiB) in 29ms
  608. 34.08 s Progress: 0 of 37 built, 150 of 174 downloaded from cache (4 downloading)
  609. 34.08 s Downloaded cached invariant (5.5 MiB) in 51ms
  610. 34.08 s Progress: 0 of 36 built, 151 of 174 downloaded from cache (3 downloading)
  611. 34.12 s Downloaded cached doctest (66.2 MiB) in 303ms
  612. 34.13 s Progress: 0 of 35 built, 152 of 174 downloaded from cache (2 downloading)
  613. 34.15 s Downloaded cached free (22.8 MiB) in 97ms
  614. 34.15 s Progress: 0 of 34 built, 153 of 174 downloaded from cache (1 downloading)
  615. 34.15 s Downloading cached adjunctions from https://cache.nix-ci.com
  616. 34.15 s Downloading cached recursion-schemes from https://cache.nix-ci.com
  617. 34.18 s Downloaded cached adjunctions (6.2 MiB) in 29ms
  618. 34.18 s Progress: 0 of 33 built, 154 of 174 downloaded from cache (2 downloading)
  619. 34.18 s Downloading cached kan-extensions from https://cache.nix-ci.com
  620. 34.18 s Downloaded cached recursion-schemes (6.8 MiB) in 38ms
  621. 34.18 s Progress: 0 of 32 built, 155 of 174 downloaded from cache (2 downloading)
  622. 34.19 s Downloading cached variant from https://cache.nix-ci.com
  623. 34.21 s Downloaded cached kan-extensions (7.2 MiB) in 31ms
  624. 34.21 s Progress: 0 of 31 built, 156 of 174 downloaded from cache (2 downloading)
  625. 34.21 s Downloaded cached vector (57.2 MiB) in 166ms
  626. 34.21 s Progress: 0 of 30 built, 157 of 174 downloaded from cache (1 downloading)
  627. 34.21 s Downloading cached indexed-traversable-instances from https://cache.nix-ci.com
  628. 34.21 s Downloading cached quickcheck-instances from https://cache.nix-ci.com
  629. 34.23 s Downloaded cached indexed-traversable-instances (360 KiB) in 17ms
  630. 34.23 s Progress: 0 of 29 built, 158 of 174 downloaded from cache (2 downloading)
  631. 34.23 s Downloading cached lens from https://cache.nix-ci.com
  632. 34.23 s Downloading cached semialign from https://cache.nix-ci.com
  633. 34.23 s Downloading cached witherable from https://cache.nix-ci.com
  634. 34.23 s Downloaded cached variant (11 MiB) in 46ms
  635. 34.23 s Progress: 0 of 28 built, 159 of 174 downloaded from cache (4 downloading)
  636. 34.26 s Downloaded cached semialign (3.8 MiB) in 26ms
  637. 34.26 s Progress: 0 of 27 built, 160 of 174 downloaded from cache (3 downloading)
  638. 34.26 s Downloaded cached witherable (4.6 MiB) in 30ms
  639. 34.26 s Progress: 0 of 26 built, 161 of 174 downloaded from cache (2 downloading)
  640. 34.26 s Downloading cached aeson from https://cache.nix-ci.com
  641. 34.28 s Downloaded cached quickcheck-instances (5.5 MiB) in 71ms
  642. 34.28 s Progress: 0 of 25 built, 162 of 174 downloaded from cache (2 downloading)
  643. 34.38 s Downloaded cached lens (60 MiB) in 145ms
  644. 34.38 s Progress: 0 of 24 built, 163 of 174 downloaded from cache (1 downloading)
  645. 34.38 s Downloading cached yaya from https://cache.nix-ci.com
  646. 34.39 s Downloaded cached aeson (48.5 MiB) in 126ms
  647. 34.39 s Progress: 0 of 23 built, 164 of 174 downloaded from cache (1 downloading)
  648. 34.39 s Downloading cached path from https://cache.nix-ci.com
  649. 34.41 s Downloaded cached yaya (5.4 MiB) in 33ms
  650. 34.41 s Progress: 0 of 22 built, 165 of 174 downloaded from cache (1 downloading)
  651. 34.41 s Downloading cached pathway-internal from https://cache.nix-ci.com
  652. 34.41 s Downloading cached yaya-containers from https://cache.nix-ci.com
  653. 34.41 s Downloading cached yaya-quickcheck from https://cache.nix-ci.com
  654. 34.41 s Downloading cached yaya-unsafe from https://cache.nix-ci.com
  655. 34.42 s Downloaded cached path (10 MiB) in 35ms
  656. 34.42 s Progress: 0 of 21 built, 166 of 174 downloaded from cache (4 downloading)
  657. 34.43 s Downloaded cached yaya-quickcheck (350 KiB) in 15ms
  658. 34.43 s Progress: 0 of 20 built, 167 of 174 downloaded from cache (3 downloading)
  659. 34.43 s Downloaded cached yaya-unsafe (1 MiB) in 18ms
  660. 34.43 s Progress: 0 of 19 built, 168 of 174 downloaded from cache (2 downloading)
  661. 34.43 s Downloaded cached pathway-internal (2.1 MiB) in 19ms
  662. 34.43 s Progress: 0 of 18 built, 169 of 174 downloaded from cache (1 downloading)
  663. 34.43 s Downloading cached pathway-quickcheck from https://cache.nix-ci.com
  664. 34.44 s Downloaded cached yaya-containers (3.5 MiB) in 25ms
  665. 34.44 s Progress: 0 of 17 built, 170 of 174 downloaded from cache (1 downloading)
  666. 34.44 s Downloaded cached pathway-quickcheck (179 KiB) in 6ms
  667. 34.44 s Downloading cached pathway from https://cache.nix-ci.com
  668. 34.44 s Progress: 0 of 16 built, 171 of 174 downloaded from cache (1 downloading)
  669. 34.45 s Downloaded cached pathway (2.7 MiB) in 17ms
  670. 34.45 s Progress: 0 of 15 built, 172 of 174 downloaded from cache
  671. 34.46 s Downloading cached pathway-compat-base from https://cache.nix-ci.com
  672. 34.46 s Downloading cached pathway-path from https://cache.nix-ci.com
  673. 34.46 s Downloaded cached pathway-path (217 KiB) in 7ms
  674. 34.46 s Progress: 0 of 14 built, 173 of 174 downloaded from cache (1 downloading)
  675. 34.47 s Downloaded cached pathway-compat-base (2 MiB) in 16ms
  676. 34.47 s Progress: 0 of 13 built, 174 of 174 downloaded from cache
  677. 34.58 s Building /nix/store/6lbsvjysc8745w76x16kfxcnc6z3dmn1-pathway-compat-filepath-0.0.1.0.drv
  678. 34.79 s [pathway-compat-filepath] Phase: setupCompilerEnvironmentPhase
  679. 34.79 s [pathway-compat-filepath] Build with /nix/store/2djpcnj8a25viv1y24h3mziy1gsy3fc6-ghc-9.6.7.
  680. 35.15 s [pathway-compat-filepath] Phase: unpackPhase
  681. 35.15 s [pathway-compat-filepath] unpacking source archive /nix/store/99h2nwiw8z9r3kqrm9kdhv4k4sf61d7w-filepath
  682. 35.16 s [pathway-compat-filepath] source root is filepath
  683. 35.17 s [pathway-compat-filepath] Phase: patchPhase
  684. 35.19 s [pathway-compat-filepath] Phase: compileBuildDriverPhase
  685. 35.19 s [pathway-compat-filepath] setupCompileFlags: -package-db=/build/tmp.5obQjx6sMQ/setup-package.conf.d -threaded
  686. 35.24 s [pathway-compat-filepath] [1 of 2] Compiling Main ( Setup.hs, /build/tmp.5obQjx6sMQ/Main.o )
  687. 35.30 s [pathway-compat-filepath] [2 of 2] Linking Setup
  688. 36.56 s [pathway-compat-filepath] Phase: updateAutotoolsGnuConfigScriptsPhase
  689. 36.57 s [pathway-compat-filepath] Phase: configurePhase
  690. 36.58 s [pathway-compat-filepath] configureFlags: --verbose --prefix=/nix/store/764l5kra2q49626jx0rg4mkpkja5c8jz-pathway-compat-filepath-0.0.1.0 --libdir=$prefix/lib/$compiler/lib --libsubdir=$abi/$libname --docdir=/nix/store/5iwzgix3zvg58nzmgb744x9xh6gy8ijk-pathway-compat-filepath-0.0.1.0-doc/share/doc/pathway-compat-filepath-0.0.1.0 --with-gcc=gcc --package-db=/build/tmp.5obQjx6sMQ/package.conf.d --ghc-option=-j16 --ghc-option=+RTS --ghc-option=-A64M --ghc-option=-RTS --enable-library-profiling --profiling-detail=exported-functions --disable-profiling --enable-shared --disable-coverage --enable-static --disable-executable-dynamic --enable-tests --disable-benchmarks --enable-library-vanilla --disable-library-for-ghci --enable-split-sections --enable-library-stripping --enable-executable-stripping --ghc-option=-haddock --ghc-options=-Werror --extra-lib-dirs=/nix/store/pndhkk0l649lm1sj0mxk7cbwq26qd1ra-ncurses-6.6/lib --extra-lib-dirs=/nix/store/0djlg4g0b81w94k3vcaqsxsc2hh4kism-libffi-3.5.2/lib --extra-lib-dirs=/nix/store/md4paia7riiggyrj8p24c7a6vf8w7jz8-elfutils-0.194/lib --extra-lib-dirs=/nix/store/39vv2pf64gd8li48a4hpbhw2crzd8z5p-gmp-with-cxx-6.3.0/lib --extra-lib-dirs=/nix/store/7wwvald8lapkrsr72qanlw8blyn55ifx-numactl-2.0.18/lib --extra-lib-dirs=/nix/store/2djpcnj8a25viv1y24h3mziy1gsy3fc6-ghc-9.6.7/lib
  691. 36.59 s [pathway-compat-filepath] Using Parsec parser
  692. 36.59 s [pathway-compat-filepath] Configuring pathway-compat-filepath-0.0.1.0...
  693. 36.98 s [pathway-compat-filepath] Flags chosen: noisy-deprecations=True, verify-no-recursion=False
  694. 36.98 s [pathway-compat-filepath] Dependency base >=4.14.0 && <4.15 || >=4.15.0 && <4.16 || >=4.16.0 && <4.17 ||
  695. 36.98 s [pathway-compat-filepath] >=4.17.0 && <4.18 || >=4.18.0 && <4.19 || >=4.19.0 && <4.20 || >=4.20.0 &&
  696. 36.98 s [pathway-compat-filepath] <4.21 || >=4.21.0 && <4.22 || >=4.22.0 && <4.23: using base-4.18.3.0
  697. 36.98 s [pathway-compat-filepath] Dependency extra: using extra-1.8.1
  698. 36.98 s [pathway-compat-filepath] Dependency filepath >=1.4.2 && <1.5 || >=1.5.0 && <1.6: using
  699. 36.98 s [pathway-compat-filepath] filepath-1.4.301.0
  700. 36.98 s [pathway-compat-filepath] Dependency megaparsec >=9.0.1 && <9.1 || >=9.2.1 && <9.3 || >=9.5.0 && <9.6 ||
  701. 36.98 s [pathway-compat-filepath] >=9.7.0 && <9.8: using megaparsec-9.7.0
  702. 36.98 s [pathway-compat-filepath] Dependency pathway >=0.0.1 && <0.1: using pathway-0.0.1.0
  703. 36.98 s [pathway-compat-filepath] Dependency pathway-compat-base >=0.0.1 && <0.1: using
  704. 36.98 s [pathway-compat-filepath] pathway-compat-base-0.0.1.0
  705. 36.98 s [pathway-compat-filepath] Dependency pathway-internal >=0.0.1 && <0.1: using pathway-internal-0.0.1.0
  706. 36.98 s [pathway-compat-filepath] Dependency base >=4.14.0 && <4.15 || >=4.15.0 && <4.16 || >=4.16.0 && <4.17 ||
  707. 36.98 s [pathway-compat-filepath] >=4.17.0 && <4.18 || >=4.18.0 && <4.19 || >=4.19.0 && <4.20 || >=4.20.0 &&
  708. 36.98 s [pathway-compat-filepath] <4.21 || >=4.21.0 && <4.22 || >=4.22.0 && <4.23: using base-4.18.3.0
  709. 36.98 s [pathway-compat-filepath] Dependency doctest >=0.16.3 && <0.17 || >=0.18.1 && <0.19 || >=0.20.1 && <0.21
  710. 36.98 s [pathway-compat-filepath] || >=0.21.1 && <0.22 || >=0.22.2 && <0.23 || >=0.24.2 && <0.25: using
  711. 36.98 s [pathway-compat-filepath] doctest-0.24.3
  712. 36.98 s [pathway-compat-filepath] Dependency pathway-compat-filepath: using pathway-compat-filepath-0.0.1.0
  713. 37.37 s [pathway-compat-filepath] Source component graph:
  714. 37.37 s [pathway-compat-filepath] component lib
  715. 37.37 s [pathway-compat-filepath] component test:doctests dependency lib
  716. 37.37 s [pathway-compat-filepath] Configured component graph:
  717. 37.37 s [pathway-compat-filepath] component pathway-compat-filepath-0.0.1.0-4Le08sqZwwxHUIaNWPZcs2
  718. 37.37 s [pathway-compat-filepath] include base-4.18.3.0
  719. 37.37 s [pathway-compat-filepath] include extra-1.8.1-FU1frm3XcM88A49dBkmtgI
  720. 37.37 s [pathway-compat-filepath] include filepath-1.4.301.0
  721. 37.37 s [pathway-compat-filepath] include megaparsec-9.7.0-EpAk7LLR2KBGAKafJPbXz1
  722. 37.37 s [pathway-compat-filepath] include pathway-0.0.1.0-5VJXWbvreBAfybP2NROr3
  723. 37.37 s [pathway-compat-filepath] include pathway-compat-base-0.0.1.0-E02izPYkwmmGdAPlQBKjbP
  724. 37.37 s [pathway-compat-filepath] include pathway-internal-0.0.1.0-1xeSc3z2VhRIotiMz9hdL1
  725. 37.37 s [pathway-compat-filepath] component pathway-compat-filepath-0.0.1.0-1CRX2L8nW586DbgyNTab4-doctests
  726. 37.37 s [pathway-compat-filepath] include base-4.18.3.0
  727. 37.37 s [pathway-compat-filepath] include doctest-0.24.3-ACQNy8u8jPjC50l4I3tyiL
  728. 37.37 s [pathway-compat-filepath] include pathway-compat-filepath-0.0.1.0-4Le08sqZwwxHUIaNWPZcs2
  729. 37.37 s [pathway-compat-filepath] Linked component graph:
  730. 37.37 s [pathway-compat-filepath] unit pathway-compat-filepath-0.0.1.0-4Le08sqZwwxHUIaNWPZcs2
  731. 37.37 s [pathway-compat-filepath] include base-4.18.3.0
  732. 37.37 s [pathway-compat-filepath] include extra-1.8.1-FU1frm3XcM88A49dBkmtgI
  733. 37.37 s [pathway-compat-filepath] include filepath-1.4.301.0
  734. 37.37 s [pathway-compat-filepath] include megaparsec-9.7.0-EpAk7LLR2KBGAKafJPbXz1
  735. 37.37 s [pathway-compat-filepath] include pathway-0.0.1.0-5VJXWbvreBAfybP2NROr3
  736. 37.37 s [pathway-compat-filepath] include pathway-compat-base-0.0.1.0-E02izPYkwmmGdAPlQBKjbP
  737. 37.37 s [pathway-compat-filepath] include pathway-internal-0.0.1.0-1xeSc3z2VhRIotiMz9hdL1
  738. 37.37 s [pathway-compat-filepath] Common.FilePath=pathway-compat-filepath-0.0.1.0-4Le08sqZwwxHUIaNWPZcs2:Common.FilePath,Common.OsPath=pathway-compat-filepath-0.0.1.0-4Le08sqZwwxHUIaNWPZcs2:Common.OsPath,System.FilePath=pathway-compat-filepath-0.0.1.0-4Le08sqZwwxHUIaNWPZcs2:System.FilePath,System.FilePath.Overlay=pathway-compat-filepath-0.0.1.0-4Le08sqZwwxHUIaNWPZcs2:System.FilePath.Overlay,System.FilePath.Pathway=pathway-compat-filepath-0.0.1.0-4Le08sqZwwxHUIaNWPZcs2:System.FilePath.Pathway,System.FilePath.Thin=pathway-compat-filepath-0.0.1.0-4Le08sqZwwxHUIaNWPZcs2:System.FilePath.Thin,System.OsPath=pathway-compat-filepath-0.0.1.0-4Le08sqZwwxHUIaNWPZcs2:System.OsPath,System.OsPath.Overlay=pathway-compat-filepath-0.0.1.0-4Le08sqZwwxHUIaNWPZcs2:System.OsPath.Overlay,System.OsPath.Pathway=pathway-compat-filepath-0.0.1.0-4Le08sqZwwxHUIaNWPZcs2:System.OsPath.Pathway,System.OsPath.Thin=pathway-compat-filepath-0.0.1.0-4Le08sqZwwxHUIaNWPZcs2:System.OsPath.Thin
  739. 37.37 s [pathway-compat-filepath] unit pathway-compat-filepath-0.0.1.0-1CRX2L8nW586DbgyNTab4-doctests
  740. 37.37 s [pathway-compat-filepath] include base-4.18.3.0
  741. 37.37 s [pathway-compat-filepath] include doctest-0.24.3-ACQNy8u8jPjC50l4I3tyiL
  742. 37.37 s [pathway-compat-filepath] include pathway-compat-filepath-0.0.1.0-4Le08sqZwwxHUIaNWPZcs2
  743. 37.37 s [pathway-compat-filepath] Ready component graph:
  744. 37.37 s [pathway-compat-filepath] definite pathway-compat-filepath-0.0.1.0-4Le08sqZwwxHUIaNWPZcs2
  745. 37.37 s [pathway-compat-filepath] depends base-4.18.3.0
  746. 37.37 s [pathway-compat-filepath] depends extra-1.8.1-FU1frm3XcM88A49dBkmtgI
  747. 37.37 s [pathway-compat-filepath] depends filepath-1.4.301.0
  748. 37.37 s [pathway-compat-filepath] depends megaparsec-9.7.0-EpAk7LLR2KBGAKafJPbXz1
  749. 37.37 s [pathway-compat-filepath] depends pathway-0.0.1.0-5VJXWbvreBAfybP2NROr3
  750. 37.37 s [pathway-compat-filepath] depends pathway-compat-base-0.0.1.0-E02izPYkwmmGdAPlQBKjbP
  751. 37.37 s [pathway-compat-filepath] depends pathway-internal-0.0.1.0-1xeSc3z2VhRIotiMz9hdL1
  752. 37.37 s [pathway-compat-filepath] definite pathway-compat-filepath-0.0.1.0-1CRX2L8nW586DbgyNTab4-doctests
  753. 37.37 s [pathway-compat-filepath] depends base-4.18.3.0
  754. 37.37 s [pathway-compat-filepath] depends doctest-0.24.3-ACQNy8u8jPjC50l4I3tyiL
  755. 37.37 s [pathway-compat-filepath] depends pathway-compat-filepath-0.0.1.0-4Le08sqZwwxHUIaNWPZcs2
  756. 37.37 s [pathway-compat-filepath] Using Cabal-3.10.3.0 compiled by ghc-9.6
  757. 37.37 s [pathway-compat-filepath] Using compiler: ghc-9.6.7
  758. 37.37 s [pathway-compat-filepath] Using install prefix:
  759. 37.37 s [pathway-compat-filepath] /nix/store/764l5kra2q49626jx0rg4mkpkja5c8jz-pathway-compat-filepath-0.0.1.0
  760. 37.37 s [pathway-compat-filepath] Executables installed in:
  761. 37.37 s [pathway-compat-filepath] /nix/store/764l5kra2q49626jx0rg4mkpkja5c8jz-pathway-compat-filepath-0.0.1.0/bin
  762. 37.37 s [pathway-compat-filepath] Libraries installed in:
  763. 37.37 s [pathway-compat-filepath] /nix/store/764l5kra2q49626jx0rg4mkpkja5c8jz-pathway-compat-filepath-0.0.1.0/lib/ghc-9.6.7/lib/x86_64-linux-ghc-9.6.7/pathway-compat-filepath-0.0.1.0-4Le08sqZwwxHUIaNWPZcs2
  764. 37.37 s [pathway-compat-filepath] Dynamic Libraries installed in:
  765. 37.37 s [pathway-compat-filepath] /nix/store/764l5kra2q49626jx0rg4mkpkja5c8jz-pathway-compat-filepath-0.0.1.0/lib/ghc-9.6.7/lib/x86_64-linux-ghc-9.6.7
  766. 37.37 s [pathway-compat-filepath] Private executables installed in:
  767. 37.37 s [pathway-compat-filepath] /nix/store/764l5kra2q49626jx0rg4mkpkja5c8jz-pathway-compat-filepath-0.0.1.0/libexec/x86_64-linux-ghc-9.6.7/pathway-compat-filepath-0.0.1.0
  768. 37.37 s [pathway-compat-filepath] Data files installed in:
  769. 37.37 s [pathway-compat-filepath] /nix/store/764l5kra2q49626jx0rg4mkpkja5c8jz-pathway-compat-filepath-0.0.1.0/share/x86_64-linux-ghc-9.6.7/pathway-compat-filepath-0.0.1.0
  770. 37.37 s [pathway-compat-filepath] Documentation installed in:
  771. 37.37 s [pathway-compat-filepath] /nix/store/5iwzgix3zvg58nzmgb744x9xh6gy8ijk-pathway-compat-filepath-0.0.1.0-doc/share/doc/pathway-compat-filepath-0.0.1.0
  772. 37.37 s [pathway-compat-filepath] Configuration files installed in:
  773. 37.37 s [pathway-compat-filepath] /nix/store/764l5kra2q49626jx0rg4mkpkja5c8jz-pathway-compat-filepath-0.0.1.0/etc
  774. 37.37 s [pathway-compat-filepath] No alex found
  775. 37.37 s [pathway-compat-filepath] Using ar found on system at:
  776. 37.37 s [pathway-compat-filepath] /nix/store/zjraf40s86y3iwhp626b934r5y6ldkbb-binutils-wrapper-2.46/bin/ar
  777. 37.37 s [pathway-compat-filepath] No c2hs found
  778. 37.37 s [pathway-compat-filepath] No cpphs found
  779. 37.37 s [pathway-compat-filepath] Using doctest version 0.24.3 found on system at:
  780. 37.37 s [pathway-compat-filepath] /nix/store/s48k56ayjjxwdbz9y7d8mnqwlcjfi1a8-doctest-0.24.3/bin/doctest
  781. 37.37 s [pathway-compat-filepath] Using gcc version 15.2.0 given by user at:
  782. 37.37 s [pathway-compat-filepath] /nix/store/29qjlshvklnyr67nhpprzgb9igmsfsjj-gcc-wrapper-15.2.0/bin/gcc
  783. 37.37 s [pathway-compat-filepath] Using ghc version 9.6.7 found on system at:
  784. 37.37 s [pathway-compat-filepath] /nix/store/2djpcnj8a25viv1y24h3mziy1gsy3fc6-ghc-9.6.7/bin/ghc
  785. 37.37 s [pathway-compat-filepath] Using ghc-pkg version 9.6.7 found on system at:
  786. 37.37 s [pathway-compat-filepath] /nix/store/2djpcnj8a25viv1y24h3mziy1gsy3fc6-ghc-9.6.7/bin/ghc-pkg-9.6.7
  787. 37.37 s [pathway-compat-filepath] No ghcjs found
  788. 37.37 s [pathway-compat-filepath] No ghcjs-pkg found
  789. 37.37 s [pathway-compat-filepath] No greencard found
  790. 37.37 s [pathway-compat-filepath] Using haddock version 2.29.2 found on system at:
  791. 37.37 s [pathway-compat-filepath] /nix/store/2djpcnj8a25viv1y24h3mziy1gsy3fc6-ghc-9.6.7/bin/haddock-ghc-9.6.7
  792. 37.37 s [pathway-compat-filepath] No happy found
  793. 37.37 s [pathway-compat-filepath] Using haskell-suite found on system at: haskell-suite-dummy-location
  794. 37.37 s [pathway-compat-filepath] Using haskell-suite-pkg found on system at: haskell-suite-pkg-dummy-location
  795. 37.37 s [pathway-compat-filepath] No hmake found
  796. 37.37 s [pathway-compat-filepath] Using hpc version 0.68 found on system at:
  797. 37.37 s [pathway-compat-filepath] /nix/store/2djpcnj8a25viv1y24h3mziy1gsy3fc6-ghc-9.6.7/bin/hpc-ghc-9.6.7
  798. 37.37 s [pathway-compat-filepath] Using hsc2hs version 0.68.9 found on system at:
  799. 37.37 s [pathway-compat-filepath] /nix/store/2djpcnj8a25viv1y24h3mziy1gsy3fc6-ghc-9.6.7/bin/hsc2hs-ghc-9.6.7
  800. 37.37 s [pathway-compat-filepath] Using hscolour version 1.25 found on system at:
  801. 37.37 s [pathway-compat-filepath] /nix/store/2x19jxh5g98bv0s06mdj71c1hmxi54yl-hscolour-1.25/bin/HsColour
  802. 37.37 s [pathway-compat-filepath] No jhc found
  803. 37.37 s [pathway-compat-filepath] Using ld found on system at:
  804. 37.37 s [pathway-compat-filepath] /nix/store/zjraf40s86y3iwhp626b934r5y6ldkbb-binutils-wrapper-2.46/bin/ld.gold
  805. 37.37 s [pathway-compat-filepath] No pkg-config found
  806. 37.37 s [pathway-compat-filepath] Using runghc version 9.6.7 found on system at:
  807. 37.37 s [pathway-compat-filepath] /nix/store/2djpcnj8a25viv1y24h3mziy1gsy3fc6-ghc-9.6.7/bin/runghc-9.6.7
  808. 37.37 s [pathway-compat-filepath] Using strip version 2.46 found on system at:
  809. 37.37 s [pathway-compat-filepath] /nix/store/29qjlshvklnyr67nhpprzgb9igmsfsjj-gcc-wrapper-15.2.0/bin/strip
  810. 37.37 s [pathway-compat-filepath] Using tar found on system at:
  811. 37.37 s [pathway-compat-filepath] /nix/store/z5mq2sam4484prf3kv6v6vjw1m0i7j24-gnutar-1.35/bin/tar
  812. 37.37 s [pathway-compat-filepath] No uhc found
  813. 37.81 s [pathway-compat-filepath] Phase: buildPhase
  814. 37.88 s [pathway-compat-filepath] Preprocessing library for pathway-compat-filepath-0.0.1.0..
  815. 37.89 s [pathway-compat-filepath] Building library for pathway-compat-filepath-0.0.1.0..
  816. 37.97 s [pathway-compat-filepath] [ 1 of 10] Compiling Common.FilePath ( src/Common/FilePath.hs, dist/build/Common/FilePath.o, dist/build/Common/FilePath.dyn_o )
  817. 38.24 s [pathway-compat-filepath] [ 2 of 10] Compiling Common.OsPath ( src/Common/OsPath.hs, dist/build/Common/OsPath.o, dist/build/Common/OsPath.dyn_o )
  818. 38.24 s [pathway-compat-filepath]
  819. 38.25 s [pathway-compat-filepath] src/Common/OsPath.hs:87:23: error: [GHC-76037]
  820. 38.25 s [pathway-compat-filepath] Not in scope: ‘O.unsafeEncodeUtf’
  821. 38.25 s [pathway-compat-filepath] NB: the module ‘System.OsPath’ does not export ‘unsafeEncodeUtf’.
  822. 38.25 s [pathway-compat-filepath] |
  823. 38.25 s [pathway-compat-filepath] 87 | Format.parent = O.unsafeEncodeUtf "..",
  824. 38.25 s [pathway-compat-filepath] | ^^^^^^^^^^^^^^^^^
  825. 38.25 s [pathway-compat-filepath] [ 3 of 10] Compiling System.FilePath.Thin ( src/System/FilePath/Thin.hs, dist/build/System/FilePath/Thin.o, dist/build/System/FilePath/Thin.dyn_o )
  826. 38.41 s [pathway-compat-filepath] [ 4 of 10] Compiling System.FilePath.Pathway ( src/System/FilePath/Pathway.hs, dist/build/System/FilePath/Pathway.o, dist/build/System/FilePath/Pathway.dyn_o )
  827. 38.44 s [pathway-compat-filepath] [ 5 of 10] Compiling System.FilePath.Overlay ( src/System/FilePath/Overlay.hs, dist/build/System/FilePath/Overlay.o, dist/build/System/FilePath/Overlay.dyn_o )
  828. 38.46 s [pathway-compat-filepath] [ 6 of 10] Compiling System.FilePath ( src/System/FilePath.hs, dist/build/System/FilePath.o, dist/build/System/FilePath.dyn_o )
  829. 38.59 s Progress: 0 of 12 built (1 failed), 174 of 174 downloaded from cache
  830. 38.59 s Failed to build pathway-compat-filepath after 4.0s
  831. 38.59 s error: Cannot build '/nix/store/6lbsvjysc8745w76x16kfxcnc6z3dmn1-pathway-compat-filepath-0.0.1.0.drv'.
  832. 38.59 s Reason: builder failed with exit code 1.
  833. 38.59 s Output paths:
  834. 38.59 s /nix/store/5iwzgix3zvg58nzmgb744x9xh6gy8ijk-pathway-compat-filepath-0.0.1.0-doc
  835. 38.59 s /nix/store/764l5kra2q49626jx0rg4mkpkja5c8jz-pathway-compat-filepath-0.0.1.0
  836. 38.59 s Last 151 log lines:
  837. 38.59 s > Running phase: setupCompilerEnvironmentPhase
  838. 38.59 s > Build with /nix/store/2djpcnj8a25viv1y24h3mziy1gsy3fc6-ghc-9.6.7.
  839. 38.59 s > Running phase: unpackPhase
  840. 38.59 s > unpacking source archive /nix/store/99h2nwiw8z9r3kqrm9kdhv4k4sf61d7w-filepath
  841. 38.59 s > source root is filepath
  842. 38.59 s > Running phase: patchPhase
  843. 38.59 s > Running phase: compileBuildDriverPhase
  844. 38.59 s > setupCompileFlags: -package-db=/build/tmp.5obQjx6sMQ/setup-package.conf.d -threaded
  845. 38.59 s > [1 of 2] Compiling Main ( Setup.hs, /build/tmp.5obQjx6sMQ/Main.o )
  846. 38.59 s > [2 of 2] Linking Setup
  847. 38.59 s > Running phase: updateAutotoolsGnuConfigScriptsPhase
  848. 38.59 s > Running phase: configurePhase
  849. 38.59 s > configureFlags: --verbose --prefix=/nix/store/764l5kra2q49626jx0rg4mkpkja5c8jz-pathway-compat-filepath-0.0.1.0 --libdir=$prefix/lib/$compiler/lib --libsubdir=$abi/$libname --docdir=/nix/store/5iwzgix3zvg58nzmgb744x9xh6gy8ijk-pathway-compat-filepath-0.0.1.0-doc/share/doc/pathway-compat-filepath-0.0.1.0 --with-gcc=gcc --package-db=/build/tmp.5obQjx6sMQ/package.conf.d --ghc-option=-j16 --ghc-option=+RTS --ghc-option=-A64M --ghc-option=-RTS --enable-library-profiling --profiling-detail=exported-functions --disable-profiling --enable-shared --disable-coverage --enable-static --disable-executable-dynamic --enable-tests --disable-benchmarks --enable-library-vanilla --disable-library-for-ghci --enable-split-sections --enable-library-stripping --enable-executable-stripping --ghc-option=-haddock --ghc-options=-Werror --extra-lib-dirs=/nix/store/pndhkk0l649lm1sj0mxk7cbwq26qd1ra-ncurses-6.6/lib --extra-lib-dirs=/nix/store/0djlg4g0b81w94k3vcaqsxsc2hh4kism-libffi-3.5.2/lib --extra-lib-dirs=/nix/store/md4paia7riiggyrj8p24c7a6vf8w7jz8-elfutils-0.194/lib --extra-lib-dirs=/nix/store/39vv2pf64gd8li48a4hpbhw2crzd8z5p-gmp-with-cxx-6.3.0/lib --extra-lib-dirs=/nix/store/7wwvald8lapkrsr72qanlw8blyn55ifx-numactl-2.0.18/lib --extra-lib-dirs=/nix/store/2djpcnj8a25viv1y24h3mziy1gsy3fc6-ghc-9.6.7/lib
  850. 38.59 s > Using Parsec parser
  851. 38.59 s > Configuring pathway-compat-filepath-0.0.1.0...
  852. 38.59 s > Flags chosen: noisy-deprecations=True, verify-no-recursion=False
  853. 38.59 s > Dependency base >=4.14.0 && <4.15 || >=4.15.0 && <4.16 || >=4.16.0 && <4.17 ||
  854. 38.59 s > >=4.17.0 && <4.18 || >=4.18.0 && <4.19 || >=4.19.0 && <4.20 || >=4.20.0 &&
  855. 38.59 s > <4.21 || >=4.21.0 && <4.22 || >=4.22.0 && <4.23: using base-4.18.3.0
  856. 38.59 s > Dependency extra: using extra-1.8.1
  857. 38.59 s > Dependency filepath >=1.4.2 && <1.5 || >=1.5.0 && <1.6: using
  858. 38.59 s > filepath-1.4.301.0
  859. 38.59 s > Dependency megaparsec >=9.0.1 && <9.1 || >=9.2.1 && <9.3 || >=9.5.0 && <9.6 ||
  860. 38.59 s > >=9.7.0 && <9.8: using megaparsec-9.7.0
  861. 38.59 s > Dependency pathway >=0.0.1 && <0.1: using pathway-0.0.1.0
  862. 38.59 s > Dependency pathway-compat-base >=0.0.1 && <0.1: using
  863. 38.59 s > pathway-compat-base-0.0.1.0
  864. 38.59 s > Dependency pathway-internal >=0.0.1 && <0.1: using pathway-internal-0.0.1.0
  865. 38.59 s > Dependency base >=4.14.0 && <4.15 || >=4.15.0 && <4.16 || >=4.16.0 && <4.17 ||
  866. 38.59 s > >=4.17.0 && <4.18 || >=4.18.0 && <4.19 || >=4.19.0 && <4.20 || >=4.20.0 &&
  867. 38.59 s > <4.21 || >=4.21.0 && <4.22 || >=4.22.0 && <4.23: using base-4.18.3.0
  868. 38.59 s > Dependency doctest >=0.16.3 && <0.17 || >=0.18.1 && <0.19 || >=0.20.1 && <0.21
  869. 38.59 s > || >=0.21.1 && <0.22 || >=0.22.2 && <0.23 || >=0.24.2 && <0.25: using
  870. 38.59 s > doctest-0.24.3
  871. 38.59 s > Dependency pathway-compat-filepath: using pathway-compat-filepath-0.0.1.0
  872. 38.59 s > Source component graph:
  873. 38.59 s > component lib
  874. 38.59 s > component test:doctests dependency lib
  875. 38.59 s > Configured component graph:
  876. 38.59 s > component pathway-compat-filepath-0.0.1.0-4Le08sqZwwxHUIaNWPZcs2
  877. 38.59 s > include base-4.18.3.0
  878. 38.59 s > include extra-1.8.1-FU1frm3XcM88A49dBkmtgI
  879. 38.59 s > include filepath-1.4.301.0
  880. 38.59 s > include megaparsec-9.7.0-EpAk7LLR2KBGAKafJPbXz1
  881. 38.59 s > include pathway-0.0.1.0-5VJXWbvreBAfybP2NROr3
  882. 38.59 s > include pathway-compat-base-0.0.1.0-E02izPYkwmmGdAPlQBKjbP
  883. 38.59 s > include pathway-internal-0.0.1.0-1xeSc3z2VhRIotiMz9hdL1
  884. 38.59 s > component pathway-compat-filepath-0.0.1.0-1CRX2L8nW586DbgyNTab4-doctests
  885. 38.59 s > include base-4.18.3.0
  886. 38.59 s > include doctest-0.24.3-ACQNy8u8jPjC50l4I3tyiL
  887. 38.59 s > include pathway-compat-filepath-0.0.1.0-4Le08sqZwwxHUIaNWPZcs2
  888. 38.59 s > Linked component graph:
  889. 38.59 s > unit pathway-compat-filepath-0.0.1.0-4Le08sqZwwxHUIaNWPZcs2
  890. 38.59 s > include base-4.18.3.0
  891. 38.59 s > include extra-1.8.1-FU1frm3XcM88A49dBkmtgI
  892. 38.59 s > include filepath-1.4.301.0
  893. 38.59 s > include megaparsec-9.7.0-EpAk7LLR2KBGAKafJPbXz1
  894. 38.59 s > include pathway-0.0.1.0-5VJXWbvreBAfybP2NROr3
  895. 38.59 s > include pathway-compat-base-0.0.1.0-E02izPYkwmmGdAPlQBKjbP
  896. 38.59 s > include pathway-internal-0.0.1.0-1xeSc3z2VhRIotiMz9hdL1
  897. 38.59 s > Common.FilePath=pathway-compat-filepath-0.0.1.0-4Le08sqZwwxHUIaNWPZcs2:Common.FilePath,Common.OsPath=pathway-compat-filepath-0.0.1.0-4Le08sqZwwxHUIaNWPZcs2:Common.OsPath,System.FilePath=pathway-compat-filepath-0.0.1.0-4Le08sqZwwxHUIaNWPZcs2:System.FilePath,System.FilePath.Overlay=pathway-compat-filepath-0.0.1.0-4Le08sqZwwxHUIaNWPZcs2:System.FilePath.Overlay,System.FilePath.Pathway=pathway-compat-filepath-0.0.1.0-4Le08sqZwwxHUIaNWPZcs2:System.FilePath.Pathway,System.FilePath.Thin=pathway-compat-filepath-0.0.1.0-4Le08sqZwwxHUIaNWPZcs2:System.FilePath.Thin,System.OsPath=pathway-compat-filepath-0.0.1.0-4Le08sqZwwxHUIaNWPZcs2:System.OsPath,System.OsPath.Overlay=pathway-compat-filepath-0.0.1.0-4Le08sqZwwxHUIaNWPZcs2:System.OsPath.Overlay,System.OsPath.Pathway=pathway-compat-filepath-0.0.1.0-4Le08sqZwwxHUIaNWPZcs2:System.OsPath.Pathway,System.OsPath.Thin=pathway-compat-filepath-0.0.1.0-4Le08sqZwwxHUIaNWPZcs2:System.OsPath.Thin
  898. 38.59 s > unit pathway-compat-filepath-0.0.1.0-1CRX2L8nW586DbgyNTab4-doctests
  899. 38.59 s > include base-4.18.3.0
  900. 38.59 s > include doctest-0.24.3-ACQNy8u8jPjC50l4I3tyiL
  901. 38.59 s > include pathway-compat-filepath-0.0.1.0-4Le08sqZwwxHUIaNWPZcs2
  902. 38.59 s > Ready component graph:
  903. 38.59 s > definite pathway-compat-filepath-0.0.1.0-4Le08sqZwwxHUIaNWPZcs2
  904. 38.59 s > depends base-4.18.3.0
  905. 38.59 s > depends extra-1.8.1-FU1frm3XcM88A49dBkmtgI
  906. 38.59 s > depends filepath-1.4.301.0
  907. 38.59 s > depends megaparsec-9.7.0-EpAk7LLR2KBGAKafJPbXz1
  908. 38.59 s > depends pathway-0.0.1.0-5VJXWbvreBAfybP2NROr3
  909. 38.59 s > depends pathway-compat-base-0.0.1.0-E02izPYkwmmGdAPlQBKjbP
  910. 38.59 s > depends pathway-internal-0.0.1.0-1xeSc3z2VhRIotiMz9hdL1
  911. 38.59 s > definite pathway-compat-filepath-0.0.1.0-1CRX2L8nW586DbgyNTab4-doctests
  912. 38.59 s > depends base-4.18.3.0
  913. 38.59 s > depends doctest-0.24.3-ACQNy8u8jPjC50l4I3tyiL
  914. 38.59 s > depends pathway-compat-filepath-0.0.1.0-4Le08sqZwwxHUIaNWPZcs2
  915. 38.59 s > Using Cabal-3.10.3.0 compiled by ghc-9.6
  916. 38.59 s > Using compiler: ghc-9.6.7
  917. 38.59 s > Using install prefix:
  918. 38.59 s > /nix/store/764l5kra2q49626jx0rg4mkpkja5c8jz-pathway-compat-filepath-0.0.1.0
  919. 38.59 s > Executables installed in:
  920. 38.59 s > /nix/store/764l5kra2q49626jx0rg4mkpkja5c8jz-pathway-compat-filepath-0.0.1.0/bin
  921. 38.59 s > Libraries installed in:
  922. 38.59 s > /nix/store/764l5kra2q49626jx0rg4mkpkja5c8jz-pathway-compat-filepath-0.0.1.0/lib/ghc-9.6.7/lib/x86_64-linux-ghc-9.6.7/pathway-compat-filepath-0.0.1.0-4Le08sqZwwxHUIaNWPZcs2
  923. 38.59 s > Dynamic Libraries installed in:
  924. 38.59 s > /nix/store/764l5kra2q49626jx0rg4mkpkja5c8jz-pathway-compat-filepath-0.0.1.0/lib/ghc-9.6.7/lib/x86_64-linux-ghc-9.6.7
  925. 38.59 s > Private executables installed in:
  926. 38.59 s > /nix/store/764l5kra2q49626jx0rg4mkpkja5c8jz-pathway-compat-filepath-0.0.1.0/libexec/x86_64-linux-ghc-9.6.7/pathway-compat-filepath-0.0.1.0
  927. 38.59 s > Data files installed in:
  928. 38.59 s > /nix/store/764l5kra2q49626jx0rg4mkpkja5c8jz-pathway-compat-filepath-0.0.1.0/share/x86_64-linux-ghc-9.6.7/pathway-compat-filepath-0.0.1.0
  929. 38.59 s > Documentation installed in:
  930. 38.59 s > /nix/store/5iwzgix3zvg58nzmgb744x9xh6gy8ijk-pathway-compat-filepath-0.0.1.0-doc/share/doc/pathway-compat-filepath-0.0.1.0
  931. 38.59 s > Configuration files installed in:
  932. 38.59 s > /nix/store/764l5kra2q49626jx0rg4mkpkja5c8jz-pathway-compat-filepath-0.0.1.0/etc
  933. 38.59 s > No alex found
  934. 38.59 s > Using ar found on system at:
  935. 38.59 s > /nix/store/zjraf40s86y3iwhp626b934r5y6ldkbb-binutils-wrapper-2.46/bin/ar
  936. 38.59 s > No c2hs found
  937. 38.59 s > No cpphs found
  938. 38.59 s > Using doctest version 0.24.3 found on system at:
  939. 38.59 s > /nix/store/s48k56ayjjxwdbz9y7d8mnqwlcjfi1a8-doctest-0.24.3/bin/doctest
  940. 38.59 s > Using gcc version 15.2.0 given by user at:
  941. 38.59 s > /nix/store/29qjlshvklnyr67nhpprzgb9igmsfsjj-gcc-wrapper-15.2.0/bin/gcc
  942. 38.59 s > Using ghc version 9.6.7 found on system at:
  943. 38.59 s > /nix/store/2djpcnj8a25viv1y24h3mziy1gsy3fc6-ghc-9.6.7/bin/ghc
  944. 38.59 s > Using ghc-pkg version 9.6.7 found on system at:
  945. 38.59 s > /nix/store/2djpcnj8a25viv1y24h3mziy1gsy3fc6-ghc-9.6.7/bin/ghc-pkg-9.6.7
  946. 38.59 s > No ghcjs found
  947. 38.59 s > No ghcjs-pkg found
  948. 38.59 s > No greencard found
  949. 38.59 s > Using haddock version 2.29.2 found on system at:
  950. 38.59 s > /nix/store/2djpcnj8a25viv1y24h3mziy1gsy3fc6-ghc-9.6.7/bin/haddock-ghc-9.6.7
  951. 38.59 s > No happy found
  952. 38.59 s > Using haskell-suite found on system at: haskell-suite-dummy-location
  953. 38.59 s > Using haskell-suite-pkg found on system at: haskell-suite-pkg-dummy-location
  954. 38.59 s > No hmake found
  955. 38.59 s > Using hpc version 0.68 found on system at:
  956. 38.59 s > /nix/store/2djpcnj8a25viv1y24h3mziy1gsy3fc6-ghc-9.6.7/bin/hpc-ghc-9.6.7
  957. 38.59 s > Using hsc2hs version 0.68.9 found on system at:
  958. 38.59 s > /nix/store/2djpcnj8a25viv1y24h3mziy1gsy3fc6-ghc-9.6.7/bin/hsc2hs-ghc-9.6.7
  959. 38.59 s > Using hscolour version 1.25 found on system at:
  960. 38.59 s > /nix/store/2x19jxh5g98bv0s06mdj71c1hmxi54yl-hscolour-1.25/bin/HsColour
  961. 38.59 s > No jhc found
  962. 38.59 s > Using ld found on system at:
  963. 38.59 s > /nix/store/zjraf40s86y3iwhp626b934r5y6ldkbb-binutils-wrapper-2.46/bin/ld.gold
  964. 38.59 s > No pkg-config found
  965. 38.59 s > Using runghc version 9.6.7 found on system at:
  966. 38.59 s > /nix/store/2djpcnj8a25viv1y24h3mziy1gsy3fc6-ghc-9.6.7/bin/runghc-9.6.7
  967. 38.59 s > Using strip version 2.46 found on system at:
  968. 38.59 s > /nix/store/29qjlshvklnyr67nhpprzgb9igmsfsjj-gcc-wrapper-15.2.0/bin/strip
  969. 38.59 s > Using tar found on system at:
  970. 38.59 s > /nix/store/z5mq2sam4484prf3kv6v6vjw1m0i7j24-gnutar-1.35/bin/tar
  971. 38.59 s > No uhc found
  972. 38.59 s > Running phase: buildPhase
  973. 38.59 s > Preprocessing library for pathway-compat-filepath-0.0.1.0..
  974. 38.59 s > Building library for pathway-compat-filepath-0.0.1.0..
  975. 38.59 s > [ 1 of 10] Compiling Common.FilePath ( src/Common/FilePath.hs, dist/build/Common/FilePath.o, dist/build/Common/FilePath.dyn_o )
  976. 38.59 s > [ 2 of 10] Compiling Common.OsPath ( src/Common/OsPath.hs, dist/build/Common/OsPath.o, dist/build/Common/OsPath.dyn_o )
  977. 38.59 s >
  978. 38.59 s > src/Common/OsPath.hs:87:23: error: [GHC-76037]
  979. 38.59 s > Not in scope: ‘O.unsafeEncodeUtf’
  980. 38.59 s > NB: the module ‘System.OsPath’ does not export ‘unsafeEncodeUtf’.
  981. 38.59 s > |
  982. 38.59 s > 87 | Format.parent = O.unsafeEncodeUtf "..",
  983. 38.59 s > | ^^^^^^^^^^^^^^^^^
  984. 38.59 s > [ 3 of 10] Compiling System.FilePath.Thin ( src/System/FilePath/Thin.hs, dist/build/System/FilePath/Thin.o, dist/build/System/FilePath/Thin.dyn_o )
  985. 38.59 s > [ 4 of 10] Compiling System.FilePath.Pathway ( src/System/FilePath/Pathway.hs, dist/build/System/FilePath/Pathway.o, dist/build/System/FilePath/Pathway.dyn_o )
  986. 38.59 s > [ 5 of 10] Compiling System.FilePath.Overlay ( src/System/FilePath/Overlay.hs, dist/build/System/FilePath/Overlay.o, dist/build/System/FilePath/Overlay.dyn_o )
  987. 38.59 s > [ 6 of 10] Compiling System.FilePath ( src/System/FilePath.hs, dist/build/System/FilePath.o, dist/build/System/FilePath.dyn_o )
  988. 38.59 s For full logs, run:
  989. 38.59 s nix log /nix/store/6lbsvjysc8745w76x16kfxcnc6z3dmn1-pathway-compat-filepath-0.0.1.0.drv
  990. 38.60 s error: Cannot build '/nix/store/6lbsvjysc8745w76x16kfxcnc6z3dmn1-pathway-compat-filepath-0.0.1.0.drv'.
  991. 38.60 s Reason: builder failed with exit code 1.
  992. 38.60 s Output paths:
  993. 38.60 s /nix/store/5iwzgix3zvg58nzmgb744x9xh6gy8ijk-pathway-compat-filepath-0.0.1.0-doc
  994. 38.60 s /nix/store/764l5kra2q49626jx0rg4mkpkja5c8jz-pathway-compat-filepath-0.0.1.0
  995. 38.60 s Last 151 log lines:
  996. 38.60 s > Running phase: setupCompilerEnvironmentPhase
  997. 38.60 s > Build with /nix/store/2djpcnj8a25viv1y24h3mziy1gsy3fc6-ghc-9.6.7.
  998. 38.60 s > Running phase: unpackPhase
  999. 38.60 s > unpacking source archive /nix/store/99h2nwiw8z9r3kqrm9kdhv4k4sf61d7w-filepath
  1000. 38.60 s > source root is filepath
  1001. 38.60 s > Running phase: patchPhase
  1002. 38.60 s > Running phase: compileBuildDriverPhase
  1003. 38.60 s > setupCompileFlags: -package-db=/build/tmp.5obQjx6sMQ/setup-package.conf.d -threaded
  1004. 38.60 s > [1 of 2] Compiling Main ( Setup.hs, /build/tmp.5obQjx6sMQ/Main.o )
  1005. 38.60 s > [2 of 2] Linking Setup
  1006. 38.60 s > Running phase: updateAutotoolsGnuConfigScriptsPhase
  1007. 38.60 s > Running phase: configurePhase
  1008. 38.60 s > configureFlags: --verbose --prefix=/nix/store/764l5kra2q49626jx0rg4mkpkja5c8jz-pathway-compat-filepath-0.0.1.0 --libdir=$prefix/lib/$compiler/lib --libsubdir=$abi/$libname --docdir=/nix/store/5iwzgix3zvg58nzmgb744x9xh6gy8ijk-pathway-compat-filepath-0.0.1.0-doc/share/doc/pathway-compat-filepath-0.0.1.0 --with-gcc=gcc --package-db=/build/tmp.5obQjx6sMQ/package.conf.d --ghc-option=-j16 --ghc-option=+RTS --ghc-option=-A64M --ghc-option=-RTS --enable-library-profiling --profiling-detail=exported-functions --disable-profiling --enable-shared --disable-coverage --enable-static --disable-executable-dynamic --enable-tests --disable-benchmarks --enable-library-vanilla --disable-library-for-ghci --enable-split-sections --enable-library-stripping --enable-executable-stripping --ghc-option=-haddock --ghc-options=-Werror --extra-lib-dirs=/nix/store/pndhkk0l649lm1sj0mxk7cbwq26qd1ra-ncurses-6.6/lib --extra-lib-dirs=/nix/store/0djlg4g0b81w94k3vcaqsxsc2hh4kism-libffi-3.5.2/lib --extra-lib-dirs=/nix/store/md4paia7riiggyrj8p24c7a6vf8w7jz8-elfutils-0.194/lib --extra-lib-dirs=/nix/store/39vv2pf64gd8li48a4hpbhw2crzd8z5p-gmp-with-cxx-6.3.0/lib --extra-lib-dirs=/nix/store/7wwvald8lapkrsr72qanlw8blyn55ifx-numactl-2.0.18/lib --extra-lib-dirs=/nix/store/2djpcnj8a25viv1y24h3mziy1gsy3fc6-ghc-9.6.7/lib
  1009. 38.60 s > Using Parsec parser
  1010. 38.60 s > Configuring pathway-compat-filepath-0.0.1.0...
  1011. 38.60 s > Flags chosen: noisy-deprecations=True, verify-no-recursion=False
  1012. 38.60 s > Dependency base >=4.14.0 && <4.15 || >=4.15.0 && <4.16 || >=4.16.0 && <4.17 ||
  1013. 38.60 s > >=4.17.0 && <4.18 || >=4.18.0 && <4.19 || >=4.19.0 && <4.20 || >=4.20.0 &&
  1014. 38.60 s > <4.21 || >=4.21.0 && <4.22 || >=4.22.0 && <4.23: using base-4.18.3.0
  1015. 38.60 s > Dependency extra: using extra-1.8.1
  1016. 38.60 s > Dependency filepath >=1.4.2 && <1.5 || >=1.5.0 && <1.6: using
  1017. 38.60 s > filepath-1.4.301.0
  1018. 38.60 s > Dependency megaparsec >=9.0.1 && <9.1 || >=9.2.1 && <9.3 || >=9.5.0 && <9.6 ||
  1019. 38.60 s > >=9.7.0 && <9.8: using megaparsec-9.7.0
  1020. 38.60 s > Dependency pathway >=0.0.1 && <0.1: using pathway-0.0.1.0
  1021. 38.60 s > Dependency pathway-compat-base >=0.0.1 && <0.1: using
  1022. 38.60 s > pathway-compat-base-0.0.1.0
  1023. 38.60 s > Dependency pathway-internal >=0.0.1 && <0.1: using pathway-internal-0.0.1.0
  1024. 38.60 s > Dependency base >=4.14.0 && <4.15 || >=4.15.0 && <4.16 || >=4.16.0 && <4.17 ||
  1025. 38.60 s > >=4.17.0 && <4.18 || >=4.18.0 && <4.19 || >=4.19.0 && <4.20 || >=4.20.0 &&
  1026. 38.60 s > <4.21 || >=4.21.0 && <4.22 || >=4.22.0 && <4.23: using base-4.18.3.0
  1027. 38.60 s > Dependency doctest >=0.16.3 && <0.17 || >=0.18.1 && <0.19 || >=0.20.1 && <0.21
  1028. 38.60 s > || >=0.21.1 && <0.22 || >=0.22.2 && <0.23 || >=0.24.2 && <0.25: using
  1029. 38.60 s > doctest-0.24.3
  1030. 38.60 s > Dependency pathway-compat-filepath: using pathway-compat-filepath-0.0.1.0
  1031. 38.60 s > Source component graph:
  1032. 38.60 s > component lib
  1033. 38.60 s > component test:doctests dependency lib
  1034. 38.60 s > Configured component graph:
  1035. 38.60 s > component pathway-compat-filepath-0.0.1.0-4Le08sqZwwxHUIaNWPZcs2
  1036. 38.60 s > include base-4.18.3.0
  1037. 38.60 s > include extra-1.8.1-FU1frm3XcM88A49dBkmtgI
  1038. 38.60 s > include filepath-1.4.301.0
  1039. 38.60 s > include megaparsec-9.7.0-EpAk7LLR2KBGAKafJPbXz1
  1040. 38.60 s > include pathway-0.0.1.0-5VJXWbvreBAfybP2NROr3
  1041. 38.60 s > include pathway-compat-base-0.0.1.0-E02izPYkwmmGdAPlQBKjbP
  1042. 38.60 s > include pathway-internal-0.0.1.0-1xeSc3z2VhRIotiMz9hdL1
  1043. 38.60 s > component pathway-compat-filepath-0.0.1.0-1CRX2L8nW586DbgyNTab4-doctests
  1044. 38.60 s > include base-4.18.3.0
  1045. 38.60 s > include doctest-0.24.3-ACQNy8u8jPjC50l4I3tyiL
  1046. 38.60 s > include pathway-compat-filepath-0.0.1.0-4Le08sqZwwxHUIaNWPZcs2
  1047. 38.60 s > Linked component graph:
  1048. 38.60 s > unit pathway-compat-filepath-0.0.1.0-4Le08sqZwwxHUIaNWPZcs2
  1049. 38.60 s > include base-4.18.3.0
  1050. 38.60 s > include extra-1.8.1-FU1frm3XcM88A49dBkmtgI
  1051. 38.60 s > include filepath-1.4.301.0
  1052. 38.60 s > include megaparsec-9.7.0-EpAk7LLR2KBGAKafJPbXz1
  1053. 38.60 s > include pathway-0.0.1.0-5VJXWbvreBAfybP2NROr3
  1054. 38.60 s > include pathway-compat-base-0.0.1.0-E02izPYkwmmGdAPlQBKjbP
  1055. 38.60 s > include pathway-internal-0.0.1.0-1xeSc3z2VhRIotiMz9hdL1
  1056. 38.60 s > Common.FilePath=pathway-compat-filepath-0.0.1.0-4Le08sqZwwxHUIaNWPZcs2:Common.FilePath,Common.OsPath=pathway-compat-filepath-0.0.1.0-4Le08sqZwwxHUIaNWPZcs2:Common.OsPath,System.FilePath=pathway-compat-filepath-0.0.1.0-4Le08sqZwwxHUIaNWPZcs2:System.FilePath,System.FilePath.Overlay=pathway-compat-filepath-0.0.1.0-4Le08sqZwwxHUIaNWPZcs2:System.FilePath.Overlay,System.FilePath.Pathway=pathway-compat-filepath-0.0.1.0-4Le08sqZwwxHUIaNWPZcs2:System.FilePath.Pathway,System.FilePath.Thin=pathway-compat-filepath-0.0.1.0-4Le08sqZwwxHUIaNWPZcs2:System.FilePath.Thin,System.OsPath=pathway-compat-filepath-0.0.1.0-4Le08sqZwwxHUIaNWPZcs2:System.OsPath,System.OsPath.Overlay=pathway-compat-filepath-0.0.1.0-4Le08sqZwwxHUIaNWPZcs2:System.OsPath.Overlay,System.OsPath.Pathway=pathway-compat-filepath-0.0.1.0-4Le08sqZwwxHUIaNWPZcs2:System.OsPath.Pathway,System.OsPath.Thin=pathway-compat-filepath-0.0.1.0-4Le08sqZwwxHUIaNWPZcs2:System.OsPath.Thin
  1057. 38.60 s > unit pathway-compat-filepath-0.0.1.0-1CRX2L8nW586DbgyNTab4-doctests
  1058. 38.60 s > include base-4.18.3.0
  1059. 38.60 s > include doctest-0.24.3-ACQNy8u8jPjC50l4I3tyiL
  1060. 38.60 s > include pathway-compat-filepath-0.0.1.0-4Le08sqZwwxHUIaNWPZcs2
  1061. 38.60 s > Ready component graph:
  1062. 38.60 s > definite pathway-compat-filepath-0.0.1.0-4Le08sqZwwxHUIaNWPZcs2
  1063. 38.60 s > depends base-4.18.3.0
  1064. 38.60 s > depends extra-1.8.1-FU1frm3XcM88A49dBkmtgI
  1065. 38.60 s > depends filepath-1.4.301.0
  1066. 38.60 s > depends megaparsec-9.7.0-EpAk7LLR2KBGAKafJPbXz1
  1067. 38.60 s > depends pathway-0.0.1.0-5VJXWbvreBAfybP2NROr3
  1068. 38.60 s > depends pathway-compat-base-0.0.1.0-E02izPYkwmmGdAPlQBKjbP
  1069. 38.60 s > depends pathway-internal-0.0.1.0-1xeSc3z2VhRIotiMz9hdL1
  1070. 38.60 s > definite pathway-compat-filepath-0.0.1.0-1CRX2L8nW586DbgyNTab4-doctests
  1071. 38.60 s > depends base-4.18.3.0
  1072. 38.60 s > depends doctest-0.24.3-ACQNy8u8jPjC50l4I3tyiL
  1073. 38.60 s > depends pathway-compat-filepath-0.0.1.0-4Le08sqZwwxHUIaNWPZcs2
  1074. 38.60 s > Using Cabal-3.10.3.0 compiled by ghc-9.6
  1075. 38.60 s > Using compiler: ghc-9.6.7
  1076. 38.60 s > Using install prefix:
  1077. 38.60 s > /nix/store/764l5kra2q49626jx0rg4mkpkja5c8jz-pathway-compat-filepath-0.0.1.0
  1078. 38.60 s > Executables installed in:
  1079. 38.60 s > /nix/store/764l5kra2q49626jx0rg4mkpkja5c8jz-pathway-compat-filepath-0.0.1.0/bin
  1080. 38.60 s > Libraries installed in:
  1081. 38.60 s > /nix/store/764l5kra2q49626jx0rg4mkpkja5c8jz-pathway-compat-filepath-0.0.1.0/lib/ghc-9.6.7/lib/x86_64-linux-ghc-9.6.7/pathway-compat-filepath-0.0.1.0-4Le08sqZwwxHUIaNWPZcs2
  1082. 38.60 s > Dynamic Libraries installed in:
  1083. 38.60 s > /nix/store/764l5kra2q49626jx0rg4mkpkja5c8jz-pathway-compat-filepath-0.0.1.0/lib/ghc-9.6.7/lib/x86_64-linux-ghc-9.6.7
  1084. 38.60 s > Private executables installed in:
  1085. 38.60 s > /nix/store/764l5kra2q49626jx0rg4mkpkja5c8jz-pathway-compat-filepath-0.0.1.0/libexec/x86_64-linux-ghc-9.6.7/pathway-compat-filepath-0.0.1.0
  1086. 38.60 s > Data files installed in:
  1087. 38.60 s > /nix/store/764l5kra2q49626jx0rg4mkpkja5c8jz-pathway-compat-filepath-0.0.1.0/share/x86_64-linux-ghc-9.6.7/pathway-compat-filepath-0.0.1.0
  1088. 38.60 s > Documentation installed in:
  1089. 38.60 s > /nix/store/5iwzgix3zvg58nzmgb744x9xh6gy8ijk-pathway-compat-filepath-0.0.1.0-doc/share/doc/pathway-compat-filepath-0.0.1.0
  1090. 38.60 s > Configuration files installed in:
  1091. 38.60 s > /nix/store/764l5kra2q49626jx0rg4mkpkja5c8jz-pathway-compat-filepath-0.0.1.0/etc
  1092. 38.60 s > No alex found
  1093. 38.60 s > Using ar found on system at:
  1094. 38.60 s > /nix/store/zjraf40s86y3iwhp626b934r5y6ldkbb-binutils-wrapper-2.46/bin/ar
  1095. 38.60 s > No c2hs found
  1096. 38.60 s > No cpphs found
  1097. 38.60 s > Using doctest version 0.24.3 found on system at:
  1098. 38.60 s > /nix/store/s48k56ayjjxwdbz9y7d8mnqwlcjfi1a8-doctest-0.24.3/bin/doctest
  1099. 38.60 s > Using gcc version 15.2.0 given by user at:
  1100. 38.60 s > /nix/store/29qjlshvklnyr67nhpprzgb9igmsfsjj-gcc-wrapper-15.2.0/bin/gcc
  1101. 38.60 s > Using ghc version 9.6.7 found on system at:
  1102. 38.60 s > /nix/store/2djpcnj8a25viv1y24h3mziy1gsy3fc6-ghc-9.6.7/bin/ghc
  1103. 38.60 s > Using ghc-pkg version 9.6.7 found on system at:
  1104. 38.60 s > /nix/store/2djpcnj8a25viv1y24h3mziy1gsy3fc6-ghc-9.6.7/bin/ghc-pkg-9.6.7
  1105. 38.60 s > No ghcjs found
  1106. 38.60 s > No ghcjs-pkg found
  1107. 38.60 s > No greencard found
  1108. 38.60 s > Using haddock version 2.29.2 found on system at:
  1109. 38.60 s > /nix/store/2djpcnj8a25viv1y24h3mziy1gsy3fc6-ghc-9.6.7/bin/haddock-ghc-9.6.7
  1110. 38.60 s > No happy found
  1111. 38.60 s > Using haskell-suite found on system at: haskell-suite-dummy-location
  1112. 38.60 s > Using haskell-suite-pkg found on system at: haskell-suite-pkg-dummy-location
  1113. 38.60 s > No hmake found
  1114. 38.60 s > Using hpc version 0.68 found on system at:
  1115. 38.60 s > /nix/store/2djpcnj8a25viv1y24h3mziy1gsy3fc6-ghc-9.6.7/bin/hpc-ghc-9.6.7
  1116. 38.60 s > Using hsc2hs version 0.68.9 found on system at:
  1117. 38.60 s > /nix/store/2djpcnj8a25viv1y24h3mziy1gsy3fc6-ghc-9.6.7/bin/hsc2hs-ghc-9.6.7
  1118. 38.60 s > Using hscolour version 1.25 found on system at:
  1119. 38.60 s > /nix/store/2x19jxh5g98bv0s06mdj71c1hmxi54yl-hscolour-1.25/bin/HsColour
  1120. 38.60 s > No jhc found
  1121. 38.60 s > Using ld found on system at:
  1122. 38.60 s > /nix/store/zjraf40s86y3iwhp626b934r5y6ldkbb-binutils-wrapper-2.46/bin/ld.gold
  1123. 38.60 s > No pkg-config found
  1124. 38.60 s > Using runghc version 9.6.7 found on system at:
  1125. 38.60 s > /nix/store/2djpcnj8a25viv1y24h3mziy1gsy3fc6-ghc-9.6.7/bin/runghc-9.6.7
  1126. 38.60 s > Using strip version 2.46 found on system at:
  1127. 38.60 s > /nix/store/29qjlshvklnyr67nhpprzgb9igmsfsjj-gcc-wrapper-15.2.0/bin/strip
  1128. 38.60 s > Using tar found on system at:
  1129. 38.60 s > /nix/store/z5mq2sam4484prf3kv6v6vjw1m0i7j24-gnutar-1.35/bin/tar
  1130. 38.60 s > No uhc found
  1131. 38.60 s > Running phase: buildPhase
  1132. 38.60 s > Preprocessing library for pathway-compat-filepath-0.0.1.0..
  1133. 38.60 s > Building library for pathway-compat-filepath-0.0.1.0..
  1134. 38.60 s > [ 1 of 10] Compiling Common.FilePath ( src/Common/FilePath.hs, dist/build/Common/FilePath.o, dist/build/Common/FilePath.dyn_o )
  1135. 38.60 s > [ 2 of 10] Compiling Common.OsPath ( src/Common/OsPath.hs, dist/build/Common/OsPath.o, dist/build/Common/OsPath.dyn_o )
  1136. 38.60 s >
  1137. 38.60 s > src/Common/OsPath.hs:87:23: error: [GHC-76037]
  1138. 38.60 s > Not in scope: ‘O.unsafeEncodeUtf’
  1139. 38.60 s > NB: the module ‘System.OsPath’ does not export ‘unsafeEncodeUtf’.
  1140. 38.60 s > |
  1141. 38.60 s > 87 | Format.parent = O.unsafeEncodeUtf "..",
  1142. 38.60 s > | ^^^^^^^^^^^^^^^^^
  1143. 38.60 s > [ 3 of 10] Compiling System.FilePath.Thin ( src/System/FilePath/Thin.hs, dist/build/System/FilePath/Thin.o, dist/build/System/FilePath/Thin.dyn_o )
  1144. 38.60 s > [ 4 of 10] Compiling System.FilePath.Pathway ( src/System/FilePath/Pathway.hs, dist/build/System/FilePath/Pathway.o, dist/build/System/FilePath/Pathway.dyn_o )
  1145. 38.60 s > [ 5 of 10] Compiling System.FilePath.Overlay ( src/System/FilePath/Overlay.hs, dist/build/System/FilePath/Overlay.o, dist/build/System/FilePath/Overlay.dyn_o )
  1146. 38.60 s > [ 6 of 10] Compiling System.FilePath ( src/System/FilePath.hs, dist/build/System/FilePath.o, dist/build/System/FilePath.dyn_o )
  1147. 38.60 s For full logs, run:
  1148. 38.60 s nix log /nix/store/6lbsvjysc8745w76x16kfxcnc6z3dmn1-pathway-compat-filepath-0.0.1.0.drv
  1149. 38.60 s error: Cannot build '/nix/store/15amzai96gbkbw8ki5aqxjagszksngpy-ghc-9.6.7-with-packages.drv'.
  1150. 38.60 s Reason: 1 dependency failed.
  1151. 38.60 s Output paths:
  1152. 38.60 s /nix/store/c9rdwlynzyxpqg75121cvf9fs84wkml0-ghc-9.6.7-with-packages
  1153. 38.60 s error: Cannot build '/nix/store/7h0g3cqs6ihlynr2zbkb1xsf66z51p79-pathway-compat-directory-0.0.1.0.drv'.
  1154. 38.60 s Reason: 1 dependency failed.
  1155. 38.60 s Output paths:
  1156. 38.60 s /nix/store/5ph59krlmy1j5pb4bqv13kyip87kwlb4-pathway-compat-directory-0.0.1.0-doc
  1157. 38.60 s /nix/store/jvfwq5drdz4dfv77mfg7wmih89crga4n-pathway-compat-directory-0.0.1.0
  1158. 38.60 s error: Cannot build '/nix/store/hyxnk0w8mpqcckn0l495qmq2cj738c7x-pathway-compat-file-io-0.0.1.0.drv'.
  1159. 38.60 s Reason: 1 dependency failed.
  1160. 38.60 s Output paths:
  1161. 38.60 s /nix/store/9nawsjhb50jgbl9pk2ykqq81cw368xn4-pathway-compat-file-io-0.0.1.0
  1162. 38.60 s /nix/store/m4klvjgcra6aric0842xyhflbilss5r3-pathway-compat-file-io-0.0.1.0-doc
  1163. 38.60 s error: Cannot build '/nix/store/iqmmyravwrm8b6mmi8zdaa7fsik96wj9-pathway-compat-temporary-0.0.1.0.drv'.
  1164. 38.60 s Reason: 1 dependency failed.
  1165. 38.60 s Output paths:
  1166. 38.60 s /nix/store/1nx5g5kv75zy0b6bbhpflr4ix5amzpks-pathway-compat-temporary-0.0.1.0-doc
  1167. 38.60 s /nix/store/i7q9b3mdhsximybdby6v6ld258j1vi7b-pathway-compat-temporary-0.0.1.0
  1168. 38.60 s error: Cannot build '/nix/store/i5j580l1byqm5dzrmn7bxxzcfrcccf6a-pathway-system-0.0.1.0.drv'.
  1169. 38.60 s Reason: 1 dependency failed.
  1170. 38.60 s Output paths:
  1171. 38.60 s /nix/store/2rywy7mz3hgj3ywg15pnxzvl3vi1b4qr-pathway-system-0.0.1.0-doc
  1172. 38.60 s /nix/store/dm52i2x1n1scfl6r969670gda0fx8jdi-pathway-system-0.0.1.0
  1173. 38.60 s error: Build failed due to failed dependency
  1174. 38.60 s error: Cannot build '/nix/store/fn9mpsk06vd9aliww84rsblz7y1qxq9d-all-packages.drv'.
  1175. 38.60 s Reason: 1 dependency failed.
  1176. 38.60 s Output paths:
  1177. 38.60 s /nix/store/vk0p0n8lb2zl3arnni10fs8hd4sg5qli-all-packages
  1178. 38.60 s Build failed due to failed dependency
  1179. 38.63 s Build failed.