build packages.x86_64-linux.ghc984_all
40.05 s
Downloaded cached strict (5.2 MiB) in 165ms
40.05 s
Progress: 0 of 52 built, 137 of 164 downloaded from cache (6 downloading)
40.11 s
Downloaded cached text-iso8601 (3 MiB) in 158ms
40.11 s
Progress: 0 of 51 built, 138 of 164 downloaded from cache (5 downloading)
40.15 s
Downloaded cached megaparsec (15.6 MiB) in 265ms
40.15 s
Progress: 0 of 50 built, 139 of 164 downloaded from cache (4 downloading)
40.22 s
Downloaded cached bifunctors (15.7 MiB) in 283ms
40.22 s
Progress: 0 of 49 built, 140 of 164 downloaded from cache (3 downloading)
40.22 s
Downloading cached profunctors from https://cache.nix-ci.com
40.22 s
Downloading cached semigroupoids from https://cache.nix-ci.com
40.45 s
Downloaded cached QuickCheck (19.9 MiB) in 652ms
40.45 s
Progress: 0 of 48 built, 141 of 164 downloaded from cache (4 downloading)
40.47 s
Downloaded cached profunctors (10.5 MiB) in 250ms
40.47 s
Progress: 0 of 47 built, 142 of 164 downloaded from cache (3 downloading)
40.47 s
Downloading cached invariant from https://cache.nix-ci.com
40.48 s
Downloaded cached semigroupoids (11.9 MiB) in 262ms
40.48 s
Progress: 0 of 46 built, 143 of 164 downloaded from cache (3 downloading)
40.48 s
Downloading cached either from https://cache.nix-ci.com
40.48 s
Downloading cached free from https://cache.nix-ci.com
40.63 s
Downloaded cached invariant (5.4 MiB) in 162ms
40.63 s
Progress: 0 of 45 built, 144 of 164 downloaded from cache (4 downloading)
40.65 s
Downloaded cached either (885 KiB) in 162ms
40.65 s
Progress: 0 of 44 built, 145 of 164 downloaded from cache (3 downloading)
40.74 s
Downloaded cached optparse-applicative (8.7 MiB) in 734ms
40.74 s
Progress: 0 of 43 built, 146 of 164 downloaded from cache (2 downloading)
40.74 s
Downloading cached tasty from https://cache.nix-ci.com
40.91 s
Downloaded cached free (22.5 MiB) in 421ms
40.91 s
Progress: 0 of 42 built, 147 of 164 downloaded from cache (2 downloading)
40.91 s
Downloading cached adjunctions from https://cache.nix-ci.com
40.99 s
Downloaded cached tasty (9.5 MiB) in 252ms
41.01 s
Building /nix/store/qswpsppgsy2abx9hbjvvligsb06rcdg1-recursion-schemes-5.2.3.drv
41.01 s
Progress: 0 of 41 built (1 building), 148 of 164 downloaded from cache (2 downloading)
41.01 s
Downloading cached tasty-quickcheck from https://cache.nix-ci.com
41.01 s
Downloading cached vector from https://cache.nix-ci.com
41.07 s
Downloaded cached adjunctions (6 MiB) in 162ms
41.07 s
Progress: 0 of 40 built (1 building), 149 of 164 downloaded from cache (3 downloading)
41.07 s
Downloading cached kan-extensions from https://cache.nix-ci.com
41.13 s
[recursion-schemes] Phase: setupCompilerEnvironmentPhase
41.13 s
[recursion-schemes] Build with /nix/store/7r9b0bl984hdgd70nf5p8raa55kml491-ghc-9.8.4.
41.17 s
Downloaded cached tasty-quickcheck (832 KiB) in 163ms
41.17 s
Progress: 0 of 39 built (1 building), 150 of 164 downloaded from cache (3 downloading)
41.27 s
Downloaded cached kan-extensions (7 MiB) in 198ms
41.27 s
Progress: 0 of 38 built (1 building), 151 of 164 downloaded from cache (2 downloading)
41.33 s
[recursion-schemes] Phase: unpackPhase
41.33 s
[recursion-schemes] unpacking source archive /nix/store/s3552nnjzw3ainjsnswrhxjs51ldc2la-recursion-schemes-5.2.3.tar.gz
41.34 s
[recursion-schemes] source root is recursion-schemes-5.2.3
41.35 s
[recursion-schemes] setting SOURCE_DATE_EPOCH to timestamp 1000000000 of file "recursion-schemes-5.2.3/src/Data/Functor/Foldable/TH.hs"
41.36 s
[recursion-schemes] Phase: patchPhase
41.36 s
[recursion-schemes] Replace Cabal file with edited version from mirror://hackage/recursion-schemes-5.2.3/revision/2.cabal.
41.37 s
[recursion-schemes] Phase: compileBuildDriverPhase
41.38 s
[recursion-schemes] setupCompileFlags: -package-db=/build/tmp.4uz8iUMUGl/setup-package.conf.d -threaded
41.42 s
[recursion-schemes] [1 of 2] Compiling Main ( /nix/store/4mdp8nhyfddh7bllbi7xszz7k9955n79-Setup.hs, /build/tmp.4uz8iUMUGl/Main.o )
41.48 s
[recursion-schemes] [2 of 2] Linking Setup
41.72 s
Downloaded cached doctest (68.8 MiB) in 1.7s
41.72 s
Progress: 0 of 37 built (1 building), 152 of 164 downloaded from cache (1 downloading)
41.76 s
Downloaded cached vector (57.1 MiB) in 751ms
41.76 s
Progress: 0 of 36 built (1 building), 153 of 164 downloaded from cache
41.76 s
Downloading cached indexed-traversable-instances from https://cache.nix-ci.com
41.76 s
Downloading cached quickcheck-instances from https://cache.nix-ci.com
41.93 s
Downloaded cached indexed-traversable-instances (359 KiB) in 163ms
41.93 s
Progress: 0 of 35 built (1 building), 154 of 164 downloaded from cache (1 downloading)
41.93 s
Downloading cached lens from https://cache.nix-ci.com
41.93 s
Downloading cached semialign from https://cache.nix-ci.com
41.93 s
Downloading cached witherable from https://cache.nix-ci.com
41.94 s
Downloaded cached quickcheck-instances (5.5 MiB) in 175ms
41.94 s
Progress: 0 of 34 built (1 building), 155 of 164 downloaded from cache (3 downloading)
42.08 s
Downloaded cached witherable (4.4 MiB) in 158ms
42.08 s
Progress: 0 of 33 built (1 building), 156 of 164 downloaded from cache (2 downloading)
42.09 s
Downloaded cached semialign (3.7 MiB) in 167ms
42.09 s
Progress: 0 of 32 built (1 building), 157 of 164 downloaded from cache (1 downloading)
42.09 s
Downloading cached aeson from https://cache.nix-ci.com
42.74 s
Downloaded cached lens (59.2 MiB) in 809ms
42.74 s
Progress: 0 of 31 built (1 building), 158 of 164 downloaded from cache (1 downloading)
42.74 s
Downloading cached yaya from https://cache.nix-ci.com
42.80 s
[recursion-schemes] Phase: updateAutotoolsGnuConfigScriptsPhase
42.81 s
Downloaded cached aeson (47.7 MiB) in 712ms
42.81 s
Progress: 0 of 30 built (1 building), 159 of 164 downloaded from cache (1 downloading)
42.81 s
Downloading cached path from https://cache.nix-ci.com
42.82 s
[recursion-schemes] Phase: configurePhase
42.82 s
[recursion-schemes] configureFlags: --verbose --prefix=/nix/store/hn3qs7c7fmk67pfa3wybzbdgl80578b3-recursion-schemes-5.2.3 --libdir=$prefix/lib/$compiler/lib --libsubdir=$abi/$libname --docdir=/nix/store/hbb4ay0gw2b8axwlzxwd2vkn37iv9xln-recursion-schemes-5.2.3-doc/share/doc/recursion-schemes-5.2.3 --with-gcc=gcc --package-db=/build/tmp.4uz8iUMUGl/package.conf.d --ghc-option=-j16 --ghc-option=+RTS --ghc-option=-A64M --ghc-option=-RTS --enable-library-profiling --profiling-detail=exported-functions --disable-profiling --enable-shared --disable-coverage --enable-static --disable-executable-dynamic --enable-tests --disable-benchmarks --enable-library-vanilla --disable-library-for-ghci --enable-split-sections --enable-library-stripping --enable-executable-stripping --ghc-option=-haddock --extra-lib-dirs=/nix/store/pndhkk0l649lm1sj0mxk7cbwq26qd1ra-ncurses-6.6/lib --extra-lib-dirs=/nix/store/0djlg4g0b81w94k3vcaqsxsc2hh4kism-libffi-3.5.2/lib --extra-lib-dirs=/nix/store/md4paia7riiggyrj8p24c7a6vf8w7jz8-elfutils-0.194/lib --extra-lib-dirs=/nix/store/39vv2pf64gd8li48a4hpbhw2crzd8z5p-gmp-with-cxx-6.3.0/lib --extra-lib-dirs=/nix/store/7wwvald8lapkrsr72qanlw8blyn55ifx-numactl-2.0.18/lib
42.83 s
[recursion-schemes] Using Parsec parser
42.83 s
[recursion-schemes] Configuring recursion-schemes-5.2.3...
43.12 s
Downloaded cached yaya (5.3 MiB) in 386ms
43.12 s
Progress: 0 of 29 built (1 building), 160 of 164 downloaded from cache (1 downloading)
43.12 s
Downloading cached yaya-containers from https://cache.nix-ci.com
43.12 s
Downloading cached yaya-quickcheck from https://cache.nix-ci.com
43.12 s
Downloading cached yaya-unsafe from https://cache.nix-ci.com
43.16 s
Building /nix/store/djnzzldpqxr7c5mn0fqfifwsapi6l6s2-pathway-internal-0.0.1.0.drv
43.16 s
[recursion-schemes] Flags chosen: template-haskell=True
43.16 s
[recursion-schemes] Dependency base >=4.9 && <5: using base-4.19.2.0
43.16 s
[recursion-schemes] Dependency comonad >=4 && <6: using comonad-5.0.10
43.16 s
[recursion-schemes] Dependency containers >=0.4.2.1 && <0.9: using containers-0.6.8
43.16 s
[recursion-schemes] Dependency data-fix >=0.3.0 && <0.4: using data-fix-0.3.4
43.16 s
[recursion-schemes] Dependency free >=4 && <6: using free-5.2
43.16 s
[recursion-schemes] Dependency template-haskell >=2.11.0.0 && <2.25: using
43.16 s
[recursion-schemes] template-haskell-2.21.0.0
43.16 s
[recursion-schemes] Dependency th-abstraction >=0.4 && <0.8: using th-abstraction-0.7.2.0
43.16 s
[recursion-schemes] Dependency transformers >=0.4.2.0 && <1: using transformers-0.6.1.0
43.16 s
[recursion-schemes] Dependency HUnit <1.7: using HUnit-1.6.2.0
43.16 s
[recursion-schemes] Dependency base: using base-4.19.2.0
43.16 s
[recursion-schemes] Dependency recursion-schemes: using recursion-schemes-5.2.3
43.16 s
[recursion-schemes] Dependency template-haskell: using template-haskell-2.21.0.0
43.16 s
[recursion-schemes] Dependency transformers >=0.2 && <1: using transformers-0.6.1.0
43.28 s
Downloaded cached yaya-containers (3.5 MiB) in 160ms
43.28 s
Progress: 0 of 28 built (2 building), 161 of 164 downloaded from cache (3 downloading)
43.32 s
Downloaded cached yaya-unsafe (1 MiB) in 199ms
43.32 s
Progress: 0 of 27 built (2 building), 162 of 164 downloaded from cache (2 downloading)
43.34 s
[pathway-internal] Phase: setupCompilerEnvironmentPhase
43.34 s
[pathway-internal] Build with /nix/store/7r9b0bl984hdgd70nf5p8raa55kml491-ghc-9.8.4.
43.35 s
Downloaded cached path (10.1 MiB) in 545ms
43.35 s
Progress: 0 of 26 built (2 building), 163 of 164 downloaded from cache (1 downloading)
43.36 s
Downloaded cached yaya-quickcheck (351 KiB) in 233ms
43.36 s
Progress: 0 of 25 built (2 building), 164 of 164 downloaded from cache
43.46 s
[recursion-schemes] Source component graph:
43.46 s
[recursion-schemes] component lib
43.46 s
[recursion-schemes] component test:Expr dependency lib
43.46 s
[recursion-schemes] Configured component graph:
43.46 s
[recursion-schemes] component recursion-schemes-5.2.3-KT2wZ2Gxb9fJwEX7AnAqNL
43.46 s
[recursion-schemes] include base-4.19.2.0-934f
43.46 s
[recursion-schemes] include comonad-5.0.10-7DBz8dDQ6aW2tJlajHD9FD
43.46 s
[recursion-schemes] include containers-0.6.8-457e
43.46 s
[recursion-schemes] include data-fix-0.3.4-GsnvgwsODx4FQBNvM93Ci
43.46 s
[recursion-schemes] include free-5.2-3QkXj1EZt1qAZiEMZnw0Oh
43.46 s
[recursion-schemes] include template-haskell-2.21.0.0-eecb
43.46 s
[recursion-schemes] include th-abstraction-0.7.2.0-1BK8r1C8X9bDzsspsMaFNx
43.46 s
[recursion-schemes] include transformers-0.6.1.0-81ea
43.46 s
[recursion-schemes] component recursion-schemes-5.2.3-Hw74IZga1wTLtNOCsHqxXb-Expr
43.46 s
[recursion-schemes] include HUnit-1.6.2.0-1lzcN5S9Uk35UaALzZDXhe
43.46 s
[recursion-schemes] include base-4.19.2.0-934f
43.46 s
[recursion-schemes] include recursion-schemes-5.2.3-KT2wZ2Gxb9fJwEX7AnAqNL
43.46 s
[recursion-schemes] include template-haskell-2.21.0.0-eecb
43.46 s
[recursion-schemes] include transformers-0.6.1.0-81ea
43.46 s
[recursion-schemes] Linked component graph:
43.46 s
[recursion-schemes] unit recursion-schemes-5.2.3-KT2wZ2Gxb9fJwEX7AnAqNL
43.46 s
[recursion-schemes] include base-4.19.2.0-934f
43.46 s
[recursion-schemes] include comonad-5.0.10-7DBz8dDQ6aW2tJlajHD9FD
43.46 s
[recursion-schemes] include containers-0.6.8-457e
43.46 s
[recursion-schemes] include data-fix-0.3.4-GsnvgwsODx4FQBNvM93Ci
43.46 s
[recursion-schemes] include free-5.2-3QkXj1EZt1qAZiEMZnw0Oh
43.46 s
[recursion-schemes] include template-haskell-2.21.0.0-eecb
43.46 s
[recursion-schemes] include th-abstraction-0.7.2.0-1BK8r1C8X9bDzsspsMaFNx
43.46 s
[recursion-schemes] include transformers-0.6.1.0-81ea
43.46 s
[recursion-schemes] Data.Functor.Base=recursion-schemes-5.2.3-KT2wZ2Gxb9fJwEX7AnAqNL:Data.Functor.Base,Data.Functor.Foldable=recursion-schemes-5.2.3-KT2wZ2Gxb9fJwEX7AnAqNL:Data.Functor.Foldable,Data.Functor.Foldable.TH=recursion-schemes-5.2.3-KT2wZ2Gxb9fJwEX7AnAqNL:Data.Functor.Foldable.TH
43.46 s
[recursion-schemes] unit recursion-schemes-5.2.3-Hw74IZga1wTLtNOCsHqxXb-Expr
43.46 s
[recursion-schemes] include HUnit-1.6.2.0-1lzcN5S9Uk35UaALzZDXhe
43.46 s
[recursion-schemes] include base-4.19.2.0-934f
43.46 s
[recursion-schemes] include recursion-schemes-5.2.3-KT2wZ2Gxb9fJwEX7AnAqNL
43.46 s
[recursion-schemes] include template-haskell-2.21.0.0-eecb
43.46 s
[recursion-schemes] include transformers-0.6.1.0-81ea
43.46 s
[recursion-schemes] Ready component graph:
43.46 s
[recursion-schemes] definite recursion-schemes-5.2.3-KT2wZ2Gxb9fJwEX7AnAqNL
43.46 s
[recursion-schemes] depends base-4.19.2.0-934f
43.46 s
[recursion-schemes] depends comonad-5.0.10-7DBz8dDQ6aW2tJlajHD9FD
43.46 s
[recursion-schemes] depends containers-0.6.8-457e
43.46 s
[recursion-schemes] depends data-fix-0.3.4-GsnvgwsODx4FQBNvM93Ci
43.46 s
[recursion-schemes] depends free-5.2-3QkXj1EZt1qAZiEMZnw0Oh
43.46 s
[recursion-schemes] depends template-haskell-2.21.0.0-eecb
43.46 s
[recursion-schemes] depends th-abstraction-0.7.2.0-1BK8r1C8X9bDzsspsMaFNx
43.46 s
[recursion-schemes] depends transformers-0.6.1.0-81ea
43.46 s
[recursion-schemes] definite recursion-schemes-5.2.3-Hw74IZga1wTLtNOCsHqxXb-Expr
43.46 s
[recursion-schemes] depends HUnit-1.6.2.0-1lzcN5S9Uk35UaALzZDXhe
43.46 s
[recursion-schemes] depends base-4.19.2.0-934f
43.46 s
[recursion-schemes] depends recursion-schemes-5.2.3-KT2wZ2Gxb9fJwEX7AnAqNL
43.46 s
[recursion-schemes] depends template-haskell-2.21.0.0-eecb
43.46 s
[recursion-schemes] depends transformers-0.6.1.0-81ea
43.46 s
[recursion-schemes] Using Cabal-3.10.3.0 compiled by ghc-9.8
43.46 s
[recursion-schemes] Using compiler: ghc-9.8.4
43.46 s
[recursion-schemes] Using install prefix:
43.46 s
[recursion-schemes] /nix/store/hn3qs7c7fmk67pfa3wybzbdgl80578b3-recursion-schemes-5.2.3
43.46 s
[recursion-schemes] Executables installed in:
43.46 s
[recursion-schemes] /nix/store/hn3qs7c7fmk67pfa3wybzbdgl80578b3-recursion-schemes-5.2.3/bin
43.46 s
[recursion-schemes] Libraries installed in:
43.46 s
[recursion-schemes] /nix/store/hn3qs7c7fmk67pfa3wybzbdgl80578b3-recursion-schemes-5.2.3/lib/ghc-9.8.4/lib/x86_64-linux-ghc-9.8.4/recursion-schemes-5.2.3-KT2wZ2Gxb9fJwEX7AnAqNL
43.46 s
[recursion-schemes] Dynamic Libraries installed in:
43.46 s
[recursion-schemes] /nix/store/hn3qs7c7fmk67pfa3wybzbdgl80578b3-recursion-schemes-5.2.3/lib/ghc-9.8.4/lib/x86_64-linux-ghc-9.8.4
43.46 s
[recursion-schemes] Private executables installed in:
43.46 s
[recursion-schemes] /nix/store/hn3qs7c7fmk67pfa3wybzbdgl80578b3-recursion-schemes-5.2.3/libexec/x86_64-linux-ghc-9.8.4/recursion-schemes-5.2.3
43.46 s
[recursion-schemes] Data files installed in:
43.46 s
[recursion-schemes] /nix/store/hn3qs7c7fmk67pfa3wybzbdgl80578b3-recursion-schemes-5.2.3/share/x86_64-linux-ghc-9.8.4/recursion-schemes-5.2.3
43.46 s
[recursion-schemes] Documentation installed in:
43.46 s
[recursion-schemes] /nix/store/hbb4ay0gw2b8axwlzxwd2vkn37iv9xln-recursion-schemes-5.2.3-doc/share/doc/recursion-schemes-5.2.3
43.46 s
[recursion-schemes] Configuration files installed in:
43.46 s
[recursion-schemes] /nix/store/hn3qs7c7fmk67pfa3wybzbdgl80578b3-recursion-schemes-5.2.3/etc
43.46 s
[recursion-schemes] No alex found
43.46 s
[recursion-schemes] Using ar found on system at:
43.46 s
[recursion-schemes] /nix/store/zjraf40s86y3iwhp626b934r5y6ldkbb-binutils-wrapper-2.46/bin/ar
43.46 s
[recursion-schemes] No c2hs found
43.46 s
[recursion-schemes] No cpphs found
43.46 s
[recursion-schemes] No doctest found
43.46 s
[recursion-schemes] Using gcc version 15.2.0 given by user at:
43.46 s
[recursion-schemes] /nix/store/29qjlshvklnyr67nhpprzgb9igmsfsjj-gcc-wrapper-15.2.0/bin/gcc
43.46 s
[recursion-schemes] Using ghc version 9.8.4 found on system at:
43.46 s
[recursion-schemes] /nix/store/7r9b0bl984hdgd70nf5p8raa55kml491-ghc-9.8.4/bin/ghc
43.46 s
[recursion-schemes] Using ghc-pkg version 9.8.4 found on system at:
43.46 s
[recursion-schemes] /nix/store/7r9b0bl984hdgd70nf5p8raa55kml491-ghc-9.8.4/bin/ghc-pkg-9.8.4
43.46 s
[recursion-schemes] No ghcjs found
43.46 s
[recursion-schemes] No ghcjs-pkg found
43.46 s
[recursion-schemes] No greencard found
43.46 s
[recursion-schemes] Using haddock version 2.30.0 found on system at:
43.46 s
[recursion-schemes] /nix/store/7r9b0bl984hdgd70nf5p8raa55kml491-ghc-9.8.4/bin/haddock-ghc-9.8.4
43.46 s
[recursion-schemes] No happy found
43.46 s
[recursion-schemes] Using haskell-suite found on system at: haskell-suite-dummy-location
43.46 s
[recursion-schemes] Using haskell-suite-pkg found on system at: haskell-suite-pkg-dummy-location
43.46 s
[recursion-schemes] No hmake found
43.46 s
[recursion-schemes] Using hpc version 0.69 found on system at:
43.46 s
[recursion-schemes] /nix/store/7r9b0bl984hdgd70nf5p8raa55kml491-ghc-9.8.4/bin/hpc-ghc-9.8.4
43.46 s
[recursion-schemes] Using hsc2hs version 0.68.10 found on system at:
43.46 s
[recursion-schemes] /nix/store/7r9b0bl984hdgd70nf5p8raa55kml491-ghc-9.8.4/bin/hsc2hs-ghc-9.8.4
43.46 s
[recursion-schemes] Using hscolour version 1.25 found on system at:
43.46 s
[recursion-schemes] /nix/store/awnxn98rlw62rrjwli6d2lb4d27mrzzw-hscolour-1.25/bin/HsColour
43.46 s
[recursion-schemes] No jhc found
43.46 s
[recursion-schemes] Using ld found on system at:
43.46 s
[recursion-schemes] /nix/store/zjraf40s86y3iwhp626b934r5y6ldkbb-binutils-wrapper-2.46/bin/ld.gold
43.46 s
[recursion-schemes] No pkg-config found
43.46 s
[recursion-schemes] Using runghc version 9.8.4 found on system at:
43.46 s
[recursion-schemes] /nix/store/7r9b0bl984hdgd70nf5p8raa55kml491-ghc-9.8.4/bin/runghc-9.8.4
43.46 s
[recursion-schemes] Using strip version 2.46 found on system at:
43.46 s
[recursion-schemes] /nix/store/29qjlshvklnyr67nhpprzgb9igmsfsjj-gcc-wrapper-15.2.0/bin/strip
43.46 s
[recursion-schemes] Using tar found on system at:
43.46 s
[recursion-schemes] /nix/store/z5mq2sam4484prf3kv6v6vjw1m0i7j24-gnutar-1.35/bin/tar
43.46 s
[recursion-schemes] No uhc found
43.62 s
[pathway-internal] Phase: unpackPhase
43.62 s
[pathway-internal] unpacking source archive /nix/store/hh572hbnzilsldmgcd4h66b9lmbbjblc-internal
43.63 s
[pathway-internal] source root is internal
43.64 s
[pathway-internal] Phase: patchPhase
43.65 s
[pathway-internal] Phase: compileBuildDriverPhase
43.66 s
[pathway-internal] setupCompileFlags: -package-db=/build/tmp.vBynQdLJyL/setup-package.conf.d -threaded
43.71 s
[pathway-internal] [1 of 2] Compiling Main ( Setup.hs, /build/tmp.vBynQdLJyL/Main.o )
43.73 s
[recursion-schemes] Phase: buildPhase
43.75 s
[pathway-internal] [2 of 2] Linking Setup
43.78 s
[recursion-schemes] Preprocessing library for recursion-schemes-5.2.3..
43.78 s
[recursion-schemes] Building library for recursion-schemes-5.2.3..
43.89 s
[recursion-schemes] [1 of 4] Compiling Data.Functor.Base ( src/Data/Functor/Base.hs, dist/build/Data/Functor/Base.o, dist/build/Data/Functor/Base.dyn_o )
44.90 s
[pathway-internal] Phase: updateAutotoolsGnuConfigScriptsPhase
44.92 s
[pathway-internal] Phase: configurePhase
44.93 s
[pathway-internal] configureFlags: --verbose --prefix=/nix/store/i9h58y5xs8nfs1xzwbzavrix2ydm8b2x-pathway-internal-0.0.1.0 --libdir=$prefix/lib/$compiler/lib --libsubdir=$abi/$libname --docdir=/nix/store/flalr1csy3bhgcnskvag3rz6z76hw69m-pathway-internal-0.0.1.0-doc/share/doc/pathway-internal-0.0.1.0 --with-gcc=gcc --package-db=/build/tmp.vBynQdLJyL/package.conf.d --ghc-option=-j16 --ghc-option=+RTS --ghc-option=-A64M --ghc-option=-RTS --enable-library-profiling --profiling-detail=exported-functions --disable-profiling --enable-shared --disable-coverage --enable-static --disable-executable-dynamic --enable-tests --disable-benchmarks --enable-library-vanilla --disable-library-for-ghci --enable-split-sections --enable-library-stripping --enable-executable-stripping --ghc-option=-haddock --ghc-options=-Werror --extra-lib-dirs=/nix/store/pndhkk0l649lm1sj0mxk7cbwq26qd1ra-ncurses-6.6/lib --extra-lib-dirs=/nix/store/0djlg4g0b81w94k3vcaqsxsc2hh4kism-libffi-3.5.2/lib --extra-lib-dirs=/nix/store/md4paia7riiggyrj8p24c7a6vf8w7jz8-elfutils-0.194/lib --extra-lib-dirs=/nix/store/39vv2pf64gd8li48a4hpbhw2crzd8z5p-gmp-with-cxx-6.3.0/lib --extra-lib-dirs=/nix/store/7wwvald8lapkrsr72qanlw8blyn55ifx-numactl-2.0.18/lib --extra-lib-dirs=/nix/store/7r9b0bl984hdgd70nf5p8raa55kml491-ghc-9.8.4/lib
45.06 s
[pathway-internal] Using Parsec parser
45.06 s
[pathway-internal] Configuring pathway-internal-0.0.1.0...
45.23 s
[pathway-internal] Flags chosen: noisy-deprecations=True, verify-no-recursion=False
45.23 s
[pathway-internal] Dependency base >=4.14.0 && <4.15 || >=4.15.0 && <4.16 || >=4.16.0 && <4.17 ||
45.23 s
[pathway-internal] >=4.17.0 && <4.18 || >=4.18.0 && <4.19 || >=4.19.0 && <4.20 || >=4.20.0 &&
45.23 s
[pathway-internal] <4.21 || >=4.21.0 && <4.22 || >=4.22.0 && <4.23: using base-4.19.2.0
45.23 s
[pathway-internal] Dependency yaya >=0.6.2 && <0.7 || >=0.7.0 && <0.8: using yaya-0.6.2.3
45.23 s
[pathway-internal] Dependency base >=4.14.0 && <4.15 || >=4.15.0 && <4.16 || >=4.16.0 && <4.17 ||
45.23 s
[pathway-internal] >=4.17.0 && <4.18 || >=4.18.0 && <4.19 || >=4.19.0 && <4.20 || >=4.20.0 &&
45.23 s
[pathway-internal] <4.21 || >=4.21.0 && <4.22 || >=4.22.0 && <4.23: using base-4.19.2.0
45.23 s
[pathway-internal] Dependency doctest >=0.16.3 && <0.17 || >=0.18.1 && <0.19 || >=0.20.1 && <0.21
45.23 s
[pathway-internal] || >=0.21.1 && <0.22 || >=0.22.2 && <0.23 || >=0.24.2 && <0.25 || >=0.25.0 &&
45.23 s
[pathway-internal] <0.26: using doctest-0.24.3
45.23 s
[pathway-internal] Dependency pathway-internal: using pathway-internal-0.0.1.0
45.30 s
[recursion-schemes] [2 of 4] Compiling Data.Functor.Foldable ( src/Data/Functor/Foldable.hs, dist/build/Data/Functor/Foldable.o, dist/build/Data/Functor/Foldable.dyn_o )
45.54 s
[pathway-internal] Source component graph:
45.54 s
[pathway-internal] component lib
45.54 s
[pathway-internal] component test:doctests dependency lib
45.54 s
[pathway-internal] Configured component graph:
45.54 s
[pathway-internal] component pathway-internal-0.0.1.0-Lnjdb2M8cxN196wSdsfQUK
45.54 s
[pathway-internal] include base-4.19.2.0-934f
45.54 s
[pathway-internal] include yaya-0.6.2.3-GccDDwL0TDlDZM8zUYiPLe
45.54 s
[pathway-internal] component pathway-internal-0.0.1.0-79xZfAXdLYy4mNBYvWNPQJ-doctests
45.54 s
[pathway-internal] include base-4.19.2.0-934f
45.54 s
[pathway-internal] include doctest-0.24.3-1aDs7zEYV5r7raSsXr9TQC
45.54 s
[pathway-internal] include pathway-internal-0.0.1.0-Lnjdb2M8cxN196wSdsfQUK
45.54 s
[pathway-internal] Linked component graph:
45.54 s
[pathway-internal] unit pathway-internal-0.0.1.0-Lnjdb2M8cxN196wSdsfQUK
45.54 s
[pathway-internal] include base-4.19.2.0-934f
45.54 s
[pathway-internal] include yaya-0.6.2.3-GccDDwL0TDlDZM8zUYiPLe
45.54 s
[pathway-internal] Data.Path.Internal=pathway-internal-0.0.1.0-Lnjdb2M8cxN196wSdsfQUK:Data.Path.Internal,Data.Path.Internal.Relativity=pathway-internal-0.0.1.0-Lnjdb2M8cxN196wSdsfQUK:Data.Path.Internal.Relativity,Data.Path.Internal.Type=pathway-internal-0.0.1.0-Lnjdb2M8cxN196wSdsfQUK:Data.Path.Internal.Type
45.54 s
[pathway-internal] unit pathway-internal-0.0.1.0-79xZfAXdLYy4mNBYvWNPQJ-doctests
45.54 s
[pathway-internal] include base-4.19.2.0-934f
45.54 s
[pathway-internal] include doctest-0.24.3-1aDs7zEYV5r7raSsXr9TQC
45.54 s
[pathway-internal] include pathway-internal-0.0.1.0-Lnjdb2M8cxN196wSdsfQUK
45.54 s
[pathway-internal] Ready component graph:
45.54 s
[pathway-internal] definite pathway-internal-0.0.1.0-Lnjdb2M8cxN196wSdsfQUK
45.54 s
[pathway-internal] depends base-4.19.2.0-934f
45.54 s
[pathway-internal] depends yaya-0.6.2.3-GccDDwL0TDlDZM8zUYiPLe
45.54 s
[pathway-internal] definite pathway-internal-0.0.1.0-79xZfAXdLYy4mNBYvWNPQJ-doctests
45.54 s
[pathway-internal] depends base-4.19.2.0-934f
45.54 s
[pathway-internal] depends doctest-0.24.3-1aDs7zEYV5r7raSsXr9TQC
45.54 s
[pathway-internal] depends pathway-internal-0.0.1.0-Lnjdb2M8cxN196wSdsfQUK
45.54 s
[pathway-internal] Using Cabal-3.10.3.0 compiled by ghc-9.8
45.54 s
[pathway-internal] Using compiler: ghc-9.8.4
45.54 s
[pathway-internal] Using install prefix:
45.54 s
[pathway-internal] /nix/store/i9h58y5xs8nfs1xzwbzavrix2ydm8b2x-pathway-internal-0.0.1.0
45.54 s
[pathway-internal] Executables installed in:
45.54 s
[pathway-internal] /nix/store/i9h58y5xs8nfs1xzwbzavrix2ydm8b2x-pathway-internal-0.0.1.0/bin
45.54 s
[pathway-internal] Libraries installed in:
45.54 s
[pathway-internal] /nix/store/i9h58y5xs8nfs1xzwbzavrix2ydm8b2x-pathway-internal-0.0.1.0/lib/ghc-9.8.4/lib/x86_64-linux-ghc-9.8.4/pathway-internal-0.0.1.0-Lnjdb2M8cxN196wSdsfQUK
45.54 s
[pathway-internal] Dynamic Libraries installed in:
45.54 s
[pathway-internal] /nix/store/i9h58y5xs8nfs1xzwbzavrix2ydm8b2x-pathway-internal-0.0.1.0/lib/ghc-9.8.4/lib/x86_64-linux-ghc-9.8.4
45.54 s
[pathway-internal] Private executables installed in:
45.54 s
[pathway-internal] /nix/store/i9h58y5xs8nfs1xzwbzavrix2ydm8b2x-pathway-internal-0.0.1.0/libexec/x86_64-linux-ghc-9.8.4/pathway-internal-0.0.1.0
45.54 s
[pathway-internal] Data files installed in:
45.54 s
[pathway-internal] /nix/store/i9h58y5xs8nfs1xzwbzavrix2ydm8b2x-pathway-internal-0.0.1.0/share/x86_64-linux-ghc-9.8.4/pathway-internal-0.0.1.0
45.54 s
[pathway-internal] Documentation installed in:
45.54 s
[pathway-internal] /nix/store/flalr1csy3bhgcnskvag3rz6z76hw69m-pathway-internal-0.0.1.0-doc/share/doc/pathway-internal-0.0.1.0
45.54 s
[pathway-internal] Configuration files installed in:
45.54 s
[pathway-internal] /nix/store/i9h58y5xs8nfs1xzwbzavrix2ydm8b2x-pathway-internal-0.0.1.0/etc
45.54 s
[pathway-internal] No alex found
45.54 s
[pathway-internal] Using ar found on system at:
45.54 s
[pathway-internal] /nix/store/zjraf40s86y3iwhp626b934r5y6ldkbb-binutils-wrapper-2.46/bin/ar
45.54 s
[pathway-internal] No c2hs found
45.54 s
[pathway-internal] No cpphs found
45.54 s
[pathway-internal] Using doctest version 0.24.3 found on system at:
45.54 s
[pathway-internal] /nix/store/2y183b1vsybv0157vfr59yhdwjkpqfkn-doctest-0.24.3/bin/doctest
45.54 s
[pathway-internal] Using gcc version 15.2.0 given by user at:
45.54 s
[pathway-internal] /nix/store/29qjlshvklnyr67nhpprzgb9igmsfsjj-gcc-wrapper-15.2.0/bin/gcc
45.54 s
[pathway-internal] Using ghc version 9.8.4 found on system at:
45.54 s
[pathway-internal] /nix/store/7r9b0bl984hdgd70nf5p8raa55kml491-ghc-9.8.4/bin/ghc
45.54 s
[pathway-internal] Using ghc-pkg version 9.8.4 found on system at:
45.54 s
[pathway-internal] /nix/store/7r9b0bl984hdgd70nf5p8raa55kml491-ghc-9.8.4/bin/ghc-pkg-9.8.4
45.54 s
[pathway-internal] No ghcjs found
45.54 s
[pathway-internal] No ghcjs-pkg found
45.54 s
[pathway-internal] No greencard found
45.54 s
[pathway-internal] Using haddock version 2.30.0 found on system at:
45.54 s
[pathway-internal] /nix/store/7r9b0bl984hdgd70nf5p8raa55kml491-ghc-9.8.4/bin/haddock-ghc-9.8.4
45.54 s
[pathway-internal] No happy found
45.54 s
[pathway-internal] Using haskell-suite found on system at: haskell-suite-dummy-location
45.54 s
[pathway-internal] Using haskell-suite-pkg found on system at: haskell-suite-pkg-dummy-location
45.54 s
[pathway-internal] No hmake found
45.54 s
[pathway-internal] Using hpc version 0.69 found on system at:
45.54 s
[pathway-internal] /nix/store/7r9b0bl984hdgd70nf5p8raa55kml491-ghc-9.8.4/bin/hpc-ghc-9.8.4
45.54 s
[pathway-internal] Using hsc2hs version 0.68.10 found on system at:
45.54 s
[pathway-internal] /nix/store/7r9b0bl984hdgd70nf5p8raa55kml491-ghc-9.8.4/bin/hsc2hs-ghc-9.8.4
45.54 s
[pathway-internal] Using hscolour version 1.25 found on system at:
45.54 s
[pathway-internal] /nix/store/awnxn98rlw62rrjwli6d2lb4d27mrzzw-hscolour-1.25/bin/HsColour
45.54 s
[pathway-internal] No jhc found
45.54 s
[pathway-internal] Using ld found on system at:
45.54 s
[pathway-internal] /nix/store/zjraf40s86y3iwhp626b934r5y6ldkbb-binutils-wrapper-2.46/bin/ld.gold
45.54 s
[pathway-internal] No pkg-config found
45.54 s
[pathway-internal] Using runghc version 9.8.4 found on system at:
45.54 s
[pathway-internal] /nix/store/7r9b0bl984hdgd70nf5p8raa55kml491-ghc-9.8.4/bin/runghc-9.8.4
45.54 s
[pathway-internal] Using strip version 2.46 found on system at:
45.54 s
[pathway-internal] /nix/store/29qjlshvklnyr67nhpprzgb9igmsfsjj-gcc-wrapper-15.2.0/bin/strip
45.54 s
[pathway-internal] Using tar found on system at:
45.54 s
[pathway-internal] /nix/store/z5mq2sam4484prf3kv6v6vjw1m0i7j24-gnutar-1.35/bin/tar
45.54 s
[pathway-internal] No uhc found
45.90 s
[pathway-internal] Phase: buildPhase
45.96 s
[pathway-internal] Preprocessing library for pathway-internal-0.0.1.0..
45.96 s
[pathway-internal] Building library for pathway-internal-0.0.1.0..
46.02 s
[pathway-internal] [1 of 3] Compiling Data.Path.Internal.Relativity ( src/Data/Path/Internal/Relativity.hs, dist/build/Data/Path/Internal/Relativity.o, dist/build/Data/Path/Internal/Relativity.dyn_o )
46.21 s
[pathway-internal] [2 of 3] Compiling Data.Path.Internal.Type ( src/Data/Path/Internal/Type.hs, dist/build/Data/Path/Internal/Type.o, dist/build/Data/Path/Internal/Type.dyn_o )
46.21 s
[pathway-internal] [3 of 3] Compiling Data.Path.Internal ( src/Data/Path/Internal.hs, dist/build/Data/Path/Internal.o, dist/build/Data/Path/Internal.dyn_o )
46.62 s
[recursion-schemes] [3 of 4] Compiling Data.Functor.Foldable.TH ( src/Data/Functor/Foldable/TH.hs, dist/build/Data/Functor/Foldable/TH.o, dist/build/Data/Functor/Foldable/TH.dyn_o )
46.78 s
[recursion-schemes] [4 of 4] Compiling Paths_recursion_schemes ( dist/build/autogen/Paths_recursion_schemes.hs, dist/build/Paths_recursion_schemes.o, dist/build/Paths_recursion_schemes.dyn_o )
47.00 s
[recursion-schemes] [1 of 4] Compiling Data.Functor.Base ( src/Data/Functor/Base.hs, dist/build/Data/Functor/Base.p_o )
47.39 s
[pathway-internal] [1 of 3] Compiling Data.Path.Internal.Relativity ( src/Data/Path/Internal/Relativity.hs, dist/build/Data/Path/Internal/Relativity.p_o )
47.67 s
[pathway-internal] [2 of 3] Compiling Data.Path.Internal.Type ( src/Data/Path/Internal/Type.hs, dist/build/Data/Path/Internal/Type.p_o )
47.67 s
[pathway-internal] [3 of 3] Compiling Data.Path.Internal ( src/Data/Path/Internal.hs, dist/build/Data/Path/Internal.p_o )
48.36 s
[recursion-schemes] [2 of 4] Compiling Data.Functor.Foldable ( src/Data/Functor/Foldable.hs, dist/build/Data/Functor/Foldable.p_o )
49.68 s
[recursion-schemes] [3 of 4] Compiling Data.Functor.Foldable.TH ( src/Data/Functor/Foldable/TH.hs, dist/build/Data/Functor/Foldable/TH.p_o )
49.95 s
[recursion-schemes] [4 of 4] Compiling Paths_recursion_schemes ( dist/build/autogen/Paths_recursion_schemes.hs, dist/build/Paths_recursion_schemes.p_o )
50.22 s
[pathway-internal] Preprocessing test suite 'doctests' for pathway-internal-0.0.1.0..
50.22 s
[pathway-internal] Building test suite 'doctests' for pathway-internal-0.0.1.0..
50.28 s
[pathway-internal] [1 of 2] Compiling Build_doctests ( dist/build/doctests/autogen/Build_doctests.hs, dist/build/doctests/doctests-tmp/Build_doctests.o )
50.46 s
[pathway-internal] [2 of 2] Compiling Main ( tests/doctests.hs, dist/build/doctests/doctests-tmp/Main.o )
50.70 s
[pathway-internal] [3 of 3] Linking dist/build/doctests/doctests
51.20 s
[recursion-schemes] Preprocessing test suite 'Expr' for recursion-schemes-5.2.3..
51.20 s
[recursion-schemes] Building test suite 'Expr' for recursion-schemes-5.2.3..
51.25 s
[recursion-schemes] [1 of 1] Compiling Main ( examples/Expr.hs, dist/build/Expr/Expr-tmp/Main.o )
53.30 s
[recursion-schemes] [2 of 2] Linking dist/build/Expr/Expr
53.98 s
[pathway-internal] Phase: checkPhase
54.02 s
[pathway-internal] Running 1 test suites...
54.02 s
[pathway-internal] Test suite doctests: RUNNING...
54.18 s
[recursion-schemes] Phase: checkPhase
54.21 s
[recursion-schemes] Running 1 test suites...
54.21 s
[recursion-schemes] Test suite Expr: RUNNING...
54.22 s
[recursion-schemes] Test suite Expr: PASS
54.22 s
[recursion-schemes] Test suite logged to: dist/test/recursion-schemes-5.2.3-Expr.log
54.22 s
[recursion-schemes] 1 of 1 test suites (1 of 1 test cases) passed.
54.22 s
[recursion-schemes] Phase: haddockPhase
54.26 s
[pathway-internal]
54.26 s
[pathway-internal] on the commandline: warning: [GHC-98887]
54.26 s
[pathway-internal] -XTemplateHaskell is not allowed in Safe Haskell; ignoring -XTemplateHaskell
54.26 s
[pathway-internal]
54.26 s
[pathway-internal] on the commandline: warning: [GHC-98887]
54.26 s
[pathway-internal] -XTemplateHaskell is not allowed in Safe Haskell; ignoring -XTemplateHaskell
54.34 s
[recursion-schemes] Preprocessing library for recursion-schemes-5.2.3..
54.35 s
[recursion-schemes] Running Haddock on library for recursion-schemes-5.2.3..
54.38 s
[recursion-schemes] Warning: --source-* options are ignored when --hyperlinked-source is enabled.
54.53 s
[recursion-schemes] [1 of 4] Compiling Data.Functor.Base ( src/Data/Functor/Base.hs, nothing )
54.71 s
[recursion-schemes] [2 of 4] Compiling Data.Functor.Foldable ( src/Data/Functor/Foldable.hs, nothing )
54.74 s
[pathway-internal] Examples: 0 Tried: 0 Errors: 0 Failures: 0
54.79 s
[pathway-internal] Test suite doctests: PASS
54.79 s
[pathway-internal] Test suite logged to: dist/test/pathway-internal-0.0.1.0-doctests.log
54.79 s
[pathway-internal] 1 of 1 test suites (1 of 1 test cases) passed.
54.80 s
[pathway-internal] Phase: haddockPhase
54.93 s
[pathway-internal] Preprocessing library for pathway-internal-0.0.1.0..
54.93 s
[pathway-internal] Running Haddock on library for pathway-internal-0.0.1.0..
54.93 s
[pathway-internal] Warning: The documentation for the following packages are not installed. No
54.93 s
[pathway-internal] links will be generated to these packages: vector-0.13.2.0
54.98 s
[pathway-internal] Warning: --source-* options are ignored when --hyperlinked-source is enabled.
55.04 s
[recursion-schemes] [3 of 4] Compiling Data.Functor.Foldable.TH ( src/Data/Functor/Foldable/TH.hs, nothing )
55.09 s
[pathway-internal] [1 of 3] Compiling Data.Path.Internal.Relativity ( src/Data/Path/Internal/Relativity.hs, nothing )
55.12 s
[recursion-schemes] [4 of 4] Compiling Paths_recursion_schemes ( dist/build/autogen/Paths_recursion_schemes.hs, nothing )
55.12 s
[recursion-schemes] Haddock coverage:
55.12 s
[recursion-schemes] 80% ( 4 / 5) in 'Data.Functor.Base'
55.12 s
[recursion-schemes] Missing documentation for:
55.12 s
[recursion-schemes] ForestF (src/Data/Functor/Base.hs:153)
55.13 s
[recursion-schemes] Warning: 't' is out of scope.
55.13 s
[recursion-schemes] If you qualify the identifier, haddock can try to link it anyway.
55.13 s
[recursion-schemes] Warning: 'a' is out of scope.
55.13 s
[recursion-schemes] If you qualify the identifier, haddock can try to link it anyway.
55.13 s
[recursion-schemes] Warning: 'unfoldr' is out of scope.
55.13 s
[recursion-schemes] If you qualify the identifier, haddock can try to link it anyway.
55.13 s
[recursion-schemes] Warning: 'rollup' is out of scope.
55.13 s
[recursion-schemes] If you qualify the identifier, haddock can try to link it anyway.
55.13 s
[recursion-schemes] Warning: 'Reader' is out of scope.
55.13 s
[recursion-schemes] If you qualify the identifier, haddock can try to link it anyway.
55.13 s
[recursion-schemes] Warning: 'local' is out of scope.
55.13 s
[recursion-schemes] If you qualify the identifier, haddock can try to link it anyway.
55.13 s
[recursion-schemes] Warning: 'Mu' is ambiguous. It is defined
55.13 s
[recursion-schemes] * in ‘Data.Fix’
55.13 s
[recursion-schemes] * in ‘Data.Fix’
55.13 s
[recursion-schemes] You may be able to disambiguate the identifier by qualifying it or
55.13 s
[recursion-schemes] by specifying the type/value namespace explicitly.
55.13 s
[recursion-schemes] Defaulting to the one defined in ‘Data.Fix’
55.13 s
[recursion-schemes] 67% ( 50 / 74) in 'Data.Functor.Foldable'
55.13 s
[recursion-schemes] Missing documentation for:
55.13 s
[recursion-schemes] zygo (src/Data/Functor/Foldable.hs:645)
55.13 s
[recursion-schemes] apo
55.13 s
[recursion-schemes] futu (src/Data/Functor/Foldable.hs:563)
55.13 s
[recursion-schemes] chrono (src/Data/Functor/Foldable.hs:793)
55.13 s
[recursion-schemes] gpara
55.13 s
[recursion-schemes] ghisto (src/Data/Functor/Foldable.hs:784)
55.13 s
[recursion-schemes] gzygo (src/Data/Functor/Foldable.hs:660)
55.13 s
[recursion-schemes] gapo (src/Data/Functor/Foldable.hs:671)
55.13 s
[recursion-schemes] gfutu (src/Data/Functor/Foldable.hs:566)
55.13 s
[recursion-schemes] gchrono (src/Data/Functor/Foldable.hs:800)
55.13 s
[recursion-schemes] gprepro
55.13 s
[recursion-schemes] distCata (src/Data/Functor/Foldable.hs:532)
55.13 s
[recursion-schemes] distPara (src/Data/Functor/Foldable.hs:305)
55.13 s
[recursion-schemes] distParaT (src/Data/Functor/Foldable.hs:308)
55.13 s
[recursion-schemes] distHisto (src/Data/Functor/Foldable.hs:787)
55.13 s
[recursion-schemes] distGHisto (src/Data/Functor/Foldable.hs:790)
55.13 s
[recursion-schemes] distZygo (src/Data/Functor/Foldable.hs:651)
55.13 s
[recursion-schemes] distZygoT (src/Data/Functor/Foldable.hs:667)
55.13 s
[recursion-schemes] distAna (src/Data/Functor/Foldable.hs:546)
55.13 s
[recursion-schemes] distApo (src/Data/Functor/Foldable.hs:674)
55.13 s
[recursion-schemes] distGApo (src/Data/Functor/Foldable.hs:677)
55.13 s
[recursion-schemes] distGApoT (src/Data/Functor/Foldable.hs:685)
55.13 s
[recursion-schemes] distFutu (src/Data/Functor/Foldable.hs:569)
55.13 s
[recursion-schemes] distGFutu (src/Data/Functor/Foldable.hs:573)
55.13 s
[recursion-schemes] Warning: 'Cofree' is out of scope.
55.13 s
[recursion-schemes] If you qualify the identifier, haddock can try to link it anyway.
55.13 s
[recursion-schemes] Warning: 'BaseRules' is ambiguous. It is defined
55.13 s
[recursion-schemes] * at src/Data/Functor/Foldable/TH.hs:174:18
55.13 s
[recursion-schemes] * at src/Data/Functor/Foldable/TH.hs:174:1
55.13 s
[recursion-schemes] You may be able to disambiguate the identifier by qualifying it or
55.13 s
[recursion-schemes] by specifying the type/value namespace explicitly.
55.13 s
[recursion-schemes] Defaulting to the one defined at src/Data/Functor/Foldable/TH.hs:174:1
55.14 s
[recursion-schemes] 85% ( 6 / 7) in 'Data.Functor.Foldable.TH'
55.14 s
[recursion-schemes] Missing documentation for:
55.14 s
[recursion-schemes] Module header
55.17 s
[pathway-internal] [2 of 3] Compiling Data.Path.Internal.Type ( src/Data/Path/Internal/Type.hs, nothing )
55.17 s
[pathway-internal] [3 of 3] Compiling Data.Path.Internal ( src/Data/Path/Internal.hs, nothing )
55.47 s
[pathway-internal] Haddock coverage:
55.47 s
[pathway-internal] Warning: 'Path' is out of scope.
55.47 s
[pathway-internal] If you qualify the identifier, haddock can try to link it anyway.
55.47 s
[pathway-internal] Warning: 'True' is out of scope.
55.47 s
[pathway-internal] If you qualify the identifier, haddock can try to link it anyway.
55.47 s
[pathway-internal] Warning: 'False' is out of scope.
55.47 s
[pathway-internal] If you qualify the identifier, haddock can try to link it anyway.
55.47 s
[pathway-internal] Warning: 'Nat' is out of scope.
55.47 s
[pathway-internal] If you qualify the identifier, haddock can try to link it anyway.
55.47 s
[pathway-internal] Warning: 'Maybe' is out of scope.
55.47 s
[pathway-internal] If you qualify the identifier, haddock can try to link it anyway.
55.47 s
[pathway-internal] Warning: 'Nothing' is out of scope.
55.47 s
[pathway-internal] If you qualify the identifier, haddock can try to link it anyway.
55.47 s
[pathway-internal] 50% ( 1 / 2) in 'Data.Path.Internal.Relativity'
55.47 s
[pathway-internal] Missing documentation for:
55.47 s
[pathway-internal] Module header
55.47 s
[pathway-internal] Warning: 'Path' is out of scope.
55.47 s
[pathway-internal] If you qualify the identifier, haddock can try to link it anyway.
55.47 s
[pathway-internal] 50% ( 1 / 2) in 'Data.Path.Internal.Type'
55.47 s
[pathway-internal] Missing documentation for:
55.47 s
[pathway-internal] Module header
55.47 s
[pathway-internal] Warning: 'toText' is out of scope.
55.47 s
[pathway-internal] If you qualify the identifier, haddock can try to link it anyway.
55.47 s
[pathway-internal] Warning: '</?>' is out of scope.
55.47 s
[pathway-internal] If you qualify the identifier, haddock can try to link it anyway.
55.47 s
[pathway-internal] Warning: 'AnyPath' is out of scope.
55.47 s
[pathway-internal] If you qualify the identifier, haddock can try to link it anyway.
55.47 s
[pathway-internal] 66% ( 6 / 9) in 'Data.Path.Internal'
55.47 s
[pathway-internal] Missing documentation for:
55.47 s
[pathway-internal] Module header
55.47 s
[pathway-internal] TotalOps (src/Data/Path/Internal.hs:199)
55.47 s
[pathway-internal] Filename (src/Data/Path/Internal.hs:77)
55.48 s
[recursion-schemes] Warning: Data.Functor.Base: could not find link destinations for:
55.48 s
[recursion-schemes] - Data.Functor.Base.Rep_TreeF
55.48 s
[recursion-schemes] - Data.Functor.Base.Rep1_TreeF
55.48 s
[recursion-schemes] - Data.Functor.Base.Rep_NonEmptyF
55.48 s
[recursion-schemes] - Data.Functor.Base.Rep1_NonEmptyF
55.48 s
[recursion-schemes] - Data.Functor.Base.Rep_ListF
55.48 s
[recursion-schemes] - Data.Functor.Base.Rep1_ListF
55.49 s
[recursion-schemes] Warning: Data.Functor.Foldable: could not find link destinations for:
55.49 s
[recursion-schemes] - Data.Functor.Base.Rep_ListF
55.49 s
[recursion-schemes] - Data.Functor.Base.Rep1_ListF
55.49 s
[recursion-schemes] - Data.Functor.Foldable.GCoerce
55.82 s
[pathway-internal] Warning: Data.Path.Internal.Relativity: could not find link destinations for:
55.82 s
[pathway-internal] - Data.Path.Internal.Relativity.Rep_Relativity
55.82 s
[pathway-internal] Warning: Data.Path.Internal.Type: could not find link destinations for:
55.82 s
[pathway-internal] - Data.Path.Internal.Type.Rep_Type
55.83 s
[pathway-internal] Warning: Data.Path.Internal: could not find link destinations for:
55.83 s
[pathway-internal] - Data.Path.Internal.Rep_Path
55.83 s
[pathway-internal] - Data.Path.Internal.Rep1_Path
55.83 s
[pathway-internal] - Data.Path.Internal.Rep_List
59.12 s
[recursion-schemes] Documentation created: dist/doc/html/recursion-schemes/,
59.12 s
[recursion-schemes] dist/doc/html/recursion-schemes/recursion-schemes.txt
59.19 s
[recursion-schemes] Preprocessing test suite 'Expr' for recursion-schemes-5.2.3..
59.19 s
[recursion-schemes] Phase: installPhase
59.24 s
[recursion-schemes] Installing library in /nix/store/hn3qs7c7fmk67pfa3wybzbdgl80578b3-recursion-schemes-5.2.3/lib/ghc-9.8.4/lib/x86_64-linux-ghc-9.8.4/recursion-schemes-5.2.3-KT2wZ2Gxb9fJwEX7AnAqNL
59.40 s
[pathway-internal] Documentation created: dist/doc/html/pathway-internal/,
59.40 s
[pathway-internal] dist/doc/html/pathway-internal/pathway-internal.txt
59.45 s
[pathway-internal] Preprocessing test suite 'doctests' for pathway-internal-0.0.1.0..
59.46 s
[pathway-internal] Phase: installPhase
59.53 s
[pathway-internal] Installing library in /nix/store/i9h58y5xs8nfs1xzwbzavrix2ydm8b2x-pathway-internal-0.0.1.0/lib/ghc-9.8.4/lib/x86_64-linux-ghc-9.8.4/pathway-internal-0.0.1.0-Lnjdb2M8cxN196wSdsfQUK
59.57 s
[recursion-schemes] Phase: fixupPhase
59.59 s
[recursion-schemes] shrinking RPATHs of ELF executables and libraries in /nix/store/hn3qs7c7fmk67pfa3wybzbdgl80578b3-recursion-schemes-5.2.3
59.59 s
[recursion-schemes] shrinking /nix/store/hn3qs7c7fmk67pfa3wybzbdgl80578b3-recursion-schemes-5.2.3/lib/ghc-9.8.4/lib/x86_64-linux-ghc-9.8.4/libHSrecursion-schemes-5.2.3-KT2wZ2Gxb9fJwEX7AnAqNL-ghc9.8.4.so
59.61 s
[recursion-schemes] checking for references to /build/ in /nix/store/hn3qs7c7fmk67pfa3wybzbdgl80578b3-recursion-schemes-5.2.3...
59.63 s
[recursion-schemes] patching script interpreter paths in /nix/store/hn3qs7c7fmk67pfa3wybzbdgl80578b3-recursion-schemes-5.2.3
59.64 s
[recursion-schemes] stripping (with command strip and flags -S -p) in /nix/store/hn3qs7c7fmk67pfa3wybzbdgl80578b3-recursion-schemes-5.2.3/lib
59.76 s
[recursion-schemes] shrinking RPATHs of ELF executables and libraries in /nix/store/hbb4ay0gw2b8axwlzxwd2vkn37iv9xln-recursion-schemes-5.2.3-doc
59.77 s
[recursion-schemes] checking for references to /build/ in /nix/store/hbb4ay0gw2b8axwlzxwd2vkn37iv9xln-recursion-schemes-5.2.3-doc...
59.79 s
[pathway-internal] Phase: fixupPhase
59.79 s
[recursion-schemes] patching script interpreter paths in /nix/store/hbb4ay0gw2b8axwlzxwd2vkn37iv9xln-recursion-schemes-5.2.3-doc
59.81 s
[pathway-internal] shrinking RPATHs of ELF executables and libraries in /nix/store/i9h58y5xs8nfs1xzwbzavrix2ydm8b2x-pathway-internal-0.0.1.0
59.81 s
[pathway-internal] shrinking /nix/store/i9h58y5xs8nfs1xzwbzavrix2ydm8b2x-pathway-internal-0.0.1.0/lib/ghc-9.8.4/lib/x86_64-linux-ghc-9.8.4/libHSpathway-internal-0.0.1.0-Lnjdb2M8cxN196wSdsfQUK-ghc9.8.4.so
59.88 s
[recursion-schemes:post-build] Uploading to cachix cache "sellout": /nix/store/hbb4ay0gw2b8axwlzxwd2vkn37iv9xln-recursion-schemes-5.2.3-doc /nix/store/hn3qs7c7fmk67pfa3wybzbdgl80578b3-recursion-schemes-5.2.3
61.02 s
[recursion-schemes:post-build] Pushing 2 paths (108 are already present) using zstd to cache sellout ⏳
61.02 s
[recursion-schemes:post-build]
62.29 s
[recursion-schemes:post-build] Pushing /nix/store/hbb4ay0gw2b8axwlzxwd2vkn37iv9xln-recursion-schemes-5.2.3-doc (1.97 MiB)
62.58 s
[recursion-schemes:post-build] Pushing /nix/store/hn3qs7c7fmk67pfa3wybzbdgl80578b3-recursion-schemes-5.2.3 (6.71 MiB)
64.78 s
[recursion-schemes:post-build]
64.78 s
[recursion-schemes:post-build] All done.
64.80 s
[recursion-schemes:post-build] Uploading to the NixCI cache: /nix/store/hbb4ay0gw2b8axwlzxwd2vkn37iv9xln-recursion-schemes-5.2.3-doc /nix/store/hn3qs7c7fmk67pfa3wybzbdgl80578b3-recursion-schemes-5.2.3
64.85 s
[recursion-schemes:post-build] warning: 'warn-short-path-literals' is deprecated, use 'lint-short-path-literals = ignore' instead
65.16 s
[recursion-schemes:post-build] copying 2 paths...
65.16 s
[recursion-schemes:post-build] copying path '/nix/store/hbb4ay0gw2b8axwlzxwd2vkn37iv9xln-recursion-schemes-5.2.3-doc' to 'https://cache.nix-ci.com'...
65.49 s
[recursion-schemes:post-build] copying path '/nix/store/hn3qs7c7fmk67pfa3wybzbdgl80578b3-recursion-schemes-5.2.3' to 'https://cache.nix-ci.com'...
67.38 s
[recursion-schemes:post-build] warning: 'warn-short-path-literals' is deprecated, use 'lint-short-path-literals = ignore' instead
67.66 s
[recursion-schemes:post-build] copying 0 paths...
67.71 s
Uploaded recursion-schemes in 7.8s
67.71 s
Progress: 1 of 25 built (1 building), 164 of 164 downloaded from cache
67.71 s
Built recursion-schemes in 26.7s
67.72 s
Building /nix/store/x6acrry261r1lxxlv0rvrqpkkv4p2s1y-variant-1.0.2.drv
67.72 s
[pathway-internal] checking for references to /build/ in /nix/store/i9h58y5xs8nfs1xzwbzavrix2ydm8b2x-pathway-internal-0.0.1.0...
67.72 s
[pathway-internal] patching script interpreter paths in /nix/store/i9h58y5xs8nfs1xzwbzavrix2ydm8b2x-pathway-internal-0.0.1.0
67.72 s
[pathway-internal] stripping (with command strip and flags -S -p) in /nix/store/i9h58y5xs8nfs1xzwbzavrix2ydm8b2x-pathway-internal-0.0.1.0/lib
67.72 s
[pathway-internal] shrinking RPATHs of ELF executables and libraries in /nix/store/flalr1csy3bhgcnskvag3rz6z76hw69m-pathway-internal-0.0.1.0-doc
67.72 s
[pathway-internal] checking for references to /build/ in /nix/store/flalr1csy3bhgcnskvag3rz6z76hw69m-pathway-internal-0.0.1.0-doc...
67.72 s
[pathway-internal] patching script interpreter paths in /nix/store/flalr1csy3bhgcnskvag3rz6z76hw69m-pathway-internal-0.0.1.0-doc
67.79 s
[pathway-internal:post-build] Uploading to cachix cache "sellout": /nix/store/flalr1csy3bhgcnskvag3rz6z76hw69m-pathway-internal-0.0.1.0-doc /nix/store/i9h58y5xs8nfs1xzwbzavrix2ydm8b2x-pathway-internal-0.0.1.0
69.39 s
[pathway-internal:post-build] Pushing 2 paths (156 are already present) using zstd to cache sellout ⏳
69.39 s
[pathway-internal:post-build]
70.15 s
[pathway-internal:post-build] Pushing /nix/store/flalr1csy3bhgcnskvag3rz6z76hw69m-pathway-internal-0.0.1.0-doc (612.95 KiB)
70.24 s
[pathway-internal:post-build] Pushing /nix/store/i9h58y5xs8nfs1xzwbzavrix2ydm8b2x-pathway-internal-0.0.1.0 (2.04 MiB)
72.25 s
[pathway-internal:post-build]
72.25 s
[pathway-internal:post-build] All done.
72.26 s
[pathway-internal:post-build] Uploading to the NixCI cache: /nix/store/flalr1csy3bhgcnskvag3rz6z76hw69m-pathway-internal-0.0.1.0-doc /nix/store/i9h58y5xs8nfs1xzwbzavrix2ydm8b2x-pathway-internal-0.0.1.0
72.30 s
[pathway-internal:post-build] warning: 'warn-short-path-literals' is deprecated, use 'lint-short-path-literals = ignore' instead
72.32 s
[pathway-internal:post-build] copying 2 paths...
72.32 s
[pathway-internal:post-build] copying path '/nix/store/flalr1csy3bhgcnskvag3rz6z76hw69m-pathway-internal-0.0.1.0-doc' to 'https://cache.nix-ci.com'...
72.85 s
[pathway-internal:post-build] copying path '/nix/store/i9h58y5xs8nfs1xzwbzavrix2ydm8b2x-pathway-internal-0.0.1.0' to 'https://cache.nix-ci.com'...
73.62 s
[pathway-internal:post-build] warning: 'warn-short-path-literals' is deprecated, use 'lint-short-path-literals = ignore' instead
73.96 s
[pathway-internal:post-build] copying 1 paths...
73.96 s
[pathway-internal:post-build] copying path '/nix/store/djnzzldpqxr7c5mn0fqfifwsapi6l6s2-pathway-internal-0.0.1.0.drv' to 'https://cache.nix-ci.com'...
74.24 s
Uploaded pathway-internal in 6.4s
74.24 s
Progress: 2 of 25 built (1 building), 164 of 164 downloaded from cache
74.24 s
Built pathway-internal in 31.0s
74.29 s
Building /nix/store/irspgilfr6aa952vk0yjyars9lj03vzj-pathway-quickcheck-0.0.1.0.drv
74.29 s
[variant] Phase: setupCompilerEnvironmentPhase
74.29 s
[variant] Build with /nix/store/7r9b0bl984hdgd70nf5p8raa55kml491-ghc-9.8.4.
74.29 s
[variant] Phase: unpackPhase
74.29 s
[variant] unpacking source archive /nix/store/ywxqzfscvssw7qcpd0arvv7sam2661yd-variant-1.0.2.tar.gz
74.29 s
[variant] source root is variant-1.0.2
74.29 s
[variant] setting SOURCE_DATE_EPOCH to timestamp 1000000000 of file "variant-1.0.2/variant.cabal"
74.29 s
[variant] Phase: patchPhase
74.29 s
[variant] Phase: compileBuildDriverPhase
74.29 s
[variant] setupCompileFlags: -package-db=/build/tmp.pN27Iu2kCT/setup-package.conf.d -threaded
74.29 s
[variant] [1 of 2] Compiling Main ( /nix/store/4mdp8nhyfddh7bllbi7xszz7k9955n79-Setup.hs, /build/tmp.pN27Iu2kCT/Main.o )
74.29 s
[variant] [2 of 2] Linking Setup
74.29 s
[variant] Phase: updateAutotoolsGnuConfigScriptsPhase
74.29 s
[variant] Phase: configurePhase
74.29 s
[variant] configureFlags: --verbose --prefix=/nix/store/i2780hl1zwwjcb5g9izvmg3qjws6cmxv-variant-1.0.2 --libdir=$prefix/lib/$compiler/lib --libsubdir=$abi/$libname --docdir=/nix/store/rifkcj39cwaw8glx7cxpjr2h6iw9lca7-variant-1.0.2-doc/share/doc/variant-1.0.2 --with-gcc=gcc --package-db=/build/tmp.pN27Iu2kCT/package.conf.d --ghc-option=-j16 --ghc-option=+RTS --ghc-option=-A64M --ghc-option=-RTS --enable-library-profiling --profiling-detail=exported-functions --disable-profiling --enable-shared --disable-coverage --enable-static --disable-executable-dynamic --enable-tests --disable-benchmarks --enable-library-vanilla --disable-library-for-ghci --enable-split-sections --enable-library-stripping --enable-executable-stripping --ghc-option=-haddock --extra-lib-dirs=/nix/store/pndhkk0l649lm1sj0mxk7cbwq26qd1ra-ncurses-6.6/lib --extra-lib-dirs=/nix/store/0djlg4g0b81w94k3vcaqsxsc2hh4kism-libffi-3.5.2/lib --extra-lib-dirs=/nix/store/md4paia7riiggyrj8p24c7a6vf8w7jz8-elfutils-0.194/lib --extra-lib-dirs=/nix/store/39vv2pf64gd8li48a4hpbhw2crzd8z5p-gmp-with-cxx-6.3.0/lib --extra-lib-dirs=/nix/store/7wwvald8lapkrsr72qanlw8blyn55ifx-numactl-2.0.18/lib
74.29 s
[variant] Using Parsec parser
74.29 s
[variant] Configuring variant-1.0.2...
74.29 s
[variant] Flags chosen: unliftio=True
74.29 s
[variant] Dependency base >=4.9 && <5: using base-4.19.2.0
74.29 s
[variant] Dependency deepseq: using deepseq-1.5.1.0
74.29 s
[variant] Dependency exceptions >=0.9: using exceptions-0.10.7
74.29 s
[variant] Dependency mtl >=2.2: using mtl-2.3.1
74.29 s
[variant] Dependency recursion-schemes: using recursion-schemes-5.2.3
74.29 s
[variant] Dependency template-haskell: using template-haskell-2.21.0.0
74.29 s
[variant] Dependency transformers: using transformers-0.6.1.0
74.29 s
[variant] Dependency unliftio-core >=0.2: using unliftio-core-0.2.1.0
74.29 s
[variant] Dependency base >=4.9 && <5.0: using base-4.19.2.0
74.29 s
[variant] Dependency tasty >=0.11: using tasty-1.5.4
74.29 s
[variant] Dependency tasty-quickcheck >=0.8: using tasty-quickcheck-0.11.1
74.29 s
[variant] Dependency variant: using variant-1.0.2
74.29 s
[variant] Source component graph:
74.29 s
[variant] component lib
74.29 s
[variant] component test:tests dependency lib
74.29 s
[variant] Configured component graph:
74.29 s
[variant] component variant-1.0.2-LM0Un02zMMi4aizfZ11g92
74.29 s
[variant] include base-4.19.2.0-934f
74.29 s
[variant] include deepseq-1.5.1.0-edc7
74.29 s
[variant] include exceptions-0.10.7-2ac1
74.29 s
[variant] include mtl-2.3.1-bed0
74.29 s
[variant] include recursion-schemes-5.2.3-KT2wZ2Gxb9fJwEX7AnAqNL
74.29 s
[variant] include template-haskell-2.21.0.0-eecb
74.29 s
[variant] include transformers-0.6.1.0-81ea
74.29 s
[variant] include unliftio-core-0.2.1.0-3OotqyvxrF9GH2meZqAlpP
74.29 s
[variant] component variant-1.0.2-E8czfI49fhX8PNRR0MB5O6-tests
74.29 s
[variant] include base-4.19.2.0-934f
74.29 s
[variant] include tasty-1.5.4-B8x2LWNTQtc1nIy4jAtOlo
74.29 s
[variant] include tasty-quickcheck-0.11.1-HuQ6Ep7c2CE3D4OCJ9pZtL
74.29 s
[variant] include variant-1.0.2-LM0Un02zMMi4aizfZ11g92
74.29 s
[variant] Linked component graph:
74.29 s
[variant] unit variant-1.0.2-LM0Un02zMMi4aizfZ11g92
74.29 s
[variant] include base-4.19.2.0-934f
74.29 s
[variant] include deepseq-1.5.1.0-edc7
74.29 s
[variant] include exceptions-0.10.7-2ac1
74.29 s
[variant] include mtl-2.3.1-bed0
74.29 s
[variant] include recursion-schemes-5.2.3-KT2wZ2Gxb9fJwEX7AnAqNL
74.29 s
[variant] include template-haskell-2.21.0.0-eecb
74.29 s
[variant] include transformers-0.6.1.0-81ea
74.29 s
[variant] include unliftio-core-0.2.1.0-3OotqyvxrF9GH2meZqAlpP
74.29 s
[variant] Data.Variant=variant-1.0.2-LM0Un02zMMi4aizfZ11g92:Data.Variant,Data.Variant.ContFlow=variant-1.0.2-LM0Un02zMMi4aizfZ11g92:Data.Variant.ContFlow,Data.Variant.EADT=variant-1.0.2-LM0Un02zMMi4aizfZ11g92:Data.Variant.EADT,Data.Variant.EADT.TH=variant-1.0.2-LM0Un02zMMi4aizfZ11g92:Data.Variant.EADT.TH,Data.Variant.EGADT=variant-1.0.2-LM0Un02zMMi4aizfZ11g92:Data.Variant.EGADT,Data.Variant.Excepts=variant-1.0.2-LM0Un02zMMi4aizfZ11g92:Data.Variant.Excepts,Data.Variant.Functor=variant-1.0.2-LM0Un02zMMi4aizfZ11g92:Data.Variant.Functor,Data.Variant.Syntax=variant-1.0.2-LM0Un02zMMi4aizfZ11g92:Data.Variant.Syntax,Data.Variant.Tuple=variant-1.0.2-LM0Un02zMMi4aizfZ11g92:Data.Variant.Tuple,Data.Variant.Types=variant-1.0.2-LM0Un02zMMi4aizfZ11g92:Data.Variant.Types,Data.Variant.VEither=variant-1.0.2-LM0Un02zMMi4aizfZ11g92:Data.Variant.VEither,Data.Variant.VariantF=variant-1.0.2-LM0Un02zMMi4aizfZ11g92:Data.Variant.VariantF
74.29 s
[variant] unit variant-1.0.2-E8czfI49fhX8PNRR0MB5O6-tests
74.29 s
[variant] include base-4.19.2.0-934f
74.29 s
[variant] include tasty-1.5.4-B8x2LWNTQtc1nIy4jAtOlo
74.29 s
[variant] include tasty-quickcheck-0.11.1-HuQ6Ep7c2CE3D4OCJ9pZtL
74.29 s
[variant] include variant-1.0.2-LM0Un02zMMi4aizfZ11g92
74.29 s
[variant] Ready component graph:
74.29 s
[variant] definite variant-1.0.2-LM0Un02zMMi4aizfZ11g92
74.29 s
[variant] depends base-4.19.2.0-934f
74.29 s
[variant] depends deepseq-1.5.1.0-edc7
74.29 s
[variant] depends exceptions-0.10.7-2ac1
74.29 s
[variant] depends mtl-2.3.1-bed0
74.29 s
[variant] depends recursion-schemes-5.2.3-KT2wZ2Gxb9fJwEX7AnAqNL
74.29 s
[variant] depends template-haskell-2.21.0.0-eecb
74.29 s
[variant] depends transformers-0.6.1.0-81ea
74.29 s
[variant] depends unliftio-core-0.2.1.0-3OotqyvxrF9GH2meZqAlpP
74.29 s
[variant] definite variant-1.0.2-E8czfI49fhX8PNRR0MB5O6-tests
74.29 s
[variant] depends base-4.19.2.0-934f
74.29 s
[variant] depends tasty-1.5.4-B8x2LWNTQtc1nIy4jAtOlo
74.29 s
[variant] depends tasty-quickcheck-0.11.1-HuQ6Ep7c2CE3D4OCJ9pZtL
74.29 s
[variant] depends variant-1.0.2-LM0Un02zMMi4aizfZ11g92
74.29 s
[variant] Using Cabal-3.10.3.0 compiled by ghc-9.8
74.29 s
[variant] Using compiler: ghc-9.8.4
74.29 s
[variant] Using install prefix:
74.29 s
[variant] /nix/store/i2780hl1zwwjcb5g9izvmg3qjws6cmxv-variant-1.0.2
74.29 s
[variant] Executables installed in:
74.29 s
[variant] /nix/store/i2780hl1zwwjcb5g9izvmg3qjws6cmxv-variant-1.0.2/bin
74.29 s
[variant] Libraries installed in:
74.29 s
[variant] /nix/store/i2780hl1zwwjcb5g9izvmg3qjws6cmxv-variant-1.0.2/lib/ghc-9.8.4/lib/x86_64-linux-ghc-9.8.4/variant-1.0.2-LM0Un02zMMi4aizfZ11g92
74.29 s
[variant] Dynamic Libraries installed in:
74.29 s
[variant] /nix/store/i2780hl1zwwjcb5g9izvmg3qjws6cmxv-variant-1.0.2/lib/ghc-9.8.4/lib/x86_64-linux-ghc-9.8.4
74.29 s
[variant] Private executables installed in:
74.29 s
[variant] /nix/store/i2780hl1zwwjcb5g9izvmg3qjws6cmxv-variant-1.0.2/libexec/x86_64-linux-ghc-9.8.4/variant-1.0.2
74.29 s
[variant] Data files installed in:
74.29 s
[variant] /nix/store/i2780hl1zwwjcb5g9izvmg3qjws6cmxv-variant-1.0.2/share/x86_64-linux-ghc-9.8.4/variant-1.0.2
74.29 s
[variant] Documentation installed in:
74.29 s
[variant] /nix/store/rifkcj39cwaw8glx7cxpjr2h6iw9lca7-variant-1.0.2-doc/share/doc/variant-1.0.2
74.29 s
[variant] Configuration files installed in:
74.29 s
[variant] /nix/store/i2780hl1zwwjcb5g9izvmg3qjws6cmxv-variant-1.0.2/etc
74.29 s
[variant] No alex found
74.29 s
[variant] Using ar found on system at:
74.29 s
[variant] /nix/store/zjraf40s86y3iwhp626b934r5y6ldkbb-binutils-wrapper-2.46/bin/ar
74.29 s
[variant] No c2hs found
74.29 s
[variant] No cpphs found
74.29 s
[variant] No doctest found
74.29 s
[variant] Using gcc version 15.2.0 given by user at:
74.29 s
[variant] /nix/store/29qjlshvklnyr67nhpprzgb9igmsfsjj-gcc-wrapper-15.2.0/bin/gcc
74.29 s
[variant] Using ghc version 9.8.4 found on system at:
74.29 s
[variant] /nix/store/7r9b0bl984hdgd70nf5p8raa55kml491-ghc-9.8.4/bin/ghc
74.29 s
[variant] Using ghc-pkg version 9.8.4 found on system at:
74.29 s
[variant] /nix/store/7r9b0bl984hdgd70nf5p8raa55kml491-ghc-9.8.4/bin/ghc-pkg-9.8.4
74.29 s
[variant] No ghcjs found
74.29 s
[variant] No ghcjs-pkg found
74.29 s
[variant] No greencard found
74.29 s
[variant] Using haddock version 2.30.0 found on system at:
74.29 s
[variant] /nix/store/7r9b0bl984hdgd70nf5p8raa55kml491-ghc-9.8.4/bin/haddock-ghc-9.8.4
74.29 s
[variant] No happy found
74.29 s
[variant] Using haskell-suite found on system at: haskell-suite-dummy-location
74.29 s
[variant] Using haskell-suite-pkg found on system at: haskell-suite-pkg-dummy-location
74.29 s
[variant] No hmake found
74.29 s
[variant] Using hpc version 0.69 found on system at:
74.29 s
[variant] /nix/store/7r9b0bl984hdgd70nf5p8raa55kml491-ghc-9.8.4/bin/hpc-ghc-9.8.4
74.29 s
[variant] Using hsc2hs version 0.68.10 found on system at:
74.29 s
[variant] /nix/store/7r9b0bl984hdgd70nf5p8raa55kml491-ghc-9.8.4/bin/hsc2hs-ghc-9.8.4
74.29 s
[variant] Using hscolour version 1.25 found on system at:
74.29 s
[variant] /nix/store/awnxn98rlw62rrjwli6d2lb4d27mrzzw-hscolour-1.25/bin/HsColour
74.29 s
[variant] No jhc found
74.29 s
[variant] Using ld found on system at:
74.29 s
[variant] /nix/store/zjraf40s86y3iwhp626b934r5y6ldkbb-binutils-wrapper-2.46/bin/ld.gold
74.29 s
[variant] No pkg-config found
74.29 s
[variant] Using runghc version 9.8.4 found on system at:
74.29 s
[variant] /nix/store/7r9b0bl984hdgd70nf5p8raa55kml491-ghc-9.8.4/bin/runghc-9.8.4
74.29 s
[variant] Using strip version 2.46 found on system at:
74.29 s
[variant] /nix/store/29qjlshvklnyr67nhpprzgb9igmsfsjj-gcc-wrapper-15.2.0/bin/strip
74.29 s
[variant] Using tar found on system at:
74.29 s
[variant] /nix/store/z5mq2sam4484prf3kv6v6vjw1m0i7j24-gnutar-1.35/bin/tar
74.29 s
[variant] No uhc found
74.29 s
[variant] Phase: buildPhase
74.29 s
[variant] Preprocessing library for variant-1.0.2..
74.29 s
[variant] Building library for variant-1.0.2..
74.29 s
[variant] [ 1 of 12] Compiling Data.Variant.Functor ( src/lib/Data/Variant/Functor.hs, dist/build/Data/Variant/Functor.o, dist/build/Data/Variant/Functor.dyn_o )
74.29 s
[variant] [ 2 of 12] Compiling Data.Variant.Types ( src/lib/Data/Variant/Types.hs, dist/build/Data/Variant/Types.o, dist/build/Data/Variant/Types.dyn_o )
74.29 s
[variant] [ 3 of 12] Compiling Data.Variant.Tuple ( src/lib/Data/Variant/Tuple.hs, dist/build/Data/Variant/Tuple.o, dist/build/Data/Variant/Tuple.dyn_o )
74.29 s
[variant] [ 4 of 12] Compiling Data.Variant.ContFlow ( src/lib/Data/Variant/ContFlow.hs, dist/build/Data/Variant/ContFlow.o, dist/build/Data/Variant/ContFlow.dyn_o )
74.29 s
[variant] [ 5 of 12] Compiling Data.Variant ( src/lib/Data/Variant.hs, dist/build/Data/Variant.o, dist/build/Data/Variant.dyn_o )
74.29 s
[variant] [ 6 of 12] Compiling Data.Variant.Syntax ( src/lib/Data/Variant/Syntax.hs, dist/build/Data/Variant/Syntax.o, dist/build/Data/Variant/Syntax.dyn_o )
74.29 s
[variant] [ 7 of 12] Compiling Data.Variant.VEither ( src/lib/Data/Variant/VEither.hs, dist/build/Data/Variant/VEither.o, dist/build/Data/Variant/VEither.dyn_o )
74.29 s
[variant] [ 8 of 12] Compiling Data.Variant.Excepts ( src/lib/Data/Variant/Excepts.hs, dist/build/Data/Variant/Excepts.o, dist/build/Data/Variant/Excepts.dyn_o )
74.29 s
[variant] [ 9 of 12] Compiling Data.Variant.VariantF ( src/lib/Data/Variant/VariantF.hs, dist/build/Data/Variant/VariantF.o, dist/build/Data/Variant/VariantF.dyn_o )
74.29 s
[variant] [10 of 12] Compiling Data.Variant.EGADT ( src/lib/Data/Variant/EGADT.hs, dist/build/Data/Variant/EGADT.o, dist/build/Data/Variant/EGADT.dyn_o )
74.29 s
[variant] [11 of 12] Compiling Data.Variant.EADT ( src/lib/Data/Variant/EADT.hs, dist/build/Data/Variant/EADT.o, dist/build/Data/Variant/EADT.dyn_o )
74.29 s
[variant] [12 of 12] Compiling Data.Variant.EADT.TH ( src/lib/Data/Variant/EADT/TH.hs, dist/build/Data/Variant/EADT/TH.o, dist/build/Data/Variant/EADT/TH.dyn_o )
74.49 s
[pathway-quickcheck] Phase: setupCompilerEnvironmentPhase
74.50 s
[pathway-quickcheck] Build with /nix/store/7r9b0bl984hdgd70nf5p8raa55kml491-ghc-9.8.4.
74.62 s
[variant] [ 1 of 12] Compiling Data.Variant.Functor ( src/lib/Data/Variant/Functor.hs, dist/build/Data/Variant/Functor.p_o )
74.82 s
[pathway-quickcheck] Phase: unpackPhase
74.83 s
[pathway-quickcheck] unpacking source archive /nix/store/2gf0ac3fqqad1lv7r6jqyw4vqvkqcw0q-quickcheck
74.84 s
[pathway-quickcheck] source root is quickcheck
74.85 s
[pathway-quickcheck] Phase: patchPhase
74.86 s
[pathway-quickcheck] Phase: compileBuildDriverPhase
74.87 s
[pathway-quickcheck] setupCompileFlags: -package-db=/build/tmp.3hoTb79yNm/setup-package.conf.d -threaded
74.92 s
[pathway-quickcheck] [1 of 2] Compiling Main ( Setup.hs, /build/tmp.3hoTb79yNm/Main.o )
74.94 s
[variant] [ 2 of 12] Compiling Data.Variant.Types ( src/lib/Data/Variant/Types.hs, dist/build/Data/Variant/Types.p_o )
74.94 s
[variant] [ 3 of 12] Compiling Data.Variant.Tuple ( src/lib/Data/Variant/Tuple.hs, dist/build/Data/Variant/Tuple.p_o )
74.97 s
[pathway-quickcheck] [2 of 2] Linking Setup
75.55 s
[variant] [ 4 of 12] Compiling Data.Variant.ContFlow ( src/lib/Data/Variant/ContFlow.hs, dist/build/Data/Variant/ContFlow.p_o )
75.73 s
[variant] [ 5 of 12] Compiling Data.Variant ( src/lib/Data/Variant.hs, dist/build/Data/Variant.p_o )
76.25 s
[pathway-quickcheck] Phase: updateAutotoolsGnuConfigScriptsPhase
76.26 s
[pathway-quickcheck] Phase: configurePhase
76.27 s
[pathway-quickcheck] configureFlags: --verbose --prefix=/nix/store/dhxk8mx04r2bmzypgamrb3d99ynai6wy-pathway-quickcheck-0.0.1.0 --libdir=$prefix/lib/$compiler/lib --libsubdir=$abi/$libname --docdir=/nix/store/9si5xl9n8081ywha52x0rly7af4wmlnv-pathway-quickcheck-0.0.1.0-doc/share/doc/pathway-quickcheck-0.0.1.0 --with-gcc=gcc --package-db=/build/tmp.3hoTb79yNm/package.conf.d --ghc-option=-j16 --ghc-option=+RTS --ghc-option=-A64M --ghc-option=-RTS --enable-library-profiling --profiling-detail=exported-functions --disable-profiling --enable-shared --disable-coverage --enable-static --disable-executable-dynamic --enable-tests --disable-benchmarks --enable-library-vanilla --disable-library-for-ghci --enable-split-sections --enable-library-stripping --enable-executable-stripping --ghc-option=-haddock --ghc-options=-Werror --extra-lib-dirs=/nix/store/pndhkk0l649lm1sj0mxk7cbwq26qd1ra-ncurses-6.6/lib --extra-lib-dirs=/nix/store/0djlg4g0b81w94k3vcaqsxsc2hh4kism-libffi-3.5.2/lib --extra-lib-dirs=/nix/store/md4paia7riiggyrj8p24c7a6vf8w7jz8-elfutils-0.194/lib --extra-lib-dirs=/nix/store/39vv2pf64gd8li48a4hpbhw2crzd8z5p-gmp-with-cxx-6.3.0/lib --extra-lib-dirs=/nix/store/7wwvald8lapkrsr72qanlw8blyn55ifx-numactl-2.0.18/lib --extra-lib-dirs=/nix/store/7r9b0bl984hdgd70nf5p8raa55kml491-ghc-9.8.4/lib
76.28 s
[pathway-quickcheck] Using Parsec parser
76.28 s
[pathway-quickcheck] Configuring pathway-quickcheck-0.0.1.0...
76.61 s
[pathway-quickcheck] Flags chosen: noisy-deprecations=True, verify-no-recursion=False
76.61 s
[pathway-quickcheck] Dependency QuickCheck >=2.14.2 && <2.15 || >=2.15.0 && <2.16 || >=2.16.0 &&
76.61 s
[pathway-quickcheck] <2.17 || >=2.17.1 && <2.18 || >=2.18.0 && <2.19: using QuickCheck-2.15.0.1
76.61 s
[pathway-quickcheck] Dependency base >=4.14.0 && <4.15 || >=4.15.0 && <4.16 || >=4.16.0 && <4.17 ||
76.61 s
[pathway-quickcheck] >=4.17.0 && <4.18 || >=4.18.0 && <4.19 || >=4.19.0 && <4.20 || >=4.20.0 &&
76.61 s
[pathway-quickcheck] <4.21 || >=4.21.0 && <4.22 || >=4.22.0 && <4.23: using base-4.19.2.0
76.61 s
[pathway-quickcheck] Dependency pathway-internal >=0.0.1 && <0.1: using pathway-internal-0.0.1.0
76.61 s
[pathway-quickcheck] Dependency quickcheck-instances >=0.3.26 && <0.5: using
76.61 s
[pathway-quickcheck] quickcheck-instances-0.3.33
76.61 s
[pathway-quickcheck] Dependency yaya >=0.6.2 && <0.7 || >=0.7.0 && <0.8: using yaya-0.6.2.3
76.61 s
[pathway-quickcheck] Dependency yaya-quickcheck >=0.2.0 && <0.3 || >=0.3.0 && <0.4 || >=1.0.0 &&
76.61 s
[pathway-quickcheck] <1.1: using yaya-quickcheck-0.2.0.3
76.61 s
[pathway-quickcheck] Dependency QuickCheck >=2.14.2 && <2.15 || >=2.15.0 && <2.16 || >=2.16.0 &&
76.61 s
[pathway-quickcheck] <2.17 || >=2.17.1 && <2.18 || >=2.18.0 && <2.19: using QuickCheck-2.15.0.1
76.61 s
[pathway-quickcheck] Dependency base >=4.14.0 && <4.15 || >=4.15.0 && <4.16 || >=4.16.0 && <4.17 ||
76.61 s
[pathway-quickcheck] >=4.17.0 && <4.18 || >=4.18.0 && <4.19 || >=4.19.0 && <4.20 || >=4.20.0 &&
76.61 s
[pathway-quickcheck] <4.21 || >=4.21.0 && <4.22 || >=4.22.0 && <4.23: using base-4.19.2.0
76.61 s
[pathway-quickcheck] Dependency doctest >=0.16.3 && <0.17 || >=0.18.1 && <0.19 || >=0.20.1 && <0.21
76.61 s
[pathway-quickcheck] || >=0.21.1 && <0.22 || >=0.22.2 && <0.23 || >=0.24.2 && <0.25 || >=0.25.0 &&
76.61 s
[pathway-quickcheck] <0.26: using doctest-0.24.3
76.61 s
[pathway-quickcheck] Dependency pathway-quickcheck: using pathway-quickcheck-0.0.1.0
76.97 s
[pathway-quickcheck] Source component graph:
76.97 s
[pathway-quickcheck] component lib
76.97 s
[pathway-quickcheck] component test:doctests dependency lib
76.97 s
[pathway-quickcheck] Configured component graph:
76.97 s
[pathway-quickcheck] component pathway-quickcheck-0.0.1.0-4oIbmpgZGhDoseg1psLQA
76.97 s
[pathway-quickcheck] include QuickCheck-2.15.0.1-LD31LrTXA1r25cYcwqMYw3
76.97 s
[pathway-quickcheck] include base-4.19.2.0-934f
76.97 s
[pathway-quickcheck] include pathway-internal-0.0.1.0-Lnjdb2M8cxN196wSdsfQUK
76.97 s
[pathway-quickcheck] include quickcheck-instances-0.3.33-84FJc7JoWWi5ZUPKjbcXI2
76.97 s
[pathway-quickcheck] include yaya-0.6.2.3-GccDDwL0TDlDZM8zUYiPLe
76.97 s
[pathway-quickcheck] include yaya-quickcheck-0.2.0.3-DWRb1wE3Ful50UBSwFzxpC
76.97 s
[pathway-quickcheck] component pathway-quickcheck-0.0.1.0-B9NgAHkYLYOBE5D5Wkzrb4-doctests
76.97 s
[pathway-quickcheck] include QuickCheck-2.15.0.1-LD31LrTXA1r25cYcwqMYw3
76.97 s
[pathway-quickcheck] include base-4.19.2.0-934f
76.97 s
[pathway-quickcheck] include doctest-0.24.3-1aDs7zEYV5r7raSsXr9TQC
76.97 s
[pathway-quickcheck] include pathway-quickcheck-0.0.1.0-4oIbmpgZGhDoseg1psLQA
76.97 s
[pathway-quickcheck] Linked component graph:
76.97 s
[pathway-quickcheck] unit pathway-quickcheck-0.0.1.0-4oIbmpgZGhDoseg1psLQA
76.97 s
[pathway-quickcheck] include QuickCheck-2.15.0.1-LD31LrTXA1r25cYcwqMYw3
76.97 s
[pathway-quickcheck] include base-4.19.2.0-934f
76.97 s
[pathway-quickcheck] include pathway-internal-0.0.1.0-Lnjdb2M8cxN196wSdsfQUK
76.97 s
[pathway-quickcheck] include quickcheck-instances-0.3.33-84FJc7JoWWi5ZUPKjbcXI2
76.97 s
[pathway-quickcheck] include yaya-0.6.2.3-GccDDwL0TDlDZM8zUYiPLe
76.97 s
[pathway-quickcheck] include yaya-quickcheck-0.2.0.3-DWRb1wE3Ful50UBSwFzxpC
76.97 s
[pathway-quickcheck] Test.Path.QuickCheck=pathway-quickcheck-0.0.1.0-4oIbmpgZGhDoseg1psLQA:Test.Path.QuickCheck
76.97 s
[pathway-quickcheck] unit pathway-quickcheck-0.0.1.0-B9NgAHkYLYOBE5D5Wkzrb4-doctests
76.97 s
[pathway-quickcheck] include QuickCheck-2.15.0.1-LD31LrTXA1r25cYcwqMYw3
76.97 s
[pathway-quickcheck] include base-4.19.2.0-934f
76.97 s
[pathway-quickcheck] include doctest-0.24.3-1aDs7zEYV5r7raSsXr9TQC
76.97 s
[pathway-quickcheck] include pathway-quickcheck-0.0.1.0-4oIbmpgZGhDoseg1psLQA
76.97 s
[pathway-quickcheck] Ready component graph:
76.97 s
[pathway-quickcheck] definite pathway-quickcheck-0.0.1.0-4oIbmpgZGhDoseg1psLQA
76.97 s
[pathway-quickcheck] depends QuickCheck-2.15.0.1-LD31LrTXA1r25cYcwqMYw3
76.97 s
[pathway-quickcheck] depends base-4.19.2.0-934f
76.97 s
[pathway-quickcheck] depends pathway-internal-0.0.1.0-Lnjdb2M8cxN196wSdsfQUK
76.97 s
[pathway-quickcheck] depends quickcheck-instances-0.3.33-84FJc7JoWWi5ZUPKjbcXI2
76.97 s
[pathway-quickcheck] depends yaya-0.6.2.3-GccDDwL0TDlDZM8zUYiPLe
76.97 s
[pathway-quickcheck] depends yaya-quickcheck-0.2.0.3-DWRb1wE3Ful50UBSwFzxpC
76.97 s
[pathway-quickcheck] definite pathway-quickcheck-0.0.1.0-B9NgAHkYLYOBE5D5Wkzrb4-doctests
76.97 s
[pathway-quickcheck] depends QuickCheck-2.15.0.1-LD31LrTXA1r25cYcwqMYw3
76.97 s
[pathway-quickcheck] depends base-4.19.2.0-934f
76.97 s
[pathway-quickcheck] depends doctest-0.24.3-1aDs7zEYV5r7raSsXr9TQC
76.97 s
[pathway-quickcheck] depends pathway-quickcheck-0.0.1.0-4oIbmpgZGhDoseg1psLQA
76.97 s
[pathway-quickcheck] Using Cabal-3.10.3.0 compiled by ghc-9.8
76.97 s
[pathway-quickcheck] Using compiler: ghc-9.8.4
76.97 s
[pathway-quickcheck] Using install prefix:
76.97 s
[pathway-quickcheck] /nix/store/dhxk8mx04r2bmzypgamrb3d99ynai6wy-pathway-quickcheck-0.0.1.0
76.97 s
[pathway-quickcheck] Executables installed in:
76.97 s
[pathway-quickcheck] /nix/store/dhxk8mx04r2bmzypgamrb3d99ynai6wy-pathway-quickcheck-0.0.1.0/bin
76.97 s
[pathway-quickcheck] Libraries installed in:
76.97 s
[pathway-quickcheck] /nix/store/dhxk8mx04r2bmzypgamrb3d99ynai6wy-pathway-quickcheck-0.0.1.0/lib/ghc-9.8.4/lib/x86_64-linux-ghc-9.8.4/pathway-quickcheck-0.0.1.0-4oIbmpgZGhDoseg1psLQA
76.97 s
[pathway-quickcheck] Dynamic Libraries installed in:
76.97 s
[pathway-quickcheck] /nix/store/dhxk8mx04r2bmzypgamrb3d99ynai6wy-pathway-quickcheck-0.0.1.0/lib/ghc-9.8.4/lib/x86_64-linux-ghc-9.8.4
76.97 s
[pathway-quickcheck] Private executables installed in:
76.97 s
[pathway-quickcheck] /nix/store/dhxk8mx04r2bmzypgamrb3d99ynai6wy-pathway-quickcheck-0.0.1.0/libexec/x86_64-linux-ghc-9.8.4/pathway-quickcheck-0.0.1.0
76.97 s
[pathway-quickcheck] Data files installed in:
76.97 s
[pathway-quickcheck] /nix/store/dhxk8mx04r2bmzypgamrb3d99ynai6wy-pathway-quickcheck-0.0.1.0/share/x86_64-linux-ghc-9.8.4/pathway-quickcheck-0.0.1.0
76.97 s
[pathway-quickcheck] Documentation installed in:
76.97 s
[pathway-quickcheck] /nix/store/9si5xl9n8081ywha52x0rly7af4wmlnv-pathway-quickcheck-0.0.1.0-doc/share/doc/pathway-quickcheck-0.0.1.0
76.97 s
[pathway-quickcheck] Configuration files installed in:
76.97 s
[pathway-quickcheck] /nix/store/dhxk8mx04r2bmzypgamrb3d99ynai6wy-pathway-quickcheck-0.0.1.0/etc
76.97 s
[pathway-quickcheck] No alex found
76.97 s
[pathway-quickcheck] Using ar found on system at:
76.97 s
[pathway-quickcheck] /nix/store/zjraf40s86y3iwhp626b934r5y6ldkbb-binutils-wrapper-2.46/bin/ar
76.97 s
[pathway-quickcheck] No c2hs found
76.97 s
[pathway-quickcheck] No cpphs found
76.97 s
[pathway-quickcheck] Using doctest version 0.24.3 found on system at:
76.97 s
[pathway-quickcheck] /nix/store/2y183b1vsybv0157vfr59yhdwjkpqfkn-doctest-0.24.3/bin/doctest
76.97 s
[pathway-quickcheck] Using gcc version 15.2.0 given by user at:
76.97 s
[pathway-quickcheck] /nix/store/29qjlshvklnyr67nhpprzgb9igmsfsjj-gcc-wrapper-15.2.0/bin/gcc
76.97 s
[pathway-quickcheck] Using ghc version 9.8.4 found on system at:
76.97 s
[pathway-quickcheck] /nix/store/7r9b0bl984hdgd70nf5p8raa55kml491-ghc-9.8.4/bin/ghc
76.97 s
[pathway-quickcheck] Using ghc-pkg version 9.8.4 found on system at:
76.97 s
[pathway-quickcheck] /nix/store/7r9b0bl984hdgd70nf5p8raa55kml491-ghc-9.8.4/bin/ghc-pkg-9.8.4
76.97 s
[pathway-quickcheck] No ghcjs found
76.97 s
[pathway-quickcheck] No ghcjs-pkg found
76.97 s
[pathway-quickcheck] No greencard found
76.97 s
[pathway-quickcheck] Using haddock version 2.30.0 found on system at:
76.97 s
[pathway-quickcheck] /nix/store/7r9b0bl984hdgd70nf5p8raa55kml491-ghc-9.8.4/bin/haddock-ghc-9.8.4
76.97 s
[pathway-quickcheck] No happy found
76.97 s
[pathway-quickcheck] Using haskell-suite found on system at: haskell-suite-dummy-location
76.97 s
[pathway-quickcheck] Using haskell-suite-pkg found on system at: haskell-suite-pkg-dummy-location
76.97 s
[pathway-quickcheck] No hmake found
76.97 s
[pathway-quickcheck] Using hpc version 0.69 found on system at:
76.97 s
[pathway-quickcheck] /nix/store/7r9b0bl984hdgd70nf5p8raa55kml491-ghc-9.8.4/bin/hpc-ghc-9.8.4
76.97 s
[pathway-quickcheck] Using hsc2hs version 0.68.10 found on system at:
76.97 s
[pathway-quickcheck] /nix/store/7r9b0bl984hdgd70nf5p8raa55kml491-ghc-9.8.4/bin/hsc2hs-ghc-9.8.4
76.97 s
[pathway-quickcheck] Using hscolour version 1.25 found on system at:
76.97 s
[pathway-quickcheck] /nix/store/awnxn98rlw62rrjwli6d2lb4d27mrzzw-hscolour-1.25/bin/HsColour
76.97 s
[pathway-quickcheck] No jhc found
76.97 s
[pathway-quickcheck] Using ld found on system at:
76.97 s
[pathway-quickcheck] /nix/store/zjraf40s86y3iwhp626b934r5y6ldkbb-binutils-wrapper-2.46/bin/ld.gold
76.97 s
[pathway-quickcheck] No pkg-config found
76.97 s
[pathway-quickcheck] Using runghc version 9.8.4 found on system at:
76.97 s
[pathway-quickcheck] /nix/store/7r9b0bl984hdgd70nf5p8raa55kml491-ghc-9.8.4/bin/runghc-9.8.4
76.97 s
[pathway-quickcheck] Using strip version 2.46 found on system at:
76.97 s
[pathway-quickcheck] /nix/store/29qjlshvklnyr67nhpprzgb9igmsfsjj-gcc-wrapper-15.2.0/bin/strip
76.97 s
[pathway-quickcheck] Using tar found on system at:
76.97 s
[pathway-quickcheck] /nix/store/z5mq2sam4484prf3kv6v6vjw1m0i7j24-gnutar-1.35/bin/tar
76.97 s
[pathway-quickcheck] No uhc found
77.41 s
[pathway-quickcheck] Phase: buildPhase
77.49 s
[pathway-quickcheck] Preprocessing library for pathway-quickcheck-0.0.1.0..
77.49 s
[pathway-quickcheck] Building library for pathway-quickcheck-0.0.1.0..
77.58 s
[pathway-quickcheck] [1 of 1] Compiling Test.Path.QuickCheck ( src/Test/Path/QuickCheck.hs, dist/build/Test/Path/QuickCheck.o, dist/build/Test/Path/QuickCheck.dyn_o )
77.88 s
[variant] [ 6 of 12] Compiling Data.Variant.Syntax ( src/lib/Data/Variant/Syntax.hs, dist/build/Data/Variant/Syntax.p_o )
77.94 s
[pathway-quickcheck] [1 of 1] Compiling Test.Path.QuickCheck ( src/Test/Path/QuickCheck.hs, dist/build/Test/Path/QuickCheck.p_o )
78.06 s
[variant] [ 7 of 12] Compiling Data.Variant.VEither ( src/lib/Data/Variant/VEither.hs, dist/build/Data/Variant/VEither.p_o )
78.23 s
[variant] [ 8 of 12] Compiling Data.Variant.Excepts ( src/lib/Data/Variant/Excepts.hs, dist/build/Data/Variant/Excepts.p_o )
78.88 s
[variant] [ 9 of 12] Compiling Data.Variant.VariantF ( src/lib/Data/Variant/VariantF.hs, dist/build/Data/Variant/VariantF.p_o )
78.88 s
[variant] [10 of 12] Compiling Data.Variant.EGADT ( src/lib/Data/Variant/EGADT.hs, dist/build/Data/Variant/EGADT.p_o )
78.88 s
[variant] [11 of 12] Compiling Data.Variant.EADT ( src/lib/Data/Variant/EADT.hs, dist/build/Data/Variant/EADT.p_o )
78.88 s
[variant] [12 of 12] Compiling Data.Variant.EADT.TH ( src/lib/Data/Variant/EADT/TH.hs, dist/build/Data/Variant/EADT/TH.p_o )
80.02 s
[pathway-quickcheck] Preprocessing test suite 'doctests' for pathway-quickcheck-0.0.1.0..
80.02 s
[pathway-quickcheck] Building test suite 'doctests' for pathway-quickcheck-0.0.1.0..
80.09 s
[pathway-quickcheck] [1 of 2] Compiling Build_doctests ( dist/build/doctests/autogen/Build_doctests.hs, dist/build/doctests/doctests-tmp/Build_doctests.o )
80.28 s
[pathway-quickcheck] [2 of 2] Compiling Main ( tests/doctests.hs, dist/build/doctests/doctests-tmp/Main.o )
80.31 s
[variant] Preprocessing test suite 'tests' for variant-1.0.2..
80.31 s
[variant] Building test suite 'tests' for variant-1.0.2..
80.38 s
[variant] [1 of 3] Compiling EADT ( src/tests/EADT.hs, dist/build/tests/tests-tmp/EADT.o )
80.55 s
[pathway-quickcheck] [3 of 3] Linking dist/build/doctests/doctests
81.18 s
[variant] [2 of 3] Compiling Variant ( src/tests/Variant.hs, dist/build/tests/tests-tmp/Variant.o )
81.36 s
[variant] [3 of 3] Compiling Main ( src/tests/Main.hs, dist/build/tests/tests-tmp/Main.o )
81.67 s
[variant] [4 of 4] Linking dist/build/tests/tests
82.67 s
[variant] Phase: checkPhase
82.70 s
[variant] Running 1 test suites...
82.70 s
[variant] Test suite tests: RUNNING...
82.72 s
[variant] utils-variant
82.72 s
[variant] Variant
82.72 s
[variant] get by index (match): OK
82.72 s
[variant] +++ OK, passed 100 tests.
82.72 s
[variant] get by index (dont' match): OK
82.72 s
[variant] +++ OK, passed 100 tests.
82.72 s
[variant] pattern V: set: OK
82.72 s
[variant] +++ OK, passed 100 tests.
82.72 s
[variant] pattern V: match: OK
82.72 s
[variant] +++ OK, passed 100 tests.
82.72 s
[variant] pattern V: match2: OK
82.72 s
[variant] +++ OK, passed 100 tests.
82.72 s
[variant] pattern V: type application: OK
82.72 s
[variant] +++ OK, passed 100 tests.
82.72 s
[variant] get by type (match): OK
82.72 s
[variant] +++ OK, passed 100 tests.
82.72 s
[variant] get by type (don't match): OK
82.72 s
[variant] +++ OK, passed 100 tests.
82.72 s
[variant] variant equality (match): OK
82.72 s
[variant] +++ OK, passed 100 tests.
82.72 s
[variant] variant equality (don't match): OK
82.72 s
[variant] +++ OK, passed 100 tests.
82.72 s
[variant] update by index (match): OK
82.72 s
[variant] +++ OK, passed 100 tests.
82.72 s
[variant] update by index (don't match): OK
82.72 s
[variant] +++ OK, passed 100 tests.
82.72 s
[variant] update by type (match): OK
82.72 s
[variant] +++ OK, passed 100 tests.
82.72 s
[variant] update by type (don't match): OK
82.72 s
[variant] +++ OK, passed 100 tests.
82.72 s
[variant] update/fold by index (match): OK
82.72 s
[variant] +++ OK, passed 100 tests.
82.72 s
[variant] update/fold by index (don't match): OK
82.72 s
[variant] +++ OK, passed 100 tests.
82.72 s
[variant] Convert single variant: OK
82.72 s
[variant] +++ OK, passed 100 tests.
82.72 s
[variant] Lift Either: Left: OK
82.72 s
[variant] +++ OK, passed 100 tests.
82.72 s
[variant] Lift Either: Right: OK
82.72 s
[variant] +++ OK, passed 100 tests.
82.72 s
[variant] To Either: Left: OK
82.72 s
[variant] +++ OK, passed 100 tests.
82.72 s
[variant] To Either: Right: OK
82.72 s
[variant] +++ OK, passed 100 tests.
82.72 s
[variant] popVariantHead (match): OK
82.72 s
[variant] +++ OK, passed 100 tests.
82.72 s
[variant] popVariantHead (don't match): OK
82.72 s
[variant] +++ OK, passed 100 tests.
82.72 s
[variant] popVariantAt (match): OK
82.72 s
[variant] +++ OK, passed 100 tests.
82.72 s
[variant] popVariantAt (don't match): OK
82.72 s
[variant] +++ OK, passed 100 tests.
82.72 s
[variant] popVariant (match): OK
82.72 s
[variant] +++ OK, passed 100 tests.
82.72 s
[variant] popVariant (match): OK
82.72 s
[variant] +++ OK, passed 100 tests.
82.72 s
[variant] popVariant (don't match): OK
82.72 s
[variant] +++ OK, passed 100 tests.
82.72 s
[variant] prependVariant: OK
82.72 s
[variant] +++ OK, passed 100 tests.
82.72 s
[variant] appendVariant: OK
82.72 s
[variant] +++ OK, passed 100 tests.
82.72 s
[variant] alterVariant: OK
82.72 s
[variant] +++ OK, passed 100 tests.
82.72 s
[variant] alterVariant: OK
82.72 s
[variant] +++ OK, passed 100 tests.
82.72 s
[variant] traverseVariant: OK
82.72 s
[variant] +++ OK, passed 100 tests.
82.72 s
[variant] traverseVariant: OK
82.72 s
[variant] +++ OK, passed 100 tests.
82.72 s
[variant] liftVariant: OK
82.72 s
[variant] +++ OK, passed 100 tests.
82.72 s
[variant] splitVariant: OK
82.72 s
[variant] +++ OK, passed 100 tests.
82.72 s
[variant] splitVariant2: OK
82.72 s
[variant] +++ OK, passed 100 tests.
82.72 s
[variant] toCont: OK
82.72 s
[variant] +++ OK, passed 100 tests.
82.72 s
[variant] EADT
82.72 s
[variant] eadtPattern: match: OK
82.72 s
[variant] +++ OK, passed 100 tests.
82.72 s
[variant] eadtInfixPattern: match: OK
82.72 s
[variant] +++ OK, passed 100 tests.
82.72 s
[variant] catamorphism: constraint: OK
82.72 s
[variant] +++ OK, passed 100 tests.
82.72 s
[variant] anamorphism: numbersTo: OK
82.72 s
[variant] +++ OK, passed 100 tests.
82.72 s
[variant] apomorphism: numbersToMin5: OK
82.72 s
[variant] +++ OK, passed 100 tests.
82.72 s
[variant]
82.72 s
[variant] All 43 tests passed (0.00s)
82.72 s
[variant] Test suite tests: PASS
82.72 s
[variant] Test suite logged to: dist/test/variant-1.0.2-tests.log
82.72 s
[variant] 1 of 1 test suites (1 of 1 test cases) passed.
82.73 s
[variant] Phase: haddockPhase
82.86 s
[variant] Preprocessing library for variant-1.0.2..
82.86 s
[variant] Running Haddock on library for variant-1.0.2..
82.92 s
[variant] Warning: --source-* options are ignored when --hyperlinked-source is enabled.
83.17 s
[variant] [ 1 of 12] Compiling Data.Variant.Functor ( src/lib/Data/Variant/Functor.hs, /build/ghc1212_0/ghc_20.o, /build/ghc1212_0/ghc_20.dyn_o )
84.72 s
[variant] [ 2 of 12] Compiling Data.Variant.Types ( src/lib/Data/Variant/Types.hs, /build/ghc1212_0/ghc_24.o, /build/ghc1212_0/ghc_24.dyn_o )
84.72 s
[variant] [ 3 of 12] Compiling Data.Variant.Tuple ( src/lib/Data/Variant/Tuple.hs, /build/ghc1212_0/ghc_22.o, /build/ghc1212_0/ghc_22.dyn_o )
84.72 s
[variant] [ 4 of 12] Compiling Data.Variant.ContFlow ( src/lib/Data/Variant/ContFlow.hs, /build/ghc1212_0/ghc_16.o, /build/ghc1212_0/ghc_16.dyn_o )
84.72 s
[variant] [ 5 of 12] Compiling Data.Variant ( src/lib/Data/Variant.hs, /build/ghc1212_0/ghc_14.o, /build/ghc1212_0/ghc_14.dyn_o )
84.73 s
[pathway-quickcheck] Phase: checkPhase
84.73 s
[pathway-quickcheck] Running 1 test suites...
84.73 s
[pathway-quickcheck] Test suite doctests: RUNNING...
84.73 s
[pathway-quickcheck]
84.73 s
[pathway-quickcheck] on the commandline: warning: [GHC-98887]
84.73 s
[pathway-quickcheck] -XTemplateHaskell is not allowed in Safe Haskell; ignoring -XTemplateHaskell
84.73 s
[pathway-quickcheck] Examples: 0 Tried: 0 Errors: 0 Failures: 0
84.73 s
[pathway-quickcheck] Test suite doctests: PASS
84.73 s
[pathway-quickcheck] Test suite logged to: dist/test/pathway-quickcheck-0.0.1.0-doctests.log
84.73 s
[pathway-quickcheck] 1 of 1 test suites (1 of 1 test cases) passed.
84.73 s
[pathway-quickcheck] Phase: haddockPhase
84.76 s
[pathway-quickcheck] Preprocessing library for pathway-quickcheck-0.0.1.0..
84.76 s
[pathway-quickcheck] Running Haddock on library for pathway-quickcheck-0.0.1.0..
84.76 s
[pathway-quickcheck] Warning: The documentation for the following packages are not installed. No
84.76 s
[pathway-quickcheck] links will be generated to these packages: vector-0.13.2.0
84.81 s
[pathway-quickcheck] Warning: --source-* options are ignored when --hyperlinked-source is enabled.
84.96 s
[pathway-quickcheck] [1 of 1] Compiling Test.Path.QuickCheck ( src/Test/Path/QuickCheck.hs, nothing )
85.02 s
[variant] [ 6 of 12] Compiling Data.Variant.Syntax ( src/lib/Data/Variant/Syntax.hs, nothing )
85.02 s
[variant] [ 7 of 12] Compiling Data.Variant.VEither ( src/lib/Data/Variant/VEither.hs, nothing )
85.07 s
[variant] [ 8 of 12] Compiling Data.Variant.Excepts ( src/lib/Data/Variant/Excepts.hs, nothing )
85.15 s
[pathway-quickcheck] Haddock coverage:
85.15 s
[pathway-quickcheck] 0% ( 0 / 3) in 'Test.Path.QuickCheck'
85.15 s
[pathway-quickcheck] Missing documentation for:
85.15 s
[pathway-quickcheck] Module header
85.15 s
[pathway-quickcheck] arbitraryNonEmptyText (src/Test/Path/QuickCheck.hs:33)
85.15 s
[pathway-quickcheck] arbitraryPath (src/Test/Path/QuickCheck.hs:43)
85.25 s
[variant] [ 9 of 12] Compiling Data.Variant.VariantF ( src/lib/Data/Variant/VariantF.hs, /build/ghc1212_0/ghc_26.o, /build/ghc1212_0/ghc_26.dyn_o )
85.38 s
[variant] [10 of 12] Compiling Data.Variant.EGADT ( src/lib/Data/Variant/EGADT.hs, nothing )
85.39 s
[variant] [11 of 12] Compiling Data.Variant.EADT ( src/lib/Data/Variant/EADT.hs, /build/ghc1212_0/ghc_18.o, /build/ghc1212_0/ghc_18.dyn_o )
85.54 s
[variant] [12 of 12] Compiling Data.Variant.EADT.TH ( src/lib/Data/Variant/EADT/TH.hs, nothing )
85.56 s
[variant] Haddock coverage:
85.57 s
[variant] 40% ( 37 / 91) in 'Data.Variant.Functor'
85.57 s
[variant] Missing documentation for:
85.57 s
[variant] BottomUpT (src/lib/Data/Variant/Functor.hs:78)
85.57 s
[variant] BottomUpOrigT (src/lib/Data/Variant/Functor.hs:79)
85.57 s
[variant] TopDownStopT (src/lib/Data/Variant/Functor.hs:80)
85.57 s
[variant] distPara
85.57 s
[variant] distParaT
85.57 s
[variant] distCata
85.57 s
[variant] distAna
85.57 s
[variant] futu
85.57 s
[variant] gfutu
85.57 s
[variant] distFutu
85.57 s
[variant] distGFutu
85.57 s
[variant] zygo
85.57 s
[variant] distZygo
85.57 s
[variant] gzygo
85.57 s
[variant] distZygoT
85.57 s
[variant] gapo
85.57 s
[variant] distApo
85.57 s
[variant] distGApo
85.57 s
[variant] distGApoT
85.57 s
[variant] ghisto
85.57 s
[variant] distHisto
85.57 s
[variant] distGHisto
85.57 s
[variant] chrono
85.57 s
[variant] gchrono
85.57 s
[variant] Algebra (src/lib/Data/Variant/Functor.hs:106)
85.57 s
[variant] CoAlgebra (src/lib/Data/Variant/Functor.hs:107)
85.57 s
[variant] RAlgebra (src/lib/Data/Variant/Functor.hs:108)
85.57 s
[variant] RCoAlgebra (src/lib/Data/Variant/Functor.hs:109)
85.57 s
[variant] ~> (src/lib/Data/Variant/Functor.hs:117)
85.57 s
[variant] NatM (src/lib/Data/Variant/Functor.hs:118)
85.57 s
[variant] HBase (src/lib/Data/Variant/Functor.hs:120)
85.57 s
[variant] HAlgebra (src/lib/Data/Variant/Functor.hs:122)
85.57 s
[variant] HAlgebraM (src/lib/Data/Variant/Functor.hs:123)
85.57 s
[variant] HGAlgebra (src/lib/Data/Variant/Functor.hs:124)
85.57 s
[variant] HGAlgebraM (src/lib/Data/Variant/Functor.hs:125)
85.57 s
[variant] HCoalgebra (src/lib/Data/Variant/Functor.hs:127)
85.57 s
[variant] HCoalgebraM (src/lib/Data/Variant/Functor.hs:128)
85.57 s
[variant] HGCoalgebra (src/lib/Data/Variant/Functor.hs:129)
85.57 s
[variant] HGCoalgebraM (src/lib/Data/Variant/Functor.hs:130)
85.57 s
[variant] HFunctor (src/lib/Data/Variant/Functor.hs:132)
85.57 s
[variant] HFoldable (src/lib/Data/Variant/Functor.hs:135)
85.57 s
[variant] HTraversable (src/lib/Data/Variant/Functor.hs:138)
85.57 s
[variant] HRecursive (src/lib/Data/Variant/Functor.hs:141)
85.57 s
[variant] HCorecursive (src/lib/Data/Variant/Functor.hs:147)
85.57 s
[variant] hhylo (src/lib/Data/Variant/Functor.hs:154)
85.57 s
[variant] hcataM (src/lib/Data/Variant/Functor.hs:157)
85.57 s
[variant] hlambek (src/lib/Data/Variant/Functor.hs:160)
85.57 s
[variant] hpara (src/lib/Data/Variant/Functor.hs:163)
85.57 s
[variant] hparaM (src/lib/Data/Variant/Functor.hs:166)
85.57 s
[variant] hanaM (src/lib/Data/Variant/Functor.hs:169)
85.57 s
[variant] hcolambek (src/lib/Data/Variant/Functor.hs:172)
85.57 s
[variant] hapo (src/lib/Data/Variant/Functor.hs:175)
85.57 s
[variant] hapoM (src/lib/Data/Variant/Functor.hs:181)
85.57 s
[variant] hhyloM (src/lib/Data/Variant/Functor.hs:187)
85.57 s
[variant] Warning: 'a' is out of scope.
85.57 s
[variant] If you qualify the identifier, haddock can try to link it anyway.
85.57 s
[variant] Warning: 'l' is out of scope.
85.57 s
[variant] If you qualify the identifier, haddock can try to link it anyway.
85.57 s
[variant] 95% ( 23 / 24) in 'Data.Variant.Types'
85.57 s
[variant] Missing documentation for:
85.57 s
[variant] Module header
85.57 s
[variant] 88% ( 22 / 25) in 'Data.Variant.Tuple'
85.57 s
[variant] Missing documentation for:
85.57 s
[variant] TypeReps (src/lib/Data/Variant/Tuple.hs:535)
85.57 s
[variant] TupleTail (src/lib/Data/Variant/Tuple.hs:263)
85.57 s
[variant] TupleCons (src/lib/Data/Variant/Tuple.hs:288)
85.57 s
[variant] 90% ( 10 / 11) in 'Data.Variant.ContFlow'
85.57 s
[variant] Missing documentation for:
85.57 s
[variant] ToMultiCont (src/lib/Data/Variant/ContFlow.hs:78)
85.58 s
[variant] Warning: 'V' is ambiguous. It is defined
85.58 s
[variant] * at src/lib/Data/Variant.hs:635:1
85.58 s
[variant] * at src/lib/Data/Variant.hs:623:1
85.58 s
[variant] You may be able to disambiguate the identifier by qualifying it or
85.58 s
[variant] by specifying the type/value namespace explicitly.
85.58 s
[variant] Defaulting to the one defined at src/lib/Data/Variant.hs:623:1
85.58 s
[variant] Warning: 'variantToTuple' is out of scope.
85.58 s
[variant] If you qualify the identifier, haddock can try to link it anyway.
85.58 s
[variant] Warning: 'variantToHList' is out of scope.
85.58 s
[variant] If you qualify the identifier, haddock can try to link it anyway.
85.58 s
[variant] Warning: 'x' is out of scope.
85.58 s
[variant] If you qualify the identifier, haddock can try to link it anyway.
85.58 s
[variant] Warning: 'xs' is out of scope.
85.58 s
[variant] If you qualify the identifier, haddock can try to link it anyway.
85.59 s
[variant] 84% ( 73 / 86) in 'Data.Variant'
85.59 s
[variant] Missing documentation for:
85.59 s
[variant] ReplaceAll (src/lib/Data/Variant.hs:1325)
85.59 s
[variant] MapVariant (src/lib/Data/Variant.hs:1321)
85.59 s
[variant] AlterVariant (src/lib/Data/Variant.hs:1469)
85.59 s
[variant] TraverseVariant (src/lib/Data/Variant.hs:1510)
85.59 s
[variant] ReduceVariant (src/lib/Data/Variant.hs:1554)
85.59 s
[variant] Flattenable (src/lib/Data/Variant.hs:1660)
85.59 s
[variant] FlattenVariant (src/lib/Data/Variant.hs:1655)
85.59 s
[variant] ExtractM (src/lib/Data/Variant.hs:1684)
85.59 s
[variant] JoinVariant (src/lib/Data/Variant.hs:1688)
85.59 s
[variant] SplitVariant (src/lib/Data/Variant.hs:1128)
85.59 s
[variant] ContVariant (src/lib/Data/Variant.hs:1767)
85.59 s
[variant] liftVariant'
85.59 s
[variant] PopVariant (src/lib/Data/Variant.hs:1103)
85.59 s
[variant] Warning: 'V' is ambiguous. It is defined
85.59 s
[variant] * at src/lib/Data/Variant.hs:635:1
85.59 s
[variant] * at src/lib/Data/Variant.hs:623:1
85.59 s
[variant] You may be able to disambiguate the identifier by qualifying it or
85.59 s
[variant] by specifying the type/value namespace explicitly.
85.59 s
[variant] Defaulting to the one defined at src/lib/Data/Variant.hs:623:1
85.59 s
[variant] 25% ( 1 / 4) in 'Data.Variant.Syntax'
85.59 s
[variant] Missing documentation for:
85.59 s
[variant] >>= (src/lib/Data/Variant/Syntax.hs:102)
85.59 s
[variant] >> (src/lib/Data/Variant/Syntax.hs:105)
85.59 s
[variant] return (src/lib/Data/Variant/Syntax.hs:108)
85.59 s
[variant] Warning: 'VEither' is ambiguous. It is defined
85.59 s
[variant] * at src/lib/Data/Variant/VEither.hs:120:6
85.59 s
[variant] * at src/lib/Data/Variant/VEither.hs:119:1
85.59 s
[variant] You may be able to disambiguate the identifier by qualifying it or
85.59 s
[variant] by specifying the type/value namespace explicitly.
85.59 s
[variant] Defaulting to the one defined at src/lib/Data/Variant/VEither.hs:119:1
85.59 s
[variant] Warning: 'V' is ambiguous. It is defined
85.59 s
[variant] * at src/lib/Data/Variant.hs:635:1
85.59 s
[variant] * at src/lib/Data/Variant.hs:623:1
85.59 s
[variant] You may be able to disambiguate the identifier by qualifying it or
85.59 s
[variant] by specifying the type/value namespace explicitly.
85.59 s
[variant] Defaulting to the one defined at src/lib/Data/Variant.hs:623:1
85.59 s
[variant] 93% ( 15 / 16) in 'Data.Variant.VEither'
85.59 s
[variant] Missing documentation for:
85.59 s
[variant] VEitherLift (src/lib/Data/Variant/VEither.hs:253)
85.59 s
[variant] Warning: 'Excepts' is ambiguous. It is defined
85.59 s
[variant] * at src/lib/Data/Variant/Excepts.hs:145:26
85.59 s
[variant] * at src/lib/Data/Variant/Excepts.hs:145:1
85.59 s
[variant] You may be able to disambiguate the identifier by qualifying it or
85.59 s
[variant] by specifying the type/value namespace explicitly.
85.59 s
[variant] Defaulting to the one defined at src/lib/Data/Variant/Excepts.hs:145:1
85.59 s
[variant] 84% ( 28 / 33) in 'Data.Variant.Excepts'
85.59 s
[variant] Missing documentation for:
85.59 s
[variant] Excepts (src/lib/Data/Variant/Excepts.hs:145)
85.59 s
[variant] injectExcepts (src/lib/Data/Variant/Excepts.hs:164)
85.59 s
[variant] withExcepts (src/lib/Data/Variant/Excepts.hs:175)
85.59 s
[variant] withExcepts_ (src/lib/Data/Variant/Excepts.hs:168)
85.59 s
[variant] mapExcepts (src/lib/Data/Variant/Excepts.hs:186)
85.59 s
[variant] 65% ( 21 / 32) in 'Data.Variant.VariantF'
85.59 s
[variant] Missing documentation for:
85.59 s
[variant] appendVariantF (src/lib/Data/Variant/VariantF.hs:244)
85.59 s
[variant] prependVariantF (src/lib/Data/Variant/VariantF.hs:250)
85.59 s
[variant] MapVariantF (src/lib/Data/Variant/VariantF.hs:284)
85.59 s
[variant] PopVariantF (src/lib/Data/Variant/VariantF.hs:270)
85.59 s
[variant] SplitVariantF (src/lib/Data/Variant/VariantF.hs:307)
85.59 s
[variant] BottomUpF (src/lib/Data/Variant/VariantF.hs:357)
85.59 s
[variant] BottomUp (src/lib/Data/Variant/VariantF.hs:360)
85.59 s
[variant] BottomUpOrig (src/lib/Data/Variant/VariantF.hs:383)
85.59 s
[variant] BottomUpOrigF (src/lib/Data/Variant/VariantF.hs:380)
85.59 s
[variant] TopDownStop (src/lib/Data/Variant/VariantF.hs:407)
85.59 s
[variant] TopDownStopF (src/lib/Data/Variant/VariantF.hs:404)
85.59 s
[variant] 30% ( 3 / 10) in 'Data.Variant.EGADT'
85.59 s
[variant] Missing documentation for:
85.59 s
[variant] Module header
85.59 s
[variant] HVariantF (src/lib/Data/Variant/EGADT.hs:130)
85.59 s
[variant] toHVariantAt (src/lib/Data/Variant/EGADT.hs:138)
85.59 s
[variant] fromHVariantAt (src/lib/Data/Variant/EGADT.hs:145)
85.59 s
[variant] :<! (src/lib/Data/Variant/EGADT.hs:157)
85.59 s
[variant] MemberAtIndex (src/lib/Data/Variant/EGADT.hs:160)
85.59 s
[variant] :<<! (src/lib/Data/Variant/EGADT.hs:163)
85.59 s
[variant] Warning: 'x' is out of scope.
85.59 s
[variant] If you qualify the identifier, haddock can try to link it anyway.
85.59 s
[variant] Warning: 'xs' is out of scope.
85.59 s
[variant] If you qualify the identifier, haddock can try to link it anyway.
85.59 s
[variant] Warning: 'f' is out of scope.
85.59 s
[variant] If you qualify the identifier, haddock can try to link it anyway.
85.60 s
[variant] 93% ( 14 / 15) in 'Data.Variant.EADT'
85.60 s
[variant] Missing documentation for:
85.60 s
[variant] EADTShow (src/lib/Data/Variant/EADT.hs:182)
85.60 s
[variant] Warning: 'forall' is out of scope.
85.60 s
[variant] If you qualify the identifier, haddock can try to link it anyway.
85.60 s
[variant] 100% ( 5 / 5) in 'Data.Variant.EADT.TH'
85.84 s
[variant] Warning: Data.Variant.Functor: could not find link destinations for:
85.84 s
[variant] - Data.Functor.Foldable.GCoerce
85.84 s
[variant] Warning: Data.Variant.Types: could not find link destinations for:
85.84 s
[variant] - Data.Variant.Types.IndexesOf'
85.84 s
[variant] - Data.Variant.Types.MemberAtIndex
85.84 s
[variant] - Data.Variant.Types.MaybeIndexOf'
85.84 s
[variant] - Data.Variant.Types.IndexOf'
85.84 s
[variant] - Data.Variant.Types.Reverse'
85.84 s
[variant] - Data.Variant.Types.Nub'
85.84 s
[variant] - Data.Variant.Types.Product'
85.84 s
[variant] - Data.Variant.Types.Length'
85.84 s
[variant] - Data.Variant.Types.Index'
85.86 s
[variant] Warning: Data.Variant.Tuple: could not find link destinations for:
85.86 s
[variant] - GHC.Generics.Rep1_Solo
85.86 s
[variant] - GHC.Generics.Rep_Solo
85.86 s
[variant] - Data.Variant.Tuple.TupleFun
85.86 s
[variant] Warning: Data.Variant.ContFlow: could not find link destinations for:
85.86 s
[variant] - Data.Variant.D:R:MultiContTypesV
85.86 s
[variant] - Data.Variant.VariantF.D:R:MultiContTypesVariantF
85.86 s
[variant] - Data.Variant.EADT.D:R:MultiContTypesEADT
85.86 s
[variant] Warning: Data.Variant: could not find link destinations for:
85.86 s
[variant] - Data.Variant.Types.MemberAtIndex
85.86 s
[variant] - Data.Variant.toFlattenVariant
85.86 s
[variant] - Data.Variant.reduceVariant'
85.86 s
[variant] - Data.Variant.traverseVariant'
85.86 s
[variant] - Data.Variant.alterVariant'
85.86 s
[variant] - Data.Variant.MapVariantIndexes
85.86 s
[variant] - Data.Variant.splitVariant'
85.86 s
[variant] - Data.Variant.ShowTypeList
85.86 s
[variant] - Data.Variant.ShowVariantValue
85.86 s
[variant] - Data.Variant.D:R:MultiContTypesV
85.87 s
[variant] Warning: Data.Variant.VariantF: could not find link destinations for:
85.87 s
[variant] - Data.Variant.VariantF.D:R:MultiContTypesVariantF
85.87 s
[variant] Warning: Data.Variant.EADT: could not find link destinations for:
85.87 s
[variant] - Data.Variant.EADT.EADTF'
85.87 s
[variant] - Data.Variant.EADT.D:R:MultiContTypesEADT
88.51 s
[pathway-quickcheck] Documentation created: dist/doc/html/pathway-quickcheck/,
88.51 s
[pathway-quickcheck] dist/doc/html/pathway-quickcheck/pathway-quickcheck.txt
88.62 s
[pathway-quickcheck] Preprocessing test suite 'doctests' for pathway-quickcheck-0.0.1.0..
88.62 s
[pathway-quickcheck] Phase: installPhase
88.66 s
[pathway-quickcheck] Installing library in /nix/store/dhxk8mx04r2bmzypgamrb3d99ynai6wy-pathway-quickcheck-0.0.1.0/lib/ghc-9.8.4/lib/x86_64-linux-ghc-9.8.4/pathway-quickcheck-0.0.1.0-4oIbmpgZGhDoseg1psLQA
88.82 s
[variant] Documentation created: dist/doc/html/variant/,
88.82 s
[variant] dist/doc/html/variant/variant.txt
88.87 s
[variant] Preprocessing test suite 'tests' for variant-1.0.2..
88.88 s
[pathway-quickcheck] Phase: fixupPhase
88.88 s
[variant] Phase: installPhase
88.90 s
[pathway-quickcheck] shrinking RPATHs of ELF executables and libraries in /nix/store/dhxk8mx04r2bmzypgamrb3d99ynai6wy-pathway-quickcheck-0.0.1.0
88.90 s
[pathway-quickcheck] shrinking /nix/store/dhxk8mx04r2bmzypgamrb3d99ynai6wy-pathway-quickcheck-0.0.1.0/lib/ghc-9.8.4/lib/x86_64-linux-ghc-9.8.4/libHSpathway-quickcheck-0.0.1.0-4oIbmpgZGhDoseg1psLQA-ghc9.8.4.so
88.92 s
[pathway-quickcheck] checking for references to /build/ in /nix/store/dhxk8mx04r2bmzypgamrb3d99ynai6wy-pathway-quickcheck-0.0.1.0...
88.95 s
[variant] Installing library in /nix/store/i2780hl1zwwjcb5g9izvmg3qjws6cmxv-variant-1.0.2/lib/ghc-9.8.4/lib/x86_64-linux-ghc-9.8.4/variant-1.0.2-LM0Un02zMMi4aizfZ11g92
88.95 s
[pathway-quickcheck] patching script interpreter paths in /nix/store/dhxk8mx04r2bmzypgamrb3d99ynai6wy-pathway-quickcheck-0.0.1.0
88.96 s
[pathway-quickcheck] stripping (with command strip and flags -S -p) in /nix/store/dhxk8mx04r2bmzypgamrb3d99ynai6wy-pathway-quickcheck-0.0.1.0/lib
89.00 s
[pathway-quickcheck] shrinking RPATHs of ELF executables and libraries in /nix/store/9si5xl9n8081ywha52x0rly7af4wmlnv-pathway-quickcheck-0.0.1.0-doc
89.01 s
[pathway-quickcheck] checking for references to /build/ in /nix/store/9si5xl9n8081ywha52x0rly7af4wmlnv-pathway-quickcheck-0.0.1.0-doc...
89.03 s
[pathway-quickcheck] patching script interpreter paths in /nix/store/9si5xl9n8081ywha52x0rly7af4wmlnv-pathway-quickcheck-0.0.1.0-doc
89.12 s
[pathway-quickcheck:post-build] Uploading to cachix cache "sellout": /nix/store/9si5xl9n8081ywha52x0rly7af4wmlnv-pathway-quickcheck-0.0.1.0-doc /nix/store/dhxk8mx04r2bmzypgamrb3d99ynai6wy-pathway-quickcheck-0.0.1.0
90.43 s
[pathway-quickcheck:post-build] Pushing 2 paths (182 are already present) using zstd to cache sellout ⏳
90.43 s
[pathway-quickcheck:post-build]
91.24 s
[pathway-quickcheck:post-build] Pushing /nix/store/9si5xl9n8081ywha52x0rly7af4wmlnv-pathway-quickcheck-0.0.1.0-doc (217.95 KiB)
91.24 s
[pathway-quickcheck:post-build] Pushing /nix/store/dhxk8mx04r2bmzypgamrb3d99ynai6wy-pathway-quickcheck-0.0.1.0 (179.67 KiB)
93.37 s
[pathway-quickcheck:post-build]
93.37 s
[pathway-quickcheck:post-build] All done.
93.39 s
[pathway-quickcheck:post-build] Uploading to the NixCI cache: /nix/store/9si5xl9n8081ywha52x0rly7af4wmlnv-pathway-quickcheck-0.0.1.0-doc /nix/store/dhxk8mx04r2bmzypgamrb3d99ynai6wy-pathway-quickcheck-0.0.1.0
93.43 s
[pathway-quickcheck:post-build] warning: 'warn-short-path-literals' is deprecated, use 'lint-short-path-literals = ignore' instead
93.44 s
[pathway-quickcheck:post-build] copying 2 paths...
93.44 s
[pathway-quickcheck:post-build] copying path '/nix/store/9si5xl9n8081ywha52x0rly7af4wmlnv-pathway-quickcheck-0.0.1.0-doc' to 'https://cache.nix-ci.com'...
93.90 s
[pathway-quickcheck:post-build] copying path '/nix/store/dhxk8mx04r2bmzypgamrb3d99ynai6wy-pathway-quickcheck-0.0.1.0' to 'https://cache.nix-ci.com'...
94.22 s
[pathway-quickcheck:post-build] warning: 'warn-short-path-literals' is deprecated, use 'lint-short-path-literals = ignore' instead
94.52 s
[pathway-quickcheck:post-build] copying 1 paths...
94.52 s
[pathway-quickcheck:post-build] copying path '/nix/store/irspgilfr6aa952vk0yjyars9lj03vzj-pathway-quickcheck-0.0.1.0.drv' to 'https://cache.nix-ci.com'...
94.78 s
Uploaded pathway-quickcheck in 5.6s
94.78 s
Progress: 3 of 24 built (1 building), 164 of 164 downloaded from cache
94.78 s
Built pathway-quickcheck in 20.4s
94.82 s
Building /nix/store/j3b24wrk7nzk4d15spqqqvs1nmkjz18y-pathway-0.0.1.0.drv
94.82 s
[variant] Phase: fixupPhase
94.82 s
[variant] shrinking RPATHs of ELF executables and libraries in /nix/store/i2780hl1zwwjcb5g9izvmg3qjws6cmxv-variant-1.0.2
94.82 s
[variant] shrinking /nix/store/i2780hl1zwwjcb5g9izvmg3qjws6cmxv-variant-1.0.2/lib/ghc-9.8.4/lib/x86_64-linux-ghc-9.8.4/libHSvariant-1.0.2-LM0Un02zMMi4aizfZ11g92-ghc9.8.4.so
94.82 s
[variant] checking for references to /build/ in /nix/store/i2780hl1zwwjcb5g9izvmg3qjws6cmxv-variant-1.0.2...
94.82 s
[variant] patching script interpreter paths in /nix/store/i2780hl1zwwjcb5g9izvmg3qjws6cmxv-variant-1.0.2
94.82 s
[variant] stripping (with command strip and flags -S -p) in /nix/store/i2780hl1zwwjcb5g9izvmg3qjws6cmxv-variant-1.0.2/lib
94.82 s
[variant] shrinking RPATHs of ELF executables and libraries in /nix/store/rifkcj39cwaw8glx7cxpjr2h6iw9lca7-variant-1.0.2-doc
94.82 s
[variant] checking for references to /build/ in /nix/store/rifkcj39cwaw8glx7cxpjr2h6iw9lca7-variant-1.0.2-doc...
94.82 s
[variant] patching script interpreter paths in /nix/store/rifkcj39cwaw8glx7cxpjr2h6iw9lca7-variant-1.0.2-doc
94.90 s
[variant:post-build] Uploading to cachix cache "sellout": /nix/store/i2780hl1zwwjcb5g9izvmg3qjws6cmxv-variant-1.0.2 /nix/store/rifkcj39cwaw8glx7cxpjr2h6iw9lca7-variant-1.0.2-doc
96.46 s
[variant:post-build] Nothing to push - all store paths are already on Cachix.
96.47 s
[variant:post-build] Uploading to the NixCI cache: /nix/store/i2780hl1zwwjcb5g9izvmg3qjws6cmxv-variant-1.0.2 /nix/store/rifkcj39cwaw8glx7cxpjr2h6iw9lca7-variant-1.0.2-doc
96.51 s
[variant:post-build] warning: 'warn-short-path-literals' is deprecated, use 'lint-short-path-literals = ignore' instead
96.76 s
[variant:post-build] copying 2 paths...
96.76 s
[variant:post-build] copying path '/nix/store/rifkcj39cwaw8glx7cxpjr2h6iw9lca7-variant-1.0.2-doc' to 'https://cache.nix-ci.com'...
97.66 s
[variant:post-build] copying path '/nix/store/i2780hl1zwwjcb5g9izvmg3qjws6cmxv-variant-1.0.2' to 'https://cache.nix-ci.com'...
99.73 s
[variant:post-build] warning: 'warn-short-path-literals' is deprecated, use 'lint-short-path-literals = ignore' instead
99.90 s
[variant:post-build] copying 0 paths...
99.95 s
Uploaded variant in 5.0s
99.95 s
Progress: 4 of 23 built (1 building), 164 of 164 downloaded from cache
99.95 s
Built variant in 32.2s
99.95 s
[pathway] Phase: setupCompilerEnvironmentPhase
99.95 s
[pathway] Build with /nix/store/7r9b0bl984hdgd70nf5p8raa55kml491-ghc-9.8.4.
99.95 s
[pathway] Phase: unpackPhase
99.95 s
[pathway] unpacking source archive /nix/store/pa5a8cacmsk7qi3b0gb3q0vn9a8b0nwv-pathway
99.95 s
[pathway] source root is pathway
99.95 s
[pathway] Phase: patchPhase
99.95 s
[pathway] Phase: compileBuildDriverPhase
99.95 s
[pathway] setupCompileFlags: -package-db=/build/tmp.Jmr3L2YSi5/setup-package.conf.d -threaded
99.95 s
[pathway] [1 of 2] Compiling Main ( Setup.hs, /build/tmp.Jmr3L2YSi5/Main.o )
99.95 s
[pathway] [2 of 2] Linking Setup
99.95 s
[pathway] Phase: updateAutotoolsGnuConfigScriptsPhase
99.95 s
[pathway] Phase: configurePhase
99.95 s
[pathway] configureFlags: --verbose --prefix=/nix/store/4w3hww8m5scx7f1d9db29isggadn48qi-pathway-0.0.1.0 --libdir=$prefix/lib/$compiler/lib --libsubdir=$abi/$libname --docdir=/nix/store/jr60dyysyq8mwsf7sfzclv93kmwv756d-pathway-0.0.1.0-doc/share/doc/pathway-0.0.1.0 --with-gcc=gcc --package-db=/build/tmp.Jmr3L2YSi5/package.conf.d --ghc-option=-j16 --ghc-option=+RTS --ghc-option=-A64M --ghc-option=-RTS --enable-library-profiling --profiling-detail=exported-functions --disable-profiling --enable-shared --disable-coverage --enable-static --disable-executable-dynamic --enable-tests --disable-benchmarks --enable-library-vanilla --disable-library-for-ghci --enable-split-sections --enable-library-stripping --enable-executable-stripping --ghc-option=-haddock --ghc-options=-Werror --extra-lib-dirs=/nix/store/pndhkk0l649lm1sj0mxk7cbwq26qd1ra-ncurses-6.6/lib --extra-lib-dirs=/nix/store/0djlg4g0b81w94k3vcaqsxsc2hh4kism-libffi-3.5.2/lib --extra-lib-dirs=/nix/store/md4paia7riiggyrj8p24c7a6vf8w7jz8-elfutils-0.194/lib --extra-lib-dirs=/nix/store/39vv2pf64gd8li48a4hpbhw2crzd8z5p-gmp-with-cxx-6.3.0/lib --extra-lib-dirs=/nix/store/7wwvald8lapkrsr72qanlw8blyn55ifx-numactl-2.0.18/lib --extra-lib-dirs=/nix/store/7r9b0bl984hdgd70nf5p8raa55kml491-ghc-9.8.4/lib
99.95 s
[pathway] Using Parsec parser
99.95 s
[pathway] Configuring pathway-0.0.1.0...
99.95 s
[pathway] Flags chosen: noisy-deprecations=True, verify-no-recursion=False
99.95 s
[pathway] Dependency base >=4.14.0 && <4.15 || >=4.15.0 && <4.16 || >=4.16.0 && <4.17 ||
99.95 s
[pathway] >=4.17.0 && <4.18 || >=4.18.0 && <4.19 || >=4.19.0 && <4.20 || >=4.20.0 &&
99.95 s
[pathway] <4.21 || >=4.21.0 && <4.22 || >=4.22.0 && <4.23: using base-4.19.2.0
99.95 s
[pathway] Dependency containers >=0.6.2 && <0.9: using containers-0.6.8
99.95 s
[pathway] Dependency extra >=1.5 && <1.6 || >=1.7.7 && <1.8 || >=1.8.1 && <1.9: using
99.95 s
[pathway] extra-1.8.1
99.95 s
[pathway] Dependency megaparsec >=9.0.1 && <9.1 || >=9.2.1 && <9.3 || >=9.5.0 && <9.6 ||
99.95 s
[pathway] >=9.7.0 && <9.8 || >=9.8.1 && <9.9: using megaparsec-9.7.0
99.95 s
[pathway] Dependency pathway-internal >=0.0.1 && <0.1: using pathway-internal-0.0.1.0
99.95 s
[pathway] Dependency template-haskell >=2.16.0 && <2.17 || >=2.17.0 && <2.18 || >=2.18.0
99.95 s
[pathway] && <2.19 || >=2.19.0 && <2.20 || >=2.20.0 && <2.21 || >=2.21.0 && <2.22 ||
99.95 s
[pathway] >=2.22.0 && <2.23 || >=2.23.0 && <2.24 || >=2.24.0 && <2.25: using
99.95 s
[pathway] template-haskell-2.21.0.0
99.95 s
[pathway] Dependency text >=1.2.3 && <1.3 || >=2.0.2 && <2.2: using text-2.1.1
99.95 s
[pathway] Dependency yaya >=0.6.2 && <0.7 || >=0.7.0 && <0.8: using yaya-0.6.2.3
99.95 s
[pathway] Dependency yaya-containers >=0.1.2 && <0.2 || >=0.2.0 && <0.3: using
99.95 s
[pathway] yaya-containers-0.1.2.2
99.95 s
[pathway] Dependency yaya-unsafe >=0.4.1 && <0.5 || >=0.5.0 && <0.6: using
99.95 s
[pathway] yaya-unsafe-0.4.1.4
99.95 s
[pathway] Dependency QuickCheck >=2.14.2 && <2.15 || >=2.15.0 && <2.16 || >=2.16.0 &&
99.95 s
[pathway] <2.17 || >=2.17.1 && <2.18 || >=2.18.0 && <2.19: using QuickCheck-2.15.0.1
99.95 s
[pathway] Dependency base >=4.14.0 && <4.15 || >=4.15.0 && <4.16 || >=4.16.0 && <4.17 ||
99.95 s
[pathway] >=4.17.0 && <4.18 || >=4.18.0 && <4.19 || >=4.19.0 && <4.20 || >=4.20.0 &&
99.95 s
[pathway] <4.21 || >=4.21.0 && <4.22 || >=4.22.0 && <4.23: using base-4.19.2.0
99.95 s
[pathway] Dependency doctest >=0.16.3 && <0.17 || >=0.18.1 && <0.19 || >=0.20.1 && <0.21
99.95 s
[pathway] || >=0.21.1 && <0.22 || >=0.22.2 && <0.23 || >=0.24.2 && <0.25 || >=0.25.0 &&
99.95 s
[pathway] <0.26: using doctest-0.24.3
99.95 s
[pathway] Dependency pathway: using pathway-0.0.1.0
99.95 s
[pathway] Dependency pathway-quickcheck >=0.0.1 && <0.1: using
99.95 s
[pathway] pathway-quickcheck-0.0.1.0
99.95 s
[pathway] Source component graph:
99.95 s
[pathway] component lib
99.95 s
[pathway] component test:doctests dependency lib
99.95 s
[pathway] Configured component graph:
99.95 s
[pathway] component pathway-0.0.1.0-H5uD0SRA9755UrSqFBaCYE
99.95 s
[pathway] include base-4.19.2.0-934f
99.95 s
[pathway] include containers-0.6.8-457e
99.95 s
[pathway] include extra-1.8.1-F4oHgTKCper3ZiIUPZjGPK
99.95 s
[pathway] include megaparsec-9.7.0-10vHZAF1maw9O8p2gXs66N
99.95 s
[pathway] include pathway-internal-0.0.1.0-Lnjdb2M8cxN196wSdsfQUK
99.95 s
[pathway] include template-haskell-2.21.0.0-eecb
99.95 s
[pathway] include text-2.1.1-b775
99.95 s
[pathway] include yaya-0.6.2.3-GccDDwL0TDlDZM8zUYiPLe
99.95 s
[pathway] include yaya-containers-0.1.2.2-56P5NXJ48KBIgKS6PAQrV9
99.95 s
[pathway] include yaya-unsafe-0.4.1.4-IRheUGQykkRHDousPLwgn3
99.95 s
[pathway] component pathway-0.0.1.0-BXEczQs7eXpJO9IAASX3YP-doctests
99.95 s
[pathway] include QuickCheck-2.15.0.1-LD31LrTXA1r25cYcwqMYw3
99.95 s
[pathway] include base-4.19.2.0-934f
99.95 s
[pathway] include doctest-0.24.3-1aDs7zEYV5r7raSsXr9TQC
99.95 s
[pathway] include pathway-0.0.1.0-H5uD0SRA9755UrSqFBaCYE
99.95 s
[pathway] include pathway-quickcheck-0.0.1.0-4oIbmpgZGhDoseg1psLQA
99.95 s
[pathway] Linked component graph:
99.95 s
[pathway] unit pathway-0.0.1.0-H5uD0SRA9755UrSqFBaCYE
99.95 s
[pathway] include base-4.19.2.0-934f
99.95 s
[pathway] include containers-0.6.8-457e
99.95 s
[pathway] include extra-1.8.1-F4oHgTKCper3ZiIUPZjGPK
99.95 s
[pathway] include megaparsec-9.7.0-10vHZAF1maw9O8p2gXs66N
99.95 s
[pathway] include pathway-internal-0.0.1.0-Lnjdb2M8cxN196wSdsfQUK
99.95 s
[pathway] include template-haskell-2.21.0.0-eecb
99.95 s
[pathway] include text-2.1.1-b775
99.95 s
[pathway] include yaya-0.6.2.3-GccDDwL0TDlDZM8zUYiPLe
99.95 s
[pathway] include yaya-containers-0.1.2.2-56P5NXJ48KBIgKS6PAQrV9
99.95 s
[pathway] include yaya-unsafe-0.4.1.4-IRheUGQykkRHDousPLwgn3
99.95 s
[pathway] Data.Path=pathway-0.0.1.0-H5uD0SRA9755UrSqFBaCYE:Data.Path,Data.Path.Directory=pathway-0.0.1.0-H5uD0SRA9755UrSqFBaCYE:Data.Path.Directory,Data.Path.File=pathway-0.0.1.0-H5uD0SRA9755UrSqFBaCYE:Data.Path.File,Data.Path.Format=pathway-0.0.1.0-H5uD0SRA9755UrSqFBaCYE:Data.Path.Format,Data.Path.Parser=pathway-0.0.1.0-H5uD0SRA9755UrSqFBaCYE:Data.Path.Parser,Data.Path.Relativity=pathway-0.0.1.0-H5uD0SRA9755UrSqFBaCYE:Data.Path.Relativity,Data.Path.TH=pathway-0.0.1.0-H5uD0SRA9755UrSqFBaCYE:Data.Path.TH,Data.Path.Type=pathway-0.0.1.0-H5uD0SRA9755UrSqFBaCYE:Data.Path.Type
99.95 s
[pathway] unit pathway-0.0.1.0-BXEczQs7eXpJO9IAASX3YP-doctests
99.95 s
[pathway] include QuickCheck-2.15.0.1-LD31LrTXA1r25cYcwqMYw3
99.95 s
[pathway] include base-4.19.2.0-934f
99.95 s
[pathway] include doctest-0.24.3-1aDs7zEYV5r7raSsXr9TQC
99.95 s
[pathway] include pathway-0.0.1.0-H5uD0SRA9755UrSqFBaCYE
99.95 s
[pathway] include pathway-quickcheck-0.0.1.0-4oIbmpgZGhDoseg1psLQA
99.95 s
[pathway] Ready component graph:
99.95 s
[pathway] definite pathway-0.0.1.0-H5uD0SRA9755UrSqFBaCYE
99.95 s
[pathway] depends base-4.19.2.0-934f
99.95 s
[pathway] depends containers-0.6.8-457e
99.95 s
[pathway] depends extra-1.8.1-F4oHgTKCper3ZiIUPZjGPK
99.95 s
[pathway] depends megaparsec-9.7.0-10vHZAF1maw9O8p2gXs66N
99.95 s
[pathway] depends pathway-internal-0.0.1.0-Lnjdb2M8cxN196wSdsfQUK
99.95 s
[pathway] depends template-haskell-2.21.0.0-eecb
99.95 s
[pathway] depends text-2.1.1-b775
99.95 s
[pathway] depends yaya-0.6.2.3-GccDDwL0TDlDZM8zUYiPLe
99.95 s
[pathway] depends yaya-containers-0.1.2.2-56P5NXJ48KBIgKS6PAQrV9
99.95 s
[pathway] depends yaya-unsafe-0.4.1.4-IRheUGQykkRHDousPLwgn3
99.95 s
[pathway] definite pathway-0.0.1.0-BXEczQs7eXpJO9IAASX3YP-doctests
99.95 s
[pathway] depends QuickCheck-2.15.0.1-LD31LrTXA1r25cYcwqMYw3
99.95 s
[pathway] depends base-4.19.2.0-934f
99.95 s
[pathway] depends doctest-0.24.3-1aDs7zEYV5r7raSsXr9TQC
99.95 s
[pathway] depends pathway-0.0.1.0-H5uD0SRA9755UrSqFBaCYE
99.95 s
[pathway] depends pathway-quickcheck-0.0.1.0-4oIbmpgZGhDoseg1psLQA
99.95 s
[pathway] Using Cabal-3.10.3.0 compiled by ghc-9.8
99.95 s
[pathway] Using compiler: ghc-9.8.4
99.95 s
[pathway] Using install prefix:
99.95 s
[pathway] /nix/store/4w3hww8m5scx7f1d9db29isggadn48qi-pathway-0.0.1.0
99.95 s
[pathway] Executables installed in:
99.95 s
[pathway] /nix/store/4w3hww8m5scx7f1d9db29isggadn48qi-pathway-0.0.1.0/bin
99.95 s
[pathway] Libraries installed in:
99.95 s
[pathway] /nix/store/4w3hww8m5scx7f1d9db29isggadn48qi-pathway-0.0.1.0/lib/ghc-9.8.4/lib/x86_64-linux-ghc-9.8.4/pathway-0.0.1.0-H5uD0SRA9755UrSqFBaCYE
99.95 s
[pathway] Dynamic Libraries installed in:
99.95 s
[pathway] /nix/store/4w3hww8m5scx7f1d9db29isggadn48qi-pathway-0.0.1.0/lib/ghc-9.8.4/lib/x86_64-linux-ghc-9.8.4
99.95 s
[pathway] Private executables installed in:
99.95 s
[pathway] /nix/store/4w3hww8m5scx7f1d9db29isggadn48qi-pathway-0.0.1.0/libexec/x86_64-linux-ghc-9.8.4/pathway-0.0.1.0
99.95 s
[pathway] Data files installed in:
99.95 s
[pathway] /nix/store/4w3hww8m5scx7f1d9db29isggadn48qi-pathway-0.0.1.0/share/x86_64-linux-ghc-9.8.4/pathway-0.0.1.0
99.95 s
[pathway] Documentation installed in:
99.95 s
[pathway] /nix/store/jr60dyysyq8mwsf7sfzclv93kmwv756d-pathway-0.0.1.0-doc/share/doc/pathway-0.0.1.0
99.95 s
[pathway] Configuration files installed in:
99.95 s
[pathway] /nix/store/4w3hww8m5scx7f1d9db29isggadn48qi-pathway-0.0.1.0/etc
99.95 s
[pathway] No alex found
99.95 s
[pathway] Using ar found on system at:
99.95 s
[pathway] /nix/store/zjraf40s86y3iwhp626b934r5y6ldkbb-binutils-wrapper-2.46/bin/ar
99.95 s
[pathway] No c2hs found
99.95 s
[pathway] No cpphs found
99.95 s
[pathway] Using doctest version 0.24.3 found on system at:
99.95 s
[pathway] /nix/store/2y183b1vsybv0157vfr59yhdwjkpqfkn-doctest-0.24.3/bin/doctest
99.95 s
[pathway] Using gcc version 15.2.0 given by user at:
99.95 s
[pathway] /nix/store/29qjlshvklnyr67nhpprzgb9igmsfsjj-gcc-wrapper-15.2.0/bin/gcc
99.95 s
[pathway] Using ghc version 9.8.4 found on system at:
99.95 s
[pathway] /nix/store/7r9b0bl984hdgd70nf5p8raa55kml491-ghc-9.8.4/bin/ghc
99.95 s
[pathway] Using ghc-pkg version 9.8.4 found on system at:
99.95 s
[pathway] /nix/store/7r9b0bl984hdgd70nf5p8raa55kml491-ghc-9.8.4/bin/ghc-pkg-9.8.4
99.95 s
[pathway] No ghcjs found
99.95 s
[pathway] No ghcjs-pkg found
99.95 s
[pathway] No greencard found
99.95 s
[pathway] Using haddock version 2.30.0 found on system at:
99.95 s
[pathway] /nix/store/7r9b0bl984hdgd70nf5p8raa55kml491-ghc-9.8.4/bin/haddock-ghc-9.8.4
99.95 s
[pathway] No happy found
99.95 s
[pathway] Using haskell-suite found on system at: haskell-suite-dummy-location
99.95 s
[pathway] Using haskell-suite-pkg found on system at: haskell-suite-pkg-dummy-location
99.95 s
[pathway] No hmake found
99.95 s
[pathway] Using hpc version 0.69 found on system at:
99.95 s
[pathway] /nix/store/7r9b0bl984hdgd70nf5p8raa55kml491-ghc-9.8.4/bin/hpc-ghc-9.8.4
99.95 s
[pathway] Using hsc2hs version 0.68.10 found on system at:
99.95 s
[pathway] /nix/store/7r9b0bl984hdgd70nf5p8raa55kml491-ghc-9.8.4/bin/hsc2hs-ghc-9.8.4
99.95 s
[pathway] Using hscolour version 1.25 found on system at:
99.95 s
[pathway] /nix/store/awnxn98rlw62rrjwli6d2lb4d27mrzzw-hscolour-1.25/bin/HsColour
99.95 s
[pathway] No jhc found
99.95 s
[pathway] Using ld found on system at:
99.95 s
[pathway] /nix/store/zjraf40s86y3iwhp626b934r5y6ldkbb-binutils-wrapper-2.46/bin/ld.gold
99.95 s
[pathway] No pkg-config found
99.95 s
[pathway] Using runghc version 9.8.4 found on system at:
99.95 s
[pathway] /nix/store/7r9b0bl984hdgd70nf5p8raa55kml491-ghc-9.8.4/bin/runghc-9.8.4
99.95 s
[pathway] Using strip version 2.46 found on system at:
99.95 s
[pathway] /nix/store/29qjlshvklnyr67nhpprzgb9igmsfsjj-gcc-wrapper-15.2.0/bin/strip
99.95 s
[pathway] Using tar found on system at:
99.95 s
[pathway] /nix/store/z5mq2sam4484prf3kv6v6vjw1m0i7j24-gnutar-1.35/bin/tar
99.95 s
[pathway] No uhc found
99.95 s
[pathway] Phase: buildPhase
99.95 s
[pathway] Preprocessing library for pathway-0.0.1.0..
99.95 s
[pathway] Building library for pathway-0.0.1.0..
99.95 s
[pathway] [1 of 8] Compiling Data.Path.Format ( src/Data/Path/Format.hs, dist/build/Data/Path/Format.o, dist/build/Data/Path/Format.dyn_o )
99.95 s
[pathway] [2 of 8] Compiling Data.Path.Relativity ( src/Data/Path/Relativity.hs, dist/build/Data/Path/Relativity.o, dist/build/Data/Path/Relativity.dyn_o )
99.95 s
[pathway] [3 of 8] Compiling Data.Path.Type ( src/Data/Path/Type.hs, dist/build/Data/Path/Type.o, dist/build/Data/Path/Type.dyn_o )
99.95 s
[pathway] [4 of 8] Compiling Data.Path.File ( src/Data/Path/File.hs, dist/build/Data/Path/File.o, dist/build/Data/Path/File.dyn_o )
99.95 s
[pathway] [5 of 8] Compiling Data.Path.Directory ( src/Data/Path/Directory.hs, dist/build/Data/Path/Directory.o, dist/build/Data/Path/Directory.dyn_o )
99.95 s
[pathway] [6 of 8] Compiling Data.Path ( src/Data/Path.hs, dist/build/Data/Path.o, dist/build/Data/Path.dyn_o )
99.95 s
[pathway] [7 of 8] Compiling Data.Path.Parser ( src/Data/Path/Parser.hs, dist/build/Data/Path/Parser.o, dist/build/Data/Path/Parser.dyn_o )
99.95 s
[pathway] [8 of 8] Compiling Data.Path.TH ( src/Data/Path/TH.hs, dist/build/Data/Path/TH.o, dist/build/Data/Path/TH.dyn_o )
99.95 s
[pathway] [1 of 8] Compiling Data.Path.Format ( src/Data/Path/Format.hs, dist/build/Data/Path/Format.p_o )
99.99 s
[pathway] [2 of 8] Compiling Data.Path.Relativity ( src/Data/Path/Relativity.hs, dist/build/Data/Path/Relativity.p_o )
99.99 s
[pathway] [3 of 8] Compiling Data.Path.Type ( src/Data/Path/Type.hs, dist/build/Data/Path/Type.p_o )
99.99 s
[pathway] [4 of 8] Compiling Data.Path.File ( src/Data/Path/File.hs, dist/build/Data/Path/File.p_o )
100.14 s
[pathway] [5 of 8] Compiling Data.Path.Directory ( src/Data/Path/Directory.hs, dist/build/Data/Path/Directory.p_o )
100.21 s
[pathway] [6 of 8] Compiling Data.Path ( src/Data/Path.hs, dist/build/Data/Path.p_o )
101.27 s
[pathway] [7 of 8] Compiling Data.Path.Parser ( src/Data/Path/Parser.hs, dist/build/Data/Path/Parser.p_o )
101.52 s
[pathway] [8 of 8] Compiling Data.Path.TH ( src/Data/Path/TH.hs, dist/build/Data/Path/TH.p_o )
103.38 s
[pathway] Preprocessing test suite 'doctests' for pathway-0.0.1.0..
103.38 s
[pathway] Building test suite 'doctests' for pathway-0.0.1.0..
103.45 s
[pathway] [1 of 2] Compiling Build_doctests ( dist/build/doctests/autogen/Build_doctests.hs, dist/build/doctests/doctests-tmp/Build_doctests.o )
103.64 s
[pathway] [2 of 2] Compiling Main ( tests/doctests.hs, dist/build/doctests/doctests-tmp/Main.o )
103.88 s
[pathway] [3 of 3] Linking dist/build/doctests/doctests
107.30 s
[pathway] Phase: checkPhase
107.34 s
[pathway] Running 1 test suites...
107.34 s
[pathway] Test suite doctests: RUNNING...
107.70 s
[pathway]
107.81 s
[pathway] on the commandline: warning: [GHC-98887]
107.81 s
[pathway] -XTemplateHaskell is not allowed in Safe Haskell; ignoring -XTemplateHaskell
107.81 s
[pathway]
107.81 s
[pathway] on the commandline: warning: [GHC-98887]
107.81 s
[pathway] -XTemplateHaskell is not allowed in Safe Haskell; ignoring -XTemplateHaskell
107.81 s
[pathway]
107.81 s
[pathway] on the commandline: warning: [GHC-98887]
107.81 s
[pathway] -XTemplateHaskell is not allowed in Safe Haskell; ignoring -XTemplateHaskell
107.81 s
[pathway]
107.81 s
[pathway] on the commandline: warning: [GHC-98887]
107.81 s
[pathway] -XTemplateHaskell is not allowed in Safe Haskell; ignoring -XTemplateHaskell
107.81 s
[pathway]
107.81 s
[pathway] on the commandline: warning: [GHC-98887]
107.81 s
[pathway] -XTemplateHaskell is not allowed in Safe Haskell; ignoring -XTemplateHaskell
107.81 s
[pathway]
107.81 s
[pathway] on the commandline: warning: [GHC-98887]
107.81 s
[pathway] -XTemplateHaskell is not allowed in Safe Haskell; ignoring -XTemplateHaskell
107.81 s
[pathway]
107.81 s
[pathway] on the commandline: warning: [GHC-98887]
107.81 s
[pathway] -XTemplateHaskell is not allowed in Safe Haskell; ignoring -XTemplateHaskell
107.81 s
[pathway]
107.81 s
[pathway] on the commandline: warning: [GHC-98887]
107.81 s
[pathway] -XTemplateHaskell is not allowed in Safe Haskell; ignoring -XTemplateHaskell
107.81 s
[pathway]
107.81 s
[pathway] on the commandline: warning: [GHC-98887]
107.81 s
[pathway] -XTemplateHaskell is not allowed in Safe Haskell; ignoring -XTemplateHaskell
107.81 s
[pathway]
107.81 s
[pathway] on the commandline: warning: [GHC-98887]
107.81 s
[pathway] -XTemplateHaskell is not allowed in Safe Haskell; ignoring -XTemplateHaskell
107.81 s
[pathway]
107.81 s
[pathway] on the commandline: warning: [GHC-98887]
107.81 s
[pathway] -XTemplateHaskell is not allowed in Safe Haskell; ignoring -XTemplateHaskell
109.19 s
[pathway] Examples: 53 Tried: 53 Errors: 0 Failures: 0
109.26 s
[pathway] Test suite doctests: PASS
109.26 s
[pathway] Test suite logged to: dist/test/pathway-0.0.1.0-doctests.log
109.26 s
[pathway] 1 of 1 test suites (1 of 1 test cases) passed.
109.27 s
[pathway] Phase: haddockPhase
109.41 s
[pathway] Preprocessing library for pathway-0.0.1.0..
109.41 s
[pathway] Running Haddock on library for pathway-0.0.1.0..
109.41 s
[pathway] Warning: The documentation for the following packages are not installed. No
109.41 s
[pathway] links will be generated to these packages: vector-0.13.2.0
109.47 s
[pathway] Warning: --source-* options are ignored when --hyperlinked-source is enabled.
109.64 s
[pathway] [1 of 8] Compiling Data.Path.Format ( src/Data/Path/Format.hs, nothing )
109.69 s
[pathway] [2 of 8] Compiling Data.Path.Relativity ( src/Data/Path/Relativity.hs, nothing )
109.69 s
[pathway] [3 of 8] Compiling Data.Path.Type ( src/Data/Path/Type.hs, nothing )
109.69 s
[pathway] [4 of 8] Compiling Data.Path.File ( src/Data/Path/File.hs, nothing )
109.74 s
[pathway] [5 of 8] Compiling Data.Path.Directory ( src/Data/Path/Directory.hs, nothing )
109.74 s
[pathway] [6 of 8] Compiling Data.Path ( src/Data/Path.hs, nothing )
110.08 s
[pathway] [7 of 8] Compiling Data.Path.Parser ( src/Data/Path/Parser.hs, nothing )
110.12 s
[pathway] [8 of 8] Compiling Data.Path.TH ( src/Data/Path/TH.hs, nothing )
110.14 s
[pathway] Haddock coverage:
110.14 s
[pathway] 20% ( 1 / 5) in 'Data.Path.Format'
110.14 s
[pathway] Missing documentation for:
110.14 s
[pathway] Module header
110.14 s
[pathway] Format (src/Data/Path/Format.hs:25)
110.14 s
[pathway] posix (src/Data/Path/Format.hs:38)
110.14 s
[pathway] windows (src/Data/Path/Format.hs:48)
110.15 s
[pathway] 50% ( 1 / 2) in 'Data.Path.Relativity'
110.15 s
[pathway] Missing documentation for:
110.15 s
[pathway] Module header
110.15 s
[pathway] 50% ( 1 / 2) in 'Data.Path.Type'
110.15 s
[pathway] Missing documentation for:
110.15 s
[pathway] Module header
110.15 s
[pathway] 0% ( 0 / 3) in 'Data.Path.File'
110.15 s
[pathway] Missing documentation for:
110.15 s
[pathway] Module header
110.15 s
[pathway] basename (src/Data/Path/File.hs:21)
110.15 s
[pathway] directory (src/Data/Path/File.hs:24)
110.15 s
[pathway] Warning: '<$>' is out of scope.
110.15 s
[pathway] If you qualify the identifier, haddock can try to link it anyway.
110.15 s
[pathway] 36% ( 4 / 11) in 'Data.Path.Directory'
110.15 s
[pathway] Missing documentation for:
110.15 s
[pathway] Module header
110.15 s
[pathway] isCurrent (src/Data/Path/Directory.hs:94)
110.15 s
[pathway] root (src/Data/Path/Directory.hs:105)
110.15 s
[pathway] isRoot (src/Data/Path/Directory.hs:108)
110.15 s
[pathway] descendThrough (src/Data/Path/Directory.hs:97)
110.15 s
[pathway] descendTo (src/Data/Path/Directory.hs:101)
110.15 s
[pathway] selectFile (src/Data/Path/Directory.hs:111)
110.15 s
[pathway] Warning: 'None' is out of scope.
110.15 s
[pathway] If you qualify the identifier, haddock can try to link it anyway.
110.15 s
[pathway] Warning: '../' is out of scope.
110.15 s
[pathway] If you qualify the identifier, haddock can try to link it anyway.
110.15 s
[pathway] Warning: 'Path' is ambiguous. It is defined
110.15 s
[pathway] * in ‘Data.Path.Internal’
110.15 s
[pathway] * in ‘Data.Path.Internal’
110.15 s
[pathway] You may be able to disambiguate the identifier by qualifying it or
110.15 s
[pathway] by specifying the type/value namespace explicitly.
110.15 s
[pathway] Defaulting to the one defined in ‘Data.Path.Internal’
110.15 s
[pathway] 55% ( 16 / 29) in 'Data.Path'
110.15 s
[pathway] Missing documentation for:
110.15 s
[pathway] Anchored (src/Data/Path.hs:660)
110.15 s
[pathway] Filename
110.15 s
[pathway] Pathy (src/Data/Path.hs:203)
110.15 s
[pathway] RelOps (src/Data/Path.hs:227)
110.15 s
[pathway] Relative (src/Data/Path.hs:174)
110.15 s
[pathway] Substible (src/Data/Path.hs:608)
110.15 s
[pathway] Typey (src/Data/Path.hs:190)
110.15 s
[pathway] escapeComponent (src/Data/Path.hs:623)
110.15 s
[pathway] forgetRelativity (src/Data/Path.hs:733)
110.15 s
[pathway] forgetType (src/Data/Path.hs:736)
110.15 s
[pathway] reparent (src/Data/Path.hs:382)
110.15 s
[pathway] replace
110.15 s
[pathway] strengthen (src/Data/Path.hs:656)
110.15 s
[pathway] Warning: 'Path' is ambiguous. It is defined
110.15 s
[pathway] * in ‘Data.Path.Internal’
110.15 s
[pathway] * in ‘Data.Path.Internal’
110.15 s
[pathway] You may be able to disambiguate the identifier by qualifying it or
110.15 s
[pathway] by specifying the type/value namespace explicitly.
110.15 s
[pathway] Defaulting to the one defined in ‘Data.Path.Internal’
110.15 s
[pathway] Warning: 'parse' is out of scope.
110.15 s
[pathway] If you qualify the identifier, haddock can try to link it anyway.
110.15 s
[pathway] Warning: 'local' is out of scope.
110.15 s
[pathway] If you qualify the identifier, haddock can try to link it anyway.
110.15 s
[pathway] 100% ( 3 / 3) in 'Data.Path.Parser'
110.15 s
[pathway] Warning: 'IsString' is out of scope.
110.15 s
[pathway] If you qualify the identifier, haddock can try to link it anyway.
110.15 s
[pathway] Warning: 'Path' is ambiguous. It is defined
110.15 s
[pathway] * in ‘Data.Path.Internal’
110.15 s
[pathway] * in ‘Data.Path.Internal’
110.15 s
[pathway] You may be able to disambiguate the identifier by qualifying it or
110.15 s
[pathway] by specifying the type/value namespace explicitly.
110.15 s
[pathway] Defaulting to the one defined in ‘Data.Path.Internal’
110.15 s
[pathway] 50% ( 2 / 4) in 'Data.Path.TH'
110.15 s
[pathway] Missing documentation for:
110.15 s
[pathway] Module header
110.16 s
[pathway] path (src/Data/Path/TH.hs:82)
110.65 s
[pathway] Warning: Data.Path: could not find link destinations for:
110.65 s
[pathway] - Data.Path.Internal.Type.Rep_Type
110.65 s
[pathway] - Data.Path.Internal.Relativity.Rep_Relativity
110.65 s
[pathway] - Data.Path.Internal.Rep1_Path
110.65 s
[pathway] - Data.Path.Internal.Rep_Path
110.65 s
[pathway] - Data.Path.Routable
110.65 s
[pathway] - Data.Path.generalizeType
110.65 s
[pathway] - Data.Path.generalizeRelativity
110.65 s
[pathway] - Data.Path.Rep_Anchored
110.65 s
[pathway] - Data.Path.Rep1_Anchored
110.65 s
[pathway] Warning: Data.Path.Parser: could not find link destinations for:
110.65 s
[pathway] - Data.Path.Parser.anchor
114.44 s
[pathway] Documentation created: dist/doc/html/pathway/,
114.44 s
[pathway] dist/doc/html/pathway/pathway.txt
114.50 s
[pathway] Preprocessing test suite 'doctests' for pathway-0.0.1.0..
114.50 s
[pathway] Phase: installPhase
114.59 s
[pathway] Installing library in /nix/store/4w3hww8m5scx7f1d9db29isggadn48qi-pathway-0.0.1.0/lib/ghc-9.8.4/lib/x86_64-linux-ghc-9.8.4/pathway-0.0.1.0-H5uD0SRA9755UrSqFBaCYE
114.96 s
[pathway] Phase: fixupPhase
114.98 s
[pathway] shrinking RPATHs of ELF executables and libraries in /nix/store/4w3hww8m5scx7f1d9db29isggadn48qi-pathway-0.0.1.0
114.98 s
[pathway] shrinking /nix/store/4w3hww8m5scx7f1d9db29isggadn48qi-pathway-0.0.1.0/lib/ghc-9.8.4/lib/x86_64-linux-ghc-9.8.4/libHSpathway-0.0.1.0-H5uD0SRA9755UrSqFBaCYE-ghc9.8.4.so
115.00 s
[pathway] checking for references to /build/ in /nix/store/4w3hww8m5scx7f1d9db29isggadn48qi-pathway-0.0.1.0...
115.03 s
[pathway] patching script interpreter paths in /nix/store/4w3hww8m5scx7f1d9db29isggadn48qi-pathway-0.0.1.0
115.04 s
[pathway] stripping (with command strip and flags -S -p) in /nix/store/4w3hww8m5scx7f1d9db29isggadn48qi-pathway-0.0.1.0/lib
115.14 s
[pathway] shrinking RPATHs of ELF executables and libraries in /nix/store/jr60dyysyq8mwsf7sfzclv93kmwv756d-pathway-0.0.1.0-doc
115.15 s
[pathway] checking for references to /build/ in /nix/store/jr60dyysyq8mwsf7sfzclv93kmwv756d-pathway-0.0.1.0-doc...
115.17 s
[pathway] patching script interpreter paths in /nix/store/jr60dyysyq8mwsf7sfzclv93kmwv756d-pathway-0.0.1.0-doc
115.28 s
[pathway:post-build] Uploading to cachix cache "sellout": /nix/store/4w3hww8m5scx7f1d9db29isggadn48qi-pathway-0.0.1.0 /nix/store/jr60dyysyq8mwsf7sfzclv93kmwv756d-pathway-0.0.1.0-doc
115.86 s
[pathway:post-build] Pushing 2 paths (176 are already present) using zstd to cache sellout ⏳
115.86 s
[pathway:post-build]
116.31 s
[pathway:post-build] Pushing /nix/store/4w3hww8m5scx7f1d9db29isggadn48qi-pathway-0.0.1.0 (2.68 MiB)
116.39 s
[pathway:post-build] Pushing /nix/store/jr60dyysyq8mwsf7sfzclv93kmwv756d-pathway-0.0.1.0-doc (1.35 MiB)
117.89 s
[pathway:post-build]
117.89 s
[pathway:post-build] All done.
117.91 s
[pathway:post-build] Uploading to the NixCI cache: /nix/store/4w3hww8m5scx7f1d9db29isggadn48qi-pathway-0.0.1.0 /nix/store/jr60dyysyq8mwsf7sfzclv93kmwv756d-pathway-0.0.1.0-doc
117.95 s
[pathway:post-build] warning: 'warn-short-path-literals' is deprecated, use 'lint-short-path-literals = ignore' instead
117.97 s
[pathway:post-build] copying 2 paths...
117.97 s
[pathway:post-build] copying path '/nix/store/jr60dyysyq8mwsf7sfzclv93kmwv756d-pathway-0.0.1.0-doc' to 'https://cache.nix-ci.com'...
118.58 s
[pathway:post-build] copying path '/nix/store/4w3hww8m5scx7f1d9db29isggadn48qi-pathway-0.0.1.0' to 'https://cache.nix-ci.com'...
119.50 s
[pathway:post-build] warning: 'warn-short-path-literals' is deprecated, use 'lint-short-path-literals = ignore' instead
119.84 s
[pathway:post-build] copying 1 paths...
119.89 s
[pathway:post-build] copying path '/nix/store/j3b24wrk7nzk4d15spqqqvs1nmkjz18y-pathway-0.0.1.0.drv' to 'https://cache.nix-ci.com'...
120.12 s
Uploaded pathway in 4.8s
120.12 s
Progress: 5 of 23 built, 164 of 164 downloaded from cache
120.12 s
Built pathway in 25.3s
120.17 s
Building /nix/store/zk8pnrqj09ffc98h9nz6jz4cixam6gxz-pathway-compat-base-0.0.1.0.drv
120.20 s
Building /nix/store/7hbrxb5fwq9ksf8pdn61896dmpqn1s6p-pathway-path-0.0.1.0.drv
120.37 s
[pathway-compat-base] Phase: setupCompilerEnvironmentPhase
120.37 s
[pathway-compat-base] Build with /nix/store/7r9b0bl984hdgd70nf5p8raa55kml491-ghc-9.8.4.
120.46 s
[pathway-path] Phase: setupCompilerEnvironmentPhase
120.46 s
[pathway-path] Build with /nix/store/7r9b0bl984hdgd70nf5p8raa55kml491-ghc-9.8.4.
120.71 s
[pathway-compat-base] Phase: unpackPhase
120.72 s
[pathway-compat-base] unpacking source archive /nix/store/jp1y9x3k1hawidjahld0khzrh2cvz0r5-base
120.73 s
[pathway-compat-base] source root is base
120.74 s
[pathway-compat-base] Phase: patchPhase
120.75 s
[pathway-compat-base] Phase: compileBuildDriverPhase
120.76 s
[pathway-compat-base] setupCompileFlags: -package-db=/build/tmp.siAxS2UaEW/setup-package.conf.d -threaded
120.81 s
[pathway-compat-base] [1 of 2] Compiling Main ( Setup.hs, /build/tmp.siAxS2UaEW/Main.o )
120.84 s
[pathway-path] Phase: unpackPhase
120.85 s
[pathway-path] unpacking source archive /nix/store/dcipmpfk1s5nwm3262d98w9iys6pr502-path
120.85 s
[pathway-path] source root is path
120.85 s
[pathway-compat-base] [2 of 2] Linking Setup
120.87 s
[pathway-path] Phase: patchPhase
120.88 s
[pathway-path] Phase: compileBuildDriverPhase
120.88 s
[pathway-path] setupCompileFlags: -package-db=/build/tmp.RqcbS0ymjx/setup-package.conf.d -threaded
120.93 s
[pathway-path] [1 of 2] Compiling Main ( Setup.hs, /build/tmp.RqcbS0ymjx/Main.o )
120.97 s
[pathway-path] [2 of 2] Linking Setup
122.09 s
[pathway-compat-base] Phase: updateAutotoolsGnuConfigScriptsPhase
122.11 s
[pathway-compat-base] Phase: configurePhase
122.12 s
[pathway-compat-base] configureFlags: --verbose --prefix=/nix/store/ny5lqzrqpnzvq468547gg0f4nh1l5hp8-pathway-compat-base-0.0.1.0 --libdir=$prefix/lib/$compiler/lib --libsubdir=$abi/$libname --docdir=/nix/store/8vrvsdrma8r8q2z0qf9d2v63gxkf06fp-pathway-compat-base-0.0.1.0-doc/share/doc/pathway-compat-base-0.0.1.0 --with-gcc=gcc --package-db=/build/tmp.siAxS2UaEW/package.conf.d --ghc-option=-j16 --ghc-option=+RTS --ghc-option=-A64M --ghc-option=-RTS --enable-library-profiling --profiling-detail=exported-functions --disable-profiling --enable-shared --disable-coverage --enable-static --disable-executable-dynamic --enable-tests --disable-benchmarks --enable-library-vanilla --disable-library-for-ghci --enable-split-sections --enable-library-stripping --enable-executable-stripping --ghc-option=-haddock --ghc-options=-Werror --extra-lib-dirs=/nix/store/pndhkk0l649lm1sj0mxk7cbwq26qd1ra-ncurses-6.6/lib --extra-lib-dirs=/nix/store/0djlg4g0b81w94k3vcaqsxsc2hh4kism-libffi-3.5.2/lib --extra-lib-dirs=/nix/store/md4paia7riiggyrj8p24c7a6vf8w7jz8-elfutils-0.194/lib --extra-lib-dirs=/nix/store/39vv2pf64gd8li48a4hpbhw2crzd8z5p-gmp-with-cxx-6.3.0/lib --extra-lib-dirs=/nix/store/7wwvald8lapkrsr72qanlw8blyn55ifx-numactl-2.0.18/lib --extra-lib-dirs=/nix/store/7r9b0bl984hdgd70nf5p8raa55kml491-ghc-9.8.4/lib
122.13 s
[pathway-compat-base] Using Parsec parser
122.13 s
[pathway-compat-base] Configuring pathway-compat-base-0.0.1.0...
122.21 s
[pathway-path] Phase: updateAutotoolsGnuConfigScriptsPhase
122.23 s
[pathway-path] Phase: configurePhase
122.23 s
[pathway-path] configureFlags: --verbose --prefix=/nix/store/zhnf64ql9iwqjbrywr875ymk3y16m46s-pathway-path-0.0.1.0 --libdir=$prefix/lib/$compiler/lib --libsubdir=$abi/$libname --docdir=/nix/store/f4iw36c17lxbzamcf3226jvpkhh8zig1-pathway-path-0.0.1.0-doc/share/doc/pathway-path-0.0.1.0 --with-gcc=gcc --package-db=/build/tmp.RqcbS0ymjx/package.conf.d --ghc-option=-j16 --ghc-option=+RTS --ghc-option=-A64M --ghc-option=-RTS --enable-library-profiling --profiling-detail=exported-functions --disable-profiling --enable-shared --disable-coverage --enable-static --disable-executable-dynamic --enable-tests --disable-benchmarks --enable-library-vanilla --disable-library-for-ghci --enable-split-sections --enable-library-stripping --enable-executable-stripping --ghc-option=-haddock --ghc-options=-Werror --extra-lib-dirs=/nix/store/pndhkk0l649lm1sj0mxk7cbwq26qd1ra-ncurses-6.6/lib --extra-lib-dirs=/nix/store/0djlg4g0b81w94k3vcaqsxsc2hh4kism-libffi-3.5.2/lib --extra-lib-dirs=/nix/store/md4paia7riiggyrj8p24c7a6vf8w7jz8-elfutils-0.194/lib --extra-lib-dirs=/nix/store/39vv2pf64gd8li48a4hpbhw2crzd8z5p-gmp-with-cxx-6.3.0/lib --extra-lib-dirs=/nix/store/7wwvald8lapkrsr72qanlw8blyn55ifx-numactl-2.0.18/lib --extra-lib-dirs=/nix/store/7r9b0bl984hdgd70nf5p8raa55kml491-ghc-9.8.4/lib
122.24 s
[pathway-path] Using Parsec parser
122.24 s
[pathway-path] Configuring pathway-path-0.0.1.0...
122.46 s
[pathway-compat-base] Flags chosen: noisy-deprecations=True, verify-no-recursion=False
122.46 s
[pathway-compat-base] Dependency base >=4.14.0 && <4.15 || >=4.15.0 && <4.16 || >=4.16.0 && <4.17 ||
122.46 s
[pathway-compat-base] >=4.17.0 && <4.18 || >=4.18.0 && <4.19 || >=4.19.0 && <4.20 || >=4.20.0 &&
122.46 s
[pathway-compat-base] <4.21 || >=4.21.0 && <4.22 || >=4.22.0 && <4.23: using base-4.19.2.0
122.46 s
[pathway-compat-base] Dependency exceptions: using exceptions-0.10.7
122.46 s
[pathway-compat-base] Dependency megaparsec >=9.0.1 && <9.1 || >=9.2.1 && <9.3 || >=9.5.0 && <9.6 ||
122.46 s
[pathway-compat-base] >=9.7.0 && <9.8: using megaparsec-9.7.0
122.46 s
[pathway-compat-base] Dependency pathway >=0.0.1 && <0.1: using pathway-0.0.1.0
122.46 s
[pathway-compat-base] Dependency variant: using variant-1.0.2
122.46 s
[pathway-compat-base] Dependency base >=4.14.0 && <4.15 || >=4.15.0 && <4.16 || >=4.16.0 && <4.17 ||
122.46 s
[pathway-compat-base] >=4.17.0 && <4.18 || >=4.18.0 && <4.19 || >=4.19.0 && <4.20 || >=4.20.0 &&
122.46 s
[pathway-compat-base] <4.21 || >=4.21.0 && <4.22 || >=4.22.0 && <4.23: using base-4.19.2.0
122.46 s
[pathway-compat-base] Dependency doctest >=0.16.3 && <0.17 || >=0.18.1 && <0.19 || >=0.20.1 && <0.21
122.46 s
[pathway-compat-base] || >=0.21.1 && <0.22 || >=0.22.2 && <0.23 || >=0.24.2 && <0.25: using
122.46 s
[pathway-compat-base] doctest-0.24.3
122.46 s
[pathway-compat-base] Dependency pathway-compat-base: using pathway-compat-base-0.0.1.0
122.61 s
[pathway-path] Flags chosen: noisy-deprecations=True, verify-no-recursion=False
122.61 s
[pathway-path] Dependency base >=4.14.0 && <4.15 || >=4.15.0 && <4.16 || >=4.16.0 && <4.17 ||
122.61 s
[pathway-path] >=4.17.0 && <4.18 || >=4.18.0 && <4.19 || >=4.19.0 && <4.20 || >=4.20.0 &&
122.61 s
[pathway-path] <4.21 || >=4.21.0 && <4.22 || >=4.22.0 && <4.23: using base-4.19.2.0
122.61 s
[pathway-path] Dependency filepath >=1.4.2 && <1.5 || >=1.5.2 && <1.6: using
122.61 s
[pathway-path] filepath-1.4.301.0
122.61 s
[pathway-path] Dependency path >=0.9.0 && <0.10: using path-0.9.6
122.61 s
[pathway-path] Dependency pathway >=0.0.1 && <0.1: using pathway-0.0.1.0
122.61 s
[pathway-path] Dependency pathway-internal >=0.0.1 && <0.1: using pathway-internal-0.0.1.0
122.61 s
[pathway-path] Dependency yaya >=0.6.2 && <0.7 || >=0.7.0 && <0.8: using yaya-0.6.2.3
122.61 s
[pathway-path] Dependency yaya-unsafe >=0.4.1 && <0.5 || >=0.5.0 && <0.6: using
122.61 s
[pathway-path] yaya-unsafe-0.4.1.4
122.61 s
[pathway-path] Dependency QuickCheck >=2.14.2 && <2.15 || >=2.15.0 && <2.16 || >=2.16.0 &&
122.61 s
[pathway-path] <2.17 || >=2.17.1 && <2.18 || >=2.18.0 && <2.19: using QuickCheck-2.15.0.1
122.61 s
[pathway-path] Dependency base >=4.14.0 && <4.15 || >=4.15.0 && <4.16 || >=4.16.0 && <4.17 ||
122.61 s
[pathway-path] >=4.17.0 && <4.18 || >=4.18.0 && <4.19 || >=4.19.0 && <4.20 || >=4.20.0 &&
122.61 s
[pathway-path] <4.21 || >=4.21.0 && <4.22 || >=4.22.0 && <4.23: using base-4.19.2.0
122.61 s
[pathway-path] Dependency doctest >=0.16.3 && <0.17 || >=0.18.1 && <0.19 || >=0.20.1 && <0.21
122.61 s
[pathway-path] || >=0.21.1 && <0.22 || >=0.22.2 && <0.23 || >=0.24.2 && <0.25 || >=0.25.0 &&
122.61 s
[pathway-path] <0.26: using doctest-0.24.3
122.61 s
[pathway-path] Dependency pathway-path: using pathway-path-0.0.1.0
122.61 s
[pathway-path] Dependency pathway-quickcheck >=0.0.1 && <0.1: using
122.61 s
[pathway-path] pathway-quickcheck-0.0.1.0
122.81 s
[pathway-compat-base] Source component graph:
122.81 s
[pathway-compat-base] component lib
122.81 s
[pathway-compat-base] component test:doctests dependency lib
122.81 s
[pathway-compat-base] Configured component graph:
122.81 s
[pathway-compat-base] component pathway-compat-base-0.0.1.0-8ldj6SPXbxq2Shd8yFeOpr
122.81 s
[pathway-compat-base] include base-4.19.2.0-934f
122.81 s
[pathway-compat-base] include exceptions-0.10.7-2ac1
122.81 s
[pathway-compat-base] include megaparsec-9.7.0-10vHZAF1maw9O8p2gXs66N
122.81 s
[pathway-compat-base] include pathway-0.0.1.0-H5uD0SRA9755UrSqFBaCYE
122.81 s
[pathway-compat-base] include variant-1.0.2-LM0Un02zMMi4aizfZ11g92
122.81 s
[pathway-compat-base] component pathway-compat-base-0.0.1.0-2zQvX9jjaD62mq1j1l7L7-doctests
122.81 s
[pathway-compat-base] include base-4.19.2.0-934f
122.81 s
[pathway-compat-base] include doctest-0.24.3-1aDs7zEYV5r7raSsXr9TQC
122.81 s
[pathway-compat-base] include pathway-compat-base-0.0.1.0-8ldj6SPXbxq2Shd8yFeOpr
122.81 s
[pathway-compat-base] Linked component graph:
122.81 s
[pathway-compat-base] unit pathway-compat-base-0.0.1.0-8ldj6SPXbxq2Shd8yFeOpr
122.81 s
[pathway-compat-base] include base-4.19.2.0-934f
122.81 s
[pathway-compat-base] include exceptions-0.10.7-2ac1
122.81 s
[pathway-compat-base] include megaparsec-9.7.0-10vHZAF1maw9O8p2gXs66N
122.81 s
[pathway-compat-base] include pathway-0.0.1.0-H5uD0SRA9755UrSqFBaCYE
122.81 s
[pathway-compat-base] include variant-1.0.2-LM0Un02zMMi4aizfZ11g92
122.81 s
[pathway-compat-base] Common=pathway-compat-base-0.0.1.0-8ldj6SPXbxq2Shd8yFeOpr:Common,System.Environment.DropIn=pathway-compat-base-0.0.1.0-8ldj6SPXbxq2Shd8yFeOpr:System.Environment.DropIn,System.Environment.Overlay=pathway-compat-base-0.0.1.0-8ldj6SPXbxq2Shd8yFeOpr:System.Environment.Overlay,System.Environment.Pathway=pathway-compat-base-0.0.1.0-8ldj6SPXbxq2Shd8yFeOpr:System.Environment.Pathway,System.Environment.Thin=pathway-compat-base-0.0.1.0-8ldj6SPXbxq2Shd8yFeOpr:System.Environment.Thin,System.IO.Caught=pathway-compat-base-0.0.1.0-8ldj6SPXbxq2Shd8yFeOpr:System.IO.Caught,System.IO.DropIn=pathway-compat-base-0.0.1.0-8ldj6SPXbxq2Shd8yFeOpr:System.IO.DropIn,System.IO.Error.Caught=pathway-compat-base-0.0.1.0-8ldj6SPXbxq2Shd8yFeOpr:System.IO.Error.Caught,System.IO.Error.DropIn=pathway-compat-base-0.0.1.0-8ldj6SPXbxq2Shd8yFeOpr:System.IO.Error.DropIn,System.IO.Error.Overlay=pathway-compat-base-0.0.1.0-8ldj6SPXbxq2Shd8yFeOpr:System.IO.Error.Overlay,System.IO.Error.Pathway=pathway-compat-base-0.0.1.0-8ldj6SPXbxq2Shd8yFeOpr:System.IO.Error.Pathway,System.IO.Error.Thin=pathway-compat-base-0.0.1.0-8ldj6SPXbxq2Shd8yFeOpr:System.IO.Error.Thin,System.IO.Overlay=pathway-compat-base-0.0.1.0-8ldj6SPXbxq2Shd8yFeOpr:System.IO.Overlay,System.IO.Pathway=pathway-compat-base-0.0.1.0-8ldj6SPXbxq2Shd8yFeOpr:System.IO.Pathway,System.IO.Thin=pathway-compat-base-0.0.1.0-8ldj6SPXbxq2Shd8yFeOpr:System.IO.Thin
122.81 s
[pathway-compat-base] unit pathway-compat-base-0.0.1.0-2zQvX9jjaD62mq1j1l7L7-doctests
122.81 s
[pathway-compat-base] include base-4.19.2.0-934f
122.81 s
[pathway-compat-base] include doctest-0.24.3-1aDs7zEYV5r7raSsXr9TQC
122.81 s
[pathway-compat-base] include pathway-compat-base-0.0.1.0-8ldj6SPXbxq2Shd8yFeOpr
122.81 s
[pathway-compat-base] Ready component graph:
122.81 s
[pathway-compat-base] definite pathway-compat-base-0.0.1.0-8ldj6SPXbxq2Shd8yFeOpr
122.81 s
[pathway-compat-base] depends base-4.19.2.0-934f
122.81 s
[pathway-compat-base] depends exceptions-0.10.7-2ac1
122.81 s
[pathway-compat-base] depends megaparsec-9.7.0-10vHZAF1maw9O8p2gXs66N
122.81 s
[pathway-compat-base] depends pathway-0.0.1.0-H5uD0SRA9755UrSqFBaCYE
122.81 s
[pathway-compat-base] depends variant-1.0.2-LM0Un02zMMi4aizfZ11g92
122.81 s
[pathway-compat-base] definite pathway-compat-base-0.0.1.0-2zQvX9jjaD62mq1j1l7L7-doctests
122.81 s
[pathway-compat-base] depends base-4.19.2.0-934f
122.81 s
[pathway-compat-base] depends doctest-0.24.3-1aDs7zEYV5r7raSsXr9TQC
122.81 s
[pathway-compat-base] depends pathway-compat-base-0.0.1.0-8ldj6SPXbxq2Shd8yFeOpr
122.81 s
[pathway-compat-base] Using Cabal-3.10.3.0 compiled by ghc-9.8
122.81 s
[pathway-compat-base] Using compiler: ghc-9.8.4
122.81 s
[pathway-compat-base] Using install prefix:
122.81 s
[pathway-compat-base] /nix/store/ny5lqzrqpnzvq468547gg0f4nh1l5hp8-pathway-compat-base-0.0.1.0
122.81 s
[pathway-compat-base] Executables installed in:
122.81 s
[pathway-compat-base] /nix/store/ny5lqzrqpnzvq468547gg0f4nh1l5hp8-pathway-compat-base-0.0.1.0/bin
122.81 s
[pathway-compat-base] Libraries installed in:
122.81 s
[pathway-compat-base] /nix/store/ny5lqzrqpnzvq468547gg0f4nh1l5hp8-pathway-compat-base-0.0.1.0/lib/ghc-9.8.4/lib/x86_64-linux-ghc-9.8.4/pathway-compat-base-0.0.1.0-8ldj6SPXbxq2Shd8yFeOpr
122.81 s
[pathway-compat-base] Dynamic Libraries installed in:
122.81 s
[pathway-compat-base] /nix/store/ny5lqzrqpnzvq468547gg0f4nh1l5hp8-pathway-compat-base-0.0.1.0/lib/ghc-9.8.4/lib/x86_64-linux-ghc-9.8.4
122.81 s
[pathway-compat-base] Private executables installed in:
122.81 s
[pathway-compat-base] /nix/store/ny5lqzrqpnzvq468547gg0f4nh1l5hp8-pathway-compat-base-0.0.1.0/libexec/x86_64-linux-ghc-9.8.4/pathway-compat-base-0.0.1.0
122.81 s
[pathway-compat-base] Data files installed in:
122.81 s
[pathway-compat-base] /nix/store/ny5lqzrqpnzvq468547gg0f4nh1l5hp8-pathway-compat-base-0.0.1.0/share/x86_64-linux-ghc-9.8.4/pathway-compat-base-0.0.1.0
122.81 s
[pathway-compat-base] Documentation installed in:
122.81 s
[pathway-compat-base] /nix/store/8vrvsdrma8r8q2z0qf9d2v63gxkf06fp-pathway-compat-base-0.0.1.0-doc/share/doc/pathway-compat-base-0.0.1.0
122.81 s
[pathway-compat-base] Configuration files installed in:
122.81 s
[pathway-compat-base] /nix/store/ny5lqzrqpnzvq468547gg0f4nh1l5hp8-pathway-compat-base-0.0.1.0/etc
122.81 s
[pathway-compat-base] No alex found
122.81 s
[pathway-compat-base] Using ar found on system at:
122.81 s
[pathway-compat-base] /nix/store/zjraf40s86y3iwhp626b934r5y6ldkbb-binutils-wrapper-2.46/bin/ar
122.81 s
[pathway-compat-base] No c2hs found
122.81 s
[pathway-compat-base] No cpphs found
122.81 s
[pathway-compat-base] Using doctest version 0.24.3 found on system at:
122.81 s
[pathway-compat-base] /nix/store/2y183b1vsybv0157vfr59yhdwjkpqfkn-doctest-0.24.3/bin/doctest
122.81 s
[pathway-compat-base] Using gcc version 15.2.0 given by user at:
122.81 s
[pathway-compat-base] /nix/store/29qjlshvklnyr67nhpprzgb9igmsfsjj-gcc-wrapper-15.2.0/bin/gcc
122.81 s
[pathway-compat-base] Using ghc version 9.8.4 found on system at:
122.81 s
[pathway-compat-base] /nix/store/7r9b0bl984hdgd70nf5p8raa55kml491-ghc-9.8.4/bin/ghc
122.81 s
[pathway-compat-base] Using ghc-pkg version 9.8.4 found on system at:
122.81 s
[pathway-compat-base] /nix/store/7r9b0bl984hdgd70nf5p8raa55kml491-ghc-9.8.4/bin/ghc-pkg-9.8.4
122.81 s
[pathway-compat-base] No ghcjs found
122.81 s
[pathway-compat-base] No ghcjs-pkg found
122.81 s
[pathway-compat-base] No greencard found
122.81 s
[pathway-compat-base] Using haddock version 2.30.0 found on system at:
122.81 s
[pathway-compat-base] /nix/store/7r9b0bl984hdgd70nf5p8raa55kml491-ghc-9.8.4/bin/haddock-ghc-9.8.4
122.81 s
[pathway-compat-base] No happy found
122.81 s
[pathway-compat-base] Using haskell-suite found on system at: haskell-suite-dummy-location
122.81 s
[pathway-compat-base] Using haskell-suite-pkg found on system at: haskell-suite-pkg-dummy-location
122.81 s
[pathway-compat-base] No hmake found
122.81 s
[pathway-compat-base] Using hpc version 0.69 found on system at:
122.81 s
[pathway-compat-base] /nix/store/7r9b0bl984hdgd70nf5p8raa55kml491-ghc-9.8.4/bin/hpc-ghc-9.8.4
122.81 s
[pathway-compat-base] Using hsc2hs version 0.68.10 found on system at:
122.81 s
[pathway-compat-base] /nix/store/7r9b0bl984hdgd70nf5p8raa55kml491-ghc-9.8.4/bin/hsc2hs-ghc-9.8.4
122.81 s
[pathway-compat-base] Using hscolour version 1.25 found on system at:
122.81 s
[pathway-compat-base] /nix/store/awnxn98rlw62rrjwli6d2lb4d27mrzzw-hscolour-1.25/bin/HsColour
122.81 s
[pathway-compat-base] No jhc found
122.81 s
[pathway-compat-base] Using ld found on system at:
122.81 s
[pathway-compat-base] /nix/store/zjraf40s86y3iwhp626b934r5y6ldkbb-binutils-wrapper-2.46/bin/ld.gold
122.81 s
[pathway-compat-base] No pkg-config found
122.81 s
[pathway-compat-base] Using runghc version 9.8.4 found on system at:
122.81 s
[pathway-compat-base] /nix/store/7r9b0bl984hdgd70nf5p8raa55kml491-ghc-9.8.4/bin/runghc-9.8.4
122.81 s
[pathway-compat-base] Using strip version 2.46 found on system at:
122.81 s
[pathway-compat-base] /nix/store/29qjlshvklnyr67nhpprzgb9igmsfsjj-gcc-wrapper-15.2.0/bin/strip
122.81 s
[pathway-compat-base] Using tar found on system at:
122.81 s
[pathway-compat-base] /nix/store/z5mq2sam4484prf3kv6v6vjw1m0i7j24-gnutar-1.35/bin/tar
122.81 s
[pathway-compat-base] No uhc found
122.95 s
[pathway-path] Source component graph:
122.95 s
[pathway-path] component lib
122.95 s
[pathway-path] component test:doctests dependency lib
122.95 s
[pathway-path] Configured component graph:
122.95 s
[pathway-path] component pathway-path-0.0.1.0-ECz7RAvXGhGt6cWXv4vY3
122.95 s
[pathway-path] include base-4.19.2.0-934f
122.95 s
[pathway-path] include filepath-1.4.301.0-6e15
122.95 s
[pathway-path] include path-0.9.6-J2nX3CV5JUgHUsLQ0N8bnu
122.95 s
[pathway-path] include pathway-0.0.1.0-H5uD0SRA9755UrSqFBaCYE
122.95 s
[pathway-path] include pathway-internal-0.0.1.0-Lnjdb2M8cxN196wSdsfQUK
122.95 s
[pathway-path] include yaya-0.6.2.3-GccDDwL0TDlDZM8zUYiPLe
122.95 s
[pathway-path] include yaya-unsafe-0.4.1.4-IRheUGQykkRHDousPLwgn3
122.95 s
[pathway-path] component pathway-path-0.0.1.0-KbCbTV6e3Cf5CRjymisYcd-doctests
122.95 s
[pathway-path] include QuickCheck-2.15.0.1-LD31LrTXA1r25cYcwqMYw3
122.95 s
[pathway-path] include base-4.19.2.0-934f
122.95 s
[pathway-path] include doctest-0.24.3-1aDs7zEYV5r7raSsXr9TQC
122.95 s
[pathway-path] include pathway-path-0.0.1.0-ECz7RAvXGhGt6cWXv4vY3
122.95 s
[pathway-path] include pathway-quickcheck-0.0.1.0-4oIbmpgZGhDoseg1psLQA
122.95 s
[pathway-path] Linked component graph:
122.95 s
[pathway-path] unit pathway-path-0.0.1.0-ECz7RAvXGhGt6cWXv4vY3
122.95 s
[pathway-path] include base-4.19.2.0-934f
122.95 s
[pathway-path] include filepath-1.4.301.0-6e15
122.95 s
[pathway-path] include path-0.9.6-J2nX3CV5JUgHUsLQ0N8bnu
122.95 s
[pathway-path] include pathway-0.0.1.0-H5uD0SRA9755UrSqFBaCYE
122.95 s
[pathway-path] include pathway-internal-0.0.1.0-Lnjdb2M8cxN196wSdsfQUK
122.95 s
[pathway-path] include yaya-0.6.2.3-GccDDwL0TDlDZM8zUYiPLe
122.95 s
[pathway-path] include yaya-unsafe-0.4.1.4-IRheUGQykkRHDousPLwgn3
122.95 s
[pathway-path] Data.Path.Integration.Path=pathway-path-0.0.1.0-ECz7RAvXGhGt6cWXv4vY3:Data.Path.Integration.Path
122.95 s
[pathway-path] unit pathway-path-0.0.1.0-KbCbTV6e3Cf5CRjymisYcd-doctests
122.95 s
[pathway-path] include QuickCheck-2.15.0.1-LD31LrTXA1r25cYcwqMYw3
122.95 s
[pathway-path] include base-4.19.2.0-934f
122.95 s
[pathway-path] include doctest-0.24.3-1aDs7zEYV5r7raSsXr9TQC
122.95 s
[pathway-path] include pathway-path-0.0.1.0-ECz7RAvXGhGt6cWXv4vY3
122.95 s
[pathway-path] include pathway-quickcheck-0.0.1.0-4oIbmpgZGhDoseg1psLQA
122.95 s
[pathway-path] Ready component graph:
122.95 s
[pathway-path] definite pathway-path-0.0.1.0-ECz7RAvXGhGt6cWXv4vY3
122.95 s
[pathway-path] depends base-4.19.2.0-934f
122.95 s
[pathway-path] depends filepath-1.4.301.0-6e15
122.95 s
[pathway-path] depends path-0.9.6-J2nX3CV5JUgHUsLQ0N8bnu
122.95 s
[pathway-path] depends pathway-0.0.1.0-H5uD0SRA9755UrSqFBaCYE
122.95 s
[pathway-path] depends pathway-internal-0.0.1.0-Lnjdb2M8cxN196wSdsfQUK
122.95 s
[pathway-path] depends yaya-0.6.2.3-GccDDwL0TDlDZM8zUYiPLe
122.95 s
[pathway-path] depends yaya-unsafe-0.4.1.4-IRheUGQykkRHDousPLwgn3
122.95 s
[pathway-path] definite pathway-path-0.0.1.0-KbCbTV6e3Cf5CRjymisYcd-doctests
122.95 s
[pathway-path] depends QuickCheck-2.15.0.1-LD31LrTXA1r25cYcwqMYw3
122.95 s
[pathway-path] depends base-4.19.2.0-934f
122.95 s
[pathway-path] depends doctest-0.24.3-1aDs7zEYV5r7raSsXr9TQC
122.95 s
[pathway-path] depends pathway-path-0.0.1.0-ECz7RAvXGhGt6cWXv4vY3
122.95 s
[pathway-path] depends pathway-quickcheck-0.0.1.0-4oIbmpgZGhDoseg1psLQA
122.95 s
[pathway-path] Using Cabal-3.10.3.0 compiled by ghc-9.8
122.95 s
[pathway-path] Using compiler: ghc-9.8.4
122.95 s
[pathway-path] Using install prefix:
122.95 s
[pathway-path] /nix/store/zhnf64ql9iwqjbrywr875ymk3y16m46s-pathway-path-0.0.1.0
122.95 s
[pathway-path] Executables installed in:
122.95 s
[pathway-path] /nix/store/zhnf64ql9iwqjbrywr875ymk3y16m46s-pathway-path-0.0.1.0/bin
122.95 s
[pathway-path] Libraries installed in:
122.95 s
[pathway-path] /nix/store/zhnf64ql9iwqjbrywr875ymk3y16m46s-pathway-path-0.0.1.0/lib/ghc-9.8.4/lib/x86_64-linux-ghc-9.8.4/pathway-path-0.0.1.0-ECz7RAvXGhGt6cWXv4vY3
122.95 s
[pathway-path] Dynamic Libraries installed in:
122.95 s
[pathway-path] /nix/store/zhnf64ql9iwqjbrywr875ymk3y16m46s-pathway-path-0.0.1.0/lib/ghc-9.8.4/lib/x86_64-linux-ghc-9.8.4
122.95 s
[pathway-path] Private executables installed in:
122.95 s
[pathway-path] /nix/store/zhnf64ql9iwqjbrywr875ymk3y16m46s-pathway-path-0.0.1.0/libexec/x86_64-linux-ghc-9.8.4/pathway-path-0.0.1.0
122.95 s
[pathway-path] Data files installed in:
122.95 s
[pathway-path] /nix/store/zhnf64ql9iwqjbrywr875ymk3y16m46s-pathway-path-0.0.1.0/share/x86_64-linux-ghc-9.8.4/pathway-path-0.0.1.0
122.95 s
[pathway-path] Documentation installed in:
122.96 s
[pathway-path] /nix/store/f4iw36c17lxbzamcf3226jvpkhh8zig1-pathway-path-0.0.1.0-doc/share/doc/pathway-path-0.0.1.0
122.96 s
[pathway-path] Configuration files installed in:
122.96 s
[pathway-path] /nix/store/zhnf64ql9iwqjbrywr875ymk3y16m46s-pathway-path-0.0.1.0/etc
122.96 s
[pathway-path] No alex found
122.96 s
[pathway-path] Using ar found on system at:
122.96 s
[pathway-path] /nix/store/zjraf40s86y3iwhp626b934r5y6ldkbb-binutils-wrapper-2.46/bin/ar
122.96 s
[pathway-path] No c2hs found
122.96 s
[pathway-path] No cpphs found
122.96 s
[pathway-path] Using doctest version 0.24.3 found on system at:
122.96 s
[pathway-path] /nix/store/2y183b1vsybv0157vfr59yhdwjkpqfkn-doctest-0.24.3/bin/doctest
122.96 s
[pathway-path] Using gcc version 15.2.0 given by user at:
122.96 s
[pathway-path] /nix/store/29qjlshvklnyr67nhpprzgb9igmsfsjj-gcc-wrapper-15.2.0/bin/gcc
122.96 s
[pathway-path] Using ghc version 9.8.4 found on system at:
122.96 s
[pathway-path] /nix/store/7r9b0bl984hdgd70nf5p8raa55kml491-ghc-9.8.4/bin/ghc
122.96 s
[pathway-path] Using ghc-pkg version 9.8.4 found on system at:
122.96 s
[pathway-path] /nix/store/7r9b0bl984hdgd70nf5p8raa55kml491-ghc-9.8.4/bin/ghc-pkg-9.8.4
122.96 s
[pathway-path] No ghcjs found
122.96 s
[pathway-path] No ghcjs-pkg found
122.96 s
[pathway-path] No greencard found
122.96 s
[pathway-path] Using haddock version 2.30.0 found on system at:
122.96 s
[pathway-path] /nix/store/7r9b0bl984hdgd70nf5p8raa55kml491-ghc-9.8.4/bin/haddock-ghc-9.8.4
122.96 s
[pathway-path] No happy found
122.96 s
[pathway-path] Using haskell-suite found on system at: haskell-suite-dummy-location
122.96 s
[pathway-path] Using haskell-suite-pkg found on system at: haskell-suite-pkg-dummy-location
122.96 s
[pathway-path] No hmake found
122.96 s
[pathway-path] Using hpc version 0.69 found on system at:
122.96 s
[pathway-path] /nix/store/7r9b0bl984hdgd70nf5p8raa55kml491-ghc-9.8.4/bin/hpc-ghc-9.8.4
122.96 s
[pathway-path] Using hsc2hs version 0.68.10 found on system at:
122.96 s
[pathway-path] /nix/store/7r9b0bl984hdgd70nf5p8raa55kml491-ghc-9.8.4/bin/hsc2hs-ghc-9.8.4
122.96 s
[pathway-path] Using hscolour version 1.25 found on system at:
122.96 s
[pathway-path] /nix/store/awnxn98rlw62rrjwli6d2lb4d27mrzzw-hscolour-1.25/bin/HsColour
122.96 s
[pathway-path] No jhc found
122.96 s
[pathway-path] Using ld found on system at:
122.96 s
[pathway-path] /nix/store/zjraf40s86y3iwhp626b934r5y6ldkbb-binutils-wrapper-2.46/bin/ld.gold
122.96 s
[pathway-path] No pkg-config found
122.96 s
[pathway-path] Using runghc version 9.8.4 found on system at:
122.96 s
[pathway-path] /nix/store/7r9b0bl984hdgd70nf5p8raa55kml491-ghc-9.8.4/bin/runghc-9.8.4
122.96 s
[pathway-path] Using strip version 2.46 found on system at:
122.96 s
[pathway-path] /nix/store/29qjlshvklnyr67nhpprzgb9igmsfsjj-gcc-wrapper-15.2.0/bin/strip
122.96 s
[pathway-path] Using tar found on system at:
122.96 s
[pathway-path] /nix/store/z5mq2sam4484prf3kv6v6vjw1m0i7j24-gnutar-1.35/bin/tar
122.96 s
[pathway-path] No uhc found
123.26 s
[pathway-compat-base] Phase: buildPhase
123.33 s
[pathway-compat-base] Preprocessing library for pathway-compat-base-0.0.1.0..
123.33 s
[pathway-compat-base] Building library for pathway-compat-base-0.0.1.0..
123.48 s
[pathway-path] Phase: buildPhase
123.48 s
[pathway-compat-base] [ 1 of 15] Compiling Common ( src/Common.hs, dist/build/Common.o, dist/build/Common.dyn_o )
123.55 s
[pathway-path] Preprocessing library for pathway-path-0.0.1.0..
123.55 s
[pathway-path] Building library for pathway-path-0.0.1.0..
123.62 s
[pathway-path] [1 of 1] Compiling Data.Path.Integration.Path ( src/Data/Path/Integration/Path.hs, dist/build/Data/Path/Integration/Path.o, dist/build/Data/Path/Integration/Path.dyn_o )
124.00 s
[pathway-compat-base] [ 2 of 15] Compiling System.Environment.Thin ( src/System/Environment/Thin.hs, dist/build/System/Environment/Thin.o, dist/build/System/Environment/Thin.dyn_o )
124.01 s
[pathway-path] [1 of 1] Compiling Data.Path.Integration.Path ( src/Data/Path/Integration/Path.hs, dist/build/Data/Path/Integration/Path.p_o )
124.07 s
[pathway-compat-base] [ 3 of 15] Compiling System.Environment.Pathway ( src/System/Environment/Pathway.hs, dist/build/System/Environment/Pathway.o, dist/build/System/Environment/Pathway.dyn_o )
124.11 s
[pathway-compat-base] [ 4 of 15] Compiling System.Environment.Overlay ( src/System/Environment/Overlay.hs, dist/build/System/Environment/Overlay.o, dist/build/System/Environment/Overlay.dyn_o )
124.13 s
[pathway-compat-base] [ 5 of 15] Compiling System.Environment.DropIn ( src/System/Environment/DropIn.hs, dist/build/System/Environment/DropIn.o, dist/build/System/Environment/DropIn.dyn_o )
124.17 s
[pathway-compat-base] [ 6 of 15] Compiling System.IO.Error.Caught ( src/System/IO/Error/Caught.hs, dist/build/System/IO/Error/Caught.o, dist/build/System/IO/Error/Caught.dyn_o )
124.17 s
[pathway-compat-base] [ 7 of 15] Compiling System.IO.Error.Thin ( src/System/IO/Error/Thin.hs, dist/build/System/IO/Error/Thin.o, dist/build/System/IO/Error/Thin.dyn_o )
124.17 s
[pathway-compat-base] [ 8 of 15] Compiling System.IO.Error.Pathway ( src/System/IO/Error/Pathway.hs, dist/build/System/IO/Error/Pathway.o, dist/build/System/IO/Error/Pathway.dyn_o )
124.17 s
[pathway-compat-base] [ 9 of 15] Compiling System.IO.Error.Overlay ( src/System/IO/Error/Overlay.hs, dist/build/System/IO/Error/Overlay.o, dist/build/System/IO/Error/Overlay.dyn_o )
124.17 s
[pathway-compat-base] [10 of 15] Compiling System.IO.Error.DropIn ( src/System/IO/Error/DropIn.hs, dist/build/System/IO/Error/DropIn.o, dist/build/System/IO/Error/DropIn.dyn_o )
124.17 s
[pathway-compat-base] [11 of 15] Compiling System.IO.Thin ( src/System/IO/Thin.hs, dist/build/System/IO/Thin.o, dist/build/System/IO/Thin.dyn_o )
124.17 s
[pathway-compat-base] [12 of 15] Compiling System.IO.Overlay ( src/System/IO/Overlay.hs, dist/build/System/IO/Overlay.o, dist/build/System/IO/Overlay.dyn_o )
124.19 s
[pathway-compat-base] [13 of 15] Compiling System.IO.DropIn ( src/System/IO/DropIn.hs, dist/build/System/IO/DropIn.o, dist/build/System/IO/DropIn.dyn_o )
124.23 s
[pathway-compat-base] [14 of 15] Compiling System.IO.Caught ( src/System/IO/Caught.hs, dist/build/System/IO/Caught.o, dist/build/System/IO/Caught.dyn_o )
124.23 s
[pathway-compat-base] [15 of 15] Compiling System.IO.Pathway ( src/System/IO/Pathway.hs, dist/build/System/IO/Pathway.o, dist/build/System/IO/Pathway.dyn_o )
124.50 s
[pathway-compat-base] [ 1 of 15] Compiling Common ( src/Common.hs, dist/build/Common.p_o )
125.04 s
[pathway-compat-base] [ 2 of 15] Compiling System.Environment.Thin ( src/System/Environment/Thin.hs, dist/build/System/Environment/Thin.p_o )
125.24 s
[pathway-compat-base] [ 3 of 15] Compiling System.Environment.Pathway ( src/System/Environment/Pathway.hs, dist/build/System/Environment/Pathway.p_o )
125.40 s
[pathway-compat-base] [ 4 of 15] Compiling System.Environment.Overlay ( src/System/Environment/Overlay.hs, dist/build/System/Environment/Overlay.p_o )
125.43 s
[pathway-compat-base] [ 5 of 15] Compiling System.Environment.DropIn ( src/System/Environment/DropIn.hs, dist/build/System/Environment/DropIn.p_o )
125.59 s
[pathway-compat-base] [ 6 of 15] Compiling System.IO.Error.Caught ( src/System/IO/Error/Caught.hs, dist/build/System/IO/Error/Caught.p_o )
125.59 s
[pathway-compat-base] [ 7 of 15] Compiling System.IO.Error.Thin ( src/System/IO/Error/Thin.hs, dist/build/System/IO/Error/Thin.p_o )
125.60 s
[pathway-compat-base] [ 8 of 15] Compiling System.IO.Error.Pathway ( src/System/IO/Error/Pathway.hs, dist/build/System/IO/Error/Pathway.p_o )
125.60 s
[pathway-compat-base] [ 9 of 15] Compiling System.IO.Error.Overlay ( src/System/IO/Error/Overlay.hs, dist/build/System/IO/Error/Overlay.p_o )
125.60 s
[pathway-compat-base] [10 of 15] Compiling System.IO.Error.DropIn ( src/System/IO/Error/DropIn.hs, dist/build/System/IO/Error/DropIn.p_o )
125.60 s
[pathway-compat-base] [11 of 15] Compiling System.IO.Thin ( src/System/IO/Thin.hs, dist/build/System/IO/Thin.p_o )
125.60 s
[pathway-compat-base] [12 of 15] Compiling System.IO.Overlay ( src/System/IO/Overlay.hs, dist/build/System/IO/Overlay.p_o )
125.60 s
[pathway-compat-base] [13 of 15] Compiling System.IO.DropIn ( src/System/IO/DropIn.hs, dist/build/System/IO/DropIn.p_o )
125.67 s
[pathway-compat-base] [14 of 15] Compiling System.IO.Caught ( src/System/IO/Caught.hs, dist/build/System/IO/Caught.p_o )
125.67 s
[pathway-compat-base] [15 of 15] Compiling System.IO.Pathway ( src/System/IO/Pathway.hs, dist/build/System/IO/Pathway.p_o )
126.43 s
[pathway-path] Preprocessing test suite 'doctests' for pathway-path-0.0.1.0..
126.43 s
[pathway-path] Building test suite 'doctests' for pathway-path-0.0.1.0..
126.50 s
[pathway-path] [1 of 2] Compiling Build_doctests ( dist/build/doctests/autogen/Build_doctests.hs, dist/build/doctests/doctests-tmp/Build_doctests.o )
126.69 s
[pathway-path] [2 of 2] Compiling Main ( tests/doctests.hs, dist/build/doctests/doctests-tmp/Main.o )
126.94 s
[pathway-path] [3 of 3] Linking dist/build/doctests/doctests
127.55 s
[pathway-compat-base] Preprocessing test suite 'doctests' for pathway-compat-base-0.0.1.0..
127.55 s
[pathway-compat-base] Building test suite 'doctests' for pathway-compat-base-0.0.1.0..
127.61 s
[pathway-compat-base] [1 of 2] Compiling Build_doctests ( dist/build/doctests/autogen/Build_doctests.hs, dist/build/doctests/doctests-tmp/Build_doctests.o )
127.80 s
[pathway-compat-base] [2 of 2] Compiling Main ( tests/doctests.hs, dist/build/doctests/doctests-tmp/Main.o )
128.03 s
[pathway-compat-base] [3 of 3] Linking dist/build/doctests/doctests
130.29 s
[pathway-path] Phase: checkPhase
130.34 s
[pathway-path] Running 1 test suites...
130.34 s
[pathway-path] Test suite doctests: RUNNING...
130.79 s
[pathway-path] Examples: 0 Tried: 0 Errors: 0 Failures: 0
130.83 s
[pathway-path] Test suite doctests: PASS
130.83 s
[pathway-path] Test suite logged to: dist/test/pathway-path-0.0.1.0-doctests.log
130.83 s
[pathway-path] 1 of 1 test suites (1 of 1 test cases) passed.
130.84 s
[pathway-path] Phase: haddockPhase
130.97 s
[pathway-path] Preprocessing library for pathway-path-0.0.1.0..
130.97 s
[pathway-path] Running Haddock on library for pathway-path-0.0.1.0..
130.97 s
[pathway-path] Warning: The documentation for the following packages are not installed. No
130.97 s
[pathway-path] links will be generated to these packages: path-0.9.6, path-0.9.6,
130.97 s
[pathway-path] vector-0.13.2.0
131.03 s
[pathway-path] Warning: --source-* options are ignored when --hyperlinked-source is enabled.
131.15 s
[pathway-path] [1 of 1] Compiling Data.Path.Integration.Path ( src/Data/Path/Integration/Path.hs, nothing )
131.31 s
[pathway-compat-base] Phase: checkPhase
131.34 s
[pathway-path] Haddock coverage:
131.34 s
[pathway-path] Warning: 'Any' is out of scope.
131.34 s
[pathway-path] If you qualify the identifier, haddock can try to link it anyway.
131.34 s
[pathway-path] Warning: 'AmbiguousPath' is out of scope.
131.34 s
[pathway-path] If you qualify the identifier, haddock can try to link it anyway.
131.34 s
[pathway-path] 100% ( 1 / 1) in 'Data.Path.Integration.Path'
131.36 s
[pathway-compat-base] Running 1 test suites...
131.36 s
[pathway-compat-base] Test suite doctests: RUNNING...
131.48 s
[pathway-path] Warning: Data.Path.Integration.Path: could not find link destinations for:
131.48 s
[pathway-path] - Path.Internal.Posix.Path
131.48 s
[pathway-path] - Path.Posix.Abs
131.48 s
[pathway-path] - Path.Posix.Dir
131.48 s
[pathway-path] - Path.Posix.File
131.48 s
[pathway-path] - Path.Posix.Rel
131.48 s
[pathway-path] - Path.Posix.SomeBase
131.69 s
[pathway-compat-base]
131.69 s
[pathway-compat-base] on the commandline: warning: [GHC-98887]
131.69 s
[pathway-compat-base] -XTemplateHaskell is not allowed in Safe Haskell; ignoring -XTemplateHaskell
131.69 s
[pathway-compat-base]
131.69 s
[pathway-compat-base] on the commandline: warning: [GHC-98887]
131.69 s
[pathway-compat-base] -XTemplateHaskell is not allowed in Safe Haskell; ignoring -XTemplateHaskell
131.69 s
[pathway-compat-base]
131.69 s
[pathway-compat-base] on the commandline: warning: [GHC-98887]
131.69 s
[pathway-compat-base] -XTemplateHaskell is not allowed in Safe Haskell; ignoring -XTemplateHaskell
131.70 s
[pathway-compat-base]
131.70 s
[pathway-compat-base] on the commandline: warning: [GHC-98887]
131.70 s
[pathway-compat-base] -XTemplateHaskell is not allowed in Safe Haskell; ignoring -XTemplateHaskell
131.72 s
[pathway-compat-base]
131.72 s
[pathway-compat-base] on the commandline: warning: [GHC-98887]
131.72 s
[pathway-compat-base] -XTemplateHaskell is not allowed in Safe Haskell; ignoring -XTemplateHaskell
131.72 s
[pathway-compat-base]
131.72 s
[pathway-compat-base] on the commandline: warning: [GHC-98887]
131.72 s
[pathway-compat-base] -XTemplateHaskell is not allowed in Safe Haskell; ignoring -XTemplateHaskell
131.72 s
[pathway-compat-base]
131.72 s
[pathway-compat-base] on the commandline: warning: [GHC-98887]
131.72 s
[pathway-compat-base] -XTemplateHaskell is not allowed in Safe Haskell; ignoring -XTemplateHaskell
131.72 s
[pathway-compat-base]
131.72 s
[pathway-compat-base] on the commandline: warning: [GHC-98887]
131.72 s
[pathway-compat-base] -XTemplateHaskell is not allowed in Safe Haskell; ignoring -XTemplateHaskell
131.72 s
[pathway-compat-base]
131.72 s
[pathway-compat-base] on the commandline: warning: [GHC-98887]
131.72 s
[pathway-compat-base] -XTemplateHaskell is not allowed in Safe Haskell; ignoring -XTemplateHaskell
131.72 s
[pathway-compat-base]
131.72 s
[pathway-compat-base] on the commandline: warning: [GHC-98887]
131.72 s
[pathway-compat-base] -XTemplateHaskell is not allowed in Safe Haskell; ignoring -XTemplateHaskell
131.72 s
[pathway-compat-base]
131.72 s
[pathway-compat-base] on the commandline: warning: [GHC-98887]
131.72 s
[pathway-compat-base] -XTemplateHaskell is not allowed in Safe Haskell; ignoring -XTemplateHaskell
131.73 s
[pathway-compat-base]
131.73 s
[pathway-compat-base] on the commandline: warning: [GHC-98887]
131.73 s
[pathway-compat-base] -XTemplateHaskell is not allowed in Safe Haskell; ignoring -XTemplateHaskell
131.73 s
[pathway-compat-base]
131.73 s
[pathway-compat-base] on the commandline: warning: [GHC-98887]
131.73 s
[pathway-compat-base] -XTemplateHaskell is not allowed in Safe Haskell; ignoring -XTemplateHaskell
131.73 s
[pathway-compat-base]
131.73 s
[pathway-compat-base] on the commandline: warning: [GHC-98887]
131.73 s
[pathway-compat-base] -XTemplateHaskell is not allowed in Safe Haskell; ignoring -XTemplateHaskell
131.75 s
[pathway-compat-base]
131.75 s
[pathway-compat-base] on the commandline: warning: [GHC-98887]
131.75 s
[pathway-compat-base] -XTemplateHaskell is not allowed in Safe Haskell; ignoring -XTemplateHaskell
131.75 s
[pathway-compat-base]
131.75 s
[pathway-compat-base] on the commandline: warning: [GHC-98887]
131.75 s
[pathway-compat-base] -XTemplateHaskell is not allowed in Safe Haskell; ignoring -XTemplateHaskell
131.75 s
[pathway-compat-base]
131.75 s
[pathway-compat-base] on the commandline: warning: [GHC-98887]
131.75 s
[pathway-compat-base] -XTemplateHaskell is not allowed in Safe Haskell; ignoring -XTemplateHaskell
131.75 s
[pathway-compat-base]
131.75 s
[pathway-compat-base] on the commandline: warning: [GHC-98887]
131.75 s
[pathway-compat-base] -XTemplateHaskell is not allowed in Safe Haskell; ignoring -XTemplateHaskell
131.75 s
[pathway-compat-base]
131.75 s
[pathway-compat-base] on the commandline: warning: [GHC-98887]
131.75 s
[pathway-compat-base] -XTemplateHaskell is not allowed in Safe Haskell; ignoring -XTemplateHaskell
131.75 s
[pathway-compat-base]
131.75 s
[pathway-compat-base] on the commandline: warning: [GHC-98887]
131.76 s
[pathway-compat-base] -XTemplateHaskell is not allowed in Safe Haskell; ignoring -XTemplateHaskell
131.76 s
[pathway-compat-base]
131.76 s
[pathway-compat-base] on the commandline: warning: [GHC-98887]
131.76 s
[pathway-compat-base] -XTemplateHaskell is not allowed in Safe Haskell; ignoring -XTemplateHaskell
131.76 s
[pathway-compat-base]
131.76 s
[pathway-compat-base] on the commandline: warning: [GHC-98887]
131.76 s
[pathway-compat-base] -XTemplateHaskell is not allowed in Safe Haskell; ignoring -XTemplateHaskell
131.76 s
[pathway-compat-base]
131.76 s
[pathway-compat-base] on the commandline: warning: [GHC-98887]
131.76 s
[pathway-compat-base] -XTemplateHaskell is not allowed in Safe Haskell; ignoring -XTemplateHaskell
132.20 s
[pathway-compat-base] Examples: 0 Tried: 0 Errors: 0 Failures: 0
132.25 s
[pathway-compat-base] Test suite doctests: PASS
132.25 s
[pathway-compat-base] Test suite logged to: dist/test/pathway-compat-base-0.0.1.0-doctests.log
132.25 s
[pathway-compat-base] 1 of 1 test suites (1 of 1 test cases) passed.
132.26 s
[pathway-compat-base] Phase: haddockPhase
132.41 s
[pathway-compat-base] Preprocessing library for pathway-compat-base-0.0.1.0..
132.42 s
[pathway-compat-base] Running Haddock on library for pathway-compat-base-0.0.1.0..
132.42 s
[pathway-compat-base] Warning: The documentation for the following packages are not installed. No
132.42 s
[pathway-compat-base] links will be generated to these packages: vector-0.13.2.0
132.47 s
[pathway-compat-base] Warning: --source-* options are ignored when --hyperlinked-source is enabled.
132.67 s
[pathway-compat-base] [ 1 of 15] Compiling Common ( src/Common.hs, nothing )
133.00 s
[pathway-compat-base] [ 2 of 15] Compiling System.Environment.Thin ( src/System/Environment/Thin.hs, nothing )
133.01 s
[pathway-compat-base] [ 3 of 15] Compiling System.Environment.Pathway ( src/System/Environment/Pathway.hs, nothing )
133.01 s
[pathway-compat-base] [ 4 of 15] Compiling System.Environment.Overlay ( src/System/Environment/Overlay.hs, nothing )
133.02 s
[pathway-compat-base] [ 5 of 15] Compiling System.Environment.DropIn ( src/System/Environment/DropIn.hs, nothing )
133.02 s
[pathway-compat-base] [ 6 of 15] Compiling System.IO.Error.Caught ( src/System/IO/Error/Caught.hs, nothing )
133.02 s
[pathway-compat-base] [ 7 of 15] Compiling System.IO.Error.Thin ( src/System/IO/Error/Thin.hs, nothing )
133.02 s
[pathway-compat-base] [ 8 of 15] Compiling System.IO.Error.Pathway ( src/System/IO/Error/Pathway.hs, nothing )
133.02 s
[pathway-compat-base] [ 9 of 15] Compiling System.IO.Error.Overlay ( src/System/IO/Error/Overlay.hs, nothing )
133.02 s
[pathway-compat-base] [10 of 15] Compiling System.IO.Error.DropIn ( src/System/IO/Error/DropIn.hs, nothing )
133.02 s
[pathway-compat-base] [11 of 15] Compiling System.IO.Thin ( src/System/IO/Thin.hs, nothing )
133.02 s
[pathway-compat-base] [12 of 15] Compiling System.IO.Overlay ( src/System/IO/Overlay.hs, nothing )
133.03 s
[pathway-compat-base] [13 of 15] Compiling System.IO.DropIn ( src/System/IO/DropIn.hs, nothing )
133.03 s
[pathway-compat-base] [14 of 15] Compiling System.IO.Caught ( src/System/IO/Caught.hs, nothing )
133.04 s
[pathway-compat-base] [15 of 15] Compiling System.IO.Pathway ( src/System/IO/Pathway.hs, nothing )
133.05 s
[pathway-compat-base] Haddock coverage:
133.05 s
[pathway-compat-base] Warning: '</?>' is out of scope.
133.05 s
[pathway-compat-base] If you qualify the identifier, haddock can try to link it anyway.
133.05 s
[pathway-compat-base] Warning: '<$>' is out of scope.
133.05 s
[pathway-compat-base] If you qualify the identifier, haddock can try to link it anyway.
133.05 s
[pathway-compat-base] Warning: 'getCurrentDirectory' is out of scope.
133.05 s
[pathway-compat-base] If you qualify the identifier, haddock can try to link it anyway.
133.05 s
[pathway-compat-base] Warning: 'makeRelativeToCurrentDirectory' is out of scope.
133.05 s
[pathway-compat-base] If you qualify the identifier, haddock can try to link it anyway.
133.05 s
[pathway-compat-base] Warning: 'IOError' is out of scope.
133.05 s
[pathway-compat-base] If you qualify the identifier, haddock can try to link it anyway.
133.05 s
[pathway-compat-base] 14% ( 1 / 7) in 'Common'
133.05 s
[pathway-compat-base] Missing documentation for:
133.05 s
[pathway-compat-base] InternalFailure (src/Common.hs:69)
133.05 s
[pathway-compat-base] toPathRep (src/Common.hs:85)
133.05 s
[pathway-compat-base] fromPathRep (src/Common.hs:91)
133.05 s
[pathway-compat-base] handleAnchoredPath (src/Common.hs:98)
133.05 s
[pathway-compat-base] absFileFromPathRep (src/Common.hs:104)
133.05 s
[pathway-compat-base] fileFromPathRep (src/Common.hs:120)
133.05 s
[pathway-compat-base] Warning: '</?>' is out of scope.
133.05 s
[pathway-compat-base] If you qualify the identifier, haddock can try to link it anyway.
133.05 s
[pathway-compat-base] Warning: 'getCurrentDirectory' is out of scope.
133.05 s
[pathway-compat-base] If you qualify the identifier, haddock can try to link it anyway.
133.05 s
[pathway-compat-base] Warning: 'makeRelativeToCurrentDirectory' is out of scope.
133.05 s
[pathway-compat-base] If you qualify the identifier, haddock can try to link it anyway.
133.05 s
[pathway-compat-base] Warning: 'IOError' is out of scope.
133.05 s
[pathway-compat-base] If you qualify the identifier, haddock can try to link it anyway.
133.05 s
[pathway-compat-base] Warning: 'Anchored' is out of scope.
133.05 s
[pathway-compat-base] If you qualify the identifier, haddock can try to link it anyway.
133.05 s
[pathway-compat-base] 33% ( 1 / 3) in 'System.Environment.Thin'
133.05 s
[pathway-compat-base] Missing documentation for:
133.05 s
[pathway-compat-base] executablePath (src/System/Environment/Thin.hs:58)
133.05 s
[pathway-compat-base] getExecutablePath (src/System/Environment/Thin.hs:72)
133.05 s
[pathway-compat-base] 100% ( 11 / 11) in 'System.Environment.Pathway'
133.05 s
[pathway-compat-base] Warning: '</?>' is out of scope.
133.05 s
[pathway-compat-base] If you qualify the identifier, haddock can try to link it anyway.
133.05 s
[pathway-compat-base] Warning: 'getCurrentDirectory' is out of scope.
133.05 s
[pathway-compat-base] If you qualify the identifier, haddock can try to link it anyway.
133.05 s
[pathway-compat-base] Warning: 'makeRelativeToCurrentDirectory' is out of scope.
133.05 s
[pathway-compat-base] If you qualify the identifier, haddock can try to link it anyway.
133.05 s
[pathway-compat-base] Warning: 'IOError' is out of scope.
133.05 s
[pathway-compat-base] If you qualify the identifier, haddock can try to link it anyway.
133.05 s
[pathway-compat-base] 33% ( 1 / 3) in 'System.Environment.Overlay'
133.05 s
[pathway-compat-base] Missing documentation for:
133.05 s
[pathway-compat-base] executablePath (src/System/Environment/Overlay.hs:51)
133.05 s
[pathway-compat-base] getExecutablePath (src/System/Environment/Overlay.hs:55)
133.05 s
[pathway-compat-base] 100% ( 11 / 11) in 'System.Environment.DropIn'
133.06 s
[pathway-compat-base] 90% ( 10 / 11) in 'System.IO.Error.Caught'
133.06 s
[pathway-compat-base] Missing documentation for:
133.06 s
[pathway-compat-base] AlreadyInUseError (src/System/IO/Error/Caught.hs:103)
133.06 s
[pathway-compat-base] 0% ( 0 / 5) in 'System.IO.Error.Thin'
133.06 s
[pathway-compat-base] Missing documentation for:
133.06 s
[pathway-compat-base] Module header
133.06 s
[pathway-compat-base] mkIOError (src/System/IO/Error/Thin.hs:29)
133.06 s
[pathway-compat-base] annotateIOError (src/System/IO/Error/Thin.hs:33)
133.06 s
[pathway-compat-base] ioeGetFileName (src/System/IO/Error/Thin.hs:39)
133.06 s
[pathway-compat-base] ioeSetFileName (src/System/IO/Error/Thin.hs:42)
133.06 s
[pathway-compat-base] 82% ( 37 / 45) in 'System.IO.Error.Pathway'
133.06 s
[pathway-compat-base] Missing documentation for:
133.06 s
[pathway-compat-base] ioeGetErrorType
133.06 s
[pathway-compat-base] ioeGetErrorString
133.06 s
[pathway-compat-base] ioeGetLocation
133.06 s
[pathway-compat-base] ioeGetHandle
133.06 s
[pathway-compat-base] ioeSetErrorType
133.06 s
[pathway-compat-base] ioeSetErrorString
133.06 s
[pathway-compat-base] ioeSetLocation
133.06 s
[pathway-compat-base] ioeSetHandle
133.06 s
[pathway-compat-base] 0% ( 0 / 2) in 'System.IO.Error.Overlay'
133.06 s
[pathway-compat-base] Missing documentation for:
133.06 s
[pathway-compat-base] Module header
133.06 s
[pathway-compat-base] ioeGetFileName (src/System/IO/Error/Overlay.hs:21)
133.06 s
[pathway-compat-base] 76% ( 36 / 47) in 'System.IO.Error.DropIn'
133.06 s
[pathway-compat-base] Missing documentation for:
133.06 s
[pathway-compat-base] ioeGetErrorType
133.06 s
[pathway-compat-base] ioeGetErrorString
133.06 s
[pathway-compat-base] ioeGetLocation
133.06 s
[pathway-compat-base] ioeGetHandle
133.06 s
[pathway-compat-base] ioeSetErrorType
133.06 s
[pathway-compat-base] ioeSetErrorString
133.06 s
[pathway-compat-base] ioeSetLocation
133.06 s
[pathway-compat-base] ioeSetHandle
133.06 s
[pathway-compat-base] mkIOError (src/System/IO/Error/Thin.hs:29)
133.06 s
[pathway-compat-base] ioeSetFileName (src/System/IO/Error/Thin.hs:42)
133.06 s
[pathway-compat-base] annotateIOError (src/System/IO/Error/Thin.hs:33)
133.06 s
[pathway-compat-base] 0% ( 0 / 13) in 'System.IO.Thin'
133.06 s
[pathway-compat-base] Missing documentation for:
133.06 s
[pathway-compat-base] Module header
133.06 s
[pathway-compat-base] withFile (src/System/IO/Thin.hs:32)
133.06 s
[pathway-compat-base] openFile (src/System/IO/Thin.hs:35)
133.06 s
[pathway-compat-base] readFile (src/System/IO/Thin.hs:38)
133.06 s
[pathway-compat-base] readFile' (src/System/IO/Thin.hs:41)
133.06 s
[pathway-compat-base] writeFile (src/System/IO/Thin.hs:44)
133.06 s
[pathway-compat-base] appendFile (src/System/IO/Thin.hs:47)
133.06 s
[pathway-compat-base] withBinaryFile (src/System/IO/Thin.hs:50)
133.06 s
[pathway-compat-base] openBinaryFile (src/System/IO/Thin.hs:53)
133.06 s
[pathway-compat-base] openTempFile (src/System/IO/Thin.hs:66)
133.06 s
[pathway-compat-base] openBinaryTempFile (src/System/IO/Thin.hs:80)
133.06 s
[pathway-compat-base] openTempFileWithDefaultPermissions (src/System/IO/Thin.hs:89)
133.06 s
[pathway-compat-base] openBinaryTempFileWithDefaultPermissions (src/System/IO/Thin.hs:98)
133.06 s
[pathway-compat-base] 0% ( 0 / 5) in 'System.IO.Overlay'
133.06 s
[pathway-compat-base] Missing documentation for:
133.06 s
[pathway-compat-base] Module header
133.06 s
[pathway-compat-base] openTempFile (src/System/IO/Overlay.hs:24)
133.06 s
[pathway-compat-base] openBinaryTempFile (src/System/IO/Overlay.hs:30)
133.06 s
[pathway-compat-base] openTempFileWithDefaultPermissions (src/System/IO/Overlay.hs:34)
133.06 s
[pathway-compat-base] openBinaryTempFileWithDefaultPermissions (src/System/IO/Overlay.hs:41)
133.06 s
[pathway-compat-base] 80% ( 73 / 91) in 'System.IO.DropIn'
133.06 s
[pathway-compat-base] Missing documentation for:
133.06 s
[pathway-compat-base] stdout
133.06 s
[pathway-compat-base] stdin
133.06 s
[pathway-compat-base] stderr
133.06 s
[pathway-compat-base] hPutBufNonBlocking
133.06 s
[pathway-compat-base] HandlePosn
133.06 s
[pathway-compat-base] hIsOpen
133.06 s
[pathway-compat-base] hIsClosed
133.06 s
[pathway-compat-base] hIsReadable
133.06 s
[pathway-compat-base] hIsWritable
133.06 s
[pathway-compat-base] hIsSeekable
133.06 s
[pathway-compat-base] openFile (src/System/IO/Thin.hs:35)
133.06 s
[pathway-compat-base] readFile' (src/System/IO/Thin.hs:41)
133.06 s
[pathway-compat-base] writeFile (src/System/IO/Thin.hs:44)
133.06 s
[pathway-compat-base] withFile (src/System/IO/Thin.hs:32)
133.06 s
[pathway-compat-base] openBinaryFile (src/System/IO/Thin.hs:53)
133.06 s
[pathway-compat-base] withBinaryFile (src/System/IO/Thin.hs:50)
133.06 s
[pathway-compat-base] readFile (src/System/IO/Thin.hs:38)
133.06 s
[pathway-compat-base] appendFile (src/System/IO/Thin.hs:47)
133.06 s
[pathway-compat-base] 20% ( 1 / 5) in 'System.IO.Caught'
133.06 s
[pathway-compat-base] Missing documentation for:
133.06 s
[pathway-compat-base] Module header
133.06 s
[pathway-compat-base] OpenFileFailure (src/System/IO/Caught.hs:38)
133.06 s
[pathway-compat-base] openFile (src/System/IO/Caught.hs:50)
133.06 s
[pathway-compat-base] recoverOpenFileFailure (src/System/IO/Caught.hs:41)
133.07 s
[pathway-compat-base] 77% ( 73 / 94) in 'System.IO.Pathway'
133.07 s
[pathway-compat-base] Missing documentation for:
133.07 s
[pathway-compat-base] stdout
133.07 s
[pathway-compat-base] stdin
133.07 s
[pathway-compat-base] stderr
133.07 s
[pathway-compat-base] hPutBufNonBlocking
133.07 s
[pathway-compat-base] HandlePosn
133.07 s
[pathway-compat-base] hIsOpen
133.07 s
[pathway-compat-base] hIsClosed
133.07 s
[pathway-compat-base] hIsReadable
133.07 s
[pathway-compat-base] hIsWritable
133.07 s
[pathway-compat-base] hIsSeekable
133.07 s
[pathway-compat-base] readFile' (src/System/IO/Thin.hs:41)
133.07 s
[pathway-compat-base] writeFile (src/System/IO/Thin.hs:44)
133.07 s
[pathway-compat-base] withFile (src/System/IO/Thin.hs:32)
133.07 s
[pathway-compat-base] openBinaryFile (src/System/IO/Thin.hs:53)
133.07 s
[pathway-compat-base] withBinaryFile (src/System/IO/Thin.hs:50)
133.07 s
[pathway-compat-base] readFile (src/System/IO/Thin.hs:38)
133.07 s
[pathway-compat-base] appendFile (src/System/IO/Thin.hs:47)
133.07 s
[pathway-compat-base] openTempFile (src/System/IO/Thin.hs:66)
133.07 s
[pathway-compat-base] openBinaryTempFile (src/System/IO/Thin.hs:80)
133.07 s
[pathway-compat-base] openTempFileWithDefaultPermissions (src/System/IO/Thin.hs:89)
133.07 s
[pathway-compat-base] openBinaryTempFileWithDefaultPermissions (src/System/IO/Thin.hs:98)
133.48 s
[pathway-compat-base] Warning: Common: could not find link destinations for:
133.48 s
[pathway-compat-base] - Common.Rep_InternalFailure
133.48 s
[pathway-compat-base] Warning: System.IO.Error.Caught: could not find link destinations for:
133.48 s
[pathway-compat-base] - System.IO.Error.Caught.Rep_UnsatisfiedConstraints
133.48 s
[pathway-compat-base] - System.IO.Error.Caught.Rep_UnsupportedOperation
133.48 s
[pathway-compat-base] - System.IO.Error.Caught.Rep_AlreadyInUseError
133.48 s
[pathway-compat-base] - System.IO.Error.Caught.Rep_AlreadyExistsError
133.48 s
[pathway-compat-base] - System.IO.Error.Caught.Rep_DoesNotExistError
133.48 s
[pathway-compat-base] - System.IO.Error.Caught.Rep_FullError
133.48 s
[pathway-compat-base] - System.IO.Error.Caught.Rep_InappropriateType
133.48 s
[pathway-compat-base] - System.IO.Error.Caught.Rep_InvalidArgument
133.48 s
[pathway-compat-base] - System.IO.Error.Caught.Rep_HardwareFault
133.48 s
[pathway-compat-base] - System.IO.Error.Caught.Rep_PermissionError
133.49 s
[pathway-compat-base] Warning: System.IO.DropIn: could not find link destinations for:
133.49 s
[pathway-compat-base] - Control.Monad.Primitive.D:R:PrimStateIO
133.49 s
[pathway-compat-base] - Text.Printf.UPrintf
133.49 s
[pathway-compat-base] - Text.Printf.hspr
133.49 s
[pathway-compat-base] - Text.Printf.spr
133.50 s
[pathway-compat-base] Warning: System.IO.Pathway: could not find link destinations for:
133.50 s
[pathway-compat-base] - Control.Monad.Primitive.D:R:PrimStateIO
133.50 s
[pathway-compat-base] - Text.Printf.UPrintf
133.50 s
[pathway-compat-base] - Text.Printf.hspr
133.50 s
[pathway-compat-base] - Text.Printf.spr
135.28 s
[pathway-path] Documentation created: dist/doc/html/pathway-path/,
135.28 s
[pathway-path] dist/doc/html/pathway-path/pathway-path.txt
135.33 s
[pathway-path] Preprocessing test suite 'doctests' for pathway-path-0.0.1.0..
135.34 s
[pathway-path] Phase: installPhase
135.42 s
[pathway-path] Installing library in /nix/store/zhnf64ql9iwqjbrywr875ymk3y16m46s-pathway-path-0.0.1.0/lib/ghc-9.8.4/lib/x86_64-linux-ghc-9.8.4/pathway-path-0.0.1.0-ECz7RAvXGhGt6cWXv4vY3
135.63 s
[pathway-path] Phase: fixupPhase
135.65 s
[pathway-path] shrinking RPATHs of ELF executables and libraries in /nix/store/zhnf64ql9iwqjbrywr875ymk3y16m46s-pathway-path-0.0.1.0
135.65 s
[pathway-path] shrinking /nix/store/zhnf64ql9iwqjbrywr875ymk3y16m46s-pathway-path-0.0.1.0/lib/ghc-9.8.4/lib/x86_64-linux-ghc-9.8.4/libHSpathway-path-0.0.1.0-ECz7RAvXGhGt6cWXv4vY3-ghc9.8.4.so
135.68 s
[pathway-path] checking for references to /build/ in /nix/store/zhnf64ql9iwqjbrywr875ymk3y16m46s-pathway-path-0.0.1.0...
135.71 s
[pathway-path] patching script interpreter paths in /nix/store/zhnf64ql9iwqjbrywr875ymk3y16m46s-pathway-path-0.0.1.0
135.71 s
[pathway-path] stripping (with command strip and flags -S -p) in /nix/store/zhnf64ql9iwqjbrywr875ymk3y16m46s-pathway-path-0.0.1.0/lib
135.75 s
[pathway-path] shrinking RPATHs of ELF executables and libraries in /nix/store/f4iw36c17lxbzamcf3226jvpkhh8zig1-pathway-path-0.0.1.0-doc
135.76 s
[pathway-path] checking for references to /build/ in /nix/store/f4iw36c17lxbzamcf3226jvpkhh8zig1-pathway-path-0.0.1.0-doc...
135.78 s
[pathway-path] patching script interpreter paths in /nix/store/f4iw36c17lxbzamcf3226jvpkhh8zig1-pathway-path-0.0.1.0-doc
135.88 s
[pathway-path:post-build] Uploading to cachix cache "sellout": /nix/store/f4iw36c17lxbzamcf3226jvpkhh8zig1-pathway-path-0.0.1.0-doc /nix/store/zhnf64ql9iwqjbrywr875ymk3y16m46s-pathway-path-0.0.1.0
136.77 s
[pathway-path:post-build] Pushing 2 paths (207 are already present) using zstd to cache sellout ⏳
136.77 s
[pathway-path:post-build]
137.47 s
[pathway-path:post-build] Pushing /nix/store/f4iw36c17lxbzamcf3226jvpkhh8zig1-pathway-path-0.0.1.0-doc (263.23 KiB)
137.72 s
[pathway-path:post-build] Pushing /nix/store/zhnf64ql9iwqjbrywr875ymk3y16m46s-pathway-path-0.0.1.0 (217.39 KiB)
140.04 s
[pathway-path:post-build]
140.04 s
[pathway-path:post-build] All done.
140.06 s
[pathway-path:post-build] Uploading to the NixCI cache: /nix/store/f4iw36c17lxbzamcf3226jvpkhh8zig1-pathway-path-0.0.1.0-doc /nix/store/zhnf64ql9iwqjbrywr875ymk3y16m46s-pathway-path-0.0.1.0
140.10 s
[pathway-path:post-build] warning: 'warn-short-path-literals' is deprecated, use 'lint-short-path-literals = ignore' instead
140.12 s
[pathway-path:post-build] copying 2 paths...
140.12 s
[pathway-path:post-build] copying path '/nix/store/f4iw36c17lxbzamcf3226jvpkhh8zig1-pathway-path-0.0.1.0-doc' to 'https://cache.nix-ci.com'...
146.83 s
[pathway-path:post-build] copying path '/nix/store/zhnf64ql9iwqjbrywr875ymk3y16m46s-pathway-path-0.0.1.0' to 'https://cache.nix-ci.com'...
147.95 s
[pathway-path:post-build] warning: 'warn-short-path-literals' is deprecated, use 'lint-short-path-literals = ignore' instead
148.27 s
[pathway-path:post-build] copying 1 paths...
148.27 s
[pathway-path:post-build] copying path '/nix/store/7hbrxb5fwq9ksf8pdn61896dmpqn1s6p-pathway-path-0.0.1.0.drv' to 'https://cache.nix-ci.com'...
149.64 s
Uploaded pathway-path in 13.7s
149.64 s
Progress: 6 of 22 built (1 building), 164 of 164 downloaded from cache
149.64 s
Built pathway-path in 29.4s
149.64 s
[pathway-compat-base] Documentation created: dist/doc/html/pathway-compat-base/,
149.64 s
[pathway-compat-base] dist/doc/html/pathway-compat-base/pathway-compat-base.txt
149.64 s
[pathway-compat-base] Preprocessing test suite 'doctests' for pathway-compat-base-0.0.1.0..
149.64 s
[pathway-compat-base] Phase: installPhase
149.64 s
[pathway-compat-base] Installing library in /nix/store/ny5lqzrqpnzvq468547gg0f4nh1l5hp8-pathway-compat-base-0.0.1.0/lib/ghc-9.8.4/lib/x86_64-linux-ghc-9.8.4/pathway-compat-base-0.0.1.0-8ldj6SPXbxq2Shd8yFeOpr
149.64 s
[pathway-compat-base] Phase: fixupPhase
149.64 s
[pathway-compat-base] shrinking RPATHs of ELF executables and libraries in /nix/store/ny5lqzrqpnzvq468547gg0f4nh1l5hp8-pathway-compat-base-0.0.1.0
149.64 s
[pathway-compat-base] shrinking /nix/store/ny5lqzrqpnzvq468547gg0f4nh1l5hp8-pathway-compat-base-0.0.1.0/lib/ghc-9.8.4/lib/x86_64-linux-ghc-9.8.4/libHSpathway-compat-base-0.0.1.0-8ldj6SPXbxq2Shd8yFeOpr-ghc9.8.4.so
149.64 s
[pathway-compat-base] checking for references to /build/ in /nix/store/ny5lqzrqpnzvq468547gg0f4nh1l5hp8-pathway-compat-base-0.0.1.0...
149.64 s
[pathway-compat-base] patching script interpreter paths in /nix/store/ny5lqzrqpnzvq468547gg0f4nh1l5hp8-pathway-compat-base-0.0.1.0
149.64 s
[pathway-compat-base] stripping (with command strip and flags -S -p) in /nix/store/ny5lqzrqpnzvq468547gg0f4nh1l5hp8-pathway-compat-base-0.0.1.0/lib
149.64 s
[pathway-compat-base] shrinking RPATHs of ELF executables and libraries in /nix/store/8vrvsdrma8r8q2z0qf9d2v63gxkf06fp-pathway-compat-base-0.0.1.0-doc
149.64 s
[pathway-compat-base] checking for references to /build/ in /nix/store/8vrvsdrma8r8q2z0qf9d2v63gxkf06fp-pathway-compat-base-0.0.1.0-doc...
149.64 s
[pathway-compat-base] patching script interpreter paths in /nix/store/8vrvsdrma8r8q2z0qf9d2v63gxkf06fp-pathway-compat-base-0.0.1.0-doc
149.72 s
[pathway-compat-base:post-build] Uploading to cachix cache "sellout": /nix/store/8vrvsdrma8r8q2z0qf9d2v63gxkf06fp-pathway-compat-base-0.0.1.0-doc /nix/store/ny5lqzrqpnzvq468547gg0f4nh1l5hp8-pathway-compat-base-0.0.1.0
151.71 s
[pathway-compat-base:post-build] Pushing 2 paths (186 are already present) using zstd to cache sellout ⏳
151.71 s
[pathway-compat-base:post-build]
152.60 s
[pathway-compat-base:post-build] Pushing /nix/store/8vrvsdrma8r8q2z0qf9d2v63gxkf06fp-pathway-compat-base-0.0.1.0-doc (1.92 MiB)
152.60 s
[pathway-compat-base:post-build] Pushing /nix/store/ny5lqzrqpnzvq468547gg0f4nh1l5hp8-pathway-compat-base-0.0.1.0 (2.02 MiB)
154.75 s
[pathway-compat-base:post-build]
154.75 s
[pathway-compat-base:post-build] All done.
154.76 s
[pathway-compat-base:post-build] Uploading to the NixCI cache: /nix/store/8vrvsdrma8r8q2z0qf9d2v63gxkf06fp-pathway-compat-base-0.0.1.0-doc /nix/store/ny5lqzrqpnzvq468547gg0f4nh1l5hp8-pathway-compat-base-0.0.1.0
154.81 s
[pathway-compat-base:post-build] warning: 'warn-short-path-literals' is deprecated, use 'lint-short-path-literals = ignore' instead
154.83 s
[pathway-compat-base:post-build] copying 2 paths...
154.83 s
[pathway-compat-base:post-build] copying path '/nix/store/8vrvsdrma8r8q2z0qf9d2v63gxkf06fp-pathway-compat-base-0.0.1.0-doc' to 'https://cache.nix-ci.com'...
156.58 s
[pathway-compat-base:post-build] copying path '/nix/store/ny5lqzrqpnzvq468547gg0f4nh1l5hp8-pathway-compat-base-0.0.1.0' to 'https://cache.nix-ci.com'...
157.79 s
[pathway-compat-base:post-build] warning: 'warn-short-path-literals' is deprecated, use 'lint-short-path-literals = ignore' instead
158.15 s
[pathway-compat-base:post-build] copying 1 paths...
158.20 s
[pathway-compat-base:post-build] copying path '/nix/store/zk8pnrqj09ffc98h9nz6jz4cixam6gxz-pathway-compat-base-0.0.1.0.drv' to 'https://cache.nix-ci.com'...
158.62 s
Uploaded pathway-compat-base in 8.9s
158.62 s
Progress: 7 of 21 built, 164 of 164 downloaded from cache
158.62 s
Built pathway-compat-base in 38.4s
158.66 s
Building /nix/store/7szrkx5w148zqvipzqp9kpvdwyixf2jm-pathway-compat-filepath-0.0.1.0.drv
158.84 s
[pathway-compat-filepath] Phase: setupCompilerEnvironmentPhase
158.84 s
[pathway-compat-filepath] Build with /nix/store/7r9b0bl984hdgd70nf5p8raa55kml491-ghc-9.8.4.
159.14 s
[pathway-compat-filepath] Phase: unpackPhase
159.14 s
[pathway-compat-filepath] unpacking source archive /nix/store/99h2nwiw8z9r3kqrm9kdhv4k4sf61d7w-filepath
159.15 s
[pathway-compat-filepath] source root is filepath
159.16 s
[pathway-compat-filepath] Phase: patchPhase
159.17 s
[pathway-compat-filepath] Phase: compileBuildDriverPhase
159.18 s
[pathway-compat-filepath] setupCompileFlags: -package-db=/build/tmp.dFNS7qW2b3/setup-package.conf.d -threaded
159.22 s
[pathway-compat-filepath] [1 of 2] Compiling Main ( Setup.hs, /build/tmp.dFNS7qW2b3/Main.o )
159.26 s
[pathway-compat-filepath] [2 of 2] Linking Setup
160.38 s
[pathway-compat-filepath] Phase: updateAutotoolsGnuConfigScriptsPhase
160.40 s
[pathway-compat-filepath] Phase: configurePhase
160.40 s
[pathway-compat-filepath] configureFlags: --verbose --prefix=/nix/store/3wxxzpw33d72qx9kng4qpfmhidc1ba2f-pathway-compat-filepath-0.0.1.0 --libdir=$prefix/lib/$compiler/lib --libsubdir=$abi/$libname --docdir=/nix/store/1a5zli1srydg9czyyyns0ql1sl8i4gzp-pathway-compat-filepath-0.0.1.0-doc/share/doc/pathway-compat-filepath-0.0.1.0 --with-gcc=gcc --package-db=/build/tmp.dFNS7qW2b3/package.conf.d --ghc-option=-j16 --ghc-option=+RTS --ghc-option=-A64M --ghc-option=-RTS --enable-library-profiling --profiling-detail=exported-functions --disable-profiling --enable-shared --disable-coverage --enable-static --disable-executable-dynamic --enable-tests --disable-benchmarks --enable-library-vanilla --disable-library-for-ghci --enable-split-sections --enable-library-stripping --enable-executable-stripping --ghc-option=-haddock --ghc-options=-Werror --extra-lib-dirs=/nix/store/pndhkk0l649lm1sj0mxk7cbwq26qd1ra-ncurses-6.6/lib --extra-lib-dirs=/nix/store/0djlg4g0b81w94k3vcaqsxsc2hh4kism-libffi-3.5.2/lib --extra-lib-dirs=/nix/store/md4paia7riiggyrj8p24c7a6vf8w7jz8-elfutils-0.194/lib --extra-lib-dirs=/nix/store/39vv2pf64gd8li48a4hpbhw2crzd8z5p-gmp-with-cxx-6.3.0/lib --extra-lib-dirs=/nix/store/7wwvald8lapkrsr72qanlw8blyn55ifx-numactl-2.0.18/lib --extra-lib-dirs=/nix/store/7r9b0bl984hdgd70nf5p8raa55kml491-ghc-9.8.4/lib
160.41 s
[pathway-compat-filepath] Using Parsec parser
160.41 s
[pathway-compat-filepath] Configuring pathway-compat-filepath-0.0.1.0...
160.71 s
[pathway-compat-filepath] Flags chosen: noisy-deprecations=True, verify-no-recursion=False
160.71 s
[pathway-compat-filepath] Dependency base >=4.14.0 && <4.15 || >=4.15.0 && <4.16 || >=4.16.0 && <4.17 ||
160.71 s
[pathway-compat-filepath] >=4.17.0 && <4.18 || >=4.18.0 && <4.19 || >=4.19.0 && <4.20 || >=4.20.0 &&
160.71 s
[pathway-compat-filepath] <4.21 || >=4.21.0 && <4.22 || >=4.22.0 && <4.23: using base-4.19.2.0
160.71 s
[pathway-compat-filepath] Dependency extra: using extra-1.8.1
160.71 s
[pathway-compat-filepath] Dependency filepath >=1.4.2 && <1.5 || >=1.5.0 && <1.6: using
160.71 s
[pathway-compat-filepath] filepath-1.4.301.0
160.71 s
[pathway-compat-filepath] Dependency megaparsec >=9.0.1 && <9.1 || >=9.2.1 && <9.3 || >=9.5.0 && <9.6 ||
160.71 s
[pathway-compat-filepath] >=9.7.0 && <9.8: using megaparsec-9.7.0
160.71 s
[pathway-compat-filepath] Dependency pathway >=0.0.1 && <0.1: using pathway-0.0.1.0
160.71 s
[pathway-compat-filepath] Dependency pathway-compat-base >=0.0.1 && <0.1: using
160.71 s
[pathway-compat-filepath] pathway-compat-base-0.0.1.0
160.71 s
[pathway-compat-filepath] Dependency pathway-internal >=0.0.1 && <0.1: using pathway-internal-0.0.1.0
160.71 s
[pathway-compat-filepath] Dependency base >=4.14.0 && <4.15 || >=4.15.0 && <4.16 || >=4.16.0 && <4.17 ||
160.71 s
[pathway-compat-filepath] >=4.17.0 && <4.18 || >=4.18.0 && <4.19 || >=4.19.0 && <4.20 || >=4.20.0 &&
160.71 s
[pathway-compat-filepath] <4.21 || >=4.21.0 && <4.22 || >=4.22.0 && <4.23: using base-4.19.2.0
160.71 s
[pathway-compat-filepath] Dependency doctest >=0.16.3 && <0.17 || >=0.18.1 && <0.19 || >=0.20.1 && <0.21
160.71 s
[pathway-compat-filepath] || >=0.21.1 && <0.22 || >=0.22.2 && <0.23 || >=0.24.2 && <0.25: using
160.71 s
[pathway-compat-filepath] doctest-0.24.3
160.71 s
[pathway-compat-filepath] Dependency pathway-compat-filepath: using pathway-compat-filepath-0.0.1.0
161.01 s
[pathway-compat-filepath] Source component graph:
161.01 s
[pathway-compat-filepath] component lib
161.01 s
[pathway-compat-filepath] component test:doctests dependency lib
161.01 s
[pathway-compat-filepath] Configured component graph:
161.01 s
[pathway-compat-filepath] component pathway-compat-filepath-0.0.1.0-1aSZ3UXFr73FDOQtPeyw7g
161.01 s
[pathway-compat-filepath] include base-4.19.2.0-934f
161.01 s
[pathway-compat-filepath] include extra-1.8.1-F4oHgTKCper3ZiIUPZjGPK
161.01 s
[pathway-compat-filepath] include filepath-1.4.301.0-6e15
161.01 s
[pathway-compat-filepath] include megaparsec-9.7.0-10vHZAF1maw9O8p2gXs66N
161.01 s
[pathway-compat-filepath] include pathway-0.0.1.0-H5uD0SRA9755UrSqFBaCYE
161.01 s
[pathway-compat-filepath] include pathway-compat-base-0.0.1.0-8ldj6SPXbxq2Shd8yFeOpr
161.01 s
[pathway-compat-filepath] include pathway-internal-0.0.1.0-Lnjdb2M8cxN196wSdsfQUK
161.01 s
[pathway-compat-filepath] component pathway-compat-filepath-0.0.1.0-5Vlr121wsSlHY9yKgCvAGY-doctests
161.01 s
[pathway-compat-filepath] include base-4.19.2.0-934f
161.01 s
[pathway-compat-filepath] include doctest-0.24.3-1aDs7zEYV5r7raSsXr9TQC
161.01 s
[pathway-compat-filepath] include pathway-compat-filepath-0.0.1.0-1aSZ3UXFr73FDOQtPeyw7g
161.01 s
[pathway-compat-filepath] Linked component graph:
161.01 s
[pathway-compat-filepath] unit pathway-compat-filepath-0.0.1.0-1aSZ3UXFr73FDOQtPeyw7g
161.01 s
[pathway-compat-filepath] include base-4.19.2.0-934f
161.01 s
[pathway-compat-filepath] include extra-1.8.1-F4oHgTKCper3ZiIUPZjGPK
161.01 s
[pathway-compat-filepath] include filepath-1.4.301.0-6e15
161.01 s
[pathway-compat-filepath] include megaparsec-9.7.0-10vHZAF1maw9O8p2gXs66N
161.01 s
[pathway-compat-filepath] include pathway-0.0.1.0-H5uD0SRA9755UrSqFBaCYE
161.01 s
[pathway-compat-filepath] include pathway-compat-base-0.0.1.0-8ldj6SPXbxq2Shd8yFeOpr
161.01 s
[pathway-compat-filepath] include pathway-internal-0.0.1.0-Lnjdb2M8cxN196wSdsfQUK
161.01 s
[pathway-compat-filepath] Common.FilePath=pathway-compat-filepath-0.0.1.0-1aSZ3UXFr73FDOQtPeyw7g:Common.FilePath,Common.OsPath=pathway-compat-filepath-0.0.1.0-1aSZ3UXFr73FDOQtPeyw7g:Common.OsPath,System.FilePath=pathway-compat-filepath-0.0.1.0-1aSZ3UXFr73FDOQtPeyw7g:System.FilePath,System.FilePath.Overlay=pathway-compat-filepath-0.0.1.0-1aSZ3UXFr73FDOQtPeyw7g:System.FilePath.Overlay,System.FilePath.Pathway=pathway-compat-filepath-0.0.1.0-1aSZ3UXFr73FDOQtPeyw7g:System.FilePath.Pathway,System.FilePath.Thin=pathway-compat-filepath-0.0.1.0-1aSZ3UXFr73FDOQtPeyw7g:System.FilePath.Thin,System.OsPath=pathway-compat-filepath-0.0.1.0-1aSZ3UXFr73FDOQtPeyw7g:System.OsPath,System.OsPath.Overlay=pathway-compat-filepath-0.0.1.0-1aSZ3UXFr73FDOQtPeyw7g:System.OsPath.Overlay,System.OsPath.Pathway=pathway-compat-filepath-0.0.1.0-1aSZ3UXFr73FDOQtPeyw7g:System.OsPath.Pathway,System.OsPath.Thin=pathway-compat-filepath-0.0.1.0-1aSZ3UXFr73FDOQtPeyw7g:System.OsPath.Thin
161.01 s
[pathway-compat-filepath] unit pathway-compat-filepath-0.0.1.0-5Vlr121wsSlHY9yKgCvAGY-doctests
161.01 s
[pathway-compat-filepath] include base-4.19.2.0-934f
161.01 s
[pathway-compat-filepath] include doctest-0.24.3-1aDs7zEYV5r7raSsXr9TQC
161.01 s
[pathway-compat-filepath] include pathway-compat-filepath-0.0.1.0-1aSZ3UXFr73FDOQtPeyw7g
161.01 s
[pathway-compat-filepath] Ready component graph:
161.01 s
[pathway-compat-filepath] definite pathway-compat-filepath-0.0.1.0-1aSZ3UXFr73FDOQtPeyw7g
161.01 s
[pathway-compat-filepath] depends base-4.19.2.0-934f
161.01 s
[pathway-compat-filepath] depends extra-1.8.1-F4oHgTKCper3ZiIUPZjGPK
161.01 s
[pathway-compat-filepath] depends filepath-1.4.301.0-6e15
161.01 s
[pathway-compat-filepath] depends megaparsec-9.7.0-10vHZAF1maw9O8p2gXs66N
161.01 s
[pathway-compat-filepath] depends pathway-0.0.1.0-H5uD0SRA9755UrSqFBaCYE
161.01 s
[pathway-compat-filepath] depends pathway-compat-base-0.0.1.0-8ldj6SPXbxq2Shd8yFeOpr
161.01 s
[pathway-compat-filepath] depends pathway-internal-0.0.1.0-Lnjdb2M8cxN196wSdsfQUK
161.01 s
[pathway-compat-filepath] definite pathway-compat-filepath-0.0.1.0-5Vlr121wsSlHY9yKgCvAGY-doctests
161.01 s
[pathway-compat-filepath] depends base-4.19.2.0-934f
161.01 s
[pathway-compat-filepath] depends doctest-0.24.3-1aDs7zEYV5r7raSsXr9TQC
161.01 s
[pathway-compat-filepath] depends pathway-compat-filepath-0.0.1.0-1aSZ3UXFr73FDOQtPeyw7g
161.01 s
[pathway-compat-filepath] Using Cabal-3.10.3.0 compiled by ghc-9.8
161.01 s
[pathway-compat-filepath] Using compiler: ghc-9.8.4
161.01 s
[pathway-compat-filepath] Using install prefix:
161.01 s
[pathway-compat-filepath] /nix/store/3wxxzpw33d72qx9kng4qpfmhidc1ba2f-pathway-compat-filepath-0.0.1.0
161.01 s
[pathway-compat-filepath] Executables installed in:
161.01 s
[pathway-compat-filepath] /nix/store/3wxxzpw33d72qx9kng4qpfmhidc1ba2f-pathway-compat-filepath-0.0.1.0/bin
161.01 s
[pathway-compat-filepath] Libraries installed in:
161.01 s
[pathway-compat-filepath] /nix/store/3wxxzpw33d72qx9kng4qpfmhidc1ba2f-pathway-compat-filepath-0.0.1.0/lib/ghc-9.8.4/lib/x86_64-linux-ghc-9.8.4/pathway-compat-filepath-0.0.1.0-1aSZ3UXFr73FDOQtPeyw7g
161.01 s
[pathway-compat-filepath] Dynamic Libraries installed in:
161.01 s
[pathway-compat-filepath] /nix/store/3wxxzpw33d72qx9kng4qpfmhidc1ba2f-pathway-compat-filepath-0.0.1.0/lib/ghc-9.8.4/lib/x86_64-linux-ghc-9.8.4
161.01 s
[pathway-compat-filepath] Private executables installed in:
161.01 s
[pathway-compat-filepath] /nix/store/3wxxzpw33d72qx9kng4qpfmhidc1ba2f-pathway-compat-filepath-0.0.1.0/libexec/x86_64-linux-ghc-9.8.4/pathway-compat-filepath-0.0.1.0
161.01 s
[pathway-compat-filepath] Data files installed in:
161.01 s
[pathway-compat-filepath] /nix/store/3wxxzpw33d72qx9kng4qpfmhidc1ba2f-pathway-compat-filepath-0.0.1.0/share/x86_64-linux-ghc-9.8.4/pathway-compat-filepath-0.0.1.0
161.01 s
[pathway-compat-filepath] Documentation installed in:
161.01 s
[pathway-compat-filepath] /nix/store/1a5zli1srydg9czyyyns0ql1sl8i4gzp-pathway-compat-filepath-0.0.1.0-doc/share/doc/pathway-compat-filepath-0.0.1.0
161.01 s
[pathway-compat-filepath] Configuration files installed in:
161.01 s
[pathway-compat-filepath] /nix/store/3wxxzpw33d72qx9kng4qpfmhidc1ba2f-pathway-compat-filepath-0.0.1.0/etc
161.01 s
[pathway-compat-filepath] No alex found
161.01 s
[pathway-compat-filepath] Using ar found on system at:
161.01 s
[pathway-compat-filepath] /nix/store/zjraf40s86y3iwhp626b934r5y6ldkbb-binutils-wrapper-2.46/bin/ar
161.01 s
[pathway-compat-filepath] No c2hs found
161.01 s
[pathway-compat-filepath] No cpphs found
161.01 s
[pathway-compat-filepath] Using doctest version 0.24.3 found on system at:
161.01 s
[pathway-compat-filepath] /nix/store/2y183b1vsybv0157vfr59yhdwjkpqfkn-doctest-0.24.3/bin/doctest
161.01 s
[pathway-compat-filepath] Using gcc version 15.2.0 given by user at:
161.01 s
[pathway-compat-filepath] /nix/store/29qjlshvklnyr67nhpprzgb9igmsfsjj-gcc-wrapper-15.2.0/bin/gcc
161.01 s
[pathway-compat-filepath] Using ghc version 9.8.4 found on system at:
161.01 s
[pathway-compat-filepath] /nix/store/7r9b0bl984hdgd70nf5p8raa55kml491-ghc-9.8.4/bin/ghc
161.01 s
[pathway-compat-filepath] Using ghc-pkg version 9.8.4 found on system at:
161.01 s
[pathway-compat-filepath] /nix/store/7r9b0bl984hdgd70nf5p8raa55kml491-ghc-9.8.4/bin/ghc-pkg-9.8.4
161.01 s
[pathway-compat-filepath] No ghcjs found
161.01 s
[pathway-compat-filepath] No ghcjs-pkg found
161.01 s
[pathway-compat-filepath] No greencard found
161.01 s
[pathway-compat-filepath] Using haddock version 2.30.0 found on system at:
161.01 s
[pathway-compat-filepath] /nix/store/7r9b0bl984hdgd70nf5p8raa55kml491-ghc-9.8.4/bin/haddock-ghc-9.8.4
161.01 s
[pathway-compat-filepath] No happy found
161.01 s
[pathway-compat-filepath] Using haskell-suite found on system at: haskell-suite-dummy-location
161.01 s
[pathway-compat-filepath] Using haskell-suite-pkg found on system at: haskell-suite-pkg-dummy-location
161.01 s
[pathway-compat-filepath] No hmake found
161.01 s
[pathway-compat-filepath] Using hpc version 0.69 found on system at:
161.01 s
[pathway-compat-filepath] /nix/store/7r9b0bl984hdgd70nf5p8raa55kml491-ghc-9.8.4/bin/hpc-ghc-9.8.4
161.01 s
[pathway-compat-filepath] Using hsc2hs version 0.68.10 found on system at:
161.01 s
[pathway-compat-filepath] /nix/store/7r9b0bl984hdgd70nf5p8raa55kml491-ghc-9.8.4/bin/hsc2hs-ghc-9.8.4
161.01 s
[pathway-compat-filepath] Using hscolour version 1.25 found on system at:
161.01 s
[pathway-compat-filepath] /nix/store/awnxn98rlw62rrjwli6d2lb4d27mrzzw-hscolour-1.25/bin/HsColour
161.01 s
[pathway-compat-filepath] No jhc found
161.01 s
[pathway-compat-filepath] Using ld found on system at:
161.01 s
[pathway-compat-filepath] /nix/store/zjraf40s86y3iwhp626b934r5y6ldkbb-binutils-wrapper-2.46/bin/ld.gold
161.01 s
[pathway-compat-filepath] No pkg-config found
161.01 s
[pathway-compat-filepath] Using runghc version 9.8.4 found on system at:
161.01 s
[pathway-compat-filepath] /nix/store/7r9b0bl984hdgd70nf5p8raa55kml491-ghc-9.8.4/bin/runghc-9.8.4
161.01 s
[pathway-compat-filepath] Using strip version 2.46 found on system at:
161.01 s
[pathway-compat-filepath] /nix/store/29qjlshvklnyr67nhpprzgb9igmsfsjj-gcc-wrapper-15.2.0/bin/strip
161.01 s
[pathway-compat-filepath] Using tar found on system at:
161.01 s
[pathway-compat-filepath] /nix/store/z5mq2sam4484prf3kv6v6vjw1m0i7j24-gnutar-1.35/bin/tar
161.01 s
[pathway-compat-filepath] No uhc found
161.41 s
[pathway-compat-filepath] Phase: buildPhase
161.47 s
[pathway-compat-filepath] Preprocessing library for pathway-compat-filepath-0.0.1.0..
161.47 s
[pathway-compat-filepath] Building library for pathway-compat-filepath-0.0.1.0..
161.54 s
[pathway-compat-filepath] [ 1 of 10] Compiling Common.FilePath ( src/Common/FilePath.hs, dist/build/Common/FilePath.o, dist/build/Common/FilePath.dyn_o )
161.81 s
[pathway-compat-filepath] [ 2 of 10] Compiling Common.OsPath ( src/Common/OsPath.hs, dist/build/Common/OsPath.o, dist/build/Common/OsPath.dyn_o )
161.81 s
[pathway-compat-filepath]
161.81 s
[pathway-compat-filepath] src/Common/OsPath.hs:87:23: error : [ GHC-76037 ]
161.81 s
[pathway-compat-filepath] Not in scope: ‘O.unsafeEncodeUtf’
161.81 s
[pathway-compat-filepath] NB: the module ‘System.OsPath’ does not export ‘unsafeEncodeUtf’.
161.81 s
[pathway-compat-filepath] |
161.81 s
[pathway-compat-filepath] 87 | Format.parent = O.unsafeEncodeUtf "..",
161.81 s
[pathway-compat-filepath] | ^^^^^^^^^^^^^^^^^
161.81 s
[pathway-compat-filepath] [ 3 of 10] Compiling System.FilePath.Thin ( src/System/FilePath/Thin.hs, dist/build/System/FilePath/Thin.o, dist/build/System/FilePath/Thin.dyn_o )
161.96 s
[pathway-compat-filepath] [ 4 of 10] Compiling System.FilePath.Pathway ( src/System/FilePath/Pathway.hs, dist/build/System/FilePath/Pathway.o, dist/build/System/FilePath/Pathway.dyn_o )
161.99 s
[pathway-compat-filepath] [ 5 of 10] Compiling System.FilePath.Overlay ( src/System/FilePath/Overlay.hs, dist/build/System/FilePath/Overlay.o, dist/build/System/FilePath/Overlay.dyn_o )
162.02 s
[pathway-compat-filepath] [ 6 of 10] Compiling System.FilePath ( src/System/FilePath.hs, dist/build/System/FilePath.o, dist/build/System/FilePath.dyn_o )
162.14 s
Progress: 7 of 19 built (1 failed), 164 of 164 downloaded from cache
162.14 s
Failed to build pathway-compat-filepath after 3.4s
162.14 s
error: Cannot build '/nix/store/7szrkx5w148zqvipzqp9kpvdwyixf2jm-pathway-compat-filepath-0.0.1.0.drv '.
162.14 s
Reason: builder failed with exit code 1 .
162.14 s
Output paths:
162.14 s
/nix/store/1a5zli1srydg9czyyyns0ql1sl8i4gzp-pathway-compat-filepath-0.0.1.0-doc
162.14 s
/nix/store/3wxxzpw33d72qx9kng4qpfmhidc1ba2f-pathway-compat-filepath-0.0.1.0
162.14 s
Last 151 log lines:
162.14 s
> Running phase: setupCompilerEnvironmentPhase
162.14 s
> Build with /nix/store/7r9b0bl984hdgd70nf5p8raa55kml491-ghc-9.8.4.
162.14 s
> Running phase: unpackPhase
162.14 s
> unpacking source archive /nix/store/99h2nwiw8z9r3kqrm9kdhv4k4sf61d7w-filepath
162.14 s
> source root is filepath
162.14 s
> Running phase: patchPhase
162.14 s
> Running phase: compileBuildDriverPhase
162.14 s
> setupCompileFlags: -package-db=/build/tmp.dFNS7qW2b3/setup-package.conf.d -threaded
162.14 s
> [1 of 2] Compiling Main ( Setup.hs, /build/tmp.dFNS7qW2b3/Main.o )
162.14 s
> [2 of 2] Linking Setup
162.14 s
> Running phase: updateAutotoolsGnuConfigScriptsPhase
162.14 s
> Running phase: configurePhase
162.14 s
> configureFlags: --verbose --prefix=/nix/store/3wxxzpw33d72qx9kng4qpfmhidc1ba2f-pathway-compat-filepath-0.0.1.0 --libdir=$prefix/lib/$compiler/lib --libsubdir=$abi/$libname --docdir=/nix/store/1a5zli1srydg9czyyyns0ql1sl8i4gzp-pathway-compat-filepath-0.0.1.0-doc/share/doc/pathway-compat-filepath-0.0.1.0 --with-gcc=gcc --package-db=/build/tmp.dFNS7qW2b3/package.conf.d --ghc-option=-j16 --ghc-option=+RTS --ghc-option=-A64M --ghc-option=-RTS --enable-library-profiling --profiling-detail=exported-functions --disable-profiling --enable-shared --disable-coverage --enable-static --disable-executable-dynamic --enable-tests --disable-benchmarks --enable-library-vanilla --disable-library-for-ghci --enable-split-sections --enable-library-stripping --enable-executable-stripping --ghc-option=-haddock --ghc-options=-Werror --extra-lib-dirs=/nix/store/pndhkk0l649lm1sj0mxk7cbwq26qd1ra-ncurses-6.6/lib --extra-lib-dirs=/nix/store/0djlg4g0b81w94k3vcaqsxsc2hh4kism-libffi-3.5.2/lib --extra-lib-dirs=/nix/store/md4paia7riiggyrj8p24c7a6vf8w7jz8-elfutils-0.194/lib --extra-lib-dirs=/nix/store/39vv2pf64gd8li48a4hpbhw2crzd8z5p-gmp-with-cxx-6.3.0/lib --extra-lib-dirs=/nix/store/7wwvald8lapkrsr72qanlw8blyn55ifx-numactl-2.0.18/lib --extra-lib-dirs=/nix/store/7r9b0bl984hdgd70nf5p8raa55kml491-ghc-9.8.4/lib
162.14 s
> Using Parsec parser
162.14 s
> Configuring pathway-compat-filepath-0.0.1.0...
162.14 s
> Flags chosen: noisy-deprecations=True, verify-no-recursion=False
162.14 s
> Dependency base >=4.14.0 && <4.15 || >=4.15.0 && <4.16 || >=4.16.0 && <4.17 ||
162.14 s
> >=4.17.0 && <4.18 || >=4.18.0 && <4.19 || >=4.19.0 && <4.20 || >=4.20.0 &&
162.14 s
> <4.21 || >=4.21.0 && <4.22 || >=4.22.0 && <4.23: using base-4.19.2.0
162.14 s
> Dependency extra: using extra-1.8.1
162.14 s
> Dependency filepath >=1.4.2 && <1.5 || >=1.5.0 && <1.6: using
162.14 s
> filepath-1.4.301.0
162.14 s
> Dependency megaparsec >=9.0.1 && <9.1 || >=9.2.1 && <9.3 || >=9.5.0 && <9.6 ||
162.14 s
> >=9.7.0 && <9.8: using megaparsec-9.7.0
162.14 s
> Dependency pathway >=0.0.1 && <0.1: using pathway-0.0.1.0
162.14 s
> Dependency pathway-compat-base >=0.0.1 && <0.1: using
162.14 s
> pathway-compat-base-0.0.1.0
162.14 s
> Dependency pathway-internal >=0.0.1 && <0.1: using pathway-internal-0.0.1.0
162.14 s
> Dependency base >=4.14.0 && <4.15 || >=4.15.0 && <4.16 || >=4.16.0 && <4.17 ||
162.14 s
> >=4.17.0 && <4.18 || >=4.18.0 && <4.19 || >=4.19.0 && <4.20 || >=4.20.0 &&
162.14 s
> <4.21 || >=4.21.0 && <4.22 || >=4.22.0 && <4.23: using base-4.19.2.0
162.14 s
> Dependency doctest >=0.16.3 && <0.17 || >=0.18.1 && <0.19 || >=0.20.1 && <0.21
162.14 s
> || >=0.21.1 && <0.22 || >=0.22.2 && <0.23 || >=0.24.2 && <0.25: using
162.14 s
> doctest-0.24.3
162.14 s
> Dependency pathway-compat-filepath: using pathway-compat-filepath-0.0.1.0
162.14 s
> Source component graph:
162.14 s
> component lib
162.14 s
> component test:doctests dependency lib
162.14 s
> Configured component graph:
162.14 s
> component pathway-compat-filepath-0.0.1.0-1aSZ3UXFr73FDOQtPeyw7g
162.14 s
> include base-4.19.2.0-934f
162.14 s
> include extra-1.8.1-F4oHgTKCper3ZiIUPZjGPK
162.14 s
> include filepath-1.4.301.0-6e15
162.14 s
> include megaparsec-9.7.0-10vHZAF1maw9O8p2gXs66N
162.14 s
> include pathway-0.0.1.0-H5uD0SRA9755UrSqFBaCYE
162.14 s
> include pathway-compat-base-0.0.1.0-8ldj6SPXbxq2Shd8yFeOpr
162.14 s
> include pathway-internal-0.0.1.0-Lnjdb2M8cxN196wSdsfQUK
162.14 s
> component pathway-compat-filepath-0.0.1.0-5Vlr121wsSlHY9yKgCvAGY-doctests
162.14 s
> include base-4.19.2.0-934f
162.14 s
> include doctest-0.24.3-1aDs7zEYV5r7raSsXr9TQC
162.14 s
> include pathway-compat-filepath-0.0.1.0-1aSZ3UXFr73FDOQtPeyw7g
162.14 s
> Linked component graph:
162.14 s
> unit pathway-compat-filepath-0.0.1.0-1aSZ3UXFr73FDOQtPeyw7g
162.14 s
> include base-4.19.2.0-934f
162.14 s
> include extra-1.8.1-F4oHgTKCper3ZiIUPZjGPK
162.14 s
> include filepath-1.4.301.0-6e15
162.14 s
> include megaparsec-9.7.0-10vHZAF1maw9O8p2gXs66N
162.14 s
> include pathway-0.0.1.0-H5uD0SRA9755UrSqFBaCYE
162.14 s
> include pathway-compat-base-0.0.1.0-8ldj6SPXbxq2Shd8yFeOpr
162.14 s
> include pathway-internal-0.0.1.0-Lnjdb2M8cxN196wSdsfQUK
162.14 s
> Common.FilePath=pathway-compat-filepath-0.0.1.0-1aSZ3UXFr73FDOQtPeyw7g:Common.FilePath,Common.OsPath=pathway-compat-filepath-0.0.1.0-1aSZ3UXFr73FDOQtPeyw7g:Common.OsPath,System.FilePath=pathway-compat-filepath-0.0.1.0-1aSZ3UXFr73FDOQtPeyw7g:System.FilePath,System.FilePath.Overlay=pathway-compat-filepath-0.0.1.0-1aSZ3UXFr73FDOQtPeyw7g:System.FilePath.Overlay,System.FilePath.Pathway=pathway-compat-filepath-0.0.1.0-1aSZ3UXFr73FDOQtPeyw7g:System.FilePath.Pathway,System.FilePath.Thin=pathway-compat-filepath-0.0.1.0-1aSZ3UXFr73FDOQtPeyw7g:System.FilePath.Thin,System.OsPath=pathway-compat-filepath-0.0.1.0-1aSZ3UXFr73FDOQtPeyw7g:System.OsPath,System.OsPath.Overlay=pathway-compat-filepath-0.0.1.0-1aSZ3UXFr73FDOQtPeyw7g:System.OsPath.Overlay,System.OsPath.Pathway=pathway-compat-filepath-0.0.1.0-1aSZ3UXFr73FDOQtPeyw7g:System.OsPath.Pathway,System.OsPath.Thin=pathway-compat-filepath-0.0.1.0-1aSZ3UXFr73FDOQtPeyw7g:System.OsPath.Thin
162.14 s
> unit pathway-compat-filepath-0.0.1.0-5Vlr121wsSlHY9yKgCvAGY-doctests
162.14 s
> include base-4.19.2.0-934f
162.14 s
> include doctest-0.24.3-1aDs7zEYV5r7raSsXr9TQC
162.14 s
> include pathway-compat-filepath-0.0.1.0-1aSZ3UXFr73FDOQtPeyw7g
162.14 s
> Ready component graph:
162.14 s
> definite pathway-compat-filepath-0.0.1.0-1aSZ3UXFr73FDOQtPeyw7g
162.14 s
> depends base-4.19.2.0-934f
162.14 s
> depends extra-1.8.1-F4oHgTKCper3ZiIUPZjGPK
162.14 s
> depends filepath-1.4.301.0-6e15
162.14 s
> depends megaparsec-9.7.0-10vHZAF1maw9O8p2gXs66N
162.14 s
> depends pathway-0.0.1.0-H5uD0SRA9755UrSqFBaCYE
162.14 s
> depends pathway-compat-base-0.0.1.0-8ldj6SPXbxq2Shd8yFeOpr
162.14 s
> depends pathway-internal-0.0.1.0-Lnjdb2M8cxN196wSdsfQUK
162.14 s
> definite pathway-compat-filepath-0.0.1.0-5Vlr121wsSlHY9yKgCvAGY-doctests
162.14 s
> depends base-4.19.2.0-934f
162.14 s
> depends doctest-0.24.3-1aDs7zEYV5r7raSsXr9TQC
162.14 s
> depends pathway-compat-filepath-0.0.1.0-1aSZ3UXFr73FDOQtPeyw7g
162.14 s
> Using Cabal-3.10.3.0 compiled by ghc-9.8
162.14 s
> Using compiler: ghc-9.8.4
162.14 s
> Using install prefix:
162.14 s
> /nix/store/3wxxzpw33d72qx9kng4qpfmhidc1ba2f-pathway-compat-filepath-0.0.1.0
162.14 s
> Executables installed in:
162.14 s
> /nix/store/3wxxzpw33d72qx9kng4qpfmhidc1ba2f-pathway-compat-filepath-0.0.1.0/bin
162.14 s
> Libraries installed in:
162.14 s
> /nix/store/3wxxzpw33d72qx9kng4qpfmhidc1ba2f-pathway-compat-filepath-0.0.1.0/lib/ghc-9.8.4/lib/x86_64-linux-ghc-9.8.4/pathway-compat-filepath-0.0.1.0-1aSZ3UXFr73FDOQtPeyw7g
162.14 s
> Dynamic Libraries installed in:
162.14 s
> /nix/store/3wxxzpw33d72qx9kng4qpfmhidc1ba2f-pathway-compat-filepath-0.0.1.0/lib/ghc-9.8.4/lib/x86_64-linux-ghc-9.8.4
162.14 s
> Private executables installed in:
162.14 s
> /nix/store/3wxxzpw33d72qx9kng4qpfmhidc1ba2f-pathway-compat-filepath-0.0.1.0/libexec/x86_64-linux-ghc-9.8.4/pathway-compat-filepath-0.0.1.0
162.14 s
> Data files installed in:
162.14 s
> /nix/store/3wxxzpw33d72qx9kng4qpfmhidc1ba2f-pathway-compat-filepath-0.0.1.0/share/x86_64-linux-ghc-9.8.4/pathway-compat-filepath-0.0.1.0
162.14 s
> Documentation installed in:
162.14 s
> /nix/store/1a5zli1srydg9czyyyns0ql1sl8i4gzp-pathway-compat-filepath-0.0.1.0-doc/share/doc/pathway-compat-filepath-0.0.1.0
162.14 s
> Configuration files installed in:
162.14 s
> /nix/store/3wxxzpw33d72qx9kng4qpfmhidc1ba2f-pathway-compat-filepath-0.0.1.0/etc
162.14 s
> No alex found
162.14 s
> Using ar found on system at:
162.14 s
> /nix/store/zjraf40s86y3iwhp626b934r5y6ldkbb-binutils-wrapper-2.46/bin/ar
162.14 s
> No c2hs found
162.14 s
> No cpphs found
162.14 s
> Using doctest version 0.24.3 found on system at:
162.14 s
> /nix/store/2y183b1vsybv0157vfr59yhdwjkpqfkn-doctest-0.24.3/bin/doctest
162.14 s
> Using gcc version 15.2.0 given by user at:
162.14 s
> /nix/store/29qjlshvklnyr67nhpprzgb9igmsfsjj-gcc-wrapper-15.2.0/bin/gcc
162.14 s
> Using ghc version 9.8.4 found on system at:
162.14 s
> /nix/store/7r9b0bl984hdgd70nf5p8raa55kml491-ghc-9.8.4/bin/ghc
162.14 s
> Using ghc-pkg version 9.8.4 found on system at:
162.14 s
> /nix/store/7r9b0bl984hdgd70nf5p8raa55kml491-ghc-9.8.4/bin/ghc-pkg-9.8.4
162.14 s
> No ghcjs found
162.14 s
> No ghcjs-pkg found
162.14 s
> No greencard found
162.14 s
> Using haddock version 2.30.0 found on system at:
162.14 s
> /nix/store/7r9b0bl984hdgd70nf5p8raa55kml491-ghc-9.8.4/bin/haddock-ghc-9.8.4
162.14 s
> No happy found
162.14 s
> Using haskell-suite found on system at: haskell-suite-dummy-location
162.14 s
> Using haskell-suite-pkg found on system at: haskell-suite-pkg-dummy-location
162.14 s
> No hmake found
162.14 s
> Using hpc version 0.69 found on system at:
162.14 s
> /nix/store/7r9b0bl984hdgd70nf5p8raa55kml491-ghc-9.8.4/bin/hpc-ghc-9.8.4
162.14 s
> Using hsc2hs version 0.68.10 found on system at:
162.14 s
> /nix/store/7r9b0bl984hdgd70nf5p8raa55kml491-ghc-9.8.4/bin/hsc2hs-ghc-9.8.4
162.14 s
> Using hscolour version 1.25 found on system at:
162.14 s
> /nix/store/awnxn98rlw62rrjwli6d2lb4d27mrzzw-hscolour-1.25/bin/HsColour
162.14 s
> No jhc found
162.14 s
> Using ld found on system at:
162.14 s
> /nix/store/zjraf40s86y3iwhp626b934r5y6ldkbb-binutils-wrapper-2.46/bin/ld.gold
162.14 s
> No pkg-config found
162.14 s
> Using runghc version 9.8.4 found on system at:
162.14 s
> /nix/store/7r9b0bl984hdgd70nf5p8raa55kml491-ghc-9.8.4/bin/runghc-9.8.4
162.14 s
> Using strip version 2.46 found on system at:
162.14 s
> /nix/store/29qjlshvklnyr67nhpprzgb9igmsfsjj-gcc-wrapper-15.2.0/bin/strip
162.14 s
> Using tar found on system at:
162.14 s
> /nix/store/z5mq2sam4484prf3kv6v6vjw1m0i7j24-gnutar-1.35/bin/tar
162.14 s
> No uhc found
162.14 s
> Running phase: buildPhase
162.14 s
> Preprocessing library for pathway-compat-filepath-0.0.1.0..
162.14 s
> Building library for pathway-compat-filepath-0.0.1.0..
162.14 s
> [ 1 of 10] Compiling Common.FilePath ( src/Common/FilePath.hs, dist/build/Common/FilePath.o, dist/build/Common/FilePath.dyn_o )
162.14 s
> [ 2 of 10] Compiling Common.OsPath ( src/Common/OsPath.hs, dist/build/Common/OsPath.o, dist/build/Common/OsPath.dyn_o )
162.14 s
>
162.14 s
> src/Common/OsPath.hs:87:23: error : [ GHC-76037 ]
162.14 s
> Not in scope: ‘O.unsafeEncodeUtf’
162.14 s
> NB: the module ‘System.OsPath’ does not export ‘unsafeEncodeUtf’.
162.14 s
> |
162.14 s
> 87 | Format.parent = O.unsafeEncodeUtf "..",
162.14 s
> | ^^^^^^^^^^^^^^^^^
162.14 s
> [ 3 of 10] Compiling System.FilePath.Thin ( src/System/FilePath/Thin.hs, dist/build/System/FilePath/Thin.o, dist/build/System/FilePath/Thin.dyn_o )
162.14 s
> [ 4 of 10] Compiling System.FilePath.Pathway ( src/System/FilePath/Pathway.hs, dist/build/System/FilePath/Pathway.o, dist/build/System/FilePath/Pathway.dyn_o )
162.14 s
> [ 5 of 10] Compiling System.FilePath.Overlay ( src/System/FilePath/Overlay.hs, dist/build/System/FilePath/Overlay.o, dist/build/System/FilePath/Overlay.dyn_o )
162.14 s
> [ 6 of 10] Compiling System.FilePath ( src/System/FilePath.hs, dist/build/System/FilePath.o, dist/build/System/FilePath.dyn_o )
162.14 s
For full logs, run:
162.14 s
nix log /nix/store/7szrkx5w148zqvipzqp9kpvdwyixf2jm-pathway-compat-filepath-0.0.1.0.drv
162.14 s
error: Cannot build '/nix/store/7szrkx5w148zqvipzqp9kpvdwyixf2jm-pathway-compat-filepath-0.0.1.0.drv '.
162.14 s
Reason: builder failed with exit code 1 .
162.14 s
Output paths:
162.14 s
/nix/store/1a5zli1srydg9czyyyns0ql1sl8i4gzp-pathway-compat-filepath-0.0.1.0-doc
162.14 s
/nix/store/3wxxzpw33d72qx9kng4qpfmhidc1ba2f-pathway-compat-filepath-0.0.1.0
162.14 s
Last 151 log lines:
162.14 s
> Running phase: setupCompilerEnvironmentPhase
162.14 s
> Build with /nix/store/7r9b0bl984hdgd70nf5p8raa55kml491-ghc-9.8.4.
162.14 s
> Running phase: unpackPhase
162.14 s
> unpacking source archive /nix/store/99h2nwiw8z9r3kqrm9kdhv4k4sf61d7w-filepath
162.14 s
> source root is filepath
162.14 s
> Running phase: patchPhase
162.14 s
> Running phase: compileBuildDriverPhase
162.14 s
> setupCompileFlags: -package-db=/build/tmp.dFNS7qW2b3/setup-package.conf.d -threaded
162.14 s
> [1 of 2] Compiling Main ( Setup.hs, /build/tmp.dFNS7qW2b3/Main.o )
162.14 s
> [2 of 2] Linking Setup
162.14 s
> Running phase: updateAutotoolsGnuConfigScriptsPhase
162.14 s
> Running phase: configurePhase
162.14 s
> configureFlags: --verbose --prefix=/nix/store/3wxxzpw33d72qx9kng4qpfmhidc1ba2f-pathway-compat-filepath-0.0.1.0 --libdir=$prefix/lib/$compiler/lib --libsubdir=$abi/$libname --docdir=/nix/store/1a5zli1srydg9czyyyns0ql1sl8i4gzp-pathway-compat-filepath-0.0.1.0-doc/share/doc/pathway-compat-filepath-0.0.1.0 --with-gcc=gcc --package-db=/build/tmp.dFNS7qW2b3/package.conf.d --ghc-option=-j16 --ghc-option=+RTS --ghc-option=-A64M --ghc-option=-RTS --enable-library-profiling --profiling-detail=exported-functions --disable-profiling --enable-shared --disable-coverage --enable-static --disable-executable-dynamic --enable-tests --disable-benchmarks --enable-library-vanilla --disable-library-for-ghci --enable-split-sections --enable-library-stripping --enable-executable-stripping --ghc-option=-haddock --ghc-options=-Werror --extra-lib-dirs=/nix/store/pndhkk0l649lm1sj0mxk7cbwq26qd1ra-ncurses-6.6/lib --extra-lib-dirs=/nix/store/0djlg4g0b81w94k3vcaqsxsc2hh4kism-libffi-3.5.2/lib --extra-lib-dirs=/nix/store/md4paia7riiggyrj8p24c7a6vf8w7jz8-elfutils-0.194/lib --extra-lib-dirs=/nix/store/39vv2pf64gd8li48a4hpbhw2crzd8z5p-gmp-with-cxx-6.3.0/lib --extra-lib-dirs=/nix/store/7wwvald8lapkrsr72qanlw8blyn55ifx-numactl-2.0.18/lib --extra-lib-dirs=/nix/store/7r9b0bl984hdgd70nf5p8raa55kml491-ghc-9.8.4/lib
162.14 s
> Using Parsec parser
162.14 s
> Configuring pathway-compat-filepath-0.0.1.0...
162.14 s
> Flags chosen: noisy-deprecations=True, verify-no-recursion=False
162.14 s
> Dependency base >=4.14.0 && <4.15 || >=4.15.0 && <4.16 || >=4.16.0 && <4.17 ||
162.14 s
> >=4.17.0 && <4.18 || >=4.18.0 && <4.19 || >=4.19.0 && <4.20 || >=4.20.0 &&
162.14 s
> <4.21 || >=4.21.0 && <4.22 || >=4.22.0 && <4.23: using base-4.19.2.0
162.14 s
> Dependency extra: using extra-1.8.1
162.14 s
> Dependency filepath >=1.4.2 && <1.5 || >=1.5.0 && <1.6: using
162.14 s
> filepath-1.4.301.0
162.14 s
> Dependency megaparsec >=9.0.1 && <9.1 || >=9.2.1 && <9.3 || >=9.5.0 && <9.6 ||
162.14 s
> >=9.7.0 && <9.8: using megaparsec-9.7.0
162.14 s
> Dependency pathway >=0.0.1 && <0.1: using pathway-0.0.1.0
162.14 s
> Dependency pathway-compat-base >=0.0.1 && <0.1: using
162.14 s
> pathway-compat-base-0.0.1.0
162.14 s
> Dependency pathway-internal >=0.0.1 && <0.1: using pathway-internal-0.0.1.0
162.14 s
> Dependency base >=4.14.0 && <4.15 || >=4.15.0 && <4.16 || >=4.16.0 && <4.17 ||
162.14 s
> >=4.17.0 && <4.18 || >=4.18.0 && <4.19 || >=4.19.0 && <4.20 || >=4.20.0 &&
162.14 s
> <4.21 || >=4.21.0 && <4.22 || >=4.22.0 && <4.23: using base-4.19.2.0
162.14 s
> Dependency doctest >=0.16.3 && <0.17 || >=0.18.1 && <0.19 || >=0.20.1 && <0.21
162.14 s
> || >=0.21.1 && <0.22 || >=0.22.2 && <0.23 || >=0.24.2 && <0.25: using
162.14 s
> doctest-0.24.3
162.14 s
> Dependency pathway-compat-filepath: using pathway-compat-filepath-0.0.1.0
162.14 s
> Source component graph:
162.14 s
> component lib
162.14 s
> component test:doctests dependency lib
162.14 s
> Configured component graph:
162.14 s
> component pathway-compat-filepath-0.0.1.0-1aSZ3UXFr73FDOQtPeyw7g
162.14 s
> include base-4.19.2.0-934f
162.14 s
> include extra-1.8.1-F4oHgTKCper3ZiIUPZjGPK
162.14 s
> include filepath-1.4.301.0-6e15
162.14 s
> include megaparsec-9.7.0-10vHZAF1maw9O8p2gXs66N
162.14 s
> include pathway-0.0.1.0-H5uD0SRA9755UrSqFBaCYE
162.14 s
> include pathway-compat-base-0.0.1.0-8ldj6SPXbxq2Shd8yFeOpr
162.14 s
> include pathway-internal-0.0.1.0-Lnjdb2M8cxN196wSdsfQUK
162.14 s
> component pathway-compat-filepath-0.0.1.0-5Vlr121wsSlHY9yKgCvAGY-doctests
162.14 s
> include base-4.19.2.0-934f
162.14 s
> include doctest-0.24.3-1aDs7zEYV5r7raSsXr9TQC
162.14 s
> include pathway-compat-filepath-0.0.1.0-1aSZ3UXFr73FDOQtPeyw7g
162.14 s
> Linked component graph:
162.14 s
> unit pathway-compat-filepath-0.0.1.0-1aSZ3UXFr73FDOQtPeyw7g
162.14 s
> include base-4.19.2.0-934f
162.14 s
> include extra-1.8.1-F4oHgTKCper3ZiIUPZjGPK
162.14 s
> include filepath-1.4.301.0-6e15
162.14 s
> include megaparsec-9.7.0-10vHZAF1maw9O8p2gXs66N
162.14 s
> include pathway-0.0.1.0-H5uD0SRA9755UrSqFBaCYE
162.14 s
> include pathway-compat-base-0.0.1.0-8ldj6SPXbxq2Shd8yFeOpr
162.14 s
> include pathway-internal-0.0.1.0-Lnjdb2M8cxN196wSdsfQUK
162.14 s
> Common.FilePath=pathway-compat-filepath-0.0.1.0-1aSZ3UXFr73FDOQtPeyw7g:Common.FilePath,Common.OsPath=pathway-compat-filepath-0.0.1.0-1aSZ3UXFr73FDOQtPeyw7g:Common.OsPath,System.FilePath=pathway-compat-filepath-0.0.1.0-1aSZ3UXFr73FDOQtPeyw7g:System.FilePath,System.FilePath.Overlay=pathway-compat-filepath-0.0.1.0-1aSZ3UXFr73FDOQtPeyw7g:System.FilePath.Overlay,System.FilePath.Pathway=pathway-compat-filepath-0.0.1.0-1aSZ3UXFr73FDOQtPeyw7g:System.FilePath.Pathway,System.FilePath.Thin=pathway-compat-filepath-0.0.1.0-1aSZ3UXFr73FDOQtPeyw7g:System.FilePath.Thin,System.OsPath=pathway-compat-filepath-0.0.1.0-1aSZ3UXFr73FDOQtPeyw7g:System.OsPath,System.OsPath.Overlay=pathway-compat-filepath-0.0.1.0-1aSZ3UXFr73FDOQtPeyw7g:System.OsPath.Overlay,System.OsPath.Pathway=pathway-compat-filepath-0.0.1.0-1aSZ3UXFr73FDOQtPeyw7g:System.OsPath.Pathway,System.OsPath.Thin=pathway-compat-filepath-0.0.1.0-1aSZ3UXFr73FDOQtPeyw7g:System.OsPath.Thin
162.14 s
> unit pathway-compat-filepath-0.0.1.0-5Vlr121wsSlHY9yKgCvAGY-doctests
162.14 s
> include base-4.19.2.0-934f
162.14 s
> include doctest-0.24.3-1aDs7zEYV5r7raSsXr9TQC
162.14 s
> include pathway-compat-filepath-0.0.1.0-1aSZ3UXFr73FDOQtPeyw7g
162.14 s
> Ready component graph:
162.14 s
> definite pathway-compat-filepath-0.0.1.0-1aSZ3UXFr73FDOQtPeyw7g
162.14 s
> depends base-4.19.2.0-934f
162.14 s
> depends extra-1.8.1-F4oHgTKCper3ZiIUPZjGPK
162.14 s
> depends filepath-1.4.301.0-6e15
162.14 s
> depends megaparsec-9.7.0-10vHZAF1maw9O8p2gXs66N
162.14 s
> depends pathway-0.0.1.0-H5uD0SRA9755UrSqFBaCYE
162.14 s
> depends pathway-compat-base-0.0.1.0-8ldj6SPXbxq2Shd8yFeOpr
162.14 s
> depends pathway-internal-0.0.1.0-Lnjdb2M8cxN196wSdsfQUK
162.14 s
> definite pathway-compat-filepath-0.0.1.0-5Vlr121wsSlHY9yKgCvAGY-doctests
162.14 s
> depends base-4.19.2.0-934f
162.14 s
> depends doctest-0.24.3-1aDs7zEYV5r7raSsXr9TQC
162.14 s
> depends pathway-compat-filepath-0.0.1.0-1aSZ3UXFr73FDOQtPeyw7g
162.14 s
> Using Cabal-3.10.3.0 compiled by ghc-9.8
162.14 s
> Using compiler: ghc-9.8.4
162.14 s
> Using install prefix:
162.14 s
> /nix/store/3wxxzpw33d72qx9kng4qpfmhidc1ba2f-pathway-compat-filepath-0.0.1.0
162.14 s
> Executables installed in:
162.14 s
> /nix/store/3wxxzpw33d72qx9kng4qpfmhidc1ba2f-pathway-compat-filepath-0.0.1.0/bin
162.14 s
> Libraries installed in:
162.14 s
> /nix/store/3wxxzpw33d72qx9kng4qpfmhidc1ba2f-pathway-compat-filepath-0.0.1.0/lib/ghc-9.8.4/lib/x86_64-linux-ghc-9.8.4/pathway-compat-filepath-0.0.1.0-1aSZ3UXFr73FDOQtPeyw7g
162.14 s
> Dynamic Libraries installed in:
162.14 s
> /nix/store/3wxxzpw33d72qx9kng4qpfmhidc1ba2f-pathway-compat-filepath-0.0.1.0/lib/ghc-9.8.4/lib/x86_64-linux-ghc-9.8.4
162.14 s
> Private executables installed in:
162.14 s
> /nix/store/3wxxzpw33d72qx9kng4qpfmhidc1ba2f-pathway-compat-filepath-0.0.1.0/libexec/x86_64-linux-ghc-9.8.4/pathway-compat-filepath-0.0.1.0
162.14 s
> Data files installed in:
162.14 s
> /nix/store/3wxxzpw33d72qx9kng4qpfmhidc1ba2f-pathway-compat-filepath-0.0.1.0/share/x86_64-linux-ghc-9.8.4/pathway-compat-filepath-0.0.1.0
162.14 s
> Documentation installed in:
162.14 s
> /nix/store/1a5zli1srydg9czyyyns0ql1sl8i4gzp-pathway-compat-filepath-0.0.1.0-doc/share/doc/pathway-compat-filepath-0.0.1.0
162.14 s
> Configuration files installed in:
162.14 s
> /nix/store/3wxxzpw33d72qx9kng4qpfmhidc1ba2f-pathway-compat-filepath-0.0.1.0/etc
162.14 s
> No alex found
162.14 s
> Using ar found on system at:
162.14 s
> /nix/store/zjraf40s86y3iwhp626b934r5y6ldkbb-binutils-wrapper-2.46/bin/ar
162.14 s
> No c2hs found
162.14 s
> No cpphs found
162.14 s
> Using doctest version 0.24.3 found on system at:
162.14 s
> /nix/store/2y183b1vsybv0157vfr59yhdwjkpqfkn-doctest-0.24.3/bin/doctest
162.14 s
> Using gcc version 15.2.0 given by user at:
162.14 s
> /nix/store/29qjlshvklnyr67nhpprzgb9igmsfsjj-gcc-wrapper-15.2.0/bin/gcc
162.14 s
> Using ghc version 9.8.4 found on system at:
162.14 s
> /nix/store/7r9b0bl984hdgd70nf5p8raa55kml491-ghc-9.8.4/bin/ghc
162.14 s
> Using ghc-pkg version 9.8.4 found on system at:
162.14 s
> /nix/store/7r9b0bl984hdgd70nf5p8raa55kml491-ghc-9.8.4/bin/ghc-pkg-9.8.4
162.14 s
> No ghcjs found
162.14 s
> No ghcjs-pkg found
162.14 s
> No greencard found
162.14 s
> Using haddock version 2.30.0 found on system at:
162.14 s
> /nix/store/7r9b0bl984hdgd70nf5p8raa55kml491-ghc-9.8.4/bin/haddock-ghc-9.8.4
162.14 s
> No happy found
162.14 s
> Using haskell-suite found on system at: haskell-suite-dummy-location
162.14 s
> Using haskell-suite-pkg found on system at: haskell-suite-pkg-dummy-location
162.14 s
> No hmake found
162.14 s
> Using hpc version 0.69 found on system at:
162.14 s
> /nix/store/7r9b0bl984hdgd70nf5p8raa55kml491-ghc-9.8.4/bin/hpc-ghc-9.8.4
162.14 s
> Using hsc2hs version 0.68.10 found on system at:
162.14 s
> /nix/store/7r9b0bl984hdgd70nf5p8raa55kml491-ghc-9.8.4/bin/hsc2hs-ghc-9.8.4
162.14 s
> Using hscolour version 1.25 found on system at:
162.14 s
> /nix/store/awnxn98rlw62rrjwli6d2lb4d27mrzzw-hscolour-1.25/bin/HsColour
162.14 s
> No jhc found
162.14 s
> Using ld found on system at:
162.14 s
> /nix/store/zjraf40s86y3iwhp626b934r5y6ldkbb-binutils-wrapper-2.46/bin/ld.gold
162.14 s
> No pkg-config found
162.14 s
> Using runghc version 9.8.4 found on system at:
162.14 s
> /nix/store/7r9b0bl984hdgd70nf5p8raa55kml491-ghc-9.8.4/bin/runghc-9.8.4
162.14 s
> Using strip version 2.46 found on system at:
162.14 s
> /nix/store/29qjlshvklnyr67nhpprzgb9igmsfsjj-gcc-wrapper-15.2.0/bin/strip
162.14 s
> Using tar found on system at:
162.14 s
> /nix/store/z5mq2sam4484prf3kv6v6vjw1m0i7j24-gnutar-1.35/bin/tar
162.14 s
> No uhc found
162.14 s
> Running phase: buildPhase
162.14 s
> Preprocessing library for pathway-compat-filepath-0.0.1.0..
162.14 s
> Building library for pathway-compat-filepath-0.0.1.0..
162.14 s
> [ 1 of 10] Compiling Common.FilePath ( src/Common/FilePath.hs, dist/build/Common/FilePath.o, dist/build/Common/FilePath.dyn_o )
162.14 s
> [ 2 of 10] Compiling Common.OsPath ( src/Common/OsPath.hs, dist/build/Common/OsPath.o, dist/build/Common/OsPath.dyn_o )
162.14 s
>
162.14 s
> src/Common/OsPath.hs:87:23: error : [ GHC-76037 ]
162.14 s
> Not in scope: ‘O.unsafeEncodeUtf’
162.14 s
> NB: the module ‘System.OsPath’ does not export ‘unsafeEncodeUtf’.
162.14 s
> |
162.14 s
> 87 | Format.parent = O.unsafeEncodeUtf "..",
162.14 s
> | ^^^^^^^^^^^^^^^^^
162.14 s
> [ 3 of 10] Compiling System.FilePath.Thin ( src/System/FilePath/Thin.hs, dist/build/System/FilePath/Thin.o, dist/build/System/FilePath/Thin.dyn_o )
162.14 s
> [ 4 of 10] Compiling System.FilePath.Pathway ( src/System/FilePath/Pathway.hs, dist/build/System/FilePath/Pathway.o, dist/build/System/FilePath/Pathway.dyn_o )
162.14 s
> [ 5 of 10] Compiling System.FilePath.Overlay ( src/System/FilePath/Overlay.hs, dist/build/System/FilePath/Overlay.o, dist/build/System/FilePath/Overlay.dyn_o )
162.14 s
> [ 6 of 10] Compiling System.FilePath ( src/System/FilePath.hs, dist/build/System/FilePath.o, dist/build/System/FilePath.dyn_o )
162.14 s
For full logs, run:
162.14 s
nix log /nix/store/7szrkx5w148zqvipzqp9kpvdwyixf2jm-pathway-compat-filepath-0.0.1.0.drv
162.14 s
error: Cannot build '/nix/store/xgk4x00p9nxy6vygklkdvq3xhnw85n9f-ghc-9.8.4-with-packages.drv '.
162.14 s
Reason: 1 dependency failed .
162.14 s
Output paths:
162.14 s
/nix/store/28d7zlh94n17052znxscmz95nzy2y14a-ghc-9.8.4-with-packages
162.14 s
error: Cannot build '/nix/store/88ry82jpw7zq3xgbiwnx1w9qxsh0qky4-pathway-compat-directory-0.0.1.0.drv '.
162.14 s
Reason: 1 dependency failed .
162.14 s
Output paths:
162.14 s
/nix/store/dywfb8cm100xr0sf32p9rsxsnsh69rj6-pathway-compat-directory-0.0.1.0-doc
162.14 s
/nix/store/s1ah3f1yscfslflkp1plkhlcli18iy6b-pathway-compat-directory-0.0.1.0
162.14 s
error: Cannot build '/nix/store/63m9x4cv94732rwlvs3r2jcm466wivfm-pathway-compat-file-io-0.0.1.0.drv '.
162.14 s
Reason: 1 dependency failed .
162.14 s
Output paths:
162.14 s
/nix/store/45czry1y9c5sgqm357i6hb6ggvyvx51b-pathway-compat-file-io-0.0.1.0
162.14 s
/nix/store/zrvf42qsq1gy5wil4341p92839w0p49b-pathway-compat-file-io-0.0.1.0-doc
162.14 s
error: Cannot build '/nix/store/ikjmgvjg2wrv8idayqspdv6jg97fzzai-pathway-compat-temporary-0.0.1.0.drv '.
162.14 s
Reason: 1 dependency failed .
162.14 s
Output paths:
162.14 s
/nix/store/5n49iv6xr88nwyza5k8dnqvxx2vqs319-pathway-compat-temporary-0.0.1.0
162.14 s
/nix/store/c3b6wzzcri7hd1jv871c7za1swan4bd1-pathway-compat-temporary-0.0.1.0-doc
162.14 s
error: Cannot build '/nix/store/h33py59mz8imsy05pgjz19b0jvgi7z1i-pathway-system-0.0.1.0.drv '.
162.14 s
Reason: 1 dependency failed .
162.14 s
Output paths:
162.14 s
/nix/store/51r6wz46nnyxhsvn968rjf84gyw6gv74-pathway-system-0.0.1.0
162.14 s
/nix/store/mlni22kgq48krfd8smgpizpj6in7d4ia-pathway-system-0.0.1.0-doc
162.14 s
error: Build failed due to failed dependency
162.14 s
error: Cannot build '/nix/store/cyn0sina55pw6lj00znvq4k29sbkm2vv-all-packages.drv '.
162.14 s
Reason: 1 dependency failed .
162.14 s
Output paths:
162.14 s
/nix/store/jxsli0j2m1xahmhzgsgird7xmfgyq57l-all-packages
162.15 s
Build failed due to failed dependency
162.17 s
Build failed.