build packages.x86_64-linux.ghc984_all

Reproduce this run
Original Run
  1. 0.67 s $ /nix/store/9ypz3flqsrl5xl495mm8h645gadjsxi1-coreutils-9.11/bin/timeout --kill-after=15s 7200s /nix/store/23zk8sgzamrbmj1fday15szf7f2279s8-nix-2.34.7/bin/nix --extra-experimental-features nix-command --extra-experimental-features flakes --log-format internal-json build --no-link --print-out-paths git+https://github.com/sellout/pathway?ref=more-system&rev=bf654313bb47699f313cdd00e42ee12d835b5bed&shallow=1#packages.x86_64-linux.ghc984_all --print-build-logs
  2. 0.71 s warning: ignoring untrusted flake configuration setting 'allow-import-from-derivation'.
  3. 0.71 s Pass '--accept-flake-config' to trust it
  4. 0.71 s warning: ignoring untrusted flake configuration setting 'extra-experimental-features'.
  5. 0.71 s Pass '--accept-flake-config' to trust it
  6. 0.71 s warning: ignoring untrusted flake configuration setting 'extra-substituters'.
  7. 0.71 s Pass '--accept-flake-config' to trust it
  8. 0.71 s warning: ignoring untrusted flake configuration setting 'extra-trusted-public-keys'.
  9. 0.71 s Pass '--accept-flake-config' to trust it
  10. 0.71 s warning: ignoring untrusted flake configuration setting 'sandbox'.
  11. 0.71 s Pass '--accept-flake-config' to trust it
  12. 0.71 s warning: ignoring untrusted flake configuration setting 'use-registries'.
  13. 0.71 s Pass '--accept-flake-config' to trust it
  14. 1.40 s
  15. 1.77 s Building /nix/store/gwlaydb47f6yhlx7hsgqq7s0m612k39r-pathway-compat-filepath-0.0.1.0.drv
  16. 1.96 s [pathway-compat-filepath] Phase: setupCompilerEnvironmentPhase
  17. 1.96 s [pathway-compat-filepath] Build with /nix/store/7r9b0bl984hdgd70nf5p8raa55kml491-ghc-9.8.4.
  18. 2.25 s [pathway-compat-filepath] Phase: unpackPhase
  19. 2.26 s [pathway-compat-filepath] unpacking source archive /nix/store/56v5999xvkp18l2ygdvahppqdv4hrlnl-filepath
  20. 2.26 s [pathway-compat-filepath] source root is filepath
  21. 2.28 s [pathway-compat-filepath] Phase: patchPhase
  22. 2.29 s [pathway-compat-filepath] Phase: compileBuildDriverPhase
  23. 2.29 s [pathway-compat-filepath] setupCompileFlags: -package-db=/build/tmp.OxKLc4AkkL/setup-package.conf.d -threaded
  24. 2.33 s [pathway-compat-filepath] [1 of 2] Compiling Main ( Setup.hs, /build/tmp.OxKLc4AkkL/Main.o )
  25. 2.37 s [pathway-compat-filepath] [2 of 2] Linking Setup
  26. 3.46 s [pathway-compat-filepath] Phase: updateAutotoolsGnuConfigScriptsPhase
  27. 3.48 s [pathway-compat-filepath] Phase: configurePhase
  28. 3.48 s [pathway-compat-filepath] configureFlags: --verbose --prefix=/nix/store/knqi4mpp2gcy2djhvikk6m439c94gw16-pathway-compat-filepath-0.0.1.0 --libdir=$prefix/lib/$compiler/lib --libsubdir=$abi/$libname --docdir=/nix/store/brb3ys0mr106j2xs2nqwq5rszfngk13w-pathway-compat-filepath-0.0.1.0-doc/share/doc/pathway-compat-filepath-0.0.1.0 --with-gcc=gcc --package-db=/build/tmp.OxKLc4AkkL/package.conf.d --ghc-option=-j16 --ghc-option=+RTS --ghc-option=-A64M --ghc-option=-RTS --enable-library-profiling --profiling-detail=exported-functions --disable-profiling --enable-shared --disable-coverage --enable-static --disable-executable-dynamic --enable-tests --disable-benchmarks --enable-library-vanilla --disable-library-for-ghci --enable-split-sections --enable-library-stripping --enable-executable-stripping --ghc-option=-haddock --ghc-options=-Werror --extra-lib-dirs=/nix/store/pndhkk0l649lm1sj0mxk7cbwq26qd1ra-ncurses-6.6/lib --extra-lib-dirs=/nix/store/0djlg4g0b81w94k3vcaqsxsc2hh4kism-libffi-3.5.2/lib --extra-lib-dirs=/nix/store/md4paia7riiggyrj8p24c7a6vf8w7jz8-elfutils-0.194/lib --extra-lib-dirs=/nix/store/39vv2pf64gd8li48a4hpbhw2crzd8z5p-gmp-with-cxx-6.3.0/lib --extra-lib-dirs=/nix/store/7wwvald8lapkrsr72qanlw8blyn55ifx-numactl-2.0.18/lib --extra-lib-dirs=/nix/store/7r9b0bl984hdgd70nf5p8raa55kml491-ghc-9.8.4/lib
  29. 3.49 s [pathway-compat-filepath] Using Parsec parser
  30. 3.49 s [pathway-compat-filepath] Configuring pathway-compat-filepath-0.0.1.0...
  31. 3.78 s [pathway-compat-filepath] Flags chosen: noisy-deprecations=True, verify-no-recursion=False
  32. 3.78 s [pathway-compat-filepath] Dependency base >=4.14.0 && <4.15 || >=4.15.0 && <4.16 || >=4.16.0 && <4.17 ||
  33. 3.78 s [pathway-compat-filepath] >=4.17.0 && <4.18 || >=4.18.0 && <4.19 || >=4.19.0 && <4.20 || >=4.20.0 &&
  34. 3.78 s [pathway-compat-filepath] <4.21 || >=4.21.0 && <4.22 || >=4.22.0 && <4.23: using base-4.19.2.0
  35. 3.78 s [pathway-compat-filepath] Dependency extra: using extra-1.8.1
  36. 3.78 s [pathway-compat-filepath] Dependency filepath >=1.4.2 && <1.5 || >=1.5.0 && <1.6: using
  37. 3.78 s [pathway-compat-filepath] filepath-1.4.301.0
  38. 3.78 s [pathway-compat-filepath] Dependency megaparsec >=9.0.1 && <9.1 || >=9.2.1 && <9.3 || >=9.5.0 && <9.6 ||
  39. 3.78 s [pathway-compat-filepath] >=9.7.0 && <9.8: using megaparsec-9.7.0
  40. 3.78 s [pathway-compat-filepath] Dependency os-string: using os-string-2.0.10
  41. 3.78 s [pathway-compat-filepath] Dependency pathway >=0.0.1 && <0.1: using pathway-0.0.1.0
  42. 3.78 s [pathway-compat-filepath] Dependency pathway-compat-base >=0.0.1 && <0.1: using
  43. 3.78 s [pathway-compat-filepath] pathway-compat-base-0.0.1.0
  44. 3.78 s [pathway-compat-filepath] Dependency pathway-internal >=0.0.1 && <0.1: using pathway-internal-0.0.1.0
  45. 3.78 s [pathway-compat-filepath] Dependency base >=4.14.0 && <4.15 || >=4.15.0 && <4.16 || >=4.16.0 && <4.17 ||
  46. 3.78 s [pathway-compat-filepath] >=4.17.0 && <4.18 || >=4.18.0 && <4.19 || >=4.19.0 && <4.20 || >=4.20.0 &&
  47. 3.78 s [pathway-compat-filepath] <4.21 || >=4.21.0 && <4.22 || >=4.22.0 && <4.23: using base-4.19.2.0
  48. 3.78 s [pathway-compat-filepath] Dependency doctest >=0.16.3 && <0.17 || >=0.18.1 && <0.19 || >=0.20.1 && <0.21
  49. 3.78 s [pathway-compat-filepath] || >=0.21.1 && <0.22 || >=0.22.2 && <0.23 || >=0.24.2 && <0.25: using
  50. 3.78 s [pathway-compat-filepath] doctest-0.24.3
  51. 3.78 s [pathway-compat-filepath] Dependency pathway-compat-filepath: using pathway-compat-filepath-0.0.1.0
  52. 4.07 s [pathway-compat-filepath] Source component graph:
  53. 4.07 s [pathway-compat-filepath] component lib
  54. 4.07 s [pathway-compat-filepath] component test:doctests dependency lib
  55. 4.07 s [pathway-compat-filepath] Configured component graph:
  56. 4.07 s [pathway-compat-filepath] component pathway-compat-filepath-0.0.1.0-6KN1Vlb8yPeBopmlZtXyrR
  57. 4.07 s [pathway-compat-filepath] include base-4.19.2.0-934f
  58. 4.07 s [pathway-compat-filepath] include extra-1.8.1-F4oHgTKCper3ZiIUPZjGPK
  59. 4.07 s [pathway-compat-filepath] include filepath-1.4.301.0-6e15
  60. 4.07 s [pathway-compat-filepath] include megaparsec-9.7.0-10vHZAF1maw9O8p2gXs66N
  61. 4.07 s [pathway-compat-filepath] include os-string-2.0.10-HbyG8qgShpTHKXL8bZ3UK8
  62. 4.07 s [pathway-compat-filepath] include pathway-0.0.1.0-H5uD0SRA9755UrSqFBaCYE
  63. 4.07 s [pathway-compat-filepath] include pathway-compat-base-0.0.1.0-8ldj6SPXbxq2Shd8yFeOpr
  64. 4.07 s [pathway-compat-filepath] include pathway-internal-0.0.1.0-Lnjdb2M8cxN196wSdsfQUK
  65. 4.07 s [pathway-compat-filepath] component pathway-compat-filepath-0.0.1.0-LoaDJ8tbb2m5kfHmaP2B9c-doctests
  66. 4.07 s [pathway-compat-filepath] include base-4.19.2.0-934f
  67. 4.07 s [pathway-compat-filepath] include doctest-0.24.3-1aDs7zEYV5r7raSsXr9TQC
  68. 4.07 s [pathway-compat-filepath] include pathway-compat-filepath-0.0.1.0-6KN1Vlb8yPeBopmlZtXyrR
  69. 4.07 s [pathway-compat-filepath] Linked component graph:
  70. 4.07 s [pathway-compat-filepath] unit pathway-compat-filepath-0.0.1.0-6KN1Vlb8yPeBopmlZtXyrR
  71. 4.07 s [pathway-compat-filepath] include base-4.19.2.0-934f
  72. 4.07 s [pathway-compat-filepath] include extra-1.8.1-F4oHgTKCper3ZiIUPZjGPK
  73. 4.07 s [pathway-compat-filepath] include filepath-1.4.301.0-6e15
  74. 4.07 s [pathway-compat-filepath] include megaparsec-9.7.0-10vHZAF1maw9O8p2gXs66N
  75. 4.07 s [pathway-compat-filepath] include os-string-2.0.10-HbyG8qgShpTHKXL8bZ3UK8
  76. 4.07 s [pathway-compat-filepath] include pathway-0.0.1.0-H5uD0SRA9755UrSqFBaCYE
  77. 4.07 s [pathway-compat-filepath] include pathway-compat-base-0.0.1.0-8ldj6SPXbxq2Shd8yFeOpr
  78. 4.07 s [pathway-compat-filepath] include pathway-internal-0.0.1.0-Lnjdb2M8cxN196wSdsfQUK
  79. 4.07 s [pathway-compat-filepath] Common.FilePath=pathway-compat-filepath-0.0.1.0-6KN1Vlb8yPeBopmlZtXyrR:Common.FilePath,Common.OsPath=pathway-compat-filepath-0.0.1.0-6KN1Vlb8yPeBopmlZtXyrR:Common.OsPath,System.FilePath=pathway-compat-filepath-0.0.1.0-6KN1Vlb8yPeBopmlZtXyrR:System.FilePath,System.FilePath.Overlay=pathway-compat-filepath-0.0.1.0-6KN1Vlb8yPeBopmlZtXyrR:System.FilePath.Overlay,System.FilePath.Pathway=pathway-compat-filepath-0.0.1.0-6KN1Vlb8yPeBopmlZtXyrR:System.FilePath.Pathway,System.FilePath.Thin=pathway-compat-filepath-0.0.1.0-6KN1Vlb8yPeBopmlZtXyrR:System.FilePath.Thin,System.OsPath=pathway-compat-filepath-0.0.1.0-6KN1Vlb8yPeBopmlZtXyrR:System.OsPath,System.OsPath.Overlay=pathway-compat-filepath-0.0.1.0-6KN1Vlb8yPeBopmlZtXyrR:System.OsPath.Overlay,System.OsPath.Pathway=pathway-compat-filepath-0.0.1.0-6KN1Vlb8yPeBopmlZtXyrR:System.OsPath.Pathway,System.OsPath.Thin=pathway-compat-filepath-0.0.1.0-6KN1Vlb8yPeBopmlZtXyrR:System.OsPath.Thin
  80. 4.07 s [pathway-compat-filepath] unit pathway-compat-filepath-0.0.1.0-LoaDJ8tbb2m5kfHmaP2B9c-doctests
  81. 4.07 s [pathway-compat-filepath] include base-4.19.2.0-934f
  82. 4.07 s [pathway-compat-filepath] include doctest-0.24.3-1aDs7zEYV5r7raSsXr9TQC
  83. 4.07 s [pathway-compat-filepath] include pathway-compat-filepath-0.0.1.0-6KN1Vlb8yPeBopmlZtXyrR
  84. 4.07 s [pathway-compat-filepath] Ready component graph:
  85. 4.07 s [pathway-compat-filepath] definite pathway-compat-filepath-0.0.1.0-6KN1Vlb8yPeBopmlZtXyrR
  86. 4.07 s [pathway-compat-filepath] depends base-4.19.2.0-934f
  87. 4.07 s [pathway-compat-filepath] depends extra-1.8.1-F4oHgTKCper3ZiIUPZjGPK
  88. 4.07 s [pathway-compat-filepath] depends filepath-1.4.301.0-6e15
  89. 4.07 s [pathway-compat-filepath] depends megaparsec-9.7.0-10vHZAF1maw9O8p2gXs66N
  90. 4.07 s [pathway-compat-filepath] depends os-string-2.0.10-HbyG8qgShpTHKXL8bZ3UK8
  91. 4.07 s [pathway-compat-filepath] depends pathway-0.0.1.0-H5uD0SRA9755UrSqFBaCYE
  92. 4.07 s [pathway-compat-filepath] depends pathway-compat-base-0.0.1.0-8ldj6SPXbxq2Shd8yFeOpr
  93. 4.07 s [pathway-compat-filepath] depends pathway-internal-0.0.1.0-Lnjdb2M8cxN196wSdsfQUK
  94. 4.07 s [pathway-compat-filepath] definite pathway-compat-filepath-0.0.1.0-LoaDJ8tbb2m5kfHmaP2B9c-doctests
  95. 4.07 s [pathway-compat-filepath] depends base-4.19.2.0-934f
  96. 4.08 s [pathway-compat-filepath] depends doctest-0.24.3-1aDs7zEYV5r7raSsXr9TQC
  97. 4.08 s [pathway-compat-filepath] depends pathway-compat-filepath-0.0.1.0-6KN1Vlb8yPeBopmlZtXyrR
  98. 4.08 s [pathway-compat-filepath] Using Cabal-3.10.3.0 compiled by ghc-9.8
  99. 4.08 s [pathway-compat-filepath] Using compiler: ghc-9.8.4
  100. 4.08 s [pathway-compat-filepath] Using install prefix:
  101. 4.08 s [pathway-compat-filepath] /nix/store/knqi4mpp2gcy2djhvikk6m439c94gw16-pathway-compat-filepath-0.0.1.0
  102. 4.08 s [pathway-compat-filepath] Executables installed in:
  103. 4.08 s [pathway-compat-filepath] /nix/store/knqi4mpp2gcy2djhvikk6m439c94gw16-pathway-compat-filepath-0.0.1.0/bin
  104. 4.08 s [pathway-compat-filepath] Libraries installed in:
  105. 4.08 s [pathway-compat-filepath] /nix/store/knqi4mpp2gcy2djhvikk6m439c94gw16-pathway-compat-filepath-0.0.1.0/lib/ghc-9.8.4/lib/x86_64-linux-ghc-9.8.4/pathway-compat-filepath-0.0.1.0-6KN1Vlb8yPeBopmlZtXyrR
  106. 4.08 s [pathway-compat-filepath] Dynamic Libraries installed in:
  107. 4.08 s [pathway-compat-filepath] /nix/store/knqi4mpp2gcy2djhvikk6m439c94gw16-pathway-compat-filepath-0.0.1.0/lib/ghc-9.8.4/lib/x86_64-linux-ghc-9.8.4
  108. 4.08 s [pathway-compat-filepath] Private executables installed in:
  109. 4.08 s [pathway-compat-filepath] /nix/store/knqi4mpp2gcy2djhvikk6m439c94gw16-pathway-compat-filepath-0.0.1.0/libexec/x86_64-linux-ghc-9.8.4/pathway-compat-filepath-0.0.1.0
  110. 4.08 s [pathway-compat-filepath] Data files installed in:
  111. 4.08 s [pathway-compat-filepath] /nix/store/knqi4mpp2gcy2djhvikk6m439c94gw16-pathway-compat-filepath-0.0.1.0/share/x86_64-linux-ghc-9.8.4/pathway-compat-filepath-0.0.1.0
  112. 4.08 s [pathway-compat-filepath] Documentation installed in:
  113. 4.08 s [pathway-compat-filepath] /nix/store/brb3ys0mr106j2xs2nqwq5rszfngk13w-pathway-compat-filepath-0.0.1.0-doc/share/doc/pathway-compat-filepath-0.0.1.0
  114. 4.08 s [pathway-compat-filepath] Configuration files installed in:
  115. 4.08 s [pathway-compat-filepath] /nix/store/knqi4mpp2gcy2djhvikk6m439c94gw16-pathway-compat-filepath-0.0.1.0/etc
  116. 4.08 s [pathway-compat-filepath] No alex found
  117. 4.08 s [pathway-compat-filepath] Using ar found on system at:
  118. 4.08 s [pathway-compat-filepath] /nix/store/zjraf40s86y3iwhp626b934r5y6ldkbb-binutils-wrapper-2.46/bin/ar
  119. 4.08 s [pathway-compat-filepath] No c2hs found
  120. 4.08 s [pathway-compat-filepath] No cpphs found
  121. 4.08 s [pathway-compat-filepath] Using doctest version 0.24.3 found on system at:
  122. 4.08 s [pathway-compat-filepath] /nix/store/2y183b1vsybv0157vfr59yhdwjkpqfkn-doctest-0.24.3/bin/doctest
  123. 4.08 s [pathway-compat-filepath] Using gcc version 15.2.0 given by user at:
  124. 4.08 s [pathway-compat-filepath] /nix/store/29qjlshvklnyr67nhpprzgb9igmsfsjj-gcc-wrapper-15.2.0/bin/gcc
  125. 4.08 s [pathway-compat-filepath] Using ghc version 9.8.4 found on system at:
  126. 4.08 s [pathway-compat-filepath] /nix/store/7r9b0bl984hdgd70nf5p8raa55kml491-ghc-9.8.4/bin/ghc
  127. 4.08 s [pathway-compat-filepath] Using ghc-pkg version 9.8.4 found on system at:
  128. 4.08 s [pathway-compat-filepath] /nix/store/7r9b0bl984hdgd70nf5p8raa55kml491-ghc-9.8.4/bin/ghc-pkg-9.8.4
  129. 4.08 s [pathway-compat-filepath] No ghcjs found
  130. 4.08 s [pathway-compat-filepath] No ghcjs-pkg found
  131. 4.08 s [pathway-compat-filepath] No greencard found
  132. 4.08 s [pathway-compat-filepath] Using haddock version 2.30.0 found on system at:
  133. 4.08 s [pathway-compat-filepath] /nix/store/7r9b0bl984hdgd70nf5p8raa55kml491-ghc-9.8.4/bin/haddock-ghc-9.8.4
  134. 4.08 s [pathway-compat-filepath] No happy found
  135. 4.08 s [pathway-compat-filepath] Using haskell-suite found on system at: haskell-suite-dummy-location
  136. 4.08 s [pathway-compat-filepath] Using haskell-suite-pkg found on system at: haskell-suite-pkg-dummy-location
  137. 4.08 s [pathway-compat-filepath] No hmake found
  138. 4.08 s [pathway-compat-filepath] Using hpc version 0.69 found on system at:
  139. 4.08 s [pathway-compat-filepath] /nix/store/7r9b0bl984hdgd70nf5p8raa55kml491-ghc-9.8.4/bin/hpc-ghc-9.8.4
  140. 4.08 s [pathway-compat-filepath] Using hsc2hs version 0.68.10 found on system at:
  141. 4.08 s [pathway-compat-filepath] /nix/store/7r9b0bl984hdgd70nf5p8raa55kml491-ghc-9.8.4/bin/hsc2hs-ghc-9.8.4
  142. 4.08 s [pathway-compat-filepath] Using hscolour version 1.25 found on system at:
  143. 4.08 s [pathway-compat-filepath] /nix/store/awnxn98rlw62rrjwli6d2lb4d27mrzzw-hscolour-1.25/bin/HsColour
  144. 4.08 s [pathway-compat-filepath] No jhc found
  145. 4.08 s [pathway-compat-filepath] Using ld found on system at:
  146. 4.08 s [pathway-compat-filepath] /nix/store/zjraf40s86y3iwhp626b934r5y6ldkbb-binutils-wrapper-2.46/bin/ld.gold
  147. 4.08 s [pathway-compat-filepath] No pkg-config found
  148. 4.08 s [pathway-compat-filepath] Using runghc version 9.8.4 found on system at:
  149. 4.08 s [pathway-compat-filepath] /nix/store/7r9b0bl984hdgd70nf5p8raa55kml491-ghc-9.8.4/bin/runghc-9.8.4
  150. 4.08 s [pathway-compat-filepath] Using strip version 2.46 found on system at:
  151. 4.08 s [pathway-compat-filepath] /nix/store/29qjlshvklnyr67nhpprzgb9igmsfsjj-gcc-wrapper-15.2.0/bin/strip
  152. 4.08 s [pathway-compat-filepath] Using tar found on system at:
  153. 4.08 s [pathway-compat-filepath] /nix/store/z5mq2sam4484prf3kv6v6vjw1m0i7j24-gnutar-1.35/bin/tar
  154. 4.08 s [pathway-compat-filepath] No uhc found
  155. 4.46 s [pathway-compat-filepath] Phase: buildPhase
  156. 4.51 s [pathway-compat-filepath] Preprocessing library for pathway-compat-filepath-0.0.1.0..
  157. 4.51 s [pathway-compat-filepath] Building library for pathway-compat-filepath-0.0.1.0..
  158. 4.59 s [pathway-compat-filepath] [ 1 of 10] Compiling Common.FilePath ( src/Common/FilePath.hs, dist/build/Common/FilePath.o, dist/build/Common/FilePath.dyn_o )
  159. 4.83 s [pathway-compat-filepath] [ 2 of 10] Compiling Common.OsPath ( src/Common/OsPath.hs, dist/build/Common/OsPath.o, dist/build/Common/OsPath.dyn_o )
  160. 4.83 s [pathway-compat-filepath]
  161. 4.83 s [pathway-compat-filepath] src/Common/OsPath.hs:90:23: error: [GHC-83865]
  162. 4.83 s [pathway-compat-filepath] • Couldn't match type ‘OSS.OsString’ with ‘OsString’
  163. 4.83 s [pathway-compat-filepath] Expected: OsPath
  164. 4.83 s [pathway-compat-filepath] Actual: OSS.OsString
  165. 4.83 s [pathway-compat-filepath] NB: ‘OsString’
  166. 4.83 s [pathway-compat-filepath] is defined in ‘System.OsString.Internal.Types.Hidden’
  167. 4.83 s [pathway-compat-filepath] in package ‘filepath-1.4.301.0’
  168. 4.83 s [pathway-compat-filepath] ‘OSS.OsString’
  169. 4.83 s [pathway-compat-filepath] is defined in ‘System.OsString.Internal.Types’
  170. 4.83 s [pathway-compat-filepath] in package ‘os-string-2.0.10’
  171. 4.83 s [pathway-compat-filepath] • In the ‘parent’ field of a record
  172. 4.83 s [pathway-compat-filepath] In the expression:
  173. 4.83 s [pathway-compat-filepath] Format
  174. 4.83 s [pathway-compat-filepath] {root = O.pack . pure $ O.pathSeparator, current = mempty,
  175. 4.83 s [pathway-compat-filepath] parent = OSS.unsafeEncodeUtf "..",
  176. 4.83 s [pathway-compat-filepath] separator = O.pack . pure $ O.pathSeparator,
  177. 4.83 s [pathway-compat-filepath] substitutions = mempty}
  178. 4.83 s [pathway-compat-filepath] In an equation for ‘localFormat’:
  179. 4.83 s [pathway-compat-filepath] localFormat
  180. 4.83 s [pathway-compat-filepath] = Format
  181. 4.83 s [pathway-compat-filepath] {root = O.pack . pure $ O.pathSeparator, current = mempty,
  182. 4.83 s [pathway-compat-filepath] parent = OSS.unsafeEncodeUtf "..",
  183. 4.83 s [pathway-compat-filepath] separator = O.pack . pure $ O.pathSeparator,
  184. 4.83 s [pathway-compat-filepath] substitutions = mempty}
  185. 4.83 s [pathway-compat-filepath] |
  186. 4.83 s [pathway-compat-filepath] 90 | Format.parent = OSS.unsafeEncodeUtf "..",
  187. 4.83 s [pathway-compat-filepath] | ^^^^^^^^^^^^^^^^^^^^^^^^
  188. 4.83 s [pathway-compat-filepath] [ 3 of 10] Compiling System.FilePath.Thin ( src/System/FilePath/Thin.hs, dist/build/System/FilePath/Thin.o, dist/build/System/FilePath/Thin.dyn_o )
  189. 4.92 s [pathway-compat-filepath] [ 4 of 10] Compiling System.FilePath.Pathway ( src/System/FilePath/Pathway.hs, dist/build/System/FilePath/Pathway.o, dist/build/System/FilePath/Pathway.dyn_o )
  190. 4.95 s [pathway-compat-filepath] [ 5 of 10] Compiling System.FilePath.Overlay ( src/System/FilePath/Overlay.hs, dist/build/System/FilePath/Overlay.o, dist/build/System/FilePath/Overlay.dyn_o )
  191. 4.96 s [pathway-compat-filepath] [ 6 of 10] Compiling System.FilePath ( src/System/FilePath.hs, dist/build/System/FilePath.o, dist/build/System/FilePath.dyn_o )
  192. 5.07 s Progress: 0 of 12 built (1 failed)
  193. 5.07 s Failed to build pathway-compat-filepath after 3.2s
  194. 5.07 s error: Cannot build '/nix/store/gwlaydb47f6yhlx7hsgqq7s0m612k39r-pathway-compat-filepath-0.0.1.0.drv'.
  195. 5.07 s Reason: builder failed with exit code 1.
  196. 5.07 s Output paths:
  197. 5.07 s /nix/store/brb3ys0mr106j2xs2nqwq5rszfngk13w-pathway-compat-filepath-0.0.1.0-doc
  198. 5.07 s /nix/store/knqi4mpp2gcy2djhvikk6m439c94gw16-pathway-compat-filepath-0.0.1.0
  199. 5.07 s Last 176 log lines:
  200. 5.07 s > Running phase: setupCompilerEnvironmentPhase
  201. 5.07 s > Build with /nix/store/7r9b0bl984hdgd70nf5p8raa55kml491-ghc-9.8.4.
  202. 5.07 s > Running phase: unpackPhase
  203. 5.07 s > unpacking source archive /nix/store/56v5999xvkp18l2ygdvahppqdv4hrlnl-filepath
  204. 5.07 s > source root is filepath
  205. 5.07 s > Running phase: patchPhase
  206. 5.07 s > Running phase: compileBuildDriverPhase
  207. 5.07 s > setupCompileFlags: -package-db=/build/tmp.OxKLc4AkkL/setup-package.conf.d -threaded
  208. 5.07 s > [1 of 2] Compiling Main ( Setup.hs, /build/tmp.OxKLc4AkkL/Main.o )
  209. 5.07 s > [2 of 2] Linking Setup
  210. 5.07 s > Running phase: updateAutotoolsGnuConfigScriptsPhase
  211. 5.07 s > Running phase: configurePhase
  212. 5.07 s > configureFlags: --verbose --prefix=/nix/store/knqi4mpp2gcy2djhvikk6m439c94gw16-pathway-compat-filepath-0.0.1.0 --libdir=$prefix/lib/$compiler/lib --libsubdir=$abi/$libname --docdir=/nix/store/brb3ys0mr106j2xs2nqwq5rszfngk13w-pathway-compat-filepath-0.0.1.0-doc/share/doc/pathway-compat-filepath-0.0.1.0 --with-gcc=gcc --package-db=/build/tmp.OxKLc4AkkL/package.conf.d --ghc-option=-j16 --ghc-option=+RTS --ghc-option=-A64M --ghc-option=-RTS --enable-library-profiling --profiling-detail=exported-functions --disable-profiling --enable-shared --disable-coverage --enable-static --disable-executable-dynamic --enable-tests --disable-benchmarks --enable-library-vanilla --disable-library-for-ghci --enable-split-sections --enable-library-stripping --enable-executable-stripping --ghc-option=-haddock --ghc-options=-Werror --extra-lib-dirs=/nix/store/pndhkk0l649lm1sj0mxk7cbwq26qd1ra-ncurses-6.6/lib --extra-lib-dirs=/nix/store/0djlg4g0b81w94k3vcaqsxsc2hh4kism-libffi-3.5.2/lib --extra-lib-dirs=/nix/store/md4paia7riiggyrj8p24c7a6vf8w7jz8-elfutils-0.194/lib --extra-lib-dirs=/nix/store/39vv2pf64gd8li48a4hpbhw2crzd8z5p-gmp-with-cxx-6.3.0/lib --extra-lib-dirs=/nix/store/7wwvald8lapkrsr72qanlw8blyn55ifx-numactl-2.0.18/lib --extra-lib-dirs=/nix/store/7r9b0bl984hdgd70nf5p8raa55kml491-ghc-9.8.4/lib
  213. 5.07 s > Using Parsec parser
  214. 5.07 s > Configuring pathway-compat-filepath-0.0.1.0...
  215. 5.07 s > Flags chosen: noisy-deprecations=True, verify-no-recursion=False
  216. 5.07 s > Dependency base >=4.14.0 && <4.15 || >=4.15.0 && <4.16 || >=4.16.0 && <4.17 ||
  217. 5.07 s > >=4.17.0 && <4.18 || >=4.18.0 && <4.19 || >=4.19.0 && <4.20 || >=4.20.0 &&
  218. 5.07 s > <4.21 || >=4.21.0 && <4.22 || >=4.22.0 && <4.23: using base-4.19.2.0
  219. 5.07 s > Dependency extra: using extra-1.8.1
  220. 5.07 s > Dependency filepath >=1.4.2 && <1.5 || >=1.5.0 && <1.6: using
  221. 5.07 s > filepath-1.4.301.0
  222. 5.07 s > Dependency megaparsec >=9.0.1 && <9.1 || >=9.2.1 && <9.3 || >=9.5.0 && <9.6 ||
  223. 5.07 s > >=9.7.0 && <9.8: using megaparsec-9.7.0
  224. 5.07 s > Dependency os-string: using os-string-2.0.10
  225. 5.07 s > Dependency pathway >=0.0.1 && <0.1: using pathway-0.0.1.0
  226. 5.07 s > Dependency pathway-compat-base >=0.0.1 && <0.1: using
  227. 5.07 s > pathway-compat-base-0.0.1.0
  228. 5.07 s > Dependency pathway-internal >=0.0.1 && <0.1: using pathway-internal-0.0.1.0
  229. 5.07 s > Dependency base >=4.14.0 && <4.15 || >=4.15.0 && <4.16 || >=4.16.0 && <4.17 ||
  230. 5.07 s > >=4.17.0 && <4.18 || >=4.18.0 && <4.19 || >=4.19.0 && <4.20 || >=4.20.0 &&
  231. 5.07 s > <4.21 || >=4.21.0 && <4.22 || >=4.22.0 && <4.23: using base-4.19.2.0
  232. 5.07 s > Dependency doctest >=0.16.3 && <0.17 || >=0.18.1 && <0.19 || >=0.20.1 && <0.21
  233. 5.07 s > || >=0.21.1 && <0.22 || >=0.22.2 && <0.23 || >=0.24.2 && <0.25: using
  234. 5.07 s > doctest-0.24.3
  235. 5.07 s > Dependency pathway-compat-filepath: using pathway-compat-filepath-0.0.1.0
  236. 5.07 s > Source component graph:
  237. 5.07 s > component lib
  238. 5.07 s > component test:doctests dependency lib
  239. 5.07 s > Configured component graph:
  240. 5.07 s > component pathway-compat-filepath-0.0.1.0-6KN1Vlb8yPeBopmlZtXyrR
  241. 5.07 s > include base-4.19.2.0-934f
  242. 5.07 s > include extra-1.8.1-F4oHgTKCper3ZiIUPZjGPK
  243. 5.07 s > include filepath-1.4.301.0-6e15
  244. 5.07 s > include megaparsec-9.7.0-10vHZAF1maw9O8p2gXs66N
  245. 5.07 s > include os-string-2.0.10-HbyG8qgShpTHKXL8bZ3UK8
  246. 5.07 s > include pathway-0.0.1.0-H5uD0SRA9755UrSqFBaCYE
  247. 5.07 s > include pathway-compat-base-0.0.1.0-8ldj6SPXbxq2Shd8yFeOpr
  248. 5.07 s > include pathway-internal-0.0.1.0-Lnjdb2M8cxN196wSdsfQUK
  249. 5.07 s > component pathway-compat-filepath-0.0.1.0-LoaDJ8tbb2m5kfHmaP2B9c-doctests
  250. 5.07 s > include base-4.19.2.0-934f
  251. 5.07 s > include doctest-0.24.3-1aDs7zEYV5r7raSsXr9TQC
  252. 5.07 s > include pathway-compat-filepath-0.0.1.0-6KN1Vlb8yPeBopmlZtXyrR
  253. 5.07 s > Linked component graph:
  254. 5.07 s > unit pathway-compat-filepath-0.0.1.0-6KN1Vlb8yPeBopmlZtXyrR
  255. 5.07 s > include base-4.19.2.0-934f
  256. 5.07 s > include extra-1.8.1-F4oHgTKCper3ZiIUPZjGPK
  257. 5.07 s > include filepath-1.4.301.0-6e15
  258. 5.07 s > include megaparsec-9.7.0-10vHZAF1maw9O8p2gXs66N
  259. 5.07 s > include os-string-2.0.10-HbyG8qgShpTHKXL8bZ3UK8
  260. 5.07 s > include pathway-0.0.1.0-H5uD0SRA9755UrSqFBaCYE
  261. 5.07 s > include pathway-compat-base-0.0.1.0-8ldj6SPXbxq2Shd8yFeOpr
  262. 5.07 s > include pathway-internal-0.0.1.0-Lnjdb2M8cxN196wSdsfQUK
  263. 5.07 s > Common.FilePath=pathway-compat-filepath-0.0.1.0-6KN1Vlb8yPeBopmlZtXyrR:Common.FilePath,Common.OsPath=pathway-compat-filepath-0.0.1.0-6KN1Vlb8yPeBopmlZtXyrR:Common.OsPath,System.FilePath=pathway-compat-filepath-0.0.1.0-6KN1Vlb8yPeBopmlZtXyrR:System.FilePath,System.FilePath.Overlay=pathway-compat-filepath-0.0.1.0-6KN1Vlb8yPeBopmlZtXyrR:System.FilePath.Overlay,System.FilePath.Pathway=pathway-compat-filepath-0.0.1.0-6KN1Vlb8yPeBopmlZtXyrR:System.FilePath.Pathway,System.FilePath.Thin=pathway-compat-filepath-0.0.1.0-6KN1Vlb8yPeBopmlZtXyrR:System.FilePath.Thin,System.OsPath=pathway-compat-filepath-0.0.1.0-6KN1Vlb8yPeBopmlZtXyrR:System.OsPath,System.OsPath.Overlay=pathway-compat-filepath-0.0.1.0-6KN1Vlb8yPeBopmlZtXyrR:System.OsPath.Overlay,System.OsPath.Pathway=pathway-compat-filepath-0.0.1.0-6KN1Vlb8yPeBopmlZtXyrR:System.OsPath.Pathway,System.OsPath.Thin=pathway-compat-filepath-0.0.1.0-6KN1Vlb8yPeBopmlZtXyrR:System.OsPath.Thin
  264. 5.07 s > unit pathway-compat-filepath-0.0.1.0-LoaDJ8tbb2m5kfHmaP2B9c-doctests
  265. 5.07 s > include base-4.19.2.0-934f
  266. 5.07 s > include doctest-0.24.3-1aDs7zEYV5r7raSsXr9TQC
  267. 5.07 s > include pathway-compat-filepath-0.0.1.0-6KN1Vlb8yPeBopmlZtXyrR
  268. 5.07 s > Ready component graph:
  269. 5.07 s > definite pathway-compat-filepath-0.0.1.0-6KN1Vlb8yPeBopmlZtXyrR
  270. 5.07 s > depends base-4.19.2.0-934f
  271. 5.07 s > depends extra-1.8.1-F4oHgTKCper3ZiIUPZjGPK
  272. 5.07 s > depends filepath-1.4.301.0-6e15
  273. 5.07 s > depends megaparsec-9.7.0-10vHZAF1maw9O8p2gXs66N
  274. 5.07 s > depends os-string-2.0.10-HbyG8qgShpTHKXL8bZ3UK8
  275. 5.07 s > depends pathway-0.0.1.0-H5uD0SRA9755UrSqFBaCYE
  276. 5.07 s > depends pathway-compat-base-0.0.1.0-8ldj6SPXbxq2Shd8yFeOpr
  277. 5.07 s > depends pathway-internal-0.0.1.0-Lnjdb2M8cxN196wSdsfQUK
  278. 5.07 s > definite pathway-compat-filepath-0.0.1.0-LoaDJ8tbb2m5kfHmaP2B9c-doctests
  279. 5.07 s > depends base-4.19.2.0-934f
  280. 5.07 s > depends doctest-0.24.3-1aDs7zEYV5r7raSsXr9TQC
  281. 5.07 s > depends pathway-compat-filepath-0.0.1.0-6KN1Vlb8yPeBopmlZtXyrR
  282. 5.07 s > Using Cabal-3.10.3.0 compiled by ghc-9.8
  283. 5.07 s > Using compiler: ghc-9.8.4
  284. 5.07 s > Using install prefix:
  285. 5.07 s > /nix/store/knqi4mpp2gcy2djhvikk6m439c94gw16-pathway-compat-filepath-0.0.1.0
  286. 5.07 s > Executables installed in:
  287. 5.07 s > /nix/store/knqi4mpp2gcy2djhvikk6m439c94gw16-pathway-compat-filepath-0.0.1.0/bin
  288. 5.07 s > Libraries installed in:
  289. 5.07 s > /nix/store/knqi4mpp2gcy2djhvikk6m439c94gw16-pathway-compat-filepath-0.0.1.0/lib/ghc-9.8.4/lib/x86_64-linux-ghc-9.8.4/pathway-compat-filepath-0.0.1.0-6KN1Vlb8yPeBopmlZtXyrR
  290. 5.07 s > Dynamic Libraries installed in:
  291. 5.07 s > /nix/store/knqi4mpp2gcy2djhvikk6m439c94gw16-pathway-compat-filepath-0.0.1.0/lib/ghc-9.8.4/lib/x86_64-linux-ghc-9.8.4
  292. 5.07 s > Private executables installed in:
  293. 5.07 s > /nix/store/knqi4mpp2gcy2djhvikk6m439c94gw16-pathway-compat-filepath-0.0.1.0/libexec/x86_64-linux-ghc-9.8.4/pathway-compat-filepath-0.0.1.0
  294. 5.07 s > Data files installed in:
  295. 5.07 s > /nix/store/knqi4mpp2gcy2djhvikk6m439c94gw16-pathway-compat-filepath-0.0.1.0/share/x86_64-linux-ghc-9.8.4/pathway-compat-filepath-0.0.1.0
  296. 5.07 s > Documentation installed in:
  297. 5.07 s > /nix/store/brb3ys0mr106j2xs2nqwq5rszfngk13w-pathway-compat-filepath-0.0.1.0-doc/share/doc/pathway-compat-filepath-0.0.1.0
  298. 5.07 s > Configuration files installed in:
  299. 5.07 s > /nix/store/knqi4mpp2gcy2djhvikk6m439c94gw16-pathway-compat-filepath-0.0.1.0/etc
  300. 5.07 s > No alex found
  301. 5.07 s > Using ar found on system at:
  302. 5.07 s > /nix/store/zjraf40s86y3iwhp626b934r5y6ldkbb-binutils-wrapper-2.46/bin/ar
  303. 5.07 s > No c2hs found
  304. 5.07 s > No cpphs found
  305. 5.07 s > Using doctest version 0.24.3 found on system at:
  306. 5.07 s > /nix/store/2y183b1vsybv0157vfr59yhdwjkpqfkn-doctest-0.24.3/bin/doctest
  307. 5.07 s > Using gcc version 15.2.0 given by user at:
  308. 5.07 s > /nix/store/29qjlshvklnyr67nhpprzgb9igmsfsjj-gcc-wrapper-15.2.0/bin/gcc
  309. 5.07 s > Using ghc version 9.8.4 found on system at:
  310. 5.07 s > /nix/store/7r9b0bl984hdgd70nf5p8raa55kml491-ghc-9.8.4/bin/ghc
  311. 5.07 s > Using ghc-pkg version 9.8.4 found on system at:
  312. 5.07 s > /nix/store/7r9b0bl984hdgd70nf5p8raa55kml491-ghc-9.8.4/bin/ghc-pkg-9.8.4
  313. 5.07 s > No ghcjs found
  314. 5.07 s > No ghcjs-pkg found
  315. 5.07 s > No greencard found
  316. 5.07 s > Using haddock version 2.30.0 found on system at:
  317. 5.07 s > /nix/store/7r9b0bl984hdgd70nf5p8raa55kml491-ghc-9.8.4/bin/haddock-ghc-9.8.4
  318. 5.07 s > No happy found
  319. 5.07 s > Using haskell-suite found on system at: haskell-suite-dummy-location
  320. 5.07 s > Using haskell-suite-pkg found on system at: haskell-suite-pkg-dummy-location
  321. 5.07 s > No hmake found
  322. 5.07 s > Using hpc version 0.69 found on system at:
  323. 5.07 s > /nix/store/7r9b0bl984hdgd70nf5p8raa55kml491-ghc-9.8.4/bin/hpc-ghc-9.8.4
  324. 5.07 s > Using hsc2hs version 0.68.10 found on system at:
  325. 5.07 s > /nix/store/7r9b0bl984hdgd70nf5p8raa55kml491-ghc-9.8.4/bin/hsc2hs-ghc-9.8.4
  326. 5.07 s > Using hscolour version 1.25 found on system at:
  327. 5.07 s > /nix/store/awnxn98rlw62rrjwli6d2lb4d27mrzzw-hscolour-1.25/bin/HsColour
  328. 5.07 s > No jhc found
  329. 5.07 s > Using ld found on system at:
  330. 5.07 s > /nix/store/zjraf40s86y3iwhp626b934r5y6ldkbb-binutils-wrapper-2.46/bin/ld.gold
  331. 5.07 s > No pkg-config found
  332. 5.07 s > Using runghc version 9.8.4 found on system at:
  333. 5.07 s > /nix/store/7r9b0bl984hdgd70nf5p8raa55kml491-ghc-9.8.4/bin/runghc-9.8.4
  334. 5.07 s > Using strip version 2.46 found on system at:
  335. 5.07 s > /nix/store/29qjlshvklnyr67nhpprzgb9igmsfsjj-gcc-wrapper-15.2.0/bin/strip
  336. 5.07 s > Using tar found on system at:
  337. 5.07 s > /nix/store/z5mq2sam4484prf3kv6v6vjw1m0i7j24-gnutar-1.35/bin/tar
  338. 5.07 s > No uhc found
  339. 5.07 s > Running phase: buildPhase
  340. 5.07 s > Preprocessing library for pathway-compat-filepath-0.0.1.0..
  341. 5.07 s > Building library for pathway-compat-filepath-0.0.1.0..
  342. 5.07 s > [ 1 of 10] Compiling Common.FilePath ( src/Common/FilePath.hs, dist/build/Common/FilePath.o, dist/build/Common/FilePath.dyn_o )
  343. 5.07 s > [ 2 of 10] Compiling Common.OsPath ( src/Common/OsPath.hs, dist/build/Common/OsPath.o, dist/build/Common/OsPath.dyn_o )
  344. 5.07 s >
  345. 5.07 s > src/Common/OsPath.hs:90:23: error: [GHC-83865]
  346. 5.07 s > • Couldn't match type ‘OSS.OsString’ with ‘OsString’
  347. 5.07 s > Expected: OsPath
  348. 5.07 s > Actual: OSS.OsString
  349. 5.07 s > NB: ‘OsString’
  350. 5.07 s > is defined in ‘System.OsString.Internal.Types.Hidden’
  351. 5.07 s > in package ‘filepath-1.4.301.0’
  352. 5.07 s > ‘OSS.OsString’
  353. 5.07 s > is defined in ‘System.OsString.Internal.Types’
  354. 5.07 s > in package ‘os-string-2.0.10’
  355. 5.07 s > • In the ‘parent’ field of a record
  356. 5.07 s > In the expression:
  357. 5.07 s > Format
  358. 5.07 s > {root = O.pack . pure $ O.pathSeparator, current = mempty,
  359. 5.07 s > parent = OSS.unsafeEncodeUtf "..",
  360. 5.07 s > separator = O.pack . pure $ O.pathSeparator,
  361. 5.07 s > substitutions = mempty}
  362. 5.07 s > In an equation for ‘localFormat’:
  363. 5.07 s > localFormat
  364. 5.07 s > = Format
  365. 5.07 s > {root = O.pack . pure $ O.pathSeparator, current = mempty,
  366. 5.07 s > parent = OSS.unsafeEncodeUtf "..",
  367. 5.07 s > separator = O.pack . pure $ O.pathSeparator,
  368. 5.07 s > substitutions = mempty}
  369. 5.07 s > |
  370. 5.07 s > 90 | Format.parent = OSS.unsafeEncodeUtf "..",
  371. 5.07 s > | ^^^^^^^^^^^^^^^^^^^^^^^^
  372. 5.07 s > [ 3 of 10] Compiling System.FilePath.Thin ( src/System/FilePath/Thin.hs, dist/build/System/FilePath/Thin.o, dist/build/System/FilePath/Thin.dyn_o )
  373. 5.07 s > [ 4 of 10] Compiling System.FilePath.Pathway ( src/System/FilePath/Pathway.hs, dist/build/System/FilePath/Pathway.o, dist/build/System/FilePath/Pathway.dyn_o )
  374. 5.07 s > [ 5 of 10] Compiling System.FilePath.Overlay ( src/System/FilePath/Overlay.hs, dist/build/System/FilePath/Overlay.o, dist/build/System/FilePath/Overlay.dyn_o )
  375. 5.07 s > [ 6 of 10] Compiling System.FilePath ( src/System/FilePath.hs, dist/build/System/FilePath.o, dist/build/System/FilePath.dyn_o )
  376. 5.07 s For full logs, run:
  377. 5.07 s nix log /nix/store/gwlaydb47f6yhlx7hsgqq7s0m612k39r-pathway-compat-filepath-0.0.1.0.drv
  378. 5.07 s error: Cannot build '/nix/store/gwlaydb47f6yhlx7hsgqq7s0m612k39r-pathway-compat-filepath-0.0.1.0.drv'.
  379. 5.07 s Reason: builder failed with exit code 1.
  380. 5.07 s Output paths:
  381. 5.07 s /nix/store/brb3ys0mr106j2xs2nqwq5rszfngk13w-pathway-compat-filepath-0.0.1.0-doc
  382. 5.07 s /nix/store/knqi4mpp2gcy2djhvikk6m439c94gw16-pathway-compat-filepath-0.0.1.0
  383. 5.07 s Last 176 log lines:
  384. 5.07 s > Running phase: setupCompilerEnvironmentPhase
  385. 5.07 s > Build with /nix/store/7r9b0bl984hdgd70nf5p8raa55kml491-ghc-9.8.4.
  386. 5.07 s > Running phase: unpackPhase
  387. 5.07 s > unpacking source archive /nix/store/56v5999xvkp18l2ygdvahppqdv4hrlnl-filepath
  388. 5.07 s > source root is filepath
  389. 5.07 s > Running phase: patchPhase
  390. 5.07 s > Running phase: compileBuildDriverPhase
  391. 5.07 s > setupCompileFlags: -package-db=/build/tmp.OxKLc4AkkL/setup-package.conf.d -threaded
  392. 5.07 s > [1 of 2] Compiling Main ( Setup.hs, /build/tmp.OxKLc4AkkL/Main.o )
  393. 5.07 s > [2 of 2] Linking Setup
  394. 5.07 s > Running phase: updateAutotoolsGnuConfigScriptsPhase
  395. 5.07 s > Running phase: configurePhase
  396. 5.07 s > configureFlags: --verbose --prefix=/nix/store/knqi4mpp2gcy2djhvikk6m439c94gw16-pathway-compat-filepath-0.0.1.0 --libdir=$prefix/lib/$compiler/lib --libsubdir=$abi/$libname --docdir=/nix/store/brb3ys0mr106j2xs2nqwq5rszfngk13w-pathway-compat-filepath-0.0.1.0-doc/share/doc/pathway-compat-filepath-0.0.1.0 --with-gcc=gcc --package-db=/build/tmp.OxKLc4AkkL/package.conf.d --ghc-option=-j16 --ghc-option=+RTS --ghc-option=-A64M --ghc-option=-RTS --enable-library-profiling --profiling-detail=exported-functions --disable-profiling --enable-shared --disable-coverage --enable-static --disable-executable-dynamic --enable-tests --disable-benchmarks --enable-library-vanilla --disable-library-for-ghci --enable-split-sections --enable-library-stripping --enable-executable-stripping --ghc-option=-haddock --ghc-options=-Werror --extra-lib-dirs=/nix/store/pndhkk0l649lm1sj0mxk7cbwq26qd1ra-ncurses-6.6/lib --extra-lib-dirs=/nix/store/0djlg4g0b81w94k3vcaqsxsc2hh4kism-libffi-3.5.2/lib --extra-lib-dirs=/nix/store/md4paia7riiggyrj8p24c7a6vf8w7jz8-elfutils-0.194/lib --extra-lib-dirs=/nix/store/39vv2pf64gd8li48a4hpbhw2crzd8z5p-gmp-with-cxx-6.3.0/lib --extra-lib-dirs=/nix/store/7wwvald8lapkrsr72qanlw8blyn55ifx-numactl-2.0.18/lib --extra-lib-dirs=/nix/store/7r9b0bl984hdgd70nf5p8raa55kml491-ghc-9.8.4/lib
  397. 5.07 s > Using Parsec parser
  398. 5.07 s > Configuring pathway-compat-filepath-0.0.1.0...
  399. 5.07 s > Flags chosen: noisy-deprecations=True, verify-no-recursion=False
  400. 5.07 s > Dependency base >=4.14.0 && <4.15 || >=4.15.0 && <4.16 || >=4.16.0 && <4.17 ||
  401. 5.07 s > >=4.17.0 && <4.18 || >=4.18.0 && <4.19 || >=4.19.0 && <4.20 || >=4.20.0 &&
  402. 5.07 s > <4.21 || >=4.21.0 && <4.22 || >=4.22.0 && <4.23: using base-4.19.2.0
  403. 5.07 s > Dependency extra: using extra-1.8.1
  404. 5.07 s > Dependency filepath >=1.4.2 && <1.5 || >=1.5.0 && <1.6: using
  405. 5.07 s > filepath-1.4.301.0
  406. 5.07 s > Dependency megaparsec >=9.0.1 && <9.1 || >=9.2.1 && <9.3 || >=9.5.0 && <9.6 ||
  407. 5.07 s > >=9.7.0 && <9.8: using megaparsec-9.7.0
  408. 5.07 s > Dependency os-string: using os-string-2.0.10
  409. 5.07 s > Dependency pathway >=0.0.1 && <0.1: using pathway-0.0.1.0
  410. 5.07 s > Dependency pathway-compat-base >=0.0.1 && <0.1: using
  411. 5.07 s > pathway-compat-base-0.0.1.0
  412. 5.07 s > Dependency pathway-internal >=0.0.1 && <0.1: using pathway-internal-0.0.1.0
  413. 5.07 s > Dependency base >=4.14.0 && <4.15 || >=4.15.0 && <4.16 || >=4.16.0 && <4.17 ||
  414. 5.07 s > >=4.17.0 && <4.18 || >=4.18.0 && <4.19 || >=4.19.0 && <4.20 || >=4.20.0 &&
  415. 5.07 s > <4.21 || >=4.21.0 && <4.22 || >=4.22.0 && <4.23: using base-4.19.2.0
  416. 5.07 s > Dependency doctest >=0.16.3 && <0.17 || >=0.18.1 && <0.19 || >=0.20.1 && <0.21
  417. 5.07 s > || >=0.21.1 && <0.22 || >=0.22.2 && <0.23 || >=0.24.2 && <0.25: using
  418. 5.07 s > doctest-0.24.3
  419. 5.07 s > Dependency pathway-compat-filepath: using pathway-compat-filepath-0.0.1.0
  420. 5.07 s > Source component graph:
  421. 5.07 s > component lib
  422. 5.07 s > component test:doctests dependency lib
  423. 5.07 s > Configured component graph:
  424. 5.07 s > component pathway-compat-filepath-0.0.1.0-6KN1Vlb8yPeBopmlZtXyrR
  425. 5.07 s > include base-4.19.2.0-934f
  426. 5.07 s > include extra-1.8.1-F4oHgTKCper3ZiIUPZjGPK
  427. 5.07 s > include filepath-1.4.301.0-6e15
  428. 5.07 s > include megaparsec-9.7.0-10vHZAF1maw9O8p2gXs66N
  429. 5.07 s > include os-string-2.0.10-HbyG8qgShpTHKXL8bZ3UK8
  430. 5.07 s > include pathway-0.0.1.0-H5uD0SRA9755UrSqFBaCYE
  431. 5.07 s > include pathway-compat-base-0.0.1.0-8ldj6SPXbxq2Shd8yFeOpr
  432. 5.07 s > include pathway-internal-0.0.1.0-Lnjdb2M8cxN196wSdsfQUK
  433. 5.07 s > component pathway-compat-filepath-0.0.1.0-LoaDJ8tbb2m5kfHmaP2B9c-doctests
  434. 5.07 s > include base-4.19.2.0-934f
  435. 5.07 s > include doctest-0.24.3-1aDs7zEYV5r7raSsXr9TQC
  436. 5.07 s > include pathway-compat-filepath-0.0.1.0-6KN1Vlb8yPeBopmlZtXyrR
  437. 5.07 s > Linked component graph:
  438. 5.07 s > unit pathway-compat-filepath-0.0.1.0-6KN1Vlb8yPeBopmlZtXyrR
  439. 5.07 s > include base-4.19.2.0-934f
  440. 5.07 s > include extra-1.8.1-F4oHgTKCper3ZiIUPZjGPK
  441. 5.07 s > include filepath-1.4.301.0-6e15
  442. 5.07 s > include megaparsec-9.7.0-10vHZAF1maw9O8p2gXs66N
  443. 5.07 s > include os-string-2.0.10-HbyG8qgShpTHKXL8bZ3UK8
  444. 5.07 s > include pathway-0.0.1.0-H5uD0SRA9755UrSqFBaCYE
  445. 5.07 s > include pathway-compat-base-0.0.1.0-8ldj6SPXbxq2Shd8yFeOpr
  446. 5.07 s > include pathway-internal-0.0.1.0-Lnjdb2M8cxN196wSdsfQUK
  447. 5.07 s > Common.FilePath=pathway-compat-filepath-0.0.1.0-6KN1Vlb8yPeBopmlZtXyrR:Common.FilePath,Common.OsPath=pathway-compat-filepath-0.0.1.0-6KN1Vlb8yPeBopmlZtXyrR:Common.OsPath,System.FilePath=pathway-compat-filepath-0.0.1.0-6KN1Vlb8yPeBopmlZtXyrR:System.FilePath,System.FilePath.Overlay=pathway-compat-filepath-0.0.1.0-6KN1Vlb8yPeBopmlZtXyrR:System.FilePath.Overlay,System.FilePath.Pathway=pathway-compat-filepath-0.0.1.0-6KN1Vlb8yPeBopmlZtXyrR:System.FilePath.Pathway,System.FilePath.Thin=pathway-compat-filepath-0.0.1.0-6KN1Vlb8yPeBopmlZtXyrR:System.FilePath.Thin,System.OsPath=pathway-compat-filepath-0.0.1.0-6KN1Vlb8yPeBopmlZtXyrR:System.OsPath,System.OsPath.Overlay=pathway-compat-filepath-0.0.1.0-6KN1Vlb8yPeBopmlZtXyrR:System.OsPath.Overlay,System.OsPath.Pathway=pathway-compat-filepath-0.0.1.0-6KN1Vlb8yPeBopmlZtXyrR:System.OsPath.Pathway,System.OsPath.Thin=pathway-compat-filepath-0.0.1.0-6KN1Vlb8yPeBopmlZtXyrR:System.OsPath.Thin
  448. 5.07 s > unit pathway-compat-filepath-0.0.1.0-LoaDJ8tbb2m5kfHmaP2B9c-doctests
  449. 5.07 s > include base-4.19.2.0-934f
  450. 5.07 s > include doctest-0.24.3-1aDs7zEYV5r7raSsXr9TQC
  451. 5.07 s > include pathway-compat-filepath-0.0.1.0-6KN1Vlb8yPeBopmlZtXyrR
  452. 5.07 s > Ready component graph:
  453. 5.07 s > definite pathway-compat-filepath-0.0.1.0-6KN1Vlb8yPeBopmlZtXyrR
  454. 5.07 s > depends base-4.19.2.0-934f
  455. 5.07 s > depends extra-1.8.1-F4oHgTKCper3ZiIUPZjGPK
  456. 5.07 s > depends filepath-1.4.301.0-6e15
  457. 5.07 s > depends megaparsec-9.7.0-10vHZAF1maw9O8p2gXs66N
  458. 5.07 s > depends os-string-2.0.10-HbyG8qgShpTHKXL8bZ3UK8
  459. 5.07 s > depends pathway-0.0.1.0-H5uD0SRA9755UrSqFBaCYE
  460. 5.07 s > depends pathway-compat-base-0.0.1.0-8ldj6SPXbxq2Shd8yFeOpr
  461. 5.07 s > depends pathway-internal-0.0.1.0-Lnjdb2M8cxN196wSdsfQUK
  462. 5.07 s > definite pathway-compat-filepath-0.0.1.0-LoaDJ8tbb2m5kfHmaP2B9c-doctests
  463. 5.07 s > depends base-4.19.2.0-934f
  464. 5.07 s > depends doctest-0.24.3-1aDs7zEYV5r7raSsXr9TQC
  465. 5.07 s > depends pathway-compat-filepath-0.0.1.0-6KN1Vlb8yPeBopmlZtXyrR
  466. 5.07 s > Using Cabal-3.10.3.0 compiled by ghc-9.8
  467. 5.07 s > Using compiler: ghc-9.8.4
  468. 5.07 s > Using install prefix:
  469. 5.07 s > /nix/store/knqi4mpp2gcy2djhvikk6m439c94gw16-pathway-compat-filepath-0.0.1.0
  470. 5.07 s > Executables installed in:
  471. 5.07 s > /nix/store/knqi4mpp2gcy2djhvikk6m439c94gw16-pathway-compat-filepath-0.0.1.0/bin
  472. 5.07 s > Libraries installed in:
  473. 5.07 s > /nix/store/knqi4mpp2gcy2djhvikk6m439c94gw16-pathway-compat-filepath-0.0.1.0/lib/ghc-9.8.4/lib/x86_64-linux-ghc-9.8.4/pathway-compat-filepath-0.0.1.0-6KN1Vlb8yPeBopmlZtXyrR
  474. 5.07 s > Dynamic Libraries installed in:
  475. 5.07 s > /nix/store/knqi4mpp2gcy2djhvikk6m439c94gw16-pathway-compat-filepath-0.0.1.0/lib/ghc-9.8.4/lib/x86_64-linux-ghc-9.8.4
  476. 5.07 s > Private executables installed in:
  477. 5.07 s > /nix/store/knqi4mpp2gcy2djhvikk6m439c94gw16-pathway-compat-filepath-0.0.1.0/libexec/x86_64-linux-ghc-9.8.4/pathway-compat-filepath-0.0.1.0
  478. 5.07 s > Data files installed in:
  479. 5.07 s > /nix/store/knqi4mpp2gcy2djhvikk6m439c94gw16-pathway-compat-filepath-0.0.1.0/share/x86_64-linux-ghc-9.8.4/pathway-compat-filepath-0.0.1.0
  480. 5.07 s > Documentation installed in:
  481. 5.07 s > /nix/store/brb3ys0mr106j2xs2nqwq5rszfngk13w-pathway-compat-filepath-0.0.1.0-doc/share/doc/pathway-compat-filepath-0.0.1.0
  482. 5.07 s > Configuration files installed in:
  483. 5.07 s > /nix/store/knqi4mpp2gcy2djhvikk6m439c94gw16-pathway-compat-filepath-0.0.1.0/etc
  484. 5.07 s > No alex found
  485. 5.07 s > Using ar found on system at:
  486. 5.07 s > /nix/store/zjraf40s86y3iwhp626b934r5y6ldkbb-binutils-wrapper-2.46/bin/ar
  487. 5.07 s > No c2hs found
  488. 5.07 s > No cpphs found
  489. 5.07 s > Using doctest version 0.24.3 found on system at:
  490. 5.07 s > /nix/store/2y183b1vsybv0157vfr59yhdwjkpqfkn-doctest-0.24.3/bin/doctest
  491. 5.07 s > Using gcc version 15.2.0 given by user at:
  492. 5.07 s > /nix/store/29qjlshvklnyr67nhpprzgb9igmsfsjj-gcc-wrapper-15.2.0/bin/gcc
  493. 5.07 s > Using ghc version 9.8.4 found on system at:
  494. 5.07 s > /nix/store/7r9b0bl984hdgd70nf5p8raa55kml491-ghc-9.8.4/bin/ghc
  495. 5.07 s > Using ghc-pkg version 9.8.4 found on system at:
  496. 5.07 s > /nix/store/7r9b0bl984hdgd70nf5p8raa55kml491-ghc-9.8.4/bin/ghc-pkg-9.8.4
  497. 5.07 s > No ghcjs found
  498. 5.07 s > No ghcjs-pkg found
  499. 5.07 s > No greencard found
  500. 5.07 s > Using haddock version 2.30.0 found on system at:
  501. 5.07 s > /nix/store/7r9b0bl984hdgd70nf5p8raa55kml491-ghc-9.8.4/bin/haddock-ghc-9.8.4
  502. 5.07 s > No happy found
  503. 5.07 s > Using haskell-suite found on system at: haskell-suite-dummy-location
  504. 5.07 s > Using haskell-suite-pkg found on system at: haskell-suite-pkg-dummy-location
  505. 5.07 s > No hmake found
  506. 5.07 s > Using hpc version 0.69 found on system at:
  507. 5.07 s > /nix/store/7r9b0bl984hdgd70nf5p8raa55kml491-ghc-9.8.4/bin/hpc-ghc-9.8.4
  508. 5.07 s > Using hsc2hs version 0.68.10 found on system at:
  509. 5.07 s > /nix/store/7r9b0bl984hdgd70nf5p8raa55kml491-ghc-9.8.4/bin/hsc2hs-ghc-9.8.4
  510. 5.07 s > Using hscolour version 1.25 found on system at:
  511. 5.07 s > /nix/store/awnxn98rlw62rrjwli6d2lb4d27mrzzw-hscolour-1.25/bin/HsColour
  512. 5.07 s > No jhc found
  513. 5.07 s > Using ld found on system at:
  514. 5.07 s > /nix/store/zjraf40s86y3iwhp626b934r5y6ldkbb-binutils-wrapper-2.46/bin/ld.gold
  515. 5.07 s > No pkg-config found
  516. 5.07 s > Using runghc version 9.8.4 found on system at:
  517. 5.07 s > /nix/store/7r9b0bl984hdgd70nf5p8raa55kml491-ghc-9.8.4/bin/runghc-9.8.4
  518. 5.07 s > Using strip version 2.46 found on system at:
  519. 5.07 s > /nix/store/29qjlshvklnyr67nhpprzgb9igmsfsjj-gcc-wrapper-15.2.0/bin/strip
  520. 5.07 s > Using tar found on system at:
  521. 5.07 s > /nix/store/z5mq2sam4484prf3kv6v6vjw1m0i7j24-gnutar-1.35/bin/tar
  522. 5.07 s > No uhc found
  523. 5.07 s > Running phase: buildPhase
  524. 5.07 s > Preprocessing library for pathway-compat-filepath-0.0.1.0..
  525. 5.07 s > Building library for pathway-compat-filepath-0.0.1.0..
  526. 5.07 s > [ 1 of 10] Compiling Common.FilePath ( src/Common/FilePath.hs, dist/build/Common/FilePath.o, dist/build/Common/FilePath.dyn_o )
  527. 5.07 s > [ 2 of 10] Compiling Common.OsPath ( src/Common/OsPath.hs, dist/build/Common/OsPath.o, dist/build/Common/OsPath.dyn_o )
  528. 5.07 s >
  529. 5.07 s > src/Common/OsPath.hs:90:23: error: [GHC-83865]
  530. 5.07 s > • Couldn't match type ‘OSS.OsString’ with ‘OsString’
  531. 5.07 s > Expected: OsPath
  532. 5.07 s > Actual: OSS.OsString
  533. 5.07 s > NB: ‘OsString’
  534. 5.07 s > is defined in ‘System.OsString.Internal.Types.Hidden’
  535. 5.07 s > in package ‘filepath-1.4.301.0’
  536. 5.07 s > ‘OSS.OsString’
  537. 5.07 s > is defined in ‘System.OsString.Internal.Types’
  538. 5.07 s > in package ‘os-string-2.0.10’
  539. 5.07 s > • In the ‘parent’ field of a record
  540. 5.07 s > In the expression:
  541. 5.07 s > Format
  542. 5.07 s > {root = O.pack . pure $ O.pathSeparator, current = mempty,
  543. 5.07 s > parent = OSS.unsafeEncodeUtf "..",
  544. 5.07 s > separator = O.pack . pure $ O.pathSeparator,
  545. 5.07 s > substitutions = mempty}
  546. 5.07 s > In an equation for ‘localFormat’:
  547. 5.07 s > localFormat
  548. 5.07 s > = Format
  549. 5.07 s > {root = O.pack . pure $ O.pathSeparator, current = mempty,
  550. 5.07 s > parent = OSS.unsafeEncodeUtf "..",
  551. 5.07 s > separator = O.pack . pure $ O.pathSeparator,
  552. 5.07 s > substitutions = mempty}
  553. 5.07 s > |
  554. 5.07 s > 90 | Format.parent = OSS.unsafeEncodeUtf "..",
  555. 5.07 s > | ^^^^^^^^^^^^^^^^^^^^^^^^
  556. 5.07 s > [ 3 of 10] Compiling System.FilePath.Thin ( src/System/FilePath/Thin.hs, dist/build/System/FilePath/Thin.o, dist/build/System/FilePath/Thin.dyn_o )
  557. 5.07 s > [ 4 of 10] Compiling System.FilePath.Pathway ( src/System/FilePath/Pathway.hs, dist/build/System/FilePath/Pathway.o, dist/build/System/FilePath/Pathway.dyn_o )
  558. 5.07 s > [ 5 of 10] Compiling System.FilePath.Overlay ( src/System/FilePath/Overlay.hs, dist/build/System/FilePath/Overlay.o, dist/build/System/FilePath/Overlay.dyn_o )
  559. 5.07 s > [ 6 of 10] Compiling System.FilePath ( src/System/FilePath.hs, dist/build/System/FilePath.o, dist/build/System/FilePath.dyn_o )
  560. 5.07 s For full logs, run:
  561. 5.07 s nix log /nix/store/gwlaydb47f6yhlx7hsgqq7s0m612k39r-pathway-compat-filepath-0.0.1.0.drv
  562. 5.07 s error: Cannot build '/nix/store/a28ihy0b969pwxwh925yhrdh6iklyv31-ghc-9.8.4-with-packages.drv'.
  563. 5.07 s Reason: 1 dependency failed.
  564. 5.07 s Output paths:
  565. 5.07 s /nix/store/f47c3sqmfcbdna77yvv3zvndirn9fi35-ghc-9.8.4-with-packages
  566. 5.07 s error: Cannot build '/nix/store/cijxvsyixgap1kwhz9cm8ird83kbmbhn-pathway-compat-directory-0.0.1.0.drv'.
  567. 5.07 s Reason: 1 dependency failed.
  568. 5.07 s Output paths:
  569. 5.07 s /nix/store/778vdqwf41vzalr7jkjccdjmn1c5aa4c-pathway-compat-directory-0.0.1.0-doc
  570. 5.07 s /nix/store/m4jqkrqxzf5yffr8mrra9qw0vva59qx1-pathway-compat-directory-0.0.1.0
  571. 5.07 s error: Cannot build '/nix/store/3vy9ph7hwp5rxb70p8wqv7aj4sw59zkv-pathway-compat-file-io-0.0.1.0.drv'.
  572. 5.07 s Reason: 1 dependency failed.
  573. 5.07 s Output paths:
  574. 5.07 s /nix/store/0bkghz6pg1sh43wpglszfz85kwxh1slh-pathway-compat-file-io-0.0.1.0-doc
  575. 5.07 s /nix/store/fi58mdj0jksk51y9cpb7pv8gsdcyalv6-pathway-compat-file-io-0.0.1.0
  576. 5.07 s error: Cannot build '/nix/store/lvyysbgzywa8rw8xjjwr4ycmka1xmx05-pathway-compat-temporary-0.0.1.0.drv'.
  577. 5.07 s Reason: 1 dependency failed.
  578. 5.07 s Output paths:
  579. 5.07 s /nix/store/2jf61xx1szaq3ixvjlisixnb51ipdk6g-pathway-compat-temporary-0.0.1.0-doc
  580. 5.07 s /nix/store/ifh2czq9h1qzw1i0l0c7bj4nhvx1g7ic-pathway-compat-temporary-0.0.1.0
  581. 5.07 s error: Cannot build '/nix/store/56dvk8jffxl3fviyasvi4k4z94pw19jr-pathway-system-0.0.1.0.drv'.
  582. 5.07 s Reason: 1 dependency failed.
  583. 5.07 s Output paths:
  584. 5.07 s /nix/store/pmqpjy6lr5f5xlihnic0nx55mhfw2gln-pathway-system-0.0.1.0
  585. 5.07 s /nix/store/w7v65phm85dmsqf6rnkimibj4wdhm833-pathway-system-0.0.1.0-doc
  586. 5.07 s error: Build failed due to failed dependency
  587. 5.07 s error: Cannot build '/nix/store/hb0lkyckyih75smvvc4h529mxzi4i14x-all-packages.drv'.
  588. 5.07 s Reason: 1 dependency failed.
  589. 5.07 s Output paths:
  590. 5.07 s /nix/store/4p28hza07d5xpn2maqhpangh4fjq464w-all-packages
  591. 5.07 s Build failed due to failed dependency
  592. 5.10 s Build failed.