build packages.x86_64-linux.ghc984_all
0.70 s
$ /nix/store/9ypz3flqsrl5xl495mm8h645gadjsxi1-coreutils-9.11/bin/timeout --kill-after=15s 7200s /nix/store/23zk8sgzamrbmj1fday15szf7f2279s8-nix-2.34.7/bin/nix --extra-experimental-features nix-command --extra-experimental-features flakes --log-format internal-json build --no-link --print-out-paths git+https://github.com/sellout/pathway?ref=more-system&rev=bf654313bb47699f313cdd00e42ee12d835b5bed&shallow=1#packages.x86_64-linux.ghc984_all --print-build-logs
0.72 s
warning: ignoring untrusted flake configuration setting 'allow-import-from-derivation'.
0.72 s
Pass '--accept-flake-config' to trust it
0.72 s
warning: ignoring untrusted flake configuration setting 'extra-experimental-features'.
0.72 s
Pass '--accept-flake-config' to trust it
0.72 s
warning: ignoring untrusted flake configuration setting 'extra-substituters'.
0.72 s
Pass '--accept-flake-config' to trust it
0.72 s
warning: ignoring untrusted flake configuration setting 'extra-trusted-public-keys'.
0.72 s
Pass '--accept-flake-config' to trust it
0.72 s
warning: ignoring untrusted flake configuration setting 'sandbox'.
0.72 s
Pass '--accept-flake-config' to trust it
0.72 s
warning: ignoring untrusted flake configuration setting 'use-registries'.
0.72 s
Pass '--accept-flake-config' to trust it
1.46 s
1.48 s
Building /nix/store/bhfppmv1iv09ifi5yzfps31vjhqmvrf8-cabal2nix-pathway.drv
1.55 s
[cabal2nix-pathway:post-build] Uploading to cachix cache "sellout": /nix/store/546v9m0h79qksrj2n10gmamab0142r59-cabal2nix-pathway
2.01 s
[cabal2nix-pathway:post-build] Nothing to push - all store paths are already on Cachix.
2.02 s
[cabal2nix-pathway:post-build] Uploading to the NixCI cache: /nix/store/546v9m0h79qksrj2n10gmamab0142r59-cabal2nix-pathway
2.05 s
[cabal2nix-pathway:post-build] warning: 'warn-short-path-literals' is deprecated, use 'lint-short-path-literals = ignore' instead
2.25 s
[cabal2nix-pathway:post-build] copying 1 paths...
2.25 s
[cabal2nix-pathway:post-build] copying path '/nix/store/546v9m0h79qksrj2n10gmamab0142r59-cabal2nix-pathway' to 'https://cache.nix-ci.com'...
2.29 s
[cabal2nix-pathway:post-build] warning: 'warn-short-path-literals' is deprecated, use 'lint-short-path-literals = ignore' instead
2.39 s
[cabal2nix-pathway:post-build] copying 0 paths...
2.41 s
Uploaded cabal2nix-pathway in 868ms
2.41 s
Progress: 1 of 2 built
2.41 s
Built cabal2nix-pathway in 924ms
2.41 s
Progress: 2 of 2 built
2.41 s
2.44 s
Building /nix/store/h10gz5c02z1yspdjsz1k3lb3sdiqcabn-cabal2nix-pathway-compat-base.drv
2.50 s
[cabal2nix-pathway-compat-base:post-build] Uploading to cachix cache "sellout": /nix/store/80fsb017zf2nx1g4klwnlfg5higgxafm-cabal2nix-pathway-compat-base
2.95 s
[cabal2nix-pathway-compat-base:post-build] Nothing to push - all store paths are already on Cachix.
2.97 s
[cabal2nix-pathway-compat-base:post-build] Uploading to the NixCI cache: /nix/store/80fsb017zf2nx1g4klwnlfg5higgxafm-cabal2nix-pathway-compat-base
3.00 s
[cabal2nix-pathway-compat-base:post-build] warning: 'warn-short-path-literals' is deprecated, use 'lint-short-path-literals = ignore' instead
3.13 s
[cabal2nix-pathway-compat-base:post-build] copying 1 paths...
3.13 s
[cabal2nix-pathway-compat-base:post-build] copying path '/nix/store/80fsb017zf2nx1g4klwnlfg5higgxafm-cabal2nix-pathway-compat-base' to 'https://cache.nix-ci.com'...
3.18 s
[cabal2nix-pathway-compat-base:post-build] warning: 'warn-short-path-literals' is deprecated, use 'lint-short-path-literals = ignore' instead
3.28 s
[cabal2nix-pathway-compat-base:post-build] copying 0 paths...
3.30 s
Uploaded cabal2nix-pathway-compat-base in 806ms
3.30 s
Progress: 1 of 2 built
3.30 s
Built cabal2nix-pathway-compat-base in 860ms
3.30 s
Progress: 2 of 2 built
3.30 s
3.32 s
Building /nix/store/ighdl8s3x2l2nk09vqx2mchic4n3arpb-cabal2nix-pathway-compat-directory.drv
3.39 s
[cabal2nix-pathway-compat-directory:post-build] Uploading to cachix cache "sellout": /nix/store/q04713d6l156iddqafvfy7rgrlpm8g9h-cabal2nix-pathway-compat-directory
3.74 s
[cabal2nix-pathway-compat-directory:post-build] Nothing to push - all store paths are already on Cachix.
3.76 s
[cabal2nix-pathway-compat-directory:post-build] Uploading to the NixCI cache: /nix/store/q04713d6l156iddqafvfy7rgrlpm8g9h-cabal2nix-pathway-compat-directory
3.79 s
[cabal2nix-pathway-compat-directory:post-build] warning: 'warn-short-path-literals' is deprecated, use 'lint-short-path-literals = ignore' instead
3.93 s
[cabal2nix-pathway-compat-directory:post-build] copying 1 paths...
3.93 s
[cabal2nix-pathway-compat-directory:post-build] copying path '/nix/store/q04713d6l156iddqafvfy7rgrlpm8g9h-cabal2nix-pathway-compat-directory' to 'https://cache.nix-ci.com'...
3.98 s
[cabal2nix-pathway-compat-directory:post-build] warning: 'warn-short-path-literals' is deprecated, use 'lint-short-path-literals = ignore' instead
4.08 s
[cabal2nix-pathway-compat-directory:post-build] copying 0 paths...
4.10 s
Uploaded cabal2nix-pathway-compat-directory in 720ms
4.10 s
Progress: 1 of 2 built
4.10 s
Built cabal2nix-pathway-compat-directory in 773ms
4.10 s
Progress: 2 of 2 built
4.10 s
4.12 s
Building /nix/store/cz1n9mzpsp3pk4sj2s2gkgj6nyrkypmx-cabal2nix-pathway-compat-file-io.drv
4.18 s
[cabal2nix-pathway-compat-file-io:post-build] Uploading to cachix cache "sellout": /nix/store/i4hmqqwns70i0igvsfk0qnz8y6mgl7yx-cabal2nix-pathway-compat-file-io
4.54 s
[cabal2nix-pathway-compat-file-io:post-build] Nothing to push - all store paths are already on Cachix.
4.55 s
[cabal2nix-pathway-compat-file-io:post-build] Uploading to the NixCI cache: /nix/store/i4hmqqwns70i0igvsfk0qnz8y6mgl7yx-cabal2nix-pathway-compat-file-io
4.59 s
[cabal2nix-pathway-compat-file-io:post-build] warning: 'warn-short-path-literals' is deprecated, use 'lint-short-path-literals = ignore' instead
4.72 s
[cabal2nix-pathway-compat-file-io:post-build] copying 1 paths...
4.72 s
[cabal2nix-pathway-compat-file-io:post-build] copying path '/nix/store/i4hmqqwns70i0igvsfk0qnz8y6mgl7yx-cabal2nix-pathway-compat-file-io' to 'https://cache.nix-ci.com'...
4.77 s
[cabal2nix-pathway-compat-file-io:post-build] warning: 'warn-short-path-literals' is deprecated, use 'lint-short-path-literals = ignore' instead
4.87 s
[cabal2nix-pathway-compat-file-io:post-build] copying 0 paths...
4.88 s
Uploaded cabal2nix-pathway-compat-file-io in 708ms
4.88 s
Progress: 1 of 2 built
4.88 s
Built cabal2nix-pathway-compat-file-io in 761ms
4.88 s
Progress: 2 of 2 built
4.89 s
4.91 s
Building /nix/store/vlm4356sprvx9zi5m8xp8m75p3hcfgmf-cabal2nix-pathway-compat-filepath.drv
4.97 s
[cabal2nix-pathway-compat-filepath:post-build] Uploading to cachix cache "sellout": /nix/store/6gldlv2yx4h21fkjv19wdfnip7ypwgx8-cabal2nix-pathway-compat-filepath
5.33 s
[cabal2nix-pathway-compat-filepath:post-build] Nothing to push - all store paths are already on Cachix.
5.35 s
[cabal2nix-pathway-compat-filepath:post-build] Uploading to the NixCI cache: /nix/store/6gldlv2yx4h21fkjv19wdfnip7ypwgx8-cabal2nix-pathway-compat-filepath
5.38 s
[cabal2nix-pathway-compat-filepath:post-build] warning: 'warn-short-path-literals' is deprecated, use 'lint-short-path-literals = ignore' instead
5.51 s
[cabal2nix-pathway-compat-filepath:post-build] copying 1 paths...
5.51 s
[cabal2nix-pathway-compat-filepath:post-build] copying path '/nix/store/6gldlv2yx4h21fkjv19wdfnip7ypwgx8-cabal2nix-pathway-compat-filepath' to 'https://cache.nix-ci.com'...
5.56 s
[cabal2nix-pathway-compat-filepath:post-build] warning: 'warn-short-path-literals' is deprecated, use 'lint-short-path-literals = ignore' instead
5.67 s
[cabal2nix-pathway-compat-filepath:post-build] copying 0 paths...
5.69 s
Uploaded cabal2nix-pathway-compat-filepath in 723ms
5.69 s
Progress: 1 of 2 built
5.69 s
Built cabal2nix-pathway-compat-filepath in 777ms
5.69 s
Progress: 2 of 2 built
5.69 s
5.71 s
Building /nix/store/qax74nnqwpysfys43skdbg0bwg6kal0s-cabal2nix-pathway-compat-temporary.drv
6.54 s
[cabal2nix-pathway-compat-temporary:post-build] Uploading to cachix cache "sellout": /nix/store/mfyf5gzil8p50csd4v5g1k3wi5pwcvqi-cabal2nix-pathway-compat-temporary
6.54 s
[cabal2nix-pathway-compat-temporary:post-build] Nothing to push - all store paths are already on Cachix.
6.54 s
[cabal2nix-pathway-compat-temporary:post-build] Uploading to the NixCI cache: /nix/store/mfyf5gzil8p50csd4v5g1k3wi5pwcvqi-cabal2nix-pathway-compat-temporary
6.54 s
[cabal2nix-pathway-compat-temporary:post-build] warning: 'warn-short-path-literals' is deprecated, use 'lint-short-path-literals = ignore' instead
6.54 s
[cabal2nix-pathway-compat-temporary:post-build] copying 1 paths...
6.54 s
[cabal2nix-pathway-compat-temporary:post-build] copying path '/nix/store/mfyf5gzil8p50csd4v5g1k3wi5pwcvqi-cabal2nix-pathway-compat-temporary' to 'https://cache.nix-ci.com'...
6.54 s
[cabal2nix-pathway-compat-temporary:post-build] warning: 'warn-short-path-literals' is deprecated, use 'lint-short-path-literals = ignore' instead
6.54 s
[cabal2nix-pathway-compat-temporary:post-build] copying 0 paths...
6.54 s
Uploaded cabal2nix-pathway-compat-temporary in 0ms
6.54 s
Progress: 1 of 2 built
6.54 s
Built cabal2nix-pathway-compat-temporary in 828ms
6.54 s
Progress: 2 of 2 built
6.54 s
6.54 s
Building /nix/store/fy7qr52yyzwgcnk8gwn668ddnkf2avwg-cabal2nix-pathway-internal.drv
6.60 s
[cabal2nix-pathway-internal:post-build] Uploading to cachix cache "sellout": /nix/store/jj1gh9gbjwld2pxcrbl1hdx2r290ai9w-cabal2nix-pathway-internal
7.04 s
[cabal2nix-pathway-internal:post-build] Nothing to push - all store paths are already on Cachix.
7.06 s
[cabal2nix-pathway-internal:post-build] Uploading to the NixCI cache: /nix/store/jj1gh9gbjwld2pxcrbl1hdx2r290ai9w-cabal2nix-pathway-internal
7.10 s
[cabal2nix-pathway-internal:post-build] warning: 'warn-short-path-literals' is deprecated, use 'lint-short-path-literals = ignore' instead
7.24 s
[cabal2nix-pathway-internal:post-build] copying 1 paths...
7.24 s
[cabal2nix-pathway-internal:post-build] copying path '/nix/store/jj1gh9gbjwld2pxcrbl1hdx2r290ai9w-cabal2nix-pathway-internal' to 'https://cache.nix-ci.com'...
7.29 s
[cabal2nix-pathway-internal:post-build] warning: 'warn-short-path-literals' is deprecated, use 'lint-short-path-literals = ignore' instead
7.40 s
[cabal2nix-pathway-internal:post-build] copying 0 paths...
7.41 s
Uploaded cabal2nix-pathway-internal in 828ms
7.42 s
Progress: 1 of 2 built
7.42 s
Built cabal2nix-pathway-internal in 871ms
7.42 s
Progress: 2 of 2 built
7.42 s
7.44 s
Building /nix/store/5yrd4sjgjw7b2004zdb6j5jyfpfaa015-cabal2nix-pathway-path.drv
7.51 s
[cabal2nix-pathway-path:post-build] Uploading to cachix cache "sellout": /nix/store/phrvfim08rz8lqfrqcrv1imvivrwz8lw-cabal2nix-pathway-path
7.87 s
[cabal2nix-pathway-path:post-build] Nothing to push - all store paths are already on Cachix.
7.88 s
[cabal2nix-pathway-path:post-build] Uploading to the NixCI cache: /nix/store/phrvfim08rz8lqfrqcrv1imvivrwz8lw-cabal2nix-pathway-path
7.92 s
[cabal2nix-pathway-path:post-build] warning: 'warn-short-path-literals' is deprecated, use 'lint-short-path-literals = ignore' instead
8.07 s
[cabal2nix-pathway-path:post-build] copying 1 paths...
8.07 s
[cabal2nix-pathway-path:post-build] copying path '/nix/store/phrvfim08rz8lqfrqcrv1imvivrwz8lw-cabal2nix-pathway-path' to 'https://cache.nix-ci.com'...
8.13 s
[cabal2nix-pathway-path:post-build] warning: 'warn-short-path-literals' is deprecated, use 'lint-short-path-literals = ignore' instead
8.23 s
[cabal2nix-pathway-path:post-build] copying 0 paths...
8.24 s
Uploaded cabal2nix-pathway-path in 746ms
8.25 s
Progress: 1 of 2 built
8.25 s
Built cabal2nix-pathway-path in 804ms
8.25 s
Progress: 2 of 2 built
8.25 s
8.28 s
Building /nix/store/h8ma0w6hif39zn70hfbjmr77a0c3y6bk-cabal2nix-pathway-quickcheck.drv
8.34 s
[cabal2nix-pathway-quickcheck:post-build] Uploading to cachix cache "sellout": /nix/store/l507wyrax7fhin6i3ymc7qv07yzcx7gs-cabal2nix-pathway-quickcheck
8.69 s
[cabal2nix-pathway-quickcheck:post-build] Nothing to push - all store paths are already on Cachix.
8.71 s
[cabal2nix-pathway-quickcheck:post-build] Uploading to the NixCI cache: /nix/store/l507wyrax7fhin6i3ymc7qv07yzcx7gs-cabal2nix-pathway-quickcheck
8.75 s
[cabal2nix-pathway-quickcheck:post-build] warning: 'warn-short-path-literals' is deprecated, use 'lint-short-path-literals = ignore' instead
8.91 s
[cabal2nix-pathway-quickcheck:post-build] copying 1 paths...
8.91 s
[cabal2nix-pathway-quickcheck:post-build] copying path '/nix/store/l507wyrax7fhin6i3ymc7qv07yzcx7gs-cabal2nix-pathway-quickcheck' to 'https://cache.nix-ci.com'...
8.97 s
[cabal2nix-pathway-quickcheck:post-build] warning: 'warn-short-path-literals' is deprecated, use 'lint-short-path-literals = ignore' instead
9.07 s
[cabal2nix-pathway-quickcheck:post-build] copying 0 paths...
9.09 s
Uploaded cabal2nix-pathway-quickcheck in 757ms
9.09 s
Progress: 1 of 2 built
9.09 s
Built cabal2nix-pathway-quickcheck in 813ms
9.09 s
Progress: 2 of 2 built
9.09 s
9.12 s
Building /nix/store/89zimkf0qixsz4ks330cjrc8kaw50qw1-cabal2nix-pathway-system.drv
9.19 s
[cabal2nix-pathway-system:post-build] Uploading to cachix cache "sellout": /nix/store/2rmv2kjpmi9ga933gnzf976v3x7cbid2-cabal2nix-pathway-system
9.57 s
[cabal2nix-pathway-system:post-build] Nothing to push - all store paths are already on Cachix.
9.58 s
[cabal2nix-pathway-system:post-build] Uploading to the NixCI cache: /nix/store/2rmv2kjpmi9ga933gnzf976v3x7cbid2-cabal2nix-pathway-system
9.62 s
[cabal2nix-pathway-system:post-build] warning: 'warn-short-path-literals' is deprecated, use 'lint-short-path-literals = ignore' instead
9.76 s
[cabal2nix-pathway-system:post-build] copying 1 paths...
9.76 s
[cabal2nix-pathway-system:post-build] copying path '/nix/store/2rmv2kjpmi9ga933gnzf976v3x7cbid2-cabal2nix-pathway-system' to 'https://cache.nix-ci.com'...
9.82 s
[cabal2nix-pathway-system:post-build] warning: 'warn-short-path-literals' is deprecated, use 'lint-short-path-literals = ignore' instead
9.92 s
[cabal2nix-pathway-system:post-build] copying 0 paths...
9.94 s
Uploaded cabal2nix-pathway-system in 764ms
9.94 s
Progress: 1 of 2 built
9.94 s
Built cabal2nix-pathway-system in 823ms
9.94 s
Progress: 2 of 2 built
9.94 s
10.93 s
Downloading cached colour-2.3.7-data from https://cache.nix-ci.com
10.96 s
Downloading cached ghc-9.8.4-doc from https://cache.nix-ci.com
10.96 s
Downloading cached hscolour from https://cache.nix-ci.com
10.96 s
Downloaded cached colour-2.3.7-data (2696 B) in 27ms
10.96 s
Progress: 0 of 103 built, 1 of 174 downloaded from cache (2 downloading)
10.98 s
Downloaded cached hscolour (2.5 MiB) in 19ms
10.98 s
Progress: 0 of 103 built, 2 of 174 downloaded from cache (1 downloading)
12.64 s
Downloaded cached ghc-9.8.4-doc (687 MiB) in 1.6s
12.64 s
Progress: 0 of 102 built, 3 of 174 downloaded from cache
12.64 s
Downloading cached OneTuple-0.4.2.1-doc from https://cache.nix-ci.com
12.64 s
Downloading cached StateVar-1.2.2-doc from https://cache.nix-ci.com
12.64 s
Downloading cached assoc-1.1.1-doc from https://cache.nix-ci.com
12.64 s
Downloading cached base-orphans-0.9.4-doc from https://cache.nix-ci.com
12.64 s
Downloading cached cabal-doctest-1.0.12-doc from https://cache.nix-ci.com
12.64 s
Downloading cached call-stack-0.4.0-doc from https://cache.nix-ci.com
12.64 s
Downloading cached character-ps-0.1-doc from https://cache.nix-ci.com
12.64 s
Downloading cached clock-0.8.4-doc from https://cache.nix-ci.com
12.64 s
Downloading cached code-page-0.2.1-doc from https://cache.nix-ci.com
12.64 s
Downloading cached colour-2.3.7-doc from https://cache.nix-ci.com
12.64 s
Downloading cached dlist-1.0-doc from https://cache.nix-ci.com
12.64 s
Downloading cached file-io-0.1.6-doc from https://cache.nix-ci.com
12.64 s
Downloading cached ghc from https://cache.nix-ci.com
12.64 s
Downloading cached ghc-paths-0.1.0.12-doc from https://cache.nix-ci.com
12.64 s
Downloading cached indexed-traversable-0.1.4-doc from https://cache.nix-ci.com
12.65 s
Downloading cached integer-logarithms-1.0.5-doc from https://cache.nix-ci.com
12.66 s
Downloaded cached OneTuple-0.4.2.1-doc (270 KiB) in 25ms
12.66 s
Progress: 0 of 101 built, 4 of 174 downloaded from cache (15 downloading)
12.66 s
Downloading cached old-locale-1.0.0.7-doc from https://cache.nix-ci.com
12.67 s
Downloaded cached clock-0.8.4-doc (517 KiB) in 29ms
12.67 s
Progress: 0 of 101 built, 5 of 174 downloaded from cache (15 downloading)
12.67 s
Downloading cached os-string-2.0.10-doc from https://cache.nix-ci.com
12.67 s
Downloaded cached StateVar-1.2.2-doc (299 KiB) in 33ms
12.67 s
Progress: 0 of 101 built, 6 of 174 downloaded from cache (15 downloading)
12.67 s
Downloaded cached cabal-doctest-1.0.12-doc (358 KiB) in 33ms
12.67 s
Downloading cached extra-1.8.1-doc from https://cache.nix-ci.com
12.67 s
Progress: 0 of 101 built, 7 of 174 downloaded from cache (15 downloading)
12.67 s
Downloading cached contravariant-1.5.6-doc from https://cache.nix-ci.com
12.67 s
Downloaded cached dlist-1.0-doc (532 KiB) in 33ms
12.67 s
Progress: 0 of 101 built, 8 of 174 downloaded from cache (15 downloading)
12.67 s
Downloading cached parallel-3.2.2.0-doc from https://cache.nix-ci.com
12.68 s
Downloaded cached call-stack-0.4.0-doc (203 KiB) in 37ms
12.68 s
Progress: 0 of 101 built, 9 of 174 downloaded from cache (15 downloading)
12.68 s
Downloading cached parser-combinators-1.3.1-doc from https://cache.nix-ci.com
12.68 s
Downloaded cached code-page-0.2.1-doc (276 KiB) in 38ms
12.68 s
Progress: 0 of 101 built, 10 of 174 downloaded from cache (15 downloading)
12.68 s
Downloading cached prettyprinter-1.7.1-doc from https://cache.nix-ci.com
12.68 s
Downloaded cached base-orphans-0.9.4-doc (1.1 MiB) in 43ms
12.68 s
Progress: 0 of 101 built, 11 of 174 downloaded from cache (15 downloading)
12.68 s
Downloaded cached assoc-1.1.1-doc (192 KiB) in 43ms
12.68 s
Downloading cached primitive-0.9.1.0-doc from https://cache.nix-ci.com
12.68 s
Progress: 0 of 101 built, 12 of 174 downloaded from cache (15 downloading)
12.68 s
Downloading cached reflection-2.1.9-doc from https://cache.nix-ci.com
12.68 s
Downloaded cached character-ps-0.1-doc (1 MiB) in 43ms
12.68 s
Progress: 0 of 101 built, 13 of 174 downloaded from cache (15 downloading)
12.68 s
Downloading cached splitmix-0.1.3.2-doc from https://cache.nix-ci.com
12.68 s
Downloaded cached indexed-traversable-0.1.4-doc (1.1 MiB) in 44ms
12.68 s
Progress: 0 of 101 built, 14 of 174 downloaded from cache (15 downloading)
12.68 s
Downloading cached syb-0.7.2.4-doc from https://cache.nix-ci.com
12.68 s
Downloaded cached file-io-0.1.6-doc (679 KiB) in 46ms
12.68 s
Progress: 0 of 101 built, 15 of 174 downloaded from cache (15 downloading)
12.68 s
Downloading cached tagged-0.8.9-doc from https://cache.nix-ci.com
12.69 s
Downloaded cached colour-2.3.7-doc (2 MiB) in 48ms
12.69 s
Progress: 0 of 101 built, 16 of 174 downloaded from cache (15 downloading)
12.69 s
Downloading cached th-abstraction-0.7.2.0-doc from https://cache.nix-ci.com
12.69 s
Downloaded cached integer-logarithms-1.0.5-doc (354 KiB) in 35ms
12.69 s
Progress: 0 of 101 built, 17 of 174 downloaded from cache (15 downloading)
12.69 s
Downloading cached ansi-terminal-types-1.1.3-doc from https://cache.nix-ci.com
12.69 s
Downloaded cached ghc-paths-0.1.0.12-doc (121 KiB) in 54ms
12.69 s
Progress: 0 of 101 built, 18 of 174 downloaded from cache (15 downloading)
12.69 s
Downloaded cached old-locale-1.0.0.7-doc (164 KiB) in 30ms
12.69 s
Downloading cached th-compat-0.1.7-doc from https://cache.nix-ci.com
12.69 s
Progress: 0 of 101 built, 19 of 174 downloaded from cache (15 downloading)
12.69 s
Downloading cached transformers-base-0.4.6.1-doc from https://cache.nix-ci.com
12.70 s
Downloaded cached contravariant-1.5.6-doc (947 KiB) in 28ms
12.70 s
Progress: 0 of 101 built, 20 of 174 downloaded from cache (15 downloading)
12.70 s
Downloading cached old-time-1.1.1.0-doc from https://cache.nix-ci.com
12.70 s
Downloaded cached parallel-3.2.2.0-doc (1 MiB) in 31ms
12.70 s
Progress: 0 of 101 built, 21 of 174 downloaded from cache (15 downloading)
12.70 s
Downloading cached transformers-compat-0.7.2-doc from https://cache.nix-ci.com
12.71 s
Downloaded cached os-string-2.0.10-doc (3.6 MiB) in 42ms
12.71 s
Progress: 0 of 101 built, 22 of 174 downloaded from cache (15 downloading)
12.71 s
Downloading cached unliftio-core-0.2.1.0-doc from https://cache.nix-ci.com
12.71 s
Downloaded cached reflection-2.1.9-doc (570 KiB) in 29ms
12.71 s
Progress: 0 of 101 built, 23 of 174 downloaded from cache (15 downloading)
12.71 s
Downloading cached hashable-1.5.1.0-doc from https://cache.nix-ci.com
12.71 s
Downloaded cached parser-combinators-1.3.1-doc (905 KiB) in 38ms
12.71 s
Progress: 0 of 101 built, 24 of 174 downloaded from cache (15 downloading)
12.72 s
Downloading cached vector-stream-0.1.0.1-doc from https://cache.nix-ci.com
12.72 s
Downloaded cached splitmix-0.1.3.2-doc (551 KiB) in 34ms
12.72 s
Progress: 0 of 101 built, 25 of 174 downloaded from cache (15 downloading)
12.72 s
Downloading cached random-1.2.1.3-doc from https://cache.nix-ci.com
12.72 s
Downloaded cached tagged-0.8.9-doc (612 KiB) in 33ms
12.72 s
Progress: 0 of 101 built, 26 of 174 downloaded from cache (15 downloading)
12.72 s
Downloading cached distributive-0.6.3-doc from https://cache.nix-ci.com
12.72 s
Downloaded cached extra-1.8.1-doc (3.1 MiB) in 48ms
12.72 s
Progress: 0 of 101 built, 27 of 174 downloaded from cache (15 downloading)
12.72 s
Downloaded cached ansi-terminal-types-1.1.3-doc (661 KiB) in 31ms
12.72 s
Progress: 0 of 101 built, 28 of 174 downloaded from cache (14 downloading)
12.72 s
Downloading cached ansi-terminal-1.1.5-doc from https://cache.nix-ci.com
12.73 s
Downloaded cached transformers-base-0.4.6.1-doc (182 KiB) in 31ms
12.73 s
Progress: 0 of 101 built, 29 of 174 downloaded from cache (14 downloading)
12.73 s
Downloaded cached syb-0.7.2.4-doc (1.2 MiB) in 43ms
12.73 s
Progress: 0 of 101 built, 30 of 174 downloaded from cache (13 downloading)
12.73 s
Downloaded cached th-abstraction-0.7.2.0-doc (2.1 MiB) in 42ms
12.73 s
Progress: 0 of 101 built, 31 of 174 downloaded from cache (12 downloading)
12.73 s
Downloaded cached prettyprinter-1.7.1-doc (3.1 MiB) in 52ms
12.73 s
Progress: 0 of 101 built, 32 of 174 downloaded from cache (11 downloading)
12.73 s
Downloaded cached th-compat-0.1.7-doc (519 KiB) in 37ms
12.73 s
Progress: 0 of 101 built, 33 of 174 downloaded from cache (10 downloading)
12.73 s
Downloading cached network-uri-2.6.4.2-doc from https://cache.nix-ci.com
12.73 s
Downloaded cached primitive-0.9.1.0-doc (5.4 MiB) in 53ms
12.73 s
Progress: 0 of 101 built, 34 of 174 downloaded from cache (10 downloading)
12.73 s
Downloading cached integer-conversion-0.1.1-doc from https://cache.nix-ci.com
12.74 s
Downloaded cached unliftio-core-0.2.1.0-doc (270 KiB) in 29ms
12.74 s
Progress: 0 of 101 built, 35 of 174 downloaded from cache (10 downloading)
12.74 s
Downloaded cached transformers-compat-0.7.2-doc (1.9 MiB) in 39ms
12.74 s
Progress: 0 of 101 built, 36 of 174 downloaded from cache (9 downloading)
12.75 s
Downloaded cached hashable-1.5.1.0-doc (1.2 MiB) in 37ms
12.75 s
Progress: 0 of 101 built, 37 of 174 downloaded from cache (8 downloading)
12.75 s
Downloading cached case-insensitive-1.2.1.0-doc from https://cache.nix-ci.com
12.75 s
Downloading cached data-fix-0.3.4-doc from https://cache.nix-ci.com
12.75 s
Downloading cached scientific-0.3.8.1-doc from https://cache.nix-ci.com
12.75 s
Downloading cached text-short-0.1.6.1-doc from https://cache.nix-ci.com
12.75 s
Downloading cached these-1.2.1-doc from https://cache.nix-ci.com
12.75 s
Downloading cached time-compat-1.9.9-doc from https://cache.nix-ci.com
12.75 s
Downloading cached unordered-containers-0.2.20.1-doc from https://cache.nix-ci.com
12.75 s
Downloaded cached distributive-0.6.3-doc (488 KiB) in 32ms
12.75 s
Progress: 0 of 101 built, 38 of 174 downloaded from cache (14 downloading)
12.75 s
Downloading cached comonad-5.0.10-doc from https://cache.nix-ci.com
12.75 s
Downloaded cached vector-stream-0.1.0.1-doc (1.5 MiB) in 36ms
12.75 s
Progress: 0 of 101 built, 39 of 174 downloaded from cache (14 downloading)
12.76 s
Downloaded cached ansi-terminal-1.1.5-doc (871 KiB) in 35ms
12.76 s
Progress: 0 of 101 built, 40 of 174 downloaded from cache (13 downloading)
12.76 s
Downloading cached prettyprinter-ansi-terminal-1.1.3-doc from https://cache.nix-ci.com
12.76 s
Downloaded cached random-1.2.1.3-doc (2.5 MiB) in 39ms
12.76 s
Progress: 0 of 101 built, 41 of 174 downloaded from cache (13 downloading)
12.76 s
Downloading cached QuickCheck-2.15.0.1-doc from https://cache.nix-ci.com
12.76 s
Downloading cached temporary-1.3-doc from https://cache.nix-ci.com
12.76 s
Downloading cached uuid-types-1.0.6.1-doc from https://cache.nix-ci.com
12.76 s
Downloaded cached network-uri-2.6.4.2-doc (1 MiB) in 32ms
12.76 s
Progress: 0 of 101 built, 42 of 174 downloaded from cache (15 downloading)
12.76 s
Downloaded cached integer-conversion-0.1.1-doc (241 KiB) in 29ms
12.76 s
Progress: 0 of 101 built, 43 of 174 downloaded from cache (14 downloading)
12.78 s
Downloaded cached data-fix-0.3.4-doc (426 KiB) in 26ms
12.78 s
Progress: 0 of 101 built, 44 of 174 downloaded from cache (13 downloading)
12.78 s
Downloaded cached case-insensitive-1.2.1.0-doc (270 KiB) in 27ms
12.78 s
Progress: 0 of 101 built, 45 of 174 downloaded from cache (12 downloading)
12.78 s
Downloaded cached these-1.2.1-doc (1 MiB) in 33ms
12.78 s
Progress: 0 of 101 built, 46 of 174 downloaded from cache (11 downloading)
12.78 s
Downloading cached strict-0.5.1-doc from https://cache.nix-ci.com
12.78 s
Downloaded cached scientific-0.3.8.1-doc (990 KiB) in 34ms
12.78 s
Downloaded cached prettyprinter-ansi-terminal-1.1.3-doc (518 KiB) in 27ms
12.78 s
Progress: 0 of 101 built, 47 of 174 downloaded from cache (11 downloading)
12.78 s
Progress: 0 of 101 built, 48 of 174 downloaded from cache (11 downloading)
12.78 s
Downloading cached megaparsec-9.7.0-doc from https://cache.nix-ci.com
12.78 s
Downloading cached optparse-applicative-0.18.1.0-doc from https://cache.nix-ci.com
12.79 s
Downloaded cached text-short-0.1.6.1-doc (1.1 MiB) in 38ms
12.79 s
Progress: 0 of 101 built, 49 of 174 downloaded from cache (11 downloading)
12.79 s
Downloaded cached temporary-1.3-doc (238 KiB) in 31ms
12.79 s
Progress: 0 of 101 built, 50 of 174 downloaded from cache (10 downloading)
12.79 s
Downloading cached doctest-0.24.3-doc from https://cache.nix-ci.com
12.79 s
Downloaded cached uuid-types-1.0.6.1-doc (596 KiB) in 32ms
12.79 s
Progress: 0 of 101 built, 51 of 174 downloaded from cache (10 downloading)
12.79 s
Downloaded cached comonad-5.0.10-doc (1.5 MiB) in 39ms
12.79 s
Downloaded cached time-compat-1.9.9-doc (2.4 MiB) in 41ms
12.79 s
Progress: 0 of 101 built, 52 of 174 downloaded from cache (9 downloading)
12.79 s
Progress: 0 of 101 built, 53 of 174 downloaded from cache (9 downloading)
12.79 s
Downloading cached bifunctors-5.6.3-doc from https://cache.nix-ci.com
12.79 s
Downloading cached text-iso8601-0.1.1.1-doc from https://cache.nix-ci.com
12.80 s
Downloaded cached unordered-containers-0.2.20.1-doc (4.5 MiB) in 50ms
12.80 s
Progress: 0 of 101 built, 54 of 174 downloaded from cache (9 downloading)
12.80 s
Downloading cached indexed-traversable-instances-0.1.2.1-doc from https://cache.nix-ci.com
12.81 s
Downloaded cached QuickCheck-2.15.0.1-doc (6.2 MiB) in 51ms
12.81 s
Progress: 0 of 101 built, 55 of 174 downloaded from cache (9 downloading)
12.82 s
Downloaded cached strict-0.5.1-doc (1.5 MiB) in 39ms
12.82 s
Progress: 0 of 101 built, 56 of 174 downloaded from cache (8 downloading)
12.83 s
Downloaded cached old-time-1.1.1.0-doc (537 KiB) in 124ms
12.83 s
Progress: 0 of 101 built, 57 of 174 downloaded from cache (7 downloading)
12.83 s
Downloading cached quickcheck-instances-0.3.33-doc from https://cache.nix-ci.com
12.83 s
Downloaded cached text-iso8601-0.1.1.1-doc (573 KiB) in 35ms
12.83 s
Progress: 0 of 101 built, 58 of 174 downloaded from cache (7 downloading)
12.83 s
Downloaded cached doctest-0.24.3-doc (1.6 MiB) in 40ms
12.83 s
Progress: 0 of 101 built, 59 of 174 downloaded from cache (6 downloading)
12.83 s
Downloaded cached indexed-traversable-instances-0.1.2.1-doc (186 KiB) in 32ms
12.83 s
Progress: 0 of 101 built, 60 of 174 downloaded from cache (5 downloading)
12.83 s
Downloading cached witherable-0.5-doc from https://cache.nix-ci.com
12.84 s
Downloaded cached optparse-applicative-0.18.1.0-doc (3.9 MiB) in 50ms
12.84 s
Progress: 0 of 101 built, 61 of 174 downloaded from cache (5 downloading)
12.84 s
Downloading cached tasty-1.5.4-doc from https://cache.nix-ci.com
12.84 s
Downloaded cached bifunctors-5.6.3-doc (3.5 MiB) in 47ms
12.84 s
Progress: 0 of 101 built, 62 of 174 downloaded from cache (5 downloading)
12.84 s
Downloading cached profunctors-5.6.3-doc from https://cache.nix-ci.com
12.84 s
Downloading cached semigroupoids-6.0.2-doc from https://cache.nix-ci.com
12.84 s
Downloaded cached megaparsec-9.7.0-doc (5.2 MiB) in 55ms
12.84 s
Progress: 0 of 101 built, 63 of 174 downloaded from cache (6 downloading)
12.86 s
Downloaded cached quickcheck-instances-0.3.33-doc (1.5 MiB) in 36ms
12.86 s
Progress: 0 of 101 built, 64 of 174 downloaded from cache (5 downloading)
12.87 s
Downloaded cached witherable-0.5-doc (1.1 MiB) in 33ms
12.87 s
Progress: 0 of 101 built, 65 of 174 downloaded from cache (4 downloading)
12.87 s
Downloaded cached tasty-1.5.4-doc (3.3 MiB) in 37ms
12.87 s
Progress: 0 of 101 built, 66 of 174 downloaded from cache (3 downloading)
12.89 s
Downloaded cached profunctors-5.6.3-doc (5.2 MiB) in 46ms
12.89 s
Progress: 0 of 101 built, 67 of 174 downloaded from cache (2 downloading)
12.89 s
Downloading cached invariant-0.6.5-doc from https://cache.nix-ci.com
12.89 s
Downloaded cached semigroupoids-6.0.2-doc (5.8 MiB) in 49ms
12.89 s
Progress: 0 of 101 built, 68 of 174 downloaded from cache (2 downloading)
12.89 s
Downloading cached either-5.0.3-doc from https://cache.nix-ci.com
12.89 s
Downloading cached free-5.2-doc from https://cache.nix-ci.com
12.89 s
Downloading cached semialign-1.3.1.1-doc from https://cache.nix-ci.com
12.92 s
Downloaded cached invariant-0.6.5-doc (2.1 MiB) in 32ms
12.92 s
Progress: 0 of 101 built, 69 of 174 downloaded from cache (4 downloading)
12.92 s
Downloaded cached either-5.0.3-doc (453 KiB) in 33ms
12.92 s
Progress: 0 of 101 built, 70 of 174 downloaded from cache (3 downloading)
12.92 s
Downloaded cached semialign-1.3.1.1-doc (1.3 MiB) in 36ms
12.92 s
Progress: 0 of 101 built, 71 of 174 downloaded from cache (2 downloading)
12.93 s
Downloading cached aeson-2.2.4.1-doc from https://cache.nix-ci.com
12.93 s
Downloaded cached free-5.2-doc (6 MiB) in 44ms
12.93 s
Progress: 0 of 101 built, 72 of 174 downloaded from cache (2 downloading)
12.93 s
Downloading cached adjunctions-4.4.4-doc from https://cache.nix-ci.com
12.93 s
Downloading cached recursion-schemes-5.2.3-doc from https://cache.nix-ci.com
12.95 s
Downloaded cached recursion-schemes-5.2.3-doc (2 MiB) in 13ms
12.95 s
Progress: 0 of 101 built, 73 of 174 downloaded from cache (3 downloading)
12.95 s
Downloading cached variant-1.0.2-doc from https://cache.nix-ci.com
12.97 s
Downloaded cached adjunctions-4.4.4-doc (2 MiB) in 40ms
12.97 s
Progress: 0 of 101 built, 74 of 174 downloaded from cache (3 downloading)
12.97 s
Downloading cached kan-extensions-5.2.8-doc from https://cache.nix-ci.com
12.98 s
Downloaded cached variant-1.0.2-doc (4.9 MiB) in 31ms
12.98 s
Progress: 0 of 101 built, 75 of 174 downloaded from cache (3 downloading)
12.99 s
Downloaded cached aeson-2.2.4.1-doc (14 MiB) in 63ms
12.99 s
Progress: 0 of 101 built, 76 of 174 downloaded from cache (2 downloading)
13.02 s
Downloaded cached kan-extensions-5.2.8-doc (2.3 MiB) in 46ms
13.02 s
Progress: 0 of 101 built, 77 of 174 downloaded from cache (1 downloading)
13.02 s
Downloading cached lens-5.3.6-doc from https://cache.nix-ci.com
13.13 s
Downloaded cached lens-5.3.6-doc (34.8 MiB) in 108ms
13.13 s
Progress: 0 of 101 built, 78 of 174 downloaded from cache (1 downloading)
13.13 s
Downloading cached yaya-0.6.2.3-doc from https://cache.nix-ci.com
13.15 s
Downloaded cached yaya-0.6.2.3-doc (2.7 MiB) in 19ms
13.15 s
Progress: 0 of 101 built, 79 of 174 downloaded from cache (1 downloading)
13.15 s
Downloading cached pathway-internal-0.0.1.0-doc from https://cache.nix-ci.com
13.15 s
Downloading cached yaya-containers-0.1.2.2-doc from https://cache.nix-ci.com
13.15 s
Downloading cached yaya-quickcheck-0.2.0.3-doc from https://cache.nix-ci.com
13.15 s
Downloading cached yaya-unsafe-0.4.1.4-doc from https://cache.nix-ci.com
13.16 s
Downloaded cached yaya-quickcheck-0.2.0.3-doc (269 KiB) in 15ms
13.16 s
Progress: 0 of 101 built, 80 of 174 downloaded from cache (4 downloading)
13.16 s
Downloaded cached pathway-internal-0.0.1.0-doc (612 KiB) in 15ms
13.16 s
Progress: 0 of 101 built, 81 of 174 downloaded from cache (3 downloading)
13.16 s
Downloading cached pathway-quickcheck-0.0.1.0-doc from https://cache.nix-ci.com
13.17 s
Downloaded cached yaya-unsafe-0.4.1.4-doc (661 KiB) in 17ms
13.17 s
Progress: 0 of 100 built, 82 of 174 downloaded from cache (3 downloading)
13.17 s
Downloaded cached yaya-containers-0.1.2.2-doc (1.1 MiB) in 18ms
13.17 s
Progress: 0 of 100 built, 83 of 174 downloaded from cache (2 downloading)
13.17 s
Downloading cached pathway-0.0.1.0-doc from https://cache.nix-ci.com
13.17 s
Downloaded cached pathway-quickcheck-0.0.1.0-doc (217 KiB) in 8ms
13.17 s
Progress: 0 of 100 built, 84 of 174 downloaded from cache (2 downloading)
13.18 s
Downloaded cached pathway-0.0.1.0-doc (1.3 MiB) in 11ms
13.18 s
Progress: 0 of 99 built, 85 of 174 downloaded from cache (1 downloading)
13.18 s
Downloading cached pathway-compat-base-0.0.1.0-doc from https://cache.nix-ci.com
13.18 s
Downloading cached pathway-path-0.0.1.0-doc from https://cache.nix-ci.com
13.19 s
Downloaded cached pathway-path-0.0.1.0-doc (263 KiB) in 10ms
13.19 s
Progress: 0 of 98 built, 86 of 174 downloaded from cache (2 downloading)
13.20 s
Downloaded cached pathway-compat-base-0.0.1.0-doc (1.9 MiB) in 18ms
13.20 s
Progress: 0 of 97 built, 87 of 174 downloaded from cache (1 downloading)
16.87 s
Downloaded cached ghc (1.8 GiB) in 4.2s
16.87 s
Progress: 0 of 96 built, 88 of 174 downloaded from cache
16.88 s
Downloading cached OneTuple from https://cache.nix-ci.com
18.43 s
Downloading cached StateVar from https://cache.nix-ci.com
18.43 s
Downloading cached assoc from https://cache.nix-ci.com
18.43 s
Downloading cached base-orphans from https://cache.nix-ci.com
18.43 s
Downloading cached call-stack from https://cache.nix-ci.com
18.43 s
Downloading cached cabal-doctest from https://cache.nix-ci.com
18.43 s
Downloading cached character-ps from https://cache.nix-ci.com
18.43 s
Downloading cached clock from https://cache.nix-ci.com
18.43 s
Downloading cached code-page from https://cache.nix-ci.com
18.43 s
Downloading cached colour from https://cache.nix-ci.com
18.43 s
Downloading cached dlist from https://cache.nix-ci.com
18.43 s
Downloading cached file-io from https://cache.nix-ci.com
18.43 s
Downloading cached indexed-traversable from https://cache.nix-ci.com
18.43 s
Downloading cached ghc-paths from https://cache.nix-ci.com
18.43 s
Downloading cached integer-logarithms from https://cache.nix-ci.com
18.43 s
Downloading cached old-locale from https://cache.nix-ci.com
18.44 s
Downloaded cached OneTuple (75 KiB) in 1.5s
18.44 s
Progress: 0 of 95 built, 89 of 174 downloaded from cache (15 downloading)
18.44 s
Downloading cached os-string from https://cache.nix-ci.com
18.44 s
Downloaded cached ghc-paths (101 KiB) in 7ms
18.44 s
Progress: 0 of 94 built, 90 of 174 downloaded from cache (15 downloading)
18.44 s
Downloading cached parallel from https://cache.nix-ci.com
18.44 s
Downloaded cached assoc (168 KiB) in 8ms
18.44 s
Progress: 0 of 94 built, 91 of 174 downloaded from cache (15 downloading)
18.44 s
Downloading cached parser-combinators from https://cache.nix-ci.com
18.45 s
Downloaded cached character-ps (2.2 MiB) in 11ms
18.45 s
Progress: 0 of 93 built, 92 of 174 downloaded from cache (15 downloading)
18.45 s
Downloading cached prettyprinter from https://cache.nix-ci.com
18.45 s
Downloaded cached StateVar (380 KiB) in 12ms
18.45 s
Progress: 0 of 92 built, 93 of 174 downloaded from cache (15 downloading)
18.45 s
Downloading cached primitive from https://cache.nix-ci.com
18.45 s
Downloaded cached old-locale (534 KiB) in 14ms
18.45 s
Progress: 0 of 91 built, 94 of 174 downloaded from cache (15 downloading)
18.45 s
Downloading cached contravariant from https://cache.nix-ci.com
18.45 s
Downloaded cached file-io (1.1 MiB) in 15ms
18.45 s
Progress: 0 of 90 built, 95 of 174 downloaded from cache (15 downloading)
18.45 s
Downloading cached old-time from https://cache.nix-ci.com
18.45 s
Downloaded cached code-page (366 KiB) in 18ms
18.45 s
Progress: 0 of 89 built, 96 of 174 downloaded from cache (15 downloading)
18.45 s
Downloading cached reflection from https://cache.nix-ci.com
18.46 s
Downloaded cached call-stack (280 KiB) in 21ms
18.46 s
Progress: 0 of 89 built, 97 of 174 downloaded from cache (15 downloading)
18.46 s
Downloaded cached cabal-doctest (770 KiB) in 21ms
18.46 s
Downloading cached splitmix from https://cache.nix-ci.com
18.46 s
Progress: 0 of 88 built, 98 of 174 downloaded from cache (15 downloading)
18.46 s
Downloading cached syb from https://cache.nix-ci.com
18.46 s
Downloaded cached dlist (1.4 MiB) in 23ms
18.46 s
Progress: 0 of 87 built, 99 of 174 downloaded from cache (15 downloading)
18.46 s
Downloading cached tagged from https://cache.nix-ci.com
18.46 s
Downloaded cached integer-logarithms (911 KiB) in 27ms
18.46 s
Progress: 0 of 86 built, 100 of 174 downloaded from cache (15 downloading)
18.46 s
Downloading cached th-abstraction from https://cache.nix-ci.com
18.46 s
Downloaded cached colour (5.5 MiB) in 28ms
18.46 s
Progress: 0 of 85 built, 101 of 174 downloaded from cache (15 downloading)
18.46 s
Downloading cached th-compat from https://cache.nix-ci.com
18.47 s
Downloaded cached base-orphans (1.8 MiB) in 38ms
18.47 s
Downloaded cached parallel (1.4 MiB) in 30ms
18.47 s
Progress: 0 of 84 built, 102 of 174 downloaded from cache (15 downloading)
18.47 s
Downloading cached ansi-terminal-types from https://cache.nix-ci.com
18.47 s
Downloaded cached parser-combinators (1.9 MiB) in 30ms
18.47 s
Downloaded cached clock (1.8 MiB) in 39ms
18.47 s
Progress: 0 of 83 built, 103 of 174 downloaded from cache (15 downloading)
18.47 s
Progress: 0 of 83 built, 104 of 174 downloaded from cache (14 downloading)
18.47 s
Progress: 0 of 83 built, 105 of 174 downloaded from cache (13 downloading)
18.47 s
Downloading cached transformers-compat from https://cache.nix-ci.com
18.47 s
Downloading cached unliftio-core from https://cache.nix-ci.com
18.47 s
Downloading cached vector-stream from https://cache.nix-ci.com
18.48 s
Downloaded cached splitmix (877 KiB) in 20ms
18.48 s
Progress: 0 of 80 built, 106 of 174 downloaded from cache (15 downloading)
18.48 s
Downloading cached extra from https://cache.nix-ci.com
18.48 s
Downloaded cached indexed-traversable (3.8 MiB) in 42ms
18.48 s
Progress: 0 of 79 built, 107 of 174 downloaded from cache (15 downloading)
18.48 s
Downloaded cached contravariant (1.9 MiB) in 28ms
18.48 s
Downloading cached random from https://cache.nix-ci.com
18.48 s
Progress: 0 of 78 built, 108 of 174 downloaded from cache (15 downloading)
18.48 s
Downloaded cached old-time (2.3 MiB) in 28ms
18.48 s
Progress: 0 of 77 built, 109 of 174 downloaded from cache (14 downloading)
18.48 s
Downloaded cached tagged (1.6 MiB) in 20ms
18.48 s
Progress: 0 of 76 built, 110 of 174 downloaded from cache (13 downloading)
18.48 s
Downloading cached distributive from https://cache.nix-ci.com
18.48 s
Downloaded cached syb (2.8 MiB) in 27ms
18.48 s
Progress: 0 of 75 built, 111 of 174 downloaded from cache (13 downloading)
18.49 s
Downloaded cached th-compat (566 KiB) in 27ms
18.49 s
Progress: 0 of 75 built, 112 of 174 downloaded from cache (12 downloading)
18.49 s
Downloaded cached reflection (6 MiB) in 38ms
18.49 s
Progress: 0 of 74 built, 113 of 174 downloaded from cache (12 downloading)
18.49 s
Downloading cached network-uri from https://cache.nix-ci.com
18.49 s
Downloaded cached os-string (5.9 MiB) in 51ms
18.49 s
Progress: 0 of 73 built, 114 of 174 downloaded from cache (11 downloading)
18.49 s
Downloading cached hashable from https://cache.nix-ci.com
18.50 s
Downloaded cached unliftio-core (390 KiB) in 21ms
18.50 s
Progress: 0 of 72 built, 115 of 174 downloaded from cache (11 downloading)
18.50 s
Downloaded cached th-abstraction (5.6 MiB) in 37ms
18.50 s
Progress: 0 of 71 built, 116 of 174 downloaded from cache (10 downloading)
18.50 s
Downloaded cached vector-stream (3.1 MiB) in 28ms
18.50 s
Downloaded cached distributive (1.2 MiB) in 22ms
18.50 s
Progress: 0 of 70 built, 117 of 174 downloaded from cache (9 downloading)
18.50 s
Downloaded cached ansi-terminal-types (3.3 MiB) in 29ms
18.50 s
Progress: 0 of 69 built, 118 of 174 downloaded from cache (8 downloading)
18.50 s
Progress: 0 of 69 built, 119 of 174 downloaded from cache (7 downloading)
18.50 s
Downloading cached ansi-terminal from https://cache.nix-ci.com
18.50 s
Downloading cached comonad from https://cache.nix-ci.com
18.51 s
Downloaded cached transformers-compat (3.4 MiB) in 32ms
18.51 s
Progress: 0 of 67 built, 120 of 174 downloaded from cache (8 downloading)
18.51 s
Downloaded cached primitive (8.7 MiB) in 59ms
18.51 s
Downloading cached transformers-base from https://cache.nix-ci.com
18.51 s
Progress: 0 of 66 built, 121 of 174 downloaded from cache (8 downloading)
18.51 s
Downloading cached integer-conversion from https://cache.nix-ci.com
18.51 s
Downloaded cached prettyprinter (8.7 MiB) in 64ms
18.51 s
Progress: 0 of 65 built, 122 of 174 downloaded from cache (8 downloading)
18.51 s
Downloaded cached hashable (3.3 MiB) in 21ms
18.51 s
Downloaded cached extra (4.1 MiB) in 37ms
18.51 s
Progress: 0 of 64 built, 123 of 174 downloaded from cache (7 downloading)
18.52 s
Downloading cached case-insensitive from https://cache.nix-ci.com
18.52 s
Downloading cached data-fix from https://cache.nix-ci.com
18.52 s
Downloading cached scientific from https://cache.nix-ci.com
18.52 s
Downloading cached text-short from https://cache.nix-ci.com
18.52 s
Downloading cached these from https://cache.nix-ci.com
18.52 s
Downloading cached time-compat from https://cache.nix-ci.com
18.52 s
Downloading cached unordered-containers from https://cache.nix-ci.com
18.52 s
Progress: 0 of 63 built, 124 of 174 downloaded from cache (13 downloading)
18.52 s
Downloaded cached network-uri (5.2 MiB) in 26ms
18.52 s
Progress: 0 of 62 built, 125 of 174 downloaded from cache (12 downloading)
18.52 s
Downloaded cached random (8.8 MiB) in 41ms
18.52 s
Progress: 0 of 61 built, 126 of 174 downloaded from cache (11 downloading)
18.52 s
Downloading cached QuickCheck from https://cache.nix-ci.com
18.52 s
Downloading cached temporary from https://cache.nix-ci.com
18.52 s
Downloading cached uuid-types from https://cache.nix-ci.com
18.52 s
Downloaded cached integer-conversion (193 KiB) in 13ms
18.52 s
Progress: 0 of 60 built, 127 of 174 downloaded from cache (13 downloading)
18.52 s
Downloaded cached ansi-terminal (1.2 MiB) in 19ms
18.52 s
Progress: 0 of 59 built, 128 of 174 downloaded from cache (12 downloading)
18.52 s
Downloading cached prettyprinter-ansi-terminal from https://cache.nix-ci.com
18.53 s
Downloaded cached transformers-base (588 KiB) in 18ms
18.53 s
Progress: 0 of 58 built, 129 of 174 downloaded from cache (12 downloading)
18.53 s
Downloaded cached case-insensitive (943 KiB) in 16ms
18.53 s
Progress: 0 of 57 built, 130 of 174 downloaded from cache (11 downloading)
18.53 s
Downloaded cached comonad (3.1 MiB) in 27ms
18.53 s
Progress: 0 of 56 built, 131 of 174 downloaded from cache (10 downloading)
18.53 s
Downloading cached bifunctors from https://cache.nix-ci.com
18.53 s
Downloaded cached data-fix (1.1 MiB) in 19ms
18.53 s
Progress: 0 of 55 built, 132 of 174 downloaded from cache (10 downloading)
18.53 s
Downloaded cached temporary (306 KiB) in 14ms
18.53 s
Progress: 0 of 54 built, 133 of 174 downloaded from cache (9 downloading)
18.54 s
Downloading cached doctest from https://cache.nix-ci.com
18.54 s
Downloaded cached text-short (1.7 MiB) in 22ms
18.54 s
Progress: 0 of 53 built, 134 of 174 downloaded from cache (9 downloading)
18.54 s
Downloaded cached uuid-types (1.6 MiB) in 18ms
18.54 s
Progress: 0 of 52 built, 135 of 174 downloaded from cache (8 downloading)
18.54 s
Downloaded cached these (3.1 MiB) in 24ms
18.54 s
Progress: 0 of 51 built, 136 of 174 downloaded from cache (7 downloading)
18.54 s
Downloading cached strict from https://cache.nix-ci.com
18.54 s
Downloaded cached time-compat (2.9 MiB) in 27ms
18.54 s
Progress: 0 of 50 built, 137 of 174 downloaded from cache (7 downloading)
18.54 s
Downloading cached text-iso8601 from https://cache.nix-ci.com
18.54 s
Downloaded cached scientific (2.9 MiB) in 27ms
18.54 s
Progress: 0 of 49 built, 138 of 174 downloaded from cache (7 downloading)
18.54 s
Downloading cached megaparsec from https://cache.nix-ci.com
18.55 s
Downloaded cached prettyprinter-ansi-terminal (1.4 MiB) in 23ms
18.55 s
Progress: 0 of 48 built, 139 of 174 downloaded from cache (7 downloading)
18.55 s
Downloading cached optparse-applicative from https://cache.nix-ci.com
18.56 s
Downloaded cached unordered-containers (9.3 MiB) in 42ms
18.56 s
Progress: 0 of 47 built, 140 of 174 downloaded from cache (7 downloading)
18.58 s
Downloaded cached text-iso8601 (3 MiB) in 35ms
18.58 s
Progress: 0 of 46 built, 141 of 174 downloaded from cache (6 downloading)
18.59 s
Downloaded cached strict (5.2 MiB) in 46ms
18.59 s
Progress: 0 of 45 built, 142 of 174 downloaded from cache (5 downloading)
18.60 s
Downloaded cached QuickCheck (19.9 MiB) in 81ms
18.60 s
Progress: 0 of 44 built, 143 of 174 downloaded from cache (4 downloading)
18.60 s
Downloaded cached bifunctors (15.7 MiB) in 71ms
18.60 s
Progress: 0 of 43 built, 144 of 174 downloaded from cache (3 downloading)
18.60 s
Downloading cached profunctors from https://cache.nix-ci.com
18.60 s
Downloading cached semigroupoids from https://cache.nix-ci.com
18.61 s
Downloaded cached optparse-applicative (8.7 MiB) in 57ms
18.61 s
Progress: 0 of 42 built, 145 of 174 downloaded from cache (4 downloading)
18.61 s
Downloading cached tasty from https://cache.nix-ci.com
18.62 s
Downloaded cached megaparsec (15.6 MiB) in 73ms
18.62 s
Progress: 0 of 41 built, 146 of 174 downloaded from cache (4 downloading)
18.65 s
Downloaded cached profunctors (10.5 MiB) in 49ms
18.66 s
Downloaded cached semigroupoids (11.9 MiB) in 56ms
18.66 s
Progress: 0 of 40 built, 147 of 174 downloaded from cache (3 downloading)
18.66 s
Downloading cached invariant from https://cache.nix-ci.com
18.66 s
Progress: 0 of 39 built, 148 of 174 downloaded from cache (3 downloading)
18.66 s
Downloading cached either from https://cache.nix-ci.com
18.66 s
Downloading cached free from https://cache.nix-ci.com
18.66 s
Downloaded cached tasty (9.5 MiB) in 55ms
18.66 s
Progress: 0 of 38 built, 149 of 174 downloaded from cache (4 downloading)
18.66 s
Downloading cached vector from https://cache.nix-ci.com
18.67 s
Downloaded cached either (885 KiB) in 8ms
18.67 s
Progress: 0 of 37 built, 150 of 174 downloaded from cache (4 downloading)
18.68 s
Downloaded cached invariant (5.4 MiB) in 18ms
18.68 s
Progress: 0 of 36 built, 151 of 174 downloaded from cache (3 downloading)
18.72 s
Downloaded cached free (22.5 MiB) in 54ms
18.72 s
Progress: 0 of 35 built, 152 of 174 downloaded from cache (2 downloading)
18.72 s
Downloading cached adjunctions from https://cache.nix-ci.com
18.72 s
Downloading cached recursion-schemes from https://cache.nix-ci.com
18.73 s
Downloaded cached adjunctions (6 MiB) in 15ms
18.73 s
Progress: 0 of 34 built, 153 of 174 downloaded from cache (3 downloading)
18.73 s
Downloading cached kan-extensions from https://cache.nix-ci.com
18.74 s
Downloaded cached doctest (68.8 MiB) in 202ms
18.74 s
Progress: 0 of 33 built, 154 of 174 downloaded from cache (3 downloading)
18.74 s
Downloaded cached recursion-schemes (6.7 MiB) in 25ms
18.74 s
Progress: 0 of 32 built, 155 of 174 downloaded from cache (2 downloading)
18.74 s
Downloading cached variant from https://cache.nix-ci.com
18.75 s
Downloaded cached kan-extensions (7 MiB) in 14ms
18.75 s
Progress: 0 of 31 built, 156 of 174 downloaded from cache (2 downloading)
18.75 s
Downloaded cached vector (57.1 MiB) in 89ms
18.75 s
Progress: 0 of 30 built, 157 of 174 downloaded from cache (1 downloading)
18.75 s
Downloading cached indexed-traversable-instances from https://cache.nix-ci.com
18.75 s
Downloading cached quickcheck-instances from https://cache.nix-ci.com
18.75 s
Downloaded cached variant (10.9 MiB) in 11ms
18.75 s
Progress: 0 of 29 built, 158 of 174 downloaded from cache (2 downloading)
18.75 s
Downloaded cached indexed-traversable-instances (359 KiB) in 2ms
18.75 s
Progress: 0 of 28 built, 159 of 174 downloaded from cache (1 downloading)
18.75 s
Downloading cached lens from https://cache.nix-ci.com
18.75 s
Downloading cached semialign from https://cache.nix-ci.com
18.75 s
Downloading cached witherable from https://cache.nix-ci.com
18.76 s
Downloaded cached quickcheck-instances (5.5 MiB) in 12ms
18.76 s
Progress: 0 of 27 built, 160 of 174 downloaded from cache (3 downloading)
18.77 s
Downloaded cached witherable (4.4 MiB) in 11ms
18.77 s
Progress: 0 of 26 built, 161 of 174 downloaded from cache (2 downloading)
18.78 s
Downloaded cached semialign (3.7 MiB) in 29ms
18.78 s
Progress: 0 of 25 built, 162 of 174 downloaded from cache (1 downloading)
18.78 s
Downloading cached aeson from https://cache.nix-ci.com
18.83 s
Downloaded cached lens (59.2 MiB) in 75ms
18.83 s
Progress: 0 of 24 built, 163 of 174 downloaded from cache (1 downloading)
18.83 s
Downloading cached yaya from https://cache.nix-ci.com
18.83 s
Downloaded cached aeson (47.7 MiB) in 45ms
18.83 s
Progress: 0 of 23 built, 164 of 174 downloaded from cache (1 downloading)
18.83 s
Downloading cached path from https://cache.nix-ci.com
18.84 s
Downloaded cached path (10.1 MiB) in 7ms
18.84 s
Progress: 0 of 22 built, 165 of 174 downloaded from cache (1 downloading)
18.84 s
Downloaded cached yaya (5.3 MiB) in 7ms
18.84 s
Progress: 0 of 21 built, 166 of 174 downloaded from cache
18.84 s
Downloading cached pathway-internal from https://cache.nix-ci.com
18.84 s
Downloading cached yaya-containers from https://cache.nix-ci.com
18.84 s
Downloading cached yaya-quickcheck from https://cache.nix-ci.com
18.84 s
Downloading cached yaya-unsafe from https://cache.nix-ci.com
18.84 s
Downloaded cached yaya-quickcheck (351 KiB) in 1ms
18.84 s
Progress: 0 of 20 built, 167 of 174 downloaded from cache (3 downloading)
18.84 s
Downloaded cached yaya-unsafe (1 MiB) in 2ms
18.84 s
Progress: 0 of 19 built, 168 of 174 downloaded from cache (2 downloading)
18.84 s
Downloaded cached pathway-internal (2 MiB) in 3ms
18.84 s
Progress: 0 of 18 built, 169 of 174 downloaded from cache (1 downloading)
18.84 s
Downloading cached pathway-quickcheck from https://cache.nix-ci.com
18.84 s
Downloaded cached yaya-containers (3.5 MiB) in 3ms
18.84 s
Progress: 0 of 17 built, 170 of 174 downloaded from cache (1 downloading)
18.84 s
Downloaded cached pathway-quickcheck (179 KiB) in 0ms
18.84 s
Downloading cached pathway from https://cache.nix-ci.com
18.84 s
Progress: 0 of 16 built, 171 of 174 downloaded from cache (1 downloading)
18.84 s
Downloaded cached pathway (2.7 MiB) in 1ms
18.84 s
Progress: 0 of 15 built, 172 of 174 downloaded from cache
18.84 s
Downloading cached pathway-compat-base from https://cache.nix-ci.com
18.84 s
Downloading cached pathway-path from https://cache.nix-ci.com
18.84 s
Downloaded cached pathway-path (217 KiB) in 0ms
18.84 s
Progress: 0 of 14 built, 173 of 174 downloaded from cache (1 downloading)
18.84 s
Downloaded cached pathway-compat-base (2 MiB) in 1ms
18.84 s
Progress: 0 of 13 built, 174 of 174 downloaded from cache
18.84 s
Building /nix/store/gwlaydb47f6yhlx7hsgqq7s0m612k39r-pathway-compat-filepath-0.0.1.0.drv
18.84 s
[pathway-compat-filepath] Phase: setupCompilerEnvironmentPhase
18.84 s
[pathway-compat-filepath] Build with /nix/store/7r9b0bl984hdgd70nf5p8raa55kml491-ghc-9.8.4.
18.96 s
[pathway-compat-filepath] Phase: unpackPhase
18.97 s
[pathway-compat-filepath] unpacking source archive /nix/store/56v5999xvkp18l2ygdvahppqdv4hrlnl-filepath
18.97 s
[pathway-compat-filepath] source root is filepath
18.99 s
[pathway-compat-filepath] Phase: patchPhase
19.00 s
[pathway-compat-filepath] Phase: compileBuildDriverPhase
19.00 s
[pathway-compat-filepath] setupCompileFlags: -package-db=/build/tmp.hsoEC5z0By/setup-package.conf.d -threaded
19.05 s
[pathway-compat-filepath] [1 of 2] Compiling Main ( Setup.hs, /build/tmp.hsoEC5z0By/Main.o )
19.09 s
[pathway-compat-filepath] [2 of 2] Linking Setup
20.94 s
[pathway-compat-filepath] Phase: updateAutotoolsGnuConfigScriptsPhase
20.95 s
[pathway-compat-filepath] Phase: configurePhase
20.96 s
[pathway-compat-filepath] configureFlags: --verbose --prefix=/nix/store/knqi4mpp2gcy2djhvikk6m439c94gw16-pathway-compat-filepath-0.0.1.0 --libdir=$prefix/lib/$compiler/lib --libsubdir=$abi/$libname --docdir=/nix/store/brb3ys0mr106j2xs2nqwq5rszfngk13w-pathway-compat-filepath-0.0.1.0-doc/share/doc/pathway-compat-filepath-0.0.1.0 --with-gcc=gcc --package-db=/build/tmp.hsoEC5z0By/package.conf.d --ghc-option=-j16 --ghc-option=+RTS --ghc-option=-A64M --ghc-option=-RTS --enable-library-profiling --profiling-detail=exported-functions --disable-profiling --enable-shared --disable-coverage --enable-static --disable-executable-dynamic --enable-tests --disable-benchmarks --enable-library-vanilla --disable-library-for-ghci --enable-split-sections --enable-library-stripping --enable-executable-stripping --ghc-option=-haddock --ghc-options=-Werror --extra-lib-dirs=/nix/store/pndhkk0l649lm1sj0mxk7cbwq26qd1ra-ncurses-6.6/lib --extra-lib-dirs=/nix/store/0djlg4g0b81w94k3vcaqsxsc2hh4kism-libffi-3.5.2/lib --extra-lib-dirs=/nix/store/md4paia7riiggyrj8p24c7a6vf8w7jz8-elfutils-0.194/lib --extra-lib-dirs=/nix/store/39vv2pf64gd8li48a4hpbhw2crzd8z5p-gmp-with-cxx-6.3.0/lib --extra-lib-dirs=/nix/store/7wwvald8lapkrsr72qanlw8blyn55ifx-numactl-2.0.18/lib --extra-lib-dirs=/nix/store/7r9b0bl984hdgd70nf5p8raa55kml491-ghc-9.8.4/lib
20.97 s
[pathway-compat-filepath] Using Parsec parser
20.97 s
[pathway-compat-filepath] Configuring pathway-compat-filepath-0.0.1.0...
21.28 s
[pathway-compat-filepath] Flags chosen: noisy-deprecations=True, verify-no-recursion=False
21.28 s
[pathway-compat-filepath] Dependency base >=4.14.0 && <4.15 || >=4.15.0 && <4.16 || >=4.16.0 && <4.17 ||
21.28 s
[pathway-compat-filepath] >=4.17.0 && <4.18 || >=4.18.0 && <4.19 || >=4.19.0 && <4.20 || >=4.20.0 &&
21.28 s
[pathway-compat-filepath] <4.21 || >=4.21.0 && <4.22 || >=4.22.0 && <4.23: using base-4.19.2.0
21.28 s
[pathway-compat-filepath] Dependency extra: using extra-1.8.1
21.28 s
[pathway-compat-filepath] Dependency filepath >=1.4.2 && <1.5 || >=1.5.0 && <1.6: using
21.28 s
[pathway-compat-filepath] filepath-1.4.301.0
21.28 s
[pathway-compat-filepath] Dependency megaparsec >=9.0.1 && <9.1 || >=9.2.1 && <9.3 || >=9.5.0 && <9.6 ||
21.28 s
[pathway-compat-filepath] >=9.7.0 && <9.8: using megaparsec-9.7.0
21.28 s
[pathway-compat-filepath] Dependency os-string: using os-string-2.0.10
21.28 s
[pathway-compat-filepath] Dependency pathway >=0.0.1 && <0.1: using pathway-0.0.1.0
21.28 s
[pathway-compat-filepath] Dependency pathway-compat-base >=0.0.1 && <0.1: using
21.28 s
[pathway-compat-filepath] pathway-compat-base-0.0.1.0
21.28 s
[pathway-compat-filepath] Dependency pathway-internal >=0.0.1 && <0.1: using pathway-internal-0.0.1.0
21.28 s
[pathway-compat-filepath] Dependency base >=4.14.0 && <4.15 || >=4.15.0 && <4.16 || >=4.16.0 && <4.17 ||
21.28 s
[pathway-compat-filepath] >=4.17.0 && <4.18 || >=4.18.0 && <4.19 || >=4.19.0 && <4.20 || >=4.20.0 &&
21.28 s
[pathway-compat-filepath] <4.21 || >=4.21.0 && <4.22 || >=4.22.0 && <4.23: using base-4.19.2.0
21.28 s
[pathway-compat-filepath] Dependency doctest >=0.16.3 && <0.17 || >=0.18.1 && <0.19 || >=0.20.1 && <0.21
21.28 s
[pathway-compat-filepath] || >=0.21.1 && <0.22 || >=0.22.2 && <0.23 || >=0.24.2 && <0.25: using
21.28 s
[pathway-compat-filepath] doctest-0.24.3
21.28 s
[pathway-compat-filepath] Dependency pathway-compat-filepath: using pathway-compat-filepath-0.0.1.0
21.60 s
[pathway-compat-filepath] Source component graph:
21.60 s
[pathway-compat-filepath] component lib
21.60 s
[pathway-compat-filepath] component test:doctests dependency lib
21.60 s
[pathway-compat-filepath] Configured component graph:
21.60 s
[pathway-compat-filepath] component pathway-compat-filepath-0.0.1.0-6KN1Vlb8yPeBopmlZtXyrR
21.60 s
[pathway-compat-filepath] include base-4.19.2.0-934f
21.60 s
[pathway-compat-filepath] include extra-1.8.1-F4oHgTKCper3ZiIUPZjGPK
21.60 s
[pathway-compat-filepath] include filepath-1.4.301.0-6e15
21.60 s
[pathway-compat-filepath] include megaparsec-9.7.0-10vHZAF1maw9O8p2gXs66N
21.60 s
[pathway-compat-filepath] include os-string-2.0.10-HbyG8qgShpTHKXL8bZ3UK8
21.60 s
[pathway-compat-filepath] include pathway-0.0.1.0-H5uD0SRA9755UrSqFBaCYE
21.60 s
[pathway-compat-filepath] include pathway-compat-base-0.0.1.0-8ldj6SPXbxq2Shd8yFeOpr
21.60 s
[pathway-compat-filepath] include pathway-internal-0.0.1.0-Lnjdb2M8cxN196wSdsfQUK
21.60 s
[pathway-compat-filepath] component pathway-compat-filepath-0.0.1.0-LoaDJ8tbb2m5kfHmaP2B9c-doctests
21.60 s
[pathway-compat-filepath] include base-4.19.2.0-934f
21.60 s
[pathway-compat-filepath] include doctest-0.24.3-1aDs7zEYV5r7raSsXr9TQC
21.60 s
[pathway-compat-filepath] include pathway-compat-filepath-0.0.1.0-6KN1Vlb8yPeBopmlZtXyrR
21.60 s
[pathway-compat-filepath] Linked component graph:
21.60 s
[pathway-compat-filepath] unit pathway-compat-filepath-0.0.1.0-6KN1Vlb8yPeBopmlZtXyrR
21.60 s
[pathway-compat-filepath] include base-4.19.2.0-934f
21.60 s
[pathway-compat-filepath] include extra-1.8.1-F4oHgTKCper3ZiIUPZjGPK
21.60 s
[pathway-compat-filepath] include filepath-1.4.301.0-6e15
21.60 s
[pathway-compat-filepath] include megaparsec-9.7.0-10vHZAF1maw9O8p2gXs66N
21.60 s
[pathway-compat-filepath] include os-string-2.0.10-HbyG8qgShpTHKXL8bZ3UK8
21.60 s
[pathway-compat-filepath] include pathway-0.0.1.0-H5uD0SRA9755UrSqFBaCYE
21.60 s
[pathway-compat-filepath] include pathway-compat-base-0.0.1.0-8ldj6SPXbxq2Shd8yFeOpr
21.60 s
[pathway-compat-filepath] include pathway-internal-0.0.1.0-Lnjdb2M8cxN196wSdsfQUK
21.60 s
[pathway-compat-filepath] Common.FilePath=pathway-compat-filepath-0.0.1.0-6KN1Vlb8yPeBopmlZtXyrR:Common.FilePath,Common.OsPath=pathway-compat-filepath-0.0.1.0-6KN1Vlb8yPeBopmlZtXyrR:Common.OsPath,System.FilePath=pathway-compat-filepath-0.0.1.0-6KN1Vlb8yPeBopmlZtXyrR:System.FilePath,System.FilePath.Overlay=pathway-compat-filepath-0.0.1.0-6KN1Vlb8yPeBopmlZtXyrR:System.FilePath.Overlay,System.FilePath.Pathway=pathway-compat-filepath-0.0.1.0-6KN1Vlb8yPeBopmlZtXyrR:System.FilePath.Pathway,System.FilePath.Thin=pathway-compat-filepath-0.0.1.0-6KN1Vlb8yPeBopmlZtXyrR:System.FilePath.Thin,System.OsPath=pathway-compat-filepath-0.0.1.0-6KN1Vlb8yPeBopmlZtXyrR:System.OsPath,System.OsPath.Overlay=pathway-compat-filepath-0.0.1.0-6KN1Vlb8yPeBopmlZtXyrR:System.OsPath.Overlay,System.OsPath.Pathway=pathway-compat-filepath-0.0.1.0-6KN1Vlb8yPeBopmlZtXyrR:System.OsPath.Pathway,System.OsPath.Thin=pathway-compat-filepath-0.0.1.0-6KN1Vlb8yPeBopmlZtXyrR:System.OsPath.Thin
21.60 s
[pathway-compat-filepath] unit pathway-compat-filepath-0.0.1.0-LoaDJ8tbb2m5kfHmaP2B9c-doctests
21.60 s
[pathway-compat-filepath] include base-4.19.2.0-934f
21.60 s
[pathway-compat-filepath] include doctest-0.24.3-1aDs7zEYV5r7raSsXr9TQC
21.60 s
[pathway-compat-filepath] include pathway-compat-filepath-0.0.1.0-6KN1Vlb8yPeBopmlZtXyrR
21.60 s
[pathway-compat-filepath] Ready component graph:
21.60 s
[pathway-compat-filepath] definite pathway-compat-filepath-0.0.1.0-6KN1Vlb8yPeBopmlZtXyrR
21.60 s
[pathway-compat-filepath] depends base-4.19.2.0-934f
21.60 s
[pathway-compat-filepath] depends extra-1.8.1-F4oHgTKCper3ZiIUPZjGPK
21.60 s
[pathway-compat-filepath] depends filepath-1.4.301.0-6e15
21.60 s
[pathway-compat-filepath] depends megaparsec-9.7.0-10vHZAF1maw9O8p2gXs66N
21.60 s
[pathway-compat-filepath] depends os-string-2.0.10-HbyG8qgShpTHKXL8bZ3UK8
21.60 s
[pathway-compat-filepath] depends pathway-0.0.1.0-H5uD0SRA9755UrSqFBaCYE
21.60 s
[pathway-compat-filepath] depends pathway-compat-base-0.0.1.0-8ldj6SPXbxq2Shd8yFeOpr
21.60 s
[pathway-compat-filepath] depends pathway-internal-0.0.1.0-Lnjdb2M8cxN196wSdsfQUK
21.60 s
[pathway-compat-filepath] definite pathway-compat-filepath-0.0.1.0-LoaDJ8tbb2m5kfHmaP2B9c-doctests
21.60 s
[pathway-compat-filepath] depends base-4.19.2.0-934f
21.60 s
[pathway-compat-filepath] depends doctest-0.24.3-1aDs7zEYV5r7raSsXr9TQC
21.60 s
[pathway-compat-filepath] depends pathway-compat-filepath-0.0.1.0-6KN1Vlb8yPeBopmlZtXyrR
21.60 s
[pathway-compat-filepath] Using Cabal-3.10.3.0 compiled by ghc-9.8
21.60 s
[pathway-compat-filepath] Using compiler: ghc-9.8.4
21.60 s
[pathway-compat-filepath] Using install prefix:
21.60 s
[pathway-compat-filepath] /nix/store/knqi4mpp2gcy2djhvikk6m439c94gw16-pathway-compat-filepath-0.0.1.0
21.60 s
[pathway-compat-filepath] Executables installed in:
21.60 s
[pathway-compat-filepath] /nix/store/knqi4mpp2gcy2djhvikk6m439c94gw16-pathway-compat-filepath-0.0.1.0/bin
21.60 s
[pathway-compat-filepath] Libraries installed in:
21.60 s
[pathway-compat-filepath] /nix/store/knqi4mpp2gcy2djhvikk6m439c94gw16-pathway-compat-filepath-0.0.1.0/lib/ghc-9.8.4/lib/x86_64-linux-ghc-9.8.4/pathway-compat-filepath-0.0.1.0-6KN1Vlb8yPeBopmlZtXyrR
21.60 s
[pathway-compat-filepath] Dynamic Libraries installed in:
21.60 s
[pathway-compat-filepath] /nix/store/knqi4mpp2gcy2djhvikk6m439c94gw16-pathway-compat-filepath-0.0.1.0/lib/ghc-9.8.4/lib/x86_64-linux-ghc-9.8.4
21.60 s
[pathway-compat-filepath] Private executables installed in:
21.60 s
[pathway-compat-filepath] /nix/store/knqi4mpp2gcy2djhvikk6m439c94gw16-pathway-compat-filepath-0.0.1.0/libexec/x86_64-linux-ghc-9.8.4/pathway-compat-filepath-0.0.1.0
21.60 s
[pathway-compat-filepath] Data files installed in:
21.60 s
[pathway-compat-filepath] /nix/store/knqi4mpp2gcy2djhvikk6m439c94gw16-pathway-compat-filepath-0.0.1.0/share/x86_64-linux-ghc-9.8.4/pathway-compat-filepath-0.0.1.0
21.60 s
[pathway-compat-filepath] Documentation installed in:
21.60 s
[pathway-compat-filepath] /nix/store/brb3ys0mr106j2xs2nqwq5rszfngk13w-pathway-compat-filepath-0.0.1.0-doc/share/doc/pathway-compat-filepath-0.0.1.0
21.60 s
[pathway-compat-filepath] Configuration files installed in:
21.60 s
[pathway-compat-filepath] /nix/store/knqi4mpp2gcy2djhvikk6m439c94gw16-pathway-compat-filepath-0.0.1.0/etc
21.60 s
[pathway-compat-filepath] No alex found
21.60 s
[pathway-compat-filepath] Using ar found on system at:
21.60 s
[pathway-compat-filepath] /nix/store/zjraf40s86y3iwhp626b934r5y6ldkbb-binutils-wrapper-2.46/bin/ar
21.60 s
[pathway-compat-filepath] No c2hs found
21.60 s
[pathway-compat-filepath] No cpphs found
21.60 s
[pathway-compat-filepath] Using doctest version 0.24.3 found on system at:
21.60 s
[pathway-compat-filepath] /nix/store/2y183b1vsybv0157vfr59yhdwjkpqfkn-doctest-0.24.3/bin/doctest
21.60 s
[pathway-compat-filepath] Using gcc version 15.2.0 given by user at:
21.60 s
[pathway-compat-filepath] /nix/store/29qjlshvklnyr67nhpprzgb9igmsfsjj-gcc-wrapper-15.2.0/bin/gcc
21.60 s
[pathway-compat-filepath] Using ghc version 9.8.4 found on system at:
21.60 s
[pathway-compat-filepath] /nix/store/7r9b0bl984hdgd70nf5p8raa55kml491-ghc-9.8.4/bin/ghc
21.60 s
[pathway-compat-filepath] Using ghc-pkg version 9.8.4 found on system at:
21.60 s
[pathway-compat-filepath] /nix/store/7r9b0bl984hdgd70nf5p8raa55kml491-ghc-9.8.4/bin/ghc-pkg-9.8.4
21.60 s
[pathway-compat-filepath] No ghcjs found
21.60 s
[pathway-compat-filepath] No ghcjs-pkg found
21.60 s
[pathway-compat-filepath] No greencard found
21.60 s
[pathway-compat-filepath] Using haddock version 2.30.0 found on system at:
21.60 s
[pathway-compat-filepath] /nix/store/7r9b0bl984hdgd70nf5p8raa55kml491-ghc-9.8.4/bin/haddock-ghc-9.8.4
21.60 s
[pathway-compat-filepath] No happy found
21.60 s
[pathway-compat-filepath] Using haskell-suite found on system at: haskell-suite-dummy-location
21.60 s
[pathway-compat-filepath] Using haskell-suite-pkg found on system at: haskell-suite-pkg-dummy-location
21.60 s
[pathway-compat-filepath] No hmake found
21.60 s
[pathway-compat-filepath] Using hpc version 0.69 found on system at:
21.60 s
[pathway-compat-filepath] /nix/store/7r9b0bl984hdgd70nf5p8raa55kml491-ghc-9.8.4/bin/hpc-ghc-9.8.4
21.60 s
[pathway-compat-filepath] Using hsc2hs version 0.68.10 found on system at:
21.60 s
[pathway-compat-filepath] /nix/store/7r9b0bl984hdgd70nf5p8raa55kml491-ghc-9.8.4/bin/hsc2hs-ghc-9.8.4
21.60 s
[pathway-compat-filepath] Using hscolour version 1.25 found on system at:
21.60 s
[pathway-compat-filepath] /nix/store/awnxn98rlw62rrjwli6d2lb4d27mrzzw-hscolour-1.25/bin/HsColour
21.60 s
[pathway-compat-filepath] No jhc found
21.60 s
[pathway-compat-filepath] Using ld found on system at:
21.60 s
[pathway-compat-filepath] /nix/store/zjraf40s86y3iwhp626b934r5y6ldkbb-binutils-wrapper-2.46/bin/ld.gold
21.60 s
[pathway-compat-filepath] No pkg-config found
21.60 s
[pathway-compat-filepath] Using runghc version 9.8.4 found on system at:
21.60 s
[pathway-compat-filepath] /nix/store/7r9b0bl984hdgd70nf5p8raa55kml491-ghc-9.8.4/bin/runghc-9.8.4
21.60 s
[pathway-compat-filepath] Using strip version 2.46 found on system at:
21.60 s
[pathway-compat-filepath] /nix/store/29qjlshvklnyr67nhpprzgb9igmsfsjj-gcc-wrapper-15.2.0/bin/strip
21.60 s
[pathway-compat-filepath] Using tar found on system at:
21.60 s
[pathway-compat-filepath] /nix/store/z5mq2sam4484prf3kv6v6vjw1m0i7j24-gnutar-1.35/bin/tar
21.60 s
[pathway-compat-filepath] No uhc found
22.07 s
[pathway-compat-filepath] Phase: buildPhase
22.35 s
[pathway-compat-filepath] Preprocessing library for pathway-compat-filepath-0.0.1.0..
22.41 s
[pathway-compat-filepath] Building library for pathway-compat-filepath-0.0.1.0..
22.43 s
[pathway-compat-filepath] [ 1 of 10] Compiling Common.FilePath ( src/Common/FilePath.hs, dist/build/Common/FilePath.o, dist/build/Common/FilePath.dyn_o )
23.07 s
[pathway-compat-filepath] [ 2 of 10] Compiling Common.OsPath ( src/Common/OsPath.hs, dist/build/Common/OsPath.o, dist/build/Common/OsPath.dyn_o )
23.07 s
[pathway-compat-filepath]
23.07 s
[pathway-compat-filepath] src/Common/OsPath.hs:90:23: error : [ GHC-83865 ]
23.07 s
[pathway-compat-filepath] • Couldn't match type ‘OSS.OsString’ with ‘OsString’
23.07 s
[pathway-compat-filepath] Expected: OsPath
23.07 s
[pathway-compat-filepath] Actual: OSS.OsString
23.07 s
[pathway-compat-filepath] NB: ‘OsString’
23.07 s
[pathway-compat-filepath] is defined in ‘System.OsString.Internal.Types.Hidden’
23.07 s
[pathway-compat-filepath] in package ‘filepath-1.4.301.0’
23.07 s
[pathway-compat-filepath] ‘OSS.OsString’
23.07 s
[pathway-compat-filepath] is defined in ‘System.OsString.Internal.Types’
23.07 s
[pathway-compat-filepath] in package ‘os-string-2.0.10’
23.07 s
[pathway-compat-filepath] • In the ‘parent’ field of a record
23.07 s
[pathway-compat-filepath] In the expression:
23.07 s
[pathway-compat-filepath] Format
23.07 s
[pathway-compat-filepath] {root = O.pack . pure $ O.pathSeparator, current = mempty,
23.07 s
[pathway-compat-filepath] parent = OSS.unsafeEncodeUtf "..",
23.07 s
[pathway-compat-filepath] separator = O.pack . pure $ O.pathSeparator,
23.07 s
[pathway-compat-filepath] substitutions = mempty}
23.07 s
[pathway-compat-filepath] In an equation for ‘localFormat’:
23.07 s
[pathway-compat-filepath] localFormat
23.07 s
[pathway-compat-filepath] = Format
23.07 s
[pathway-compat-filepath] {root = O.pack . pure $ O.pathSeparator, current = mempty,
23.07 s
[pathway-compat-filepath] parent = OSS.unsafeEncodeUtf "..",
23.07 s
[pathway-compat-filepath] separator = O.pack . pure $ O.pathSeparator,
23.07 s
[pathway-compat-filepath] substitutions = mempty}
23.07 s
[pathway-compat-filepath] |
23.07 s
[pathway-compat-filepath] 90 | Format.parent = OSS.unsafeEncodeUtf ".." ,
23.07 s
[pathway-compat-filepath] | ^^^^^^^^^^^^^^^^^^^^^^^^
23.07 s
[pathway-compat-filepath] [ 3 of 10] Compiling System.FilePath.Thin ( src/System/FilePath/Thin.hs, dist/build/System/FilePath/Thin.o, dist/build/System/FilePath/Thin.dyn_o )
23.17 s
[pathway-compat-filepath] [ 4 of 10] Compiling System.FilePath.Pathway ( src/System/FilePath/Pathway.hs, dist/build/System/FilePath/Pathway.o, dist/build/System/FilePath/Pathway.dyn_o )
23.19 s
[pathway-compat-filepath] [ 5 of 10] Compiling System.FilePath.Overlay ( src/System/FilePath/Overlay.hs, dist/build/System/FilePath/Overlay.o, dist/build/System/FilePath/Overlay.dyn_o )
23.21 s
[pathway-compat-filepath] [ 6 of 10] Compiling System.FilePath ( src/System/FilePath.hs, dist/build/System/FilePath.o, dist/build/System/FilePath.dyn_o )
23.32 s
Progress: 0 of 12 built (1 failed), 174 of 174 downloaded from cache
23.32 s
Failed to build pathway-compat-filepath after 4.4s
23.32 s
error: Cannot build '/nix/store/gwlaydb47f6yhlx7hsgqq7s0m612k39r-pathway-compat-filepath-0.0.1.0.drv '.
23.32 s
Reason: builder failed with exit code 1 .
23.32 s
Output paths:
23.32 s
/nix/store/brb3ys0mr106j2xs2nqwq5rszfngk13w-pathway-compat-filepath-0.0.1.0-doc
23.32 s
/nix/store/knqi4mpp2gcy2djhvikk6m439c94gw16-pathway-compat-filepath-0.0.1.0
23.32 s
Last 176 log lines:
23.32 s
> Running phase: setupCompilerEnvironmentPhase
23.32 s
> Build with /nix/store/7r9b0bl984hdgd70nf5p8raa55kml491-ghc-9.8.4.
23.32 s
> Running phase: unpackPhase
23.32 s
> unpacking source archive /nix/store/56v5999xvkp18l2ygdvahppqdv4hrlnl-filepath
23.32 s
> source root is filepath
23.32 s
> Running phase: patchPhase
23.32 s
> Running phase: compileBuildDriverPhase
23.32 s
> setupCompileFlags: -package-db=/build/tmp.hsoEC5z0By/setup-package.conf.d -threaded
23.32 s
> [1 of 2] Compiling Main ( Setup.hs, /build/tmp.hsoEC5z0By/Main.o )
23.32 s
> [2 of 2] Linking Setup
23.32 s
> Running phase: updateAutotoolsGnuConfigScriptsPhase
23.32 s
> Running phase: configurePhase
23.32 s
> configureFlags: --verbose --prefix=/nix/store/knqi4mpp2gcy2djhvikk6m439c94gw16-pathway-compat-filepath-0.0.1.0 --libdir=$prefix/lib/$compiler/lib --libsubdir=$abi/$libname --docdir=/nix/store/brb3ys0mr106j2xs2nqwq5rszfngk13w-pathway-compat-filepath-0.0.1.0-doc/share/doc/pathway-compat-filepath-0.0.1.0 --with-gcc=gcc --package-db=/build/tmp.hsoEC5z0By/package.conf.d --ghc-option=-j16 --ghc-option=+RTS --ghc-option=-A64M --ghc-option=-RTS --enable-library-profiling --profiling-detail=exported-functions --disable-profiling --enable-shared --disable-coverage --enable-static --disable-executable-dynamic --enable-tests --disable-benchmarks --enable-library-vanilla --disable-library-for-ghci --enable-split-sections --enable-library-stripping --enable-executable-stripping --ghc-option=-haddock --ghc-options=-Werror --extra-lib-dirs=/nix/store/pndhkk0l649lm1sj0mxk7cbwq26qd1ra-ncurses-6.6/lib --extra-lib-dirs=/nix/store/0djlg4g0b81w94k3vcaqsxsc2hh4kism-libffi-3.5.2/lib --extra-lib-dirs=/nix/store/md4paia7riiggyrj8p24c7a6vf8w7jz8-elfutils-0.194/lib --extra-lib-dirs=/nix/store/39vv2pf64gd8li48a4hpbhw2crzd8z5p-gmp-with-cxx-6.3.0/lib --extra-lib-dirs=/nix/store/7wwvald8lapkrsr72qanlw8blyn55ifx-numactl-2.0.18/lib --extra-lib-dirs=/nix/store/7r9b0bl984hdgd70nf5p8raa55kml491-ghc-9.8.4/lib
23.32 s
> Using Parsec parser
23.32 s
> Configuring pathway-compat-filepath-0.0.1.0...
23.32 s
> Flags chosen: noisy-deprecations=True, verify-no-recursion=False
23.32 s
> Dependency base >=4.14.0 && <4.15 || >=4.15.0 && <4.16 || >=4.16.0 && <4.17 ||
23.32 s
> >=4.17.0 && <4.18 || >=4.18.0 && <4.19 || >=4.19.0 && <4.20 || >=4.20.0 &&
23.32 s
> <4.21 || >=4.21.0 && <4.22 || >=4.22.0 && <4.23: using base-4.19.2.0
23.32 s
> Dependency extra: using extra-1.8.1
23.32 s
> Dependency filepath >=1.4.2 && <1.5 || >=1.5.0 && <1.6: using
23.32 s
> filepath-1.4.301.0
23.32 s
> Dependency megaparsec >=9.0.1 && <9.1 || >=9.2.1 && <9.3 || >=9.5.0 && <9.6 ||
23.32 s
> >=9.7.0 && <9.8: using megaparsec-9.7.0
23.32 s
> Dependency os-string: using os-string-2.0.10
23.32 s
> Dependency pathway >=0.0.1 && <0.1: using pathway-0.0.1.0
23.32 s
> Dependency pathway-compat-base >=0.0.1 && <0.1: using
23.32 s
> pathway-compat-base-0.0.1.0
23.32 s
> Dependency pathway-internal >=0.0.1 && <0.1: using pathway-internal-0.0.1.0
23.32 s
> Dependency base >=4.14.0 && <4.15 || >=4.15.0 && <4.16 || >=4.16.0 && <4.17 ||
23.32 s
> >=4.17.0 && <4.18 || >=4.18.0 && <4.19 || >=4.19.0 && <4.20 || >=4.20.0 &&
23.32 s
> <4.21 || >=4.21.0 && <4.22 || >=4.22.0 && <4.23: using base-4.19.2.0
23.32 s
> Dependency doctest >=0.16.3 && <0.17 || >=0.18.1 && <0.19 || >=0.20.1 && <0.21
23.32 s
> || >=0.21.1 && <0.22 || >=0.22.2 && <0.23 || >=0.24.2 && <0.25: using
23.32 s
> doctest-0.24.3
23.32 s
> Dependency pathway-compat-filepath: using pathway-compat-filepath-0.0.1.0
23.32 s
> Source component graph:
23.32 s
> component lib
23.32 s
> component test:doctests dependency lib
23.32 s
> Configured component graph:
23.32 s
> component pathway-compat-filepath-0.0.1.0-6KN1Vlb8yPeBopmlZtXyrR
23.32 s
> include base-4.19.2.0-934f
23.32 s
> include extra-1.8.1-F4oHgTKCper3ZiIUPZjGPK
23.32 s
> include filepath-1.4.301.0-6e15
23.32 s
> include megaparsec-9.7.0-10vHZAF1maw9O8p2gXs66N
23.32 s
> include os-string-2.0.10-HbyG8qgShpTHKXL8bZ3UK8
23.32 s
> include pathway-0.0.1.0-H5uD0SRA9755UrSqFBaCYE
23.32 s
> include pathway-compat-base-0.0.1.0-8ldj6SPXbxq2Shd8yFeOpr
23.32 s
> include pathway-internal-0.0.1.0-Lnjdb2M8cxN196wSdsfQUK
23.32 s
> component pathway-compat-filepath-0.0.1.0-LoaDJ8tbb2m5kfHmaP2B9c-doctests
23.32 s
> include base-4.19.2.0-934f
23.32 s
> include doctest-0.24.3-1aDs7zEYV5r7raSsXr9TQC
23.32 s
> include pathway-compat-filepath-0.0.1.0-6KN1Vlb8yPeBopmlZtXyrR
23.32 s
> Linked component graph:
23.32 s
> unit pathway-compat-filepath-0.0.1.0-6KN1Vlb8yPeBopmlZtXyrR
23.32 s
> include base-4.19.2.0-934f
23.32 s
> include extra-1.8.1-F4oHgTKCper3ZiIUPZjGPK
23.32 s
> include filepath-1.4.301.0-6e15
23.32 s
> include megaparsec-9.7.0-10vHZAF1maw9O8p2gXs66N
23.32 s
> include os-string-2.0.10-HbyG8qgShpTHKXL8bZ3UK8
23.32 s
> include pathway-0.0.1.0-H5uD0SRA9755UrSqFBaCYE
23.32 s
> include pathway-compat-base-0.0.1.0-8ldj6SPXbxq2Shd8yFeOpr
23.32 s
> include pathway-internal-0.0.1.0-Lnjdb2M8cxN196wSdsfQUK
23.32 s
> Common.FilePath=pathway-compat-filepath-0.0.1.0-6KN1Vlb8yPeBopmlZtXyrR:Common.FilePath,Common.OsPath=pathway-compat-filepath-0.0.1.0-6KN1Vlb8yPeBopmlZtXyrR:Common.OsPath,System.FilePath=pathway-compat-filepath-0.0.1.0-6KN1Vlb8yPeBopmlZtXyrR:System.FilePath,System.FilePath.Overlay=pathway-compat-filepath-0.0.1.0-6KN1Vlb8yPeBopmlZtXyrR:System.FilePath.Overlay,System.FilePath.Pathway=pathway-compat-filepath-0.0.1.0-6KN1Vlb8yPeBopmlZtXyrR:System.FilePath.Pathway,System.FilePath.Thin=pathway-compat-filepath-0.0.1.0-6KN1Vlb8yPeBopmlZtXyrR:System.FilePath.Thin,System.OsPath=pathway-compat-filepath-0.0.1.0-6KN1Vlb8yPeBopmlZtXyrR:System.OsPath,System.OsPath.Overlay=pathway-compat-filepath-0.0.1.0-6KN1Vlb8yPeBopmlZtXyrR:System.OsPath.Overlay,System.OsPath.Pathway=pathway-compat-filepath-0.0.1.0-6KN1Vlb8yPeBopmlZtXyrR:System.OsPath.Pathway,System.OsPath.Thin=pathway-compat-filepath-0.0.1.0-6KN1Vlb8yPeBopmlZtXyrR:System.OsPath.Thin
23.32 s
> unit pathway-compat-filepath-0.0.1.0-LoaDJ8tbb2m5kfHmaP2B9c-doctests
23.32 s
> include base-4.19.2.0-934f
23.32 s
> include doctest-0.24.3-1aDs7zEYV5r7raSsXr9TQC
23.32 s
> include pathway-compat-filepath-0.0.1.0-6KN1Vlb8yPeBopmlZtXyrR
23.32 s
> Ready component graph:
23.32 s
> definite pathway-compat-filepath-0.0.1.0-6KN1Vlb8yPeBopmlZtXyrR
23.32 s
> depends base-4.19.2.0-934f
23.32 s
> depends extra-1.8.1-F4oHgTKCper3ZiIUPZjGPK
23.32 s
> depends filepath-1.4.301.0-6e15
23.32 s
> depends megaparsec-9.7.0-10vHZAF1maw9O8p2gXs66N
23.32 s
> depends os-string-2.0.10-HbyG8qgShpTHKXL8bZ3UK8
23.32 s
> depends pathway-0.0.1.0-H5uD0SRA9755UrSqFBaCYE
23.32 s
> depends pathway-compat-base-0.0.1.0-8ldj6SPXbxq2Shd8yFeOpr
23.32 s
> depends pathway-internal-0.0.1.0-Lnjdb2M8cxN196wSdsfQUK
23.32 s
> definite pathway-compat-filepath-0.0.1.0-LoaDJ8tbb2m5kfHmaP2B9c-doctests
23.32 s
> depends base-4.19.2.0-934f
23.32 s
> depends doctest-0.24.3-1aDs7zEYV5r7raSsXr9TQC
23.32 s
> depends pathway-compat-filepath-0.0.1.0-6KN1Vlb8yPeBopmlZtXyrR
23.32 s
> Using Cabal-3.10.3.0 compiled by ghc-9.8
23.32 s
> Using compiler: ghc-9.8.4
23.32 s
> Using install prefix:
23.32 s
> /nix/store/knqi4mpp2gcy2djhvikk6m439c94gw16-pathway-compat-filepath-0.0.1.0
23.32 s
> Executables installed in:
23.32 s
> /nix/store/knqi4mpp2gcy2djhvikk6m439c94gw16-pathway-compat-filepath-0.0.1.0/bin
23.32 s
> Libraries installed in:
23.32 s
> /nix/store/knqi4mpp2gcy2djhvikk6m439c94gw16-pathway-compat-filepath-0.0.1.0/lib/ghc-9.8.4/lib/x86_64-linux-ghc-9.8.4/pathway-compat-filepath-0.0.1.0-6KN1Vlb8yPeBopmlZtXyrR
23.32 s
> Dynamic Libraries installed in:
23.32 s
> /nix/store/knqi4mpp2gcy2djhvikk6m439c94gw16-pathway-compat-filepath-0.0.1.0/lib/ghc-9.8.4/lib/x86_64-linux-ghc-9.8.4
23.32 s
> Private executables installed in:
23.32 s
> /nix/store/knqi4mpp2gcy2djhvikk6m439c94gw16-pathway-compat-filepath-0.0.1.0/libexec/x86_64-linux-ghc-9.8.4/pathway-compat-filepath-0.0.1.0
23.32 s
> Data files installed in:
23.32 s
> /nix/store/knqi4mpp2gcy2djhvikk6m439c94gw16-pathway-compat-filepath-0.0.1.0/share/x86_64-linux-ghc-9.8.4/pathway-compat-filepath-0.0.1.0
23.32 s
> Documentation installed in:
23.32 s
> /nix/store/brb3ys0mr106j2xs2nqwq5rszfngk13w-pathway-compat-filepath-0.0.1.0-doc/share/doc/pathway-compat-filepath-0.0.1.0
23.32 s
> Configuration files installed in:
23.32 s
> /nix/store/knqi4mpp2gcy2djhvikk6m439c94gw16-pathway-compat-filepath-0.0.1.0/etc
23.32 s
> No alex found
23.32 s
> Using ar found on system at:
23.32 s
> /nix/store/zjraf40s86y3iwhp626b934r5y6ldkbb-binutils-wrapper-2.46/bin/ar
23.32 s
> No c2hs found
23.32 s
> No cpphs found
23.32 s
> Using doctest version 0.24.3 found on system at:
23.32 s
> /nix/store/2y183b1vsybv0157vfr59yhdwjkpqfkn-doctest-0.24.3/bin/doctest
23.32 s
> Using gcc version 15.2.0 given by user at:
23.32 s
> /nix/store/29qjlshvklnyr67nhpprzgb9igmsfsjj-gcc-wrapper-15.2.0/bin/gcc
23.32 s
> Using ghc version 9.8.4 found on system at:
23.32 s
> /nix/store/7r9b0bl984hdgd70nf5p8raa55kml491-ghc-9.8.4/bin/ghc
23.32 s
> Using ghc-pkg version 9.8.4 found on system at:
23.32 s
> /nix/store/7r9b0bl984hdgd70nf5p8raa55kml491-ghc-9.8.4/bin/ghc-pkg-9.8.4
23.32 s
> No ghcjs found
23.32 s
> No ghcjs-pkg found
23.32 s
> No greencard found
23.32 s
> Using haddock version 2.30.0 found on system at:
23.32 s
> /nix/store/7r9b0bl984hdgd70nf5p8raa55kml491-ghc-9.8.4/bin/haddock-ghc-9.8.4
23.32 s
> No happy found
23.32 s
> Using haskell-suite found on system at: haskell-suite-dummy-location
23.32 s
> Using haskell-suite-pkg found on system at: haskell-suite-pkg-dummy-location
23.32 s
> No hmake found
23.32 s
> Using hpc version 0.69 found on system at:
23.32 s
> /nix/store/7r9b0bl984hdgd70nf5p8raa55kml491-ghc-9.8.4/bin/hpc-ghc-9.8.4
23.32 s
> Using hsc2hs version 0.68.10 found on system at:
23.32 s
> /nix/store/7r9b0bl984hdgd70nf5p8raa55kml491-ghc-9.8.4/bin/hsc2hs-ghc-9.8.4
23.32 s
> Using hscolour version 1.25 found on system at:
23.32 s
> /nix/store/awnxn98rlw62rrjwli6d2lb4d27mrzzw-hscolour-1.25/bin/HsColour
23.32 s
> No jhc found
23.32 s
> Using ld found on system at:
23.32 s
> /nix/store/zjraf40s86y3iwhp626b934r5y6ldkbb-binutils-wrapper-2.46/bin/ld.gold
23.32 s
> No pkg-config found
23.32 s
> Using runghc version 9.8.4 found on system at:
23.32 s
> /nix/store/7r9b0bl984hdgd70nf5p8raa55kml491-ghc-9.8.4/bin/runghc-9.8.4
23.32 s
> Using strip version 2.46 found on system at:
23.32 s
> /nix/store/29qjlshvklnyr67nhpprzgb9igmsfsjj-gcc-wrapper-15.2.0/bin/strip
23.32 s
> Using tar found on system at:
23.32 s
> /nix/store/z5mq2sam4484prf3kv6v6vjw1m0i7j24-gnutar-1.35/bin/tar
23.32 s
> No uhc found
23.32 s
> Running phase: buildPhase
23.32 s
> Preprocessing library for pathway-compat-filepath-0.0.1.0..
23.32 s
> Building library for pathway-compat-filepath-0.0.1.0..
23.32 s
> [ 1 of 10] Compiling Common.FilePath ( src/Common/FilePath.hs, dist/build/Common/FilePath.o, dist/build/Common/FilePath.dyn_o )
23.32 s
> [ 2 of 10] Compiling Common.OsPath ( src/Common/OsPath.hs, dist/build/Common/OsPath.o, dist/build/Common/OsPath.dyn_o )
23.32 s
>
23.32 s
> src/Common/OsPath.hs:90:23: error : [ GHC-83865 ]
23.32 s
> • Couldn't match type ‘OSS.OsString’ with ‘OsString’
23.32 s
> Expected: OsPath
23.32 s
> Actual: OSS.OsString
23.32 s
> NB: ‘OsString’
23.32 s
> is defined in ‘System.OsString.Internal.Types.Hidden’
23.32 s
> in package ‘filepath-1.4.301.0’
23.32 s
> ‘OSS.OsString’
23.32 s
> is defined in ‘System.OsString.Internal.Types’
23.32 s
> in package ‘os-string-2.0.10’
23.32 s
> • In the ‘parent’ field of a record
23.32 s
> In the expression:
23.32 s
> Format
23.32 s
> {root = O.pack . pure $ O.pathSeparator, current = mempty,
23.32 s
> parent = OSS.unsafeEncodeUtf "..",
23.32 s
> separator = O.pack . pure $ O.pathSeparator,
23.32 s
> substitutions = mempty}
23.32 s
> In an equation for ‘localFormat’:
23.32 s
> localFormat
23.32 s
> = Format
23.32 s
> {root = O.pack . pure $ O.pathSeparator, current = mempty,
23.32 s
> parent = OSS.unsafeEncodeUtf "..",
23.32 s
> separator = O.pack . pure $ O.pathSeparator,
23.32 s
> substitutions = mempty}
23.32 s
> |
23.32 s
> 90 | Format.parent = OSS.unsafeEncodeUtf ".." ,
23.32 s
> | ^^^^^^^^^^^^^^^^^^^^^^^^
23.32 s
> [ 3 of 10] Compiling System.FilePath.Thin ( src/System/FilePath/Thin.hs, dist/build/System/FilePath/Thin.o, dist/build/System/FilePath/Thin.dyn_o )
23.32 s
> [ 4 of 10] Compiling System.FilePath.Pathway ( src/System/FilePath/Pathway.hs, dist/build/System/FilePath/Pathway.o, dist/build/System/FilePath/Pathway.dyn_o )
23.32 s
> [ 5 of 10] Compiling System.FilePath.Overlay ( src/System/FilePath/Overlay.hs, dist/build/System/FilePath/Overlay.o, dist/build/System/FilePath/Overlay.dyn_o )
23.32 s
> [ 6 of 10] Compiling System.FilePath ( src/System/FilePath.hs, dist/build/System/FilePath.o, dist/build/System/FilePath.dyn_o )
23.32 s
For full logs, run:
23.32 s
nix log /nix/store/gwlaydb47f6yhlx7hsgqq7s0m612k39r-pathway-compat-filepath-0.0.1.0.drv
23.32 s
error: Cannot build '/nix/store/gwlaydb47f6yhlx7hsgqq7s0m612k39r-pathway-compat-filepath-0.0.1.0.drv '.
23.32 s
Reason: builder failed with exit code 1 .
23.32 s
Output paths:
23.32 s
/nix/store/brb3ys0mr106j2xs2nqwq5rszfngk13w-pathway-compat-filepath-0.0.1.0-doc
23.32 s
/nix/store/knqi4mpp2gcy2djhvikk6m439c94gw16-pathway-compat-filepath-0.0.1.0
23.32 s
Last 176 log lines:
23.32 s
> Running phase: setupCompilerEnvironmentPhase
23.32 s
> Build with /nix/store/7r9b0bl984hdgd70nf5p8raa55kml491-ghc-9.8.4.
23.32 s
> Running phase: unpackPhase
23.32 s
> unpacking source archive /nix/store/56v5999xvkp18l2ygdvahppqdv4hrlnl-filepath
23.32 s
> source root is filepath
23.32 s
> Running phase: patchPhase
23.32 s
> Running phase: compileBuildDriverPhase
23.32 s
> setupCompileFlags: -package-db=/build/tmp.hsoEC5z0By/setup-package.conf.d -threaded
23.32 s
> [1 of 2] Compiling Main ( Setup.hs, /build/tmp.hsoEC5z0By/Main.o )
23.32 s
> [2 of 2] Linking Setup
23.32 s
> Running phase: updateAutotoolsGnuConfigScriptsPhase
23.32 s
> Running phase: configurePhase
23.32 s
> configureFlags: --verbose --prefix=/nix/store/knqi4mpp2gcy2djhvikk6m439c94gw16-pathway-compat-filepath-0.0.1.0 --libdir=$prefix/lib/$compiler/lib --libsubdir=$abi/$libname --docdir=/nix/store/brb3ys0mr106j2xs2nqwq5rszfngk13w-pathway-compat-filepath-0.0.1.0-doc/share/doc/pathway-compat-filepath-0.0.1.0 --with-gcc=gcc --package-db=/build/tmp.hsoEC5z0By/package.conf.d --ghc-option=-j16 --ghc-option=+RTS --ghc-option=-A64M --ghc-option=-RTS --enable-library-profiling --profiling-detail=exported-functions --disable-profiling --enable-shared --disable-coverage --enable-static --disable-executable-dynamic --enable-tests --disable-benchmarks --enable-library-vanilla --disable-library-for-ghci --enable-split-sections --enable-library-stripping --enable-executable-stripping --ghc-option=-haddock --ghc-options=-Werror --extra-lib-dirs=/nix/store/pndhkk0l649lm1sj0mxk7cbwq26qd1ra-ncurses-6.6/lib --extra-lib-dirs=/nix/store/0djlg4g0b81w94k3vcaqsxsc2hh4kism-libffi-3.5.2/lib --extra-lib-dirs=/nix/store/md4paia7riiggyrj8p24c7a6vf8w7jz8-elfutils-0.194/lib --extra-lib-dirs=/nix/store/39vv2pf64gd8li48a4hpbhw2crzd8z5p-gmp-with-cxx-6.3.0/lib --extra-lib-dirs=/nix/store/7wwvald8lapkrsr72qanlw8blyn55ifx-numactl-2.0.18/lib --extra-lib-dirs=/nix/store/7r9b0bl984hdgd70nf5p8raa55kml491-ghc-9.8.4/lib
23.32 s
> Using Parsec parser
23.32 s
> Configuring pathway-compat-filepath-0.0.1.0...
23.32 s
> Flags chosen: noisy-deprecations=True, verify-no-recursion=False
23.32 s
> Dependency base >=4.14.0 && <4.15 || >=4.15.0 && <4.16 || >=4.16.0 && <4.17 ||
23.32 s
> >=4.17.0 && <4.18 || >=4.18.0 && <4.19 || >=4.19.0 && <4.20 || >=4.20.0 &&
23.32 s
> <4.21 || >=4.21.0 && <4.22 || >=4.22.0 && <4.23: using base-4.19.2.0
23.32 s
> Dependency extra: using extra-1.8.1
23.32 s
> Dependency filepath >=1.4.2 && <1.5 || >=1.5.0 && <1.6: using
23.32 s
> filepath-1.4.301.0
23.32 s
> Dependency megaparsec >=9.0.1 && <9.1 || >=9.2.1 && <9.3 || >=9.5.0 && <9.6 ||
23.32 s
> >=9.7.0 && <9.8: using megaparsec-9.7.0
23.32 s
> Dependency os-string: using os-string-2.0.10
23.32 s
> Dependency pathway >=0.0.1 && <0.1: using pathway-0.0.1.0
23.32 s
> Dependency pathway-compat-base >=0.0.1 && <0.1: using
23.32 s
> pathway-compat-base-0.0.1.0
23.32 s
> Dependency pathway-internal >=0.0.1 && <0.1: using pathway-internal-0.0.1.0
23.32 s
> Dependency base >=4.14.0 && <4.15 || >=4.15.0 && <4.16 || >=4.16.0 && <4.17 ||
23.32 s
> >=4.17.0 && <4.18 || >=4.18.0 && <4.19 || >=4.19.0 && <4.20 || >=4.20.0 &&
23.32 s
> <4.21 || >=4.21.0 && <4.22 || >=4.22.0 && <4.23: using base-4.19.2.0
23.32 s
> Dependency doctest >=0.16.3 && <0.17 || >=0.18.1 && <0.19 || >=0.20.1 && <0.21
23.32 s
> || >=0.21.1 && <0.22 || >=0.22.2 && <0.23 || >=0.24.2 && <0.25: using
23.32 s
> doctest-0.24.3
23.32 s
> Dependency pathway-compat-filepath: using pathway-compat-filepath-0.0.1.0
23.32 s
> Source component graph:
23.32 s
> component lib
23.32 s
> component test:doctests dependency lib
23.32 s
> Configured component graph:
23.32 s
> component pathway-compat-filepath-0.0.1.0-6KN1Vlb8yPeBopmlZtXyrR
23.32 s
> include base-4.19.2.0-934f
23.32 s
> include extra-1.8.1-F4oHgTKCper3ZiIUPZjGPK
23.32 s
> include filepath-1.4.301.0-6e15
23.32 s
> include megaparsec-9.7.0-10vHZAF1maw9O8p2gXs66N
23.32 s
> include os-string-2.0.10-HbyG8qgShpTHKXL8bZ3UK8
23.32 s
> include pathway-0.0.1.0-H5uD0SRA9755UrSqFBaCYE
23.32 s
> include pathway-compat-base-0.0.1.0-8ldj6SPXbxq2Shd8yFeOpr
23.32 s
> include pathway-internal-0.0.1.0-Lnjdb2M8cxN196wSdsfQUK
23.32 s
> component pathway-compat-filepath-0.0.1.0-LoaDJ8tbb2m5kfHmaP2B9c-doctests
23.32 s
> include base-4.19.2.0-934f
23.32 s
> include doctest-0.24.3-1aDs7zEYV5r7raSsXr9TQC
23.32 s
> include pathway-compat-filepath-0.0.1.0-6KN1Vlb8yPeBopmlZtXyrR
23.32 s
> Linked component graph:
23.32 s
> unit pathway-compat-filepath-0.0.1.0-6KN1Vlb8yPeBopmlZtXyrR
23.32 s
> include base-4.19.2.0-934f
23.32 s
> include extra-1.8.1-F4oHgTKCper3ZiIUPZjGPK
23.32 s
> include filepath-1.4.301.0-6e15
23.32 s
> include megaparsec-9.7.0-10vHZAF1maw9O8p2gXs66N
23.32 s
> include os-string-2.0.10-HbyG8qgShpTHKXL8bZ3UK8
23.32 s
> include pathway-0.0.1.0-H5uD0SRA9755UrSqFBaCYE
23.32 s
> include pathway-compat-base-0.0.1.0-8ldj6SPXbxq2Shd8yFeOpr
23.32 s
> include pathway-internal-0.0.1.0-Lnjdb2M8cxN196wSdsfQUK
23.32 s
> Common.FilePath=pathway-compat-filepath-0.0.1.0-6KN1Vlb8yPeBopmlZtXyrR:Common.FilePath,Common.OsPath=pathway-compat-filepath-0.0.1.0-6KN1Vlb8yPeBopmlZtXyrR:Common.OsPath,System.FilePath=pathway-compat-filepath-0.0.1.0-6KN1Vlb8yPeBopmlZtXyrR:System.FilePath,System.FilePath.Overlay=pathway-compat-filepath-0.0.1.0-6KN1Vlb8yPeBopmlZtXyrR:System.FilePath.Overlay,System.FilePath.Pathway=pathway-compat-filepath-0.0.1.0-6KN1Vlb8yPeBopmlZtXyrR:System.FilePath.Pathway,System.FilePath.Thin=pathway-compat-filepath-0.0.1.0-6KN1Vlb8yPeBopmlZtXyrR:System.FilePath.Thin,System.OsPath=pathway-compat-filepath-0.0.1.0-6KN1Vlb8yPeBopmlZtXyrR:System.OsPath,System.OsPath.Overlay=pathway-compat-filepath-0.0.1.0-6KN1Vlb8yPeBopmlZtXyrR:System.OsPath.Overlay,System.OsPath.Pathway=pathway-compat-filepath-0.0.1.0-6KN1Vlb8yPeBopmlZtXyrR:System.OsPath.Pathway,System.OsPath.Thin=pathway-compat-filepath-0.0.1.0-6KN1Vlb8yPeBopmlZtXyrR:System.OsPath.Thin
23.32 s
> unit pathway-compat-filepath-0.0.1.0-LoaDJ8tbb2m5kfHmaP2B9c-doctests
23.32 s
> include base-4.19.2.0-934f
23.32 s
> include doctest-0.24.3-1aDs7zEYV5r7raSsXr9TQC
23.32 s
> include pathway-compat-filepath-0.0.1.0-6KN1Vlb8yPeBopmlZtXyrR
23.32 s
> Ready component graph:
23.32 s
> definite pathway-compat-filepath-0.0.1.0-6KN1Vlb8yPeBopmlZtXyrR
23.32 s
> depends base-4.19.2.0-934f
23.32 s
> depends extra-1.8.1-F4oHgTKCper3ZiIUPZjGPK
23.32 s
> depends filepath-1.4.301.0-6e15
23.32 s
> depends megaparsec-9.7.0-10vHZAF1maw9O8p2gXs66N
23.32 s
> depends os-string-2.0.10-HbyG8qgShpTHKXL8bZ3UK8
23.32 s
> depends pathway-0.0.1.0-H5uD0SRA9755UrSqFBaCYE
23.32 s
> depends pathway-compat-base-0.0.1.0-8ldj6SPXbxq2Shd8yFeOpr
23.32 s
> depends pathway-internal-0.0.1.0-Lnjdb2M8cxN196wSdsfQUK
23.32 s
> definite pathway-compat-filepath-0.0.1.0-LoaDJ8tbb2m5kfHmaP2B9c-doctests
23.32 s
> depends base-4.19.2.0-934f
23.32 s
> depends doctest-0.24.3-1aDs7zEYV5r7raSsXr9TQC
23.32 s
> depends pathway-compat-filepath-0.0.1.0-6KN1Vlb8yPeBopmlZtXyrR
23.32 s
> Using Cabal-3.10.3.0 compiled by ghc-9.8
23.32 s
> Using compiler: ghc-9.8.4
23.32 s
> Using install prefix:
23.32 s
> /nix/store/knqi4mpp2gcy2djhvikk6m439c94gw16-pathway-compat-filepath-0.0.1.0
23.32 s
> Executables installed in:
23.32 s
> /nix/store/knqi4mpp2gcy2djhvikk6m439c94gw16-pathway-compat-filepath-0.0.1.0/bin
23.32 s
> Libraries installed in:
23.32 s
> /nix/store/knqi4mpp2gcy2djhvikk6m439c94gw16-pathway-compat-filepath-0.0.1.0/lib/ghc-9.8.4/lib/x86_64-linux-ghc-9.8.4/pathway-compat-filepath-0.0.1.0-6KN1Vlb8yPeBopmlZtXyrR
23.32 s
> Dynamic Libraries installed in:
23.32 s
> /nix/store/knqi4mpp2gcy2djhvikk6m439c94gw16-pathway-compat-filepath-0.0.1.0/lib/ghc-9.8.4/lib/x86_64-linux-ghc-9.8.4
23.32 s
> Private executables installed in:
23.32 s
> /nix/store/knqi4mpp2gcy2djhvikk6m439c94gw16-pathway-compat-filepath-0.0.1.0/libexec/x86_64-linux-ghc-9.8.4/pathway-compat-filepath-0.0.1.0
23.32 s
> Data files installed in:
23.32 s
> /nix/store/knqi4mpp2gcy2djhvikk6m439c94gw16-pathway-compat-filepath-0.0.1.0/share/x86_64-linux-ghc-9.8.4/pathway-compat-filepath-0.0.1.0
23.32 s
> Documentation installed in:
23.32 s
> /nix/store/brb3ys0mr106j2xs2nqwq5rszfngk13w-pathway-compat-filepath-0.0.1.0-doc/share/doc/pathway-compat-filepath-0.0.1.0
23.32 s
> Configuration files installed in:
23.32 s
> /nix/store/knqi4mpp2gcy2djhvikk6m439c94gw16-pathway-compat-filepath-0.0.1.0/etc
23.32 s
> No alex found
23.32 s
> Using ar found on system at:
23.32 s
> /nix/store/zjraf40s86y3iwhp626b934r5y6ldkbb-binutils-wrapper-2.46/bin/ar
23.32 s
> No c2hs found
23.32 s
> No cpphs found
23.32 s
> Using doctest version 0.24.3 found on system at:
23.32 s
> /nix/store/2y183b1vsybv0157vfr59yhdwjkpqfkn-doctest-0.24.3/bin/doctest
23.32 s
> Using gcc version 15.2.0 given by user at:
23.32 s
> /nix/store/29qjlshvklnyr67nhpprzgb9igmsfsjj-gcc-wrapper-15.2.0/bin/gcc
23.32 s
> Using ghc version 9.8.4 found on system at:
23.32 s
> /nix/store/7r9b0bl984hdgd70nf5p8raa55kml491-ghc-9.8.4/bin/ghc
23.32 s
> Using ghc-pkg version 9.8.4 found on system at:
23.32 s
> /nix/store/7r9b0bl984hdgd70nf5p8raa55kml491-ghc-9.8.4/bin/ghc-pkg-9.8.4
23.32 s
> No ghcjs found
23.32 s
> No ghcjs-pkg found
23.32 s
> No greencard found
23.32 s
> Using haddock version 2.30.0 found on system at:
23.32 s
> /nix/store/7r9b0bl984hdgd70nf5p8raa55kml491-ghc-9.8.4/bin/haddock-ghc-9.8.4
23.32 s
> No happy found
23.32 s
> Using haskell-suite found on system at: haskell-suite-dummy-location
23.32 s
> Using haskell-suite-pkg found on system at: haskell-suite-pkg-dummy-location
23.32 s
> No hmake found
23.32 s
> Using hpc version 0.69 found on system at:
23.32 s
> /nix/store/7r9b0bl984hdgd70nf5p8raa55kml491-ghc-9.8.4/bin/hpc-ghc-9.8.4
23.32 s
> Using hsc2hs version 0.68.10 found on system at:
23.32 s
> /nix/store/7r9b0bl984hdgd70nf5p8raa55kml491-ghc-9.8.4/bin/hsc2hs-ghc-9.8.4
23.32 s
> Using hscolour version 1.25 found on system at:
23.32 s
> /nix/store/awnxn98rlw62rrjwli6d2lb4d27mrzzw-hscolour-1.25/bin/HsColour
23.32 s
> No jhc found
23.32 s
> Using ld found on system at:
23.32 s
> /nix/store/zjraf40s86y3iwhp626b934r5y6ldkbb-binutils-wrapper-2.46/bin/ld.gold
23.32 s
> No pkg-config found
23.32 s
> Using runghc version 9.8.4 found on system at:
23.32 s
> /nix/store/7r9b0bl984hdgd70nf5p8raa55kml491-ghc-9.8.4/bin/runghc-9.8.4
23.32 s
> Using strip version 2.46 found on system at:
23.32 s
> /nix/store/29qjlshvklnyr67nhpprzgb9igmsfsjj-gcc-wrapper-15.2.0/bin/strip
23.32 s
> Using tar found on system at:
23.32 s
> /nix/store/z5mq2sam4484prf3kv6v6vjw1m0i7j24-gnutar-1.35/bin/tar
23.32 s
> No uhc found
23.32 s
> Running phase: buildPhase
23.32 s
> Preprocessing library for pathway-compat-filepath-0.0.1.0..
23.32 s
> Building library for pathway-compat-filepath-0.0.1.0..
23.32 s
> [ 1 of 10] Compiling Common.FilePath ( src/Common/FilePath.hs, dist/build/Common/FilePath.o, dist/build/Common/FilePath.dyn_o )
23.32 s
> [ 2 of 10] Compiling Common.OsPath ( src/Common/OsPath.hs, dist/build/Common/OsPath.o, dist/build/Common/OsPath.dyn_o )
23.32 s
>
23.32 s
> src/Common/OsPath.hs:90:23: error : [ GHC-83865 ]
23.32 s
> • Couldn't match type ‘OSS.OsString’ with ‘OsString’
23.32 s
> Expected: OsPath
23.32 s
> Actual: OSS.OsString
23.32 s
> NB: ‘OsString’
23.32 s
> is defined in ‘System.OsString.Internal.Types.Hidden’
23.32 s
> in package ‘filepath-1.4.301.0’
23.32 s
> ‘OSS.OsString’
23.32 s
> is defined in ‘System.OsString.Internal.Types’
23.32 s
> in package ‘os-string-2.0.10’
23.32 s
> • In the ‘parent’ field of a record
23.32 s
> In the expression:
23.32 s
> Format
23.32 s
> {root = O.pack . pure $ O.pathSeparator, current = mempty,
23.32 s
> parent = OSS.unsafeEncodeUtf "..",
23.32 s
> separator = O.pack . pure $ O.pathSeparator,
23.32 s
> substitutions = mempty}
23.32 s
> In an equation for ‘localFormat’:
23.32 s
> localFormat
23.32 s
> = Format
23.32 s
> {root = O.pack . pure $ O.pathSeparator, current = mempty,
23.32 s
> parent = OSS.unsafeEncodeUtf "..",
23.32 s
> separator = O.pack . pure $ O.pathSeparator,
23.32 s
> substitutions = mempty}
23.32 s
> |
23.32 s
> 90 | Format.parent = OSS.unsafeEncodeUtf ".." ,
23.32 s
> | ^^^^^^^^^^^^^^^^^^^^^^^^
23.32 s
> [ 3 of 10] Compiling System.FilePath.Thin ( src/System/FilePath/Thin.hs, dist/build/System/FilePath/Thin.o, dist/build/System/FilePath/Thin.dyn_o )
23.32 s
> [ 4 of 10] Compiling System.FilePath.Pathway ( src/System/FilePath/Pathway.hs, dist/build/System/FilePath/Pathway.o, dist/build/System/FilePath/Pathway.dyn_o )
23.32 s
> [ 5 of 10] Compiling System.FilePath.Overlay ( src/System/FilePath/Overlay.hs, dist/build/System/FilePath/Overlay.o, dist/build/System/FilePath/Overlay.dyn_o )
23.32 s
> [ 6 of 10] Compiling System.FilePath ( src/System/FilePath.hs, dist/build/System/FilePath.o, dist/build/System/FilePath.dyn_o )
23.32 s
For full logs, run:
23.32 s
nix log /nix/store/gwlaydb47f6yhlx7hsgqq7s0m612k39r-pathway-compat-filepath-0.0.1.0.drv
23.32 s
error: Cannot build '/nix/store/a28ihy0b969pwxwh925yhrdh6iklyv31-ghc-9.8.4-with-packages.drv '.
23.32 s
Reason: 1 dependency failed .
23.32 s
Output paths:
23.32 s
/nix/store/f47c3sqmfcbdna77yvv3zvndirn9fi35-ghc-9.8.4-with-packages
23.32 s
error: Cannot build '/nix/store/cijxvsyixgap1kwhz9cm8ird83kbmbhn-pathway-compat-directory-0.0.1.0.drv '.
23.32 s
Reason: 1 dependency failed .
23.32 s
Output paths:
23.32 s
/nix/store/778vdqwf41vzalr7jkjccdjmn1c5aa4c-pathway-compat-directory-0.0.1.0-doc
23.32 s
/nix/store/m4jqkrqxzf5yffr8mrra9qw0vva59qx1-pathway-compat-directory-0.0.1.0
23.32 s
error: Cannot build '/nix/store/3vy9ph7hwp5rxb70p8wqv7aj4sw59zkv-pathway-compat-file-io-0.0.1.0.drv '.
23.32 s
Reason: 1 dependency failed .
23.32 s
Output paths:
23.32 s
/nix/store/0bkghz6pg1sh43wpglszfz85kwxh1slh-pathway-compat-file-io-0.0.1.0-doc
23.32 s
/nix/store/fi58mdj0jksk51y9cpb7pv8gsdcyalv6-pathway-compat-file-io-0.0.1.0
23.32 s
error: Cannot build '/nix/store/lvyysbgzywa8rw8xjjwr4ycmka1xmx05-pathway-compat-temporary-0.0.1.0.drv '.
23.32 s
Reason: 1 dependency failed .
23.32 s
Output paths:
23.32 s
/nix/store/2jf61xx1szaq3ixvjlisixnb51ipdk6g-pathway-compat-temporary-0.0.1.0-doc
23.32 s
/nix/store/ifh2czq9h1qzw1i0l0c7bj4nhvx1g7ic-pathway-compat-temporary-0.0.1.0
23.32 s
error: Cannot build '/nix/store/56dvk8jffxl3fviyasvi4k4z94pw19jr-pathway-system-0.0.1.0.drv '.
23.32 s
Reason: 1 dependency failed .
23.32 s
Output paths:
23.32 s
/nix/store/pmqpjy6lr5f5xlihnic0nx55mhfw2gln-pathway-system-0.0.1.0
23.32 s
/nix/store/w7v65phm85dmsqf6rnkimibj4wdhm833-pathway-system-0.0.1.0-doc
23.32 s
error: Build failed due to failed dependency
23.32 s
error: Cannot build '/nix/store/hb0lkyckyih75smvvc4h529mxzi4i14x-all-packages.drv '.
23.32 s
Reason: 1 dependency failed .
23.32 s
Output paths:
23.32 s
/nix/store/4p28hza07d5xpn2maqhpangh4fjq464w-all-packages
23.33 s
Build failed due to failed dependency
23.36 s
Build failed.