build packages.x86_64-linux.ghc967_all
0.74 s
$ /nix/store/9ypz3flqsrl5xl495mm8h645gadjsxi1-coreutils-9.11/bin/timeout --kill-after=15s 7200s /nix/store/23zk8sgzamrbmj1fday15szf7f2279s8-nix-2.34.7/bin/nix --extra-experimental-features nix-command --extra-experimental-features flakes --log-format internal-json build --no-link --print-out-paths git+https://github.com/sellout/pathway?ref=more-system&rev=bf654313bb47699f313cdd00e42ee12d835b5bed&shallow=1#packages.x86_64-linux.ghc967_all --print-build-logs
0.84 s
warning: ignoring untrusted flake configuration setting 'allow-import-from-derivation'.
0.84 s
Pass '--accept-flake-config' to trust it
0.84 s
warning: ignoring untrusted flake configuration setting 'extra-experimental-features'.
0.84 s
Pass '--accept-flake-config' to trust it
0.84 s
warning: ignoring untrusted flake configuration setting 'extra-substituters'.
0.84 s
Pass '--accept-flake-config' to trust it
0.84 s
warning: ignoring untrusted flake configuration setting 'extra-trusted-public-keys'.
0.84 s
Pass '--accept-flake-config' to trust it
0.84 s
warning: ignoring untrusted flake configuration setting 'sandbox'.
0.84 s
Pass '--accept-flake-config' to trust it
0.84 s
warning: ignoring untrusted flake configuration setting 'use-registries'.
0.84 s
Pass '--accept-flake-config' to trust it
0.84 s
error (ignored): SQLite database '/var/cache/nix-ci-worker/eval-cache-v6/ce64b74b4de8d8ae91f7291e66459c5ea87d9e2f54a2343866e5476db495272f.sqlite ' is busy
1.39 s
1.51 s
Building /nix/store/c8ld59zcpq3bz2hf64lqj0fwbh40yx3x-cabal2nix-pathway-compat-filepath.drv
1.58 s
[cabal2nix-pathway-compat-filepath:post-build] Uploading to cachix cache "sellout": /nix/store/bh07yxdrjhv0i6y9mgr1xwk62kzx7j4n-cabal2nix-pathway-compat-filepath
1.92 s
[cabal2nix-pathway-compat-filepath:post-build] Nothing to push - all store paths are already on Cachix.
1.94 s
[cabal2nix-pathway-compat-filepath:post-build] Uploading to the NixCI cache: /nix/store/bh07yxdrjhv0i6y9mgr1xwk62kzx7j4n-cabal2nix-pathway-compat-filepath
1.98 s
[cabal2nix-pathway-compat-filepath:post-build] warning: 'warn-short-path-literals' is deprecated, use 'lint-short-path-literals = ignore' instead
2.14 s
[cabal2nix-pathway-compat-filepath:post-build] copying 1 paths...
2.14 s
[cabal2nix-pathway-compat-filepath:post-build] copying path '/nix/store/bh07yxdrjhv0i6y9mgr1xwk62kzx7j4n-cabal2nix-pathway-compat-filepath' to 'https://cache.nix-ci.com'...
2.20 s
[cabal2nix-pathway-compat-filepath:post-build] warning: 'warn-short-path-literals' is deprecated, use 'lint-short-path-literals = ignore' instead
2.30 s
[cabal2nix-pathway-compat-filepath:post-build] copying 0 paths...
2.31 s
Uploaded cabal2nix-pathway-compat-filepath in 748ms
2.31 s
Progress: 1 of 2 built
2.32 s
Built cabal2nix-pathway-compat-filepath in 804ms
2.32 s
Progress: 2 of 2 built
2.32 s
3.26 s
Building /nix/store/0xfx9r31aw74hs5sjbw3nqlrrvg2y7r8-pathway-compat-filepath-0.0.1.0.drv
3.45 s
[pathway-compat-filepath] Phase: setupCompilerEnvironmentPhase
3.46 s
[pathway-compat-filepath] Build with /nix/store/2djpcnj8a25viv1y24h3mziy1gsy3fc6-ghc-9.6.7.
3.78 s
[pathway-compat-filepath] Phase: unpackPhase
3.79 s
[pathway-compat-filepath] unpacking source archive /nix/store/56v5999xvkp18l2ygdvahppqdv4hrlnl-filepath
3.80 s
[pathway-compat-filepath] source root is filepath
3.81 s
[pathway-compat-filepath] Phase: patchPhase
3.82 s
[pathway-compat-filepath] Phase: compileBuildDriverPhase
3.83 s
[pathway-compat-filepath] setupCompileFlags: -package-db=/build/tmp.d3lPm5lwVP/setup-package.conf.d -threaded
3.88 s
[pathway-compat-filepath] [1 of 2] Compiling Main ( Setup.hs, /build/tmp.d3lPm5lwVP/Main.o )
3.94 s
[pathway-compat-filepath] [2 of 2] Linking Setup
5.14 s
[pathway-compat-filepath] Phase: updateAutotoolsGnuConfigScriptsPhase
5.16 s
[pathway-compat-filepath] Phase: configurePhase
5.17 s
[pathway-compat-filepath] configureFlags: --verbose --prefix=/nix/store/0igg77m8f8gygqh7ywrf5yrrz3q05mcp-pathway-compat-filepath-0.0.1.0 --libdir=$prefix/lib/$compiler/lib --libsubdir=$abi/$libname --docdir=/nix/store/h9ipqzh965180gvqq9glid6sh6h06105-pathway-compat-filepath-0.0.1.0-doc/share/doc/pathway-compat-filepath-0.0.1.0 --with-gcc=gcc --package-db=/build/tmp.d3lPm5lwVP/package.conf.d --ghc-option=-j16 --ghc-option=+RTS --ghc-option=-A64M --ghc-option=-RTS --enable-library-profiling --profiling-detail=exported-functions --disable-profiling --enable-shared --disable-coverage --enable-static --disable-executable-dynamic --enable-tests --disable-benchmarks --enable-library-vanilla --disable-library-for-ghci --enable-split-sections --enable-library-stripping --enable-executable-stripping --ghc-option=-haddock --ghc-options=-Werror --extra-lib-dirs=/nix/store/pndhkk0l649lm1sj0mxk7cbwq26qd1ra-ncurses-6.6/lib --extra-lib-dirs=/nix/store/0djlg4g0b81w94k3vcaqsxsc2hh4kism-libffi-3.5.2/lib --extra-lib-dirs=/nix/store/md4paia7riiggyrj8p24c7a6vf8w7jz8-elfutils-0.194/lib --extra-lib-dirs=/nix/store/39vv2pf64gd8li48a4hpbhw2crzd8z5p-gmp-with-cxx-6.3.0/lib --extra-lib-dirs=/nix/store/7wwvald8lapkrsr72qanlw8blyn55ifx-numactl-2.0.18/lib --extra-lib-dirs=/nix/store/2djpcnj8a25viv1y24h3mziy1gsy3fc6-ghc-9.6.7/lib
5.18 s
[pathway-compat-filepath] Using Parsec parser
5.18 s
[pathway-compat-filepath] Configuring pathway-compat-filepath-0.0.1.0...
5.60 s
[pathway-compat-filepath] Flags chosen: noisy-deprecations=True, verify-no-recursion=False
5.60 s
[pathway-compat-filepath] Dependency base >=4.14.0 && <4.15 || >=4.15.0 && <4.16 || >=4.16.0 && <4.17 ||
5.60 s
[pathway-compat-filepath] >=4.17.0 && <4.18 || >=4.18.0 && <4.19 || >=4.19.0 && <4.20 || >=4.20.0 &&
5.60 s
[pathway-compat-filepath] <4.21 || >=4.21.0 && <4.22 || >=4.22.0 && <4.23: using base-4.18.3.0
5.60 s
[pathway-compat-filepath] Dependency extra: using extra-1.8.1
5.60 s
[pathway-compat-filepath] Dependency filepath >=1.4.2 && <1.5 || >=1.5.0 && <1.6: using
5.60 s
[pathway-compat-filepath] filepath-1.4.301.0
5.60 s
[pathway-compat-filepath] Dependency megaparsec >=9.0.1 && <9.1 || >=9.2.1 && <9.3 || >=9.5.0 && <9.6 ||
5.60 s
[pathway-compat-filepath] >=9.7.0 && <9.8: using megaparsec-9.7.0
5.60 s
[pathway-compat-filepath] Dependency os-string: using os-string-2.0.10
5.60 s
[pathway-compat-filepath] Dependency pathway >=0.0.1 && <0.1: using pathway-0.0.1.0
5.60 s
[pathway-compat-filepath] Dependency pathway-compat-base >=0.0.1 && <0.1: using
5.60 s
[pathway-compat-filepath] pathway-compat-base-0.0.1.0
5.60 s
[pathway-compat-filepath] Dependency pathway-internal >=0.0.1 && <0.1: using pathway-internal-0.0.1.0
5.60 s
[pathway-compat-filepath] Dependency base >=4.14.0 && <4.15 || >=4.15.0 && <4.16 || >=4.16.0 && <4.17 ||
5.60 s
[pathway-compat-filepath] >=4.17.0 && <4.18 || >=4.18.0 && <4.19 || >=4.19.0 && <4.20 || >=4.20.0 &&
5.60 s
[pathway-compat-filepath] <4.21 || >=4.21.0 && <4.22 || >=4.22.0 && <4.23: using base-4.18.3.0
5.60 s
[pathway-compat-filepath] Dependency doctest >=0.16.3 && <0.17 || >=0.18.1 && <0.19 || >=0.20.1 && <0.21
5.60 s
[pathway-compat-filepath] || >=0.21.1 && <0.22 || >=0.22.2 && <0.23 || >=0.24.2 && <0.25: using
5.60 s
[pathway-compat-filepath] doctest-0.24.3
5.60 s
[pathway-compat-filepath] Dependency pathway-compat-filepath: using pathway-compat-filepath-0.0.1.0
6.01 s
[pathway-compat-filepath] Source component graph:
6.02 s
[pathway-compat-filepath] component lib
6.02 s
[pathway-compat-filepath] component test:doctests dependency lib
6.02 s
[pathway-compat-filepath] Configured component graph:
6.02 s
[pathway-compat-filepath] component pathway-compat-filepath-0.0.1.0-Ck51GFznMiC2cxIfBMz4NH
6.02 s
[pathway-compat-filepath] include base-4.18.3.0
6.02 s
[pathway-compat-filepath] include extra-1.8.1-FU1frm3XcM88A49dBkmtgI
6.02 s
[pathway-compat-filepath] include filepath-1.4.301.0
6.02 s
[pathway-compat-filepath] include megaparsec-9.7.0-EpAk7LLR2KBGAKafJPbXz1
6.02 s
[pathway-compat-filepath] include os-string-2.0.10-19KGKnZaj8J2ODUMyNXxJr
6.02 s
[pathway-compat-filepath] include pathway-0.0.1.0-5VJXWbvreBAfybP2NROr3
6.02 s
[pathway-compat-filepath] include pathway-compat-base-0.0.1.0-E02izPYkwmmGdAPlQBKjbP
6.02 s
[pathway-compat-filepath] include pathway-internal-0.0.1.0-1xeSc3z2VhRIotiMz9hdL1
6.02 s
[pathway-compat-filepath] component pathway-compat-filepath-0.0.1.0-Bh4LT0cz7im2Vo1hGnl75g-doctests
6.02 s
[pathway-compat-filepath] include base-4.18.3.0
6.02 s
[pathway-compat-filepath] include doctest-0.24.3-ACQNy8u8jPjC50l4I3tyiL
6.02 s
[pathway-compat-filepath] include pathway-compat-filepath-0.0.1.0-Ck51GFznMiC2cxIfBMz4NH
6.02 s
[pathway-compat-filepath] Linked component graph:
6.02 s
[pathway-compat-filepath] unit pathway-compat-filepath-0.0.1.0-Ck51GFznMiC2cxIfBMz4NH
6.02 s
[pathway-compat-filepath] include base-4.18.3.0
6.02 s
[pathway-compat-filepath] include extra-1.8.1-FU1frm3XcM88A49dBkmtgI
6.02 s
[pathway-compat-filepath] include filepath-1.4.301.0
6.02 s
[pathway-compat-filepath] include megaparsec-9.7.0-EpAk7LLR2KBGAKafJPbXz1
6.02 s
[pathway-compat-filepath] include os-string-2.0.10-19KGKnZaj8J2ODUMyNXxJr
6.02 s
[pathway-compat-filepath] include pathway-0.0.1.0-5VJXWbvreBAfybP2NROr3
6.02 s
[pathway-compat-filepath] include pathway-compat-base-0.0.1.0-E02izPYkwmmGdAPlQBKjbP
6.02 s
[pathway-compat-filepath] include pathway-internal-0.0.1.0-1xeSc3z2VhRIotiMz9hdL1
6.02 s
[pathway-compat-filepath] Common.FilePath=pathway-compat-filepath-0.0.1.0-Ck51GFznMiC2cxIfBMz4NH:Common.FilePath,Common.OsPath=pathway-compat-filepath-0.0.1.0-Ck51GFznMiC2cxIfBMz4NH:Common.OsPath,System.FilePath=pathway-compat-filepath-0.0.1.0-Ck51GFznMiC2cxIfBMz4NH:System.FilePath,System.FilePath.Overlay=pathway-compat-filepath-0.0.1.0-Ck51GFznMiC2cxIfBMz4NH:System.FilePath.Overlay,System.FilePath.Pathway=pathway-compat-filepath-0.0.1.0-Ck51GFznMiC2cxIfBMz4NH:System.FilePath.Pathway,System.FilePath.Thin=pathway-compat-filepath-0.0.1.0-Ck51GFznMiC2cxIfBMz4NH:System.FilePath.Thin,System.OsPath=pathway-compat-filepath-0.0.1.0-Ck51GFznMiC2cxIfBMz4NH:System.OsPath,System.OsPath.Overlay=pathway-compat-filepath-0.0.1.0-Ck51GFznMiC2cxIfBMz4NH:System.OsPath.Overlay,System.OsPath.Pathway=pathway-compat-filepath-0.0.1.0-Ck51GFznMiC2cxIfBMz4NH:System.OsPath.Pathway,System.OsPath.Thin=pathway-compat-filepath-0.0.1.0-Ck51GFznMiC2cxIfBMz4NH:System.OsPath.Thin
6.02 s
[pathway-compat-filepath] unit pathway-compat-filepath-0.0.1.0-Bh4LT0cz7im2Vo1hGnl75g-doctests
6.02 s
[pathway-compat-filepath] include base-4.18.3.0
6.02 s
[pathway-compat-filepath] include doctest-0.24.3-ACQNy8u8jPjC50l4I3tyiL
6.02 s
[pathway-compat-filepath] include pathway-compat-filepath-0.0.1.0-Ck51GFznMiC2cxIfBMz4NH
6.02 s
[pathway-compat-filepath] Ready component graph:
6.02 s
[pathway-compat-filepath] definite pathway-compat-filepath-0.0.1.0-Ck51GFznMiC2cxIfBMz4NH
6.02 s
[pathway-compat-filepath] depends base-4.18.3.0
6.02 s
[pathway-compat-filepath] depends extra-1.8.1-FU1frm3XcM88A49dBkmtgI
6.02 s
[pathway-compat-filepath] depends filepath-1.4.301.0
6.02 s
[pathway-compat-filepath] depends megaparsec-9.7.0-EpAk7LLR2KBGAKafJPbXz1
6.03 s
[pathway-compat-filepath] depends os-string-2.0.10-19KGKnZaj8J2ODUMyNXxJr
6.03 s
[pathway-compat-filepath] depends pathway-0.0.1.0-5VJXWbvreBAfybP2NROr3
6.03 s
[pathway-compat-filepath] depends pathway-compat-base-0.0.1.0-E02izPYkwmmGdAPlQBKjbP
6.03 s
[pathway-compat-filepath] depends pathway-internal-0.0.1.0-1xeSc3z2VhRIotiMz9hdL1
6.03 s
[pathway-compat-filepath] definite pathway-compat-filepath-0.0.1.0-Bh4LT0cz7im2Vo1hGnl75g-doctests
6.03 s
[pathway-compat-filepath] depends base-4.18.3.0
6.03 s
[pathway-compat-filepath] depends doctest-0.24.3-ACQNy8u8jPjC50l4I3tyiL
6.03 s
[pathway-compat-filepath] depends pathway-compat-filepath-0.0.1.0-Ck51GFznMiC2cxIfBMz4NH
6.03 s
[pathway-compat-filepath] Using Cabal-3.10.3.0 compiled by ghc-9.6
6.03 s
[pathway-compat-filepath] Using compiler: ghc-9.6.7
6.03 s
[pathway-compat-filepath] Using install prefix:
6.03 s
[pathway-compat-filepath] /nix/store/0igg77m8f8gygqh7ywrf5yrrz3q05mcp-pathway-compat-filepath-0.0.1.0
6.03 s
[pathway-compat-filepath] Executables installed in:
6.03 s
[pathway-compat-filepath] /nix/store/0igg77m8f8gygqh7ywrf5yrrz3q05mcp-pathway-compat-filepath-0.0.1.0/bin
6.03 s
[pathway-compat-filepath] Libraries installed in:
6.03 s
[pathway-compat-filepath] /nix/store/0igg77m8f8gygqh7ywrf5yrrz3q05mcp-pathway-compat-filepath-0.0.1.0/lib/ghc-9.6.7/lib/x86_64-linux-ghc-9.6.7/pathway-compat-filepath-0.0.1.0-Ck51GFznMiC2cxIfBMz4NH
6.03 s
[pathway-compat-filepath] Dynamic Libraries installed in:
6.03 s
[pathway-compat-filepath] /nix/store/0igg77m8f8gygqh7ywrf5yrrz3q05mcp-pathway-compat-filepath-0.0.1.0/lib/ghc-9.6.7/lib/x86_64-linux-ghc-9.6.7
6.03 s
[pathway-compat-filepath] Private executables installed in:
6.03 s
[pathway-compat-filepath] /nix/store/0igg77m8f8gygqh7ywrf5yrrz3q05mcp-pathway-compat-filepath-0.0.1.0/libexec/x86_64-linux-ghc-9.6.7/pathway-compat-filepath-0.0.1.0
6.03 s
[pathway-compat-filepath] Data files installed in:
6.03 s
[pathway-compat-filepath] /nix/store/0igg77m8f8gygqh7ywrf5yrrz3q05mcp-pathway-compat-filepath-0.0.1.0/share/x86_64-linux-ghc-9.6.7/pathway-compat-filepath-0.0.1.0
6.03 s
[pathway-compat-filepath] Documentation installed in:
6.03 s
[pathway-compat-filepath] /nix/store/h9ipqzh965180gvqq9glid6sh6h06105-pathway-compat-filepath-0.0.1.0-doc/share/doc/pathway-compat-filepath-0.0.1.0
6.03 s
[pathway-compat-filepath] Configuration files installed in:
6.03 s
[pathway-compat-filepath] /nix/store/0igg77m8f8gygqh7ywrf5yrrz3q05mcp-pathway-compat-filepath-0.0.1.0/etc
6.03 s
[pathway-compat-filepath] No alex found
6.03 s
[pathway-compat-filepath] Using ar found on system at:
6.03 s
[pathway-compat-filepath] /nix/store/zjraf40s86y3iwhp626b934r5y6ldkbb-binutils-wrapper-2.46/bin/ar
6.03 s
[pathway-compat-filepath] No c2hs found
6.03 s
[pathway-compat-filepath] No cpphs found
6.03 s
[pathway-compat-filepath] Using doctest version 0.24.3 found on system at:
6.03 s
[pathway-compat-filepath] /nix/store/s48k56ayjjxwdbz9y7d8mnqwlcjfi1a8-doctest-0.24.3/bin/doctest
6.03 s
[pathway-compat-filepath] Using gcc version 15.2.0 given by user at:
6.03 s
[pathway-compat-filepath] /nix/store/29qjlshvklnyr67nhpprzgb9igmsfsjj-gcc-wrapper-15.2.0/bin/gcc
6.03 s
[pathway-compat-filepath] Using ghc version 9.6.7 found on system at:
6.03 s
[pathway-compat-filepath] /nix/store/2djpcnj8a25viv1y24h3mziy1gsy3fc6-ghc-9.6.7/bin/ghc
6.03 s
[pathway-compat-filepath] Using ghc-pkg version 9.6.7 found on system at:
6.03 s
[pathway-compat-filepath] /nix/store/2djpcnj8a25viv1y24h3mziy1gsy3fc6-ghc-9.6.7/bin/ghc-pkg-9.6.7
6.03 s
[pathway-compat-filepath] No ghcjs found
6.03 s
[pathway-compat-filepath] No ghcjs-pkg found
6.03 s
[pathway-compat-filepath] No greencard found
6.03 s
[pathway-compat-filepath] Using haddock version 2.29.2 found on system at:
6.03 s
[pathway-compat-filepath] /nix/store/2djpcnj8a25viv1y24h3mziy1gsy3fc6-ghc-9.6.7/bin/haddock-ghc-9.6.7
6.03 s
[pathway-compat-filepath] No happy found
6.03 s
[pathway-compat-filepath] Using haskell-suite found on system at: haskell-suite-dummy-location
6.03 s
[pathway-compat-filepath] Using haskell-suite-pkg found on system at: haskell-suite-pkg-dummy-location
6.03 s
[pathway-compat-filepath] No hmake found
6.03 s
[pathway-compat-filepath] Using hpc version 0.68 found on system at:
6.03 s
[pathway-compat-filepath] /nix/store/2djpcnj8a25viv1y24h3mziy1gsy3fc6-ghc-9.6.7/bin/hpc-ghc-9.6.7
6.03 s
[pathway-compat-filepath] Using hsc2hs version 0.68.9 found on system at:
6.03 s
[pathway-compat-filepath] /nix/store/2djpcnj8a25viv1y24h3mziy1gsy3fc6-ghc-9.6.7/bin/hsc2hs-ghc-9.6.7
6.03 s
[pathway-compat-filepath] Using hscolour version 1.25 found on system at:
6.03 s
[pathway-compat-filepath] /nix/store/2x19jxh5g98bv0s06mdj71c1hmxi54yl-hscolour-1.25/bin/HsColour
6.03 s
[pathway-compat-filepath] No jhc found
6.03 s
[pathway-compat-filepath] Using ld found on system at:
6.03 s
[pathway-compat-filepath] /nix/store/zjraf40s86y3iwhp626b934r5y6ldkbb-binutils-wrapper-2.46/bin/ld.gold
6.03 s
[pathway-compat-filepath] No pkg-config found
6.03 s
[pathway-compat-filepath] Using runghc version 9.6.7 found on system at:
6.03 s
[pathway-compat-filepath] /nix/store/2djpcnj8a25viv1y24h3mziy1gsy3fc6-ghc-9.6.7/bin/runghc-9.6.7
6.03 s
[pathway-compat-filepath] Using strip version 2.46 found on system at:
6.03 s
[pathway-compat-filepath] /nix/store/29qjlshvklnyr67nhpprzgb9igmsfsjj-gcc-wrapper-15.2.0/bin/strip
6.03 s
[pathway-compat-filepath] Using tar found on system at:
6.03 s
[pathway-compat-filepath] /nix/store/z5mq2sam4484prf3kv6v6vjw1m0i7j24-gnutar-1.35/bin/tar
6.03 s
[pathway-compat-filepath] No uhc found
6.49 s
[pathway-compat-filepath] Phase: buildPhase
6.58 s
[pathway-compat-filepath] Preprocessing library for pathway-compat-filepath-0.0.1.0..
6.58 s
[pathway-compat-filepath] Building library for pathway-compat-filepath-0.0.1.0..
6.68 s
[pathway-compat-filepath] [ 1 of 10] Compiling Common.FilePath ( src/Common/FilePath.hs, dist/build/Common/FilePath.o, dist/build/Common/FilePath.dyn_o )
7.01 s
[pathway-compat-filepath] [ 2 of 10] Compiling Common.OsPath ( src/Common/OsPath.hs, dist/build/Common/OsPath.o, dist/build/Common/OsPath.dyn_o )
7.01 s
[pathway-compat-filepath]
7.01 s
[pathway-compat-filepath] src/Common/OsPath.hs:90:23: error : [ GHC-83865 ]
7.01 s
[pathway-compat-filepath] • Couldn't match type ‘OSS.OsString’ with ‘OsString’
7.01 s
[pathway-compat-filepath] Expected: OsPath
7.01 s
[pathway-compat-filepath] Actual: OSS.OsString
7.01 s
[pathway-compat-filepath] NB: ‘OsString’
7.01 s
[pathway-compat-filepath] is defined in ‘System.OsString.Internal.Types.Hidden’
7.01 s
[pathway-compat-filepath] in package ‘filepath-1.4.301.0’
7.01 s
[pathway-compat-filepath] ‘OSS.OsString’
7.01 s
[pathway-compat-filepath] is defined in ‘System.OsString.Internal.Types’
7.01 s
[pathway-compat-filepath] in package ‘os-string-2.0.10’
7.01 s
[pathway-compat-filepath] • In the ‘parent’ field of a record
7.01 s
[pathway-compat-filepath] In the expression:
7.01 s
[pathway-compat-filepath] Format
7.01 s
[pathway-compat-filepath] {Format.root = O.pack . pure $ O.pathSeparator,
7.01 s
[pathway-compat-filepath] Format.current = mempty, Format.parent = OSS.unsafeEncodeUtf "..",
7.01 s
[pathway-compat-filepath] Format.separator = O.pack . pure $ O.pathSeparator,
7.01 s
[pathway-compat-filepath] Format.substitutions = mempty}
7.01 s
[pathway-compat-filepath] In an equation for ‘localFormat’:
7.01 s
[pathway-compat-filepath] localFormat
7.01 s
[pathway-compat-filepath] = Format
7.01 s
[pathway-compat-filepath] {Format.root = O.pack . pure $ O.pathSeparator,
7.01 s
[pathway-compat-filepath] Format.current = mempty, Format.parent = OSS.unsafeEncodeUtf "..",
7.01 s
[pathway-compat-filepath] Format.separator = O.pack . pure $ O.pathSeparator,
7.01 s
[pathway-compat-filepath] Format.substitutions = mempty}
7.01 s
[pathway-compat-filepath] |
7.01 s
[pathway-compat-filepath] 90 | Format.parent = OSS.unsafeEncodeUtf ".." ,
7.01 s
[pathway-compat-filepath] | ^^^^^^^^^^^^^^^^^^^^^^^^
7.01 s
[pathway-compat-filepath] [ 3 of 10] Compiling System.FilePath.Thin ( src/System/FilePath/Thin.hs, dist/build/System/FilePath/Thin.o, dist/build/System/FilePath/Thin.dyn_o )
7.11 s
[pathway-compat-filepath] [ 4 of 10] Compiling System.FilePath.Pathway ( src/System/FilePath/Pathway.hs, dist/build/System/FilePath/Pathway.o, dist/build/System/FilePath/Pathway.dyn_o )
7.15 s
[pathway-compat-filepath] [ 5 of 10] Compiling System.FilePath.Overlay ( src/System/FilePath/Overlay.hs, dist/build/System/FilePath/Overlay.o, dist/build/System/FilePath/Overlay.dyn_o )
7.17 s
[pathway-compat-filepath] [ 6 of 10] Compiling System.FilePath ( src/System/FilePath.hs, dist/build/System/FilePath.o, dist/build/System/FilePath.dyn_o )
7.48 s
Progress: 0 of 12 built (1 failed)
7.48 s
Failed to build pathway-compat-filepath after 4.2s
7.48 s
error: Cannot build '/nix/store/0xfx9r31aw74hs5sjbw3nqlrrvg2y7r8-pathway-compat-filepath-0.0.1.0.drv '.
7.48 s
Reason: builder failed with exit code 1 .
7.48 s
Output paths:
7.48 s
/nix/store/0igg77m8f8gygqh7ywrf5yrrz3q05mcp-pathway-compat-filepath-0.0.1.0
7.48 s
/nix/store/h9ipqzh965180gvqq9glid6sh6h06105-pathway-compat-filepath-0.0.1.0-doc
7.48 s
Last 176 log lines:
7.48 s
> Running phase: setupCompilerEnvironmentPhase
7.48 s
> Build with /nix/store/2djpcnj8a25viv1y24h3mziy1gsy3fc6-ghc-9.6.7.
7.48 s
> Running phase: unpackPhase
7.48 s
> unpacking source archive /nix/store/56v5999xvkp18l2ygdvahppqdv4hrlnl-filepath
7.48 s
> source root is filepath
7.48 s
> Running phase: patchPhase
7.48 s
> Running phase: compileBuildDriverPhase
7.48 s
> setupCompileFlags: -package-db=/build/tmp.d3lPm5lwVP/setup-package.conf.d -threaded
7.48 s
> [1 of 2] Compiling Main ( Setup.hs, /build/tmp.d3lPm5lwVP/Main.o )
7.48 s
> [2 of 2] Linking Setup
7.48 s
> Running phase: updateAutotoolsGnuConfigScriptsPhase
7.48 s
> Running phase: configurePhase
7.48 s
> configureFlags: --verbose --prefix=/nix/store/0igg77m8f8gygqh7ywrf5yrrz3q05mcp-pathway-compat-filepath-0.0.1.0 --libdir=$prefix/lib/$compiler/lib --libsubdir=$abi/$libname --docdir=/nix/store/h9ipqzh965180gvqq9glid6sh6h06105-pathway-compat-filepath-0.0.1.0-doc/share/doc/pathway-compat-filepath-0.0.1.0 --with-gcc=gcc --package-db=/build/tmp.d3lPm5lwVP/package.conf.d --ghc-option=-j16 --ghc-option=+RTS --ghc-option=-A64M --ghc-option=-RTS --enable-library-profiling --profiling-detail=exported-functions --disable-profiling --enable-shared --disable-coverage --enable-static --disable-executable-dynamic --enable-tests --disable-benchmarks --enable-library-vanilla --disable-library-for-ghci --enable-split-sections --enable-library-stripping --enable-executable-stripping --ghc-option=-haddock --ghc-options=-Werror --extra-lib-dirs=/nix/store/pndhkk0l649lm1sj0mxk7cbwq26qd1ra-ncurses-6.6/lib --extra-lib-dirs=/nix/store/0djlg4g0b81w94k3vcaqsxsc2hh4kism-libffi-3.5.2/lib --extra-lib-dirs=/nix/store/md4paia7riiggyrj8p24c7a6vf8w7jz8-elfutils-0.194/lib --extra-lib-dirs=/nix/store/39vv2pf64gd8li48a4hpbhw2crzd8z5p-gmp-with-cxx-6.3.0/lib --extra-lib-dirs=/nix/store/7wwvald8lapkrsr72qanlw8blyn55ifx-numactl-2.0.18/lib --extra-lib-dirs=/nix/store/2djpcnj8a25viv1y24h3mziy1gsy3fc6-ghc-9.6.7/lib
7.48 s
> Using Parsec parser
7.48 s
> Configuring pathway-compat-filepath-0.0.1.0...
7.48 s
> Flags chosen: noisy-deprecations=True, verify-no-recursion=False
7.48 s
> Dependency base >=4.14.0 && <4.15 || >=4.15.0 && <4.16 || >=4.16.0 && <4.17 ||
7.48 s
> >=4.17.0 && <4.18 || >=4.18.0 && <4.19 || >=4.19.0 && <4.20 || >=4.20.0 &&
7.48 s
> <4.21 || >=4.21.0 && <4.22 || >=4.22.0 && <4.23: using base-4.18.3.0
7.48 s
> Dependency extra: using extra-1.8.1
7.48 s
> Dependency filepath >=1.4.2 && <1.5 || >=1.5.0 && <1.6: using
7.48 s
> filepath-1.4.301.0
7.48 s
> Dependency megaparsec >=9.0.1 && <9.1 || >=9.2.1 && <9.3 || >=9.5.0 && <9.6 ||
7.48 s
> >=9.7.0 && <9.8: using megaparsec-9.7.0
7.48 s
> Dependency os-string: using os-string-2.0.10
7.48 s
> Dependency pathway >=0.0.1 && <0.1: using pathway-0.0.1.0
7.48 s
> Dependency pathway-compat-base >=0.0.1 && <0.1: using
7.48 s
> pathway-compat-base-0.0.1.0
7.48 s
> Dependency pathway-internal >=0.0.1 && <0.1: using pathway-internal-0.0.1.0
7.48 s
> Dependency base >=4.14.0 && <4.15 || >=4.15.0 && <4.16 || >=4.16.0 && <4.17 ||
7.48 s
> >=4.17.0 && <4.18 || >=4.18.0 && <4.19 || >=4.19.0 && <4.20 || >=4.20.0 &&
7.48 s
> <4.21 || >=4.21.0 && <4.22 || >=4.22.0 && <4.23: using base-4.18.3.0
7.48 s
> Dependency doctest >=0.16.3 && <0.17 || >=0.18.1 && <0.19 || >=0.20.1 && <0.21
7.48 s
> || >=0.21.1 && <0.22 || >=0.22.2 && <0.23 || >=0.24.2 && <0.25: using
7.48 s
> doctest-0.24.3
7.48 s
> Dependency pathway-compat-filepath: using pathway-compat-filepath-0.0.1.0
7.48 s
> Source component graph:
7.48 s
> component lib
7.48 s
> component test:doctests dependency lib
7.48 s
> Configured component graph:
7.48 s
> component pathway-compat-filepath-0.0.1.0-Ck51GFznMiC2cxIfBMz4NH
7.48 s
> include base-4.18.3.0
7.48 s
> include extra-1.8.1-FU1frm3XcM88A49dBkmtgI
7.48 s
> include filepath-1.4.301.0
7.48 s
> include megaparsec-9.7.0-EpAk7LLR2KBGAKafJPbXz1
7.48 s
> include os-string-2.0.10-19KGKnZaj8J2ODUMyNXxJr
7.48 s
> include pathway-0.0.1.0-5VJXWbvreBAfybP2NROr3
7.48 s
> include pathway-compat-base-0.0.1.0-E02izPYkwmmGdAPlQBKjbP
7.48 s
> include pathway-internal-0.0.1.0-1xeSc3z2VhRIotiMz9hdL1
7.48 s
> component pathway-compat-filepath-0.0.1.0-Bh4LT0cz7im2Vo1hGnl75g-doctests
7.48 s
> include base-4.18.3.0
7.48 s
> include doctest-0.24.3-ACQNy8u8jPjC50l4I3tyiL
7.48 s
> include pathway-compat-filepath-0.0.1.0-Ck51GFznMiC2cxIfBMz4NH
7.48 s
> Linked component graph:
7.48 s
> unit pathway-compat-filepath-0.0.1.0-Ck51GFznMiC2cxIfBMz4NH
7.48 s
> include base-4.18.3.0
7.48 s
> include extra-1.8.1-FU1frm3XcM88A49dBkmtgI
7.48 s
> include filepath-1.4.301.0
7.48 s
> include megaparsec-9.7.0-EpAk7LLR2KBGAKafJPbXz1
7.48 s
> include os-string-2.0.10-19KGKnZaj8J2ODUMyNXxJr
7.48 s
> include pathway-0.0.1.0-5VJXWbvreBAfybP2NROr3
7.48 s
> include pathway-compat-base-0.0.1.0-E02izPYkwmmGdAPlQBKjbP
7.48 s
> include pathway-internal-0.0.1.0-1xeSc3z2VhRIotiMz9hdL1
7.48 s
> Common.FilePath=pathway-compat-filepath-0.0.1.0-Ck51GFznMiC2cxIfBMz4NH:Common.FilePath,Common.OsPath=pathway-compat-filepath-0.0.1.0-Ck51GFznMiC2cxIfBMz4NH:Common.OsPath,System.FilePath=pathway-compat-filepath-0.0.1.0-Ck51GFznMiC2cxIfBMz4NH:System.FilePath,System.FilePath.Overlay=pathway-compat-filepath-0.0.1.0-Ck51GFznMiC2cxIfBMz4NH:System.FilePath.Overlay,System.FilePath.Pathway=pathway-compat-filepath-0.0.1.0-Ck51GFznMiC2cxIfBMz4NH:System.FilePath.Pathway,System.FilePath.Thin=pathway-compat-filepath-0.0.1.0-Ck51GFznMiC2cxIfBMz4NH:System.FilePath.Thin,System.OsPath=pathway-compat-filepath-0.0.1.0-Ck51GFznMiC2cxIfBMz4NH:System.OsPath,System.OsPath.Overlay=pathway-compat-filepath-0.0.1.0-Ck51GFznMiC2cxIfBMz4NH:System.OsPath.Overlay,System.OsPath.Pathway=pathway-compat-filepath-0.0.1.0-Ck51GFznMiC2cxIfBMz4NH:System.OsPath.Pathway,System.OsPath.Thin=pathway-compat-filepath-0.0.1.0-Ck51GFznMiC2cxIfBMz4NH:System.OsPath.Thin
7.48 s
> unit pathway-compat-filepath-0.0.1.0-Bh4LT0cz7im2Vo1hGnl75g-doctests
7.48 s
> include base-4.18.3.0
7.48 s
> include doctest-0.24.3-ACQNy8u8jPjC50l4I3tyiL
7.48 s
> include pathway-compat-filepath-0.0.1.0-Ck51GFznMiC2cxIfBMz4NH
7.48 s
> Ready component graph:
7.48 s
> definite pathway-compat-filepath-0.0.1.0-Ck51GFznMiC2cxIfBMz4NH
7.48 s
> depends base-4.18.3.0
7.48 s
> depends extra-1.8.1-FU1frm3XcM88A49dBkmtgI
7.48 s
> depends filepath-1.4.301.0
7.48 s
> depends megaparsec-9.7.0-EpAk7LLR2KBGAKafJPbXz1
7.48 s
> depends os-string-2.0.10-19KGKnZaj8J2ODUMyNXxJr
7.48 s
> depends pathway-0.0.1.0-5VJXWbvreBAfybP2NROr3
7.48 s
> depends pathway-compat-base-0.0.1.0-E02izPYkwmmGdAPlQBKjbP
7.48 s
> depends pathway-internal-0.0.1.0-1xeSc3z2VhRIotiMz9hdL1
7.48 s
> definite pathway-compat-filepath-0.0.1.0-Bh4LT0cz7im2Vo1hGnl75g-doctests
7.48 s
> depends base-4.18.3.0
7.48 s
> depends doctest-0.24.3-ACQNy8u8jPjC50l4I3tyiL
7.48 s
> depends pathway-compat-filepath-0.0.1.0-Ck51GFznMiC2cxIfBMz4NH
7.48 s
> Using Cabal-3.10.3.0 compiled by ghc-9.6
7.48 s
> Using compiler: ghc-9.6.7
7.48 s
> Using install prefix:
7.48 s
> /nix/store/0igg77m8f8gygqh7ywrf5yrrz3q05mcp-pathway-compat-filepath-0.0.1.0
7.48 s
> Executables installed in:
7.48 s
> /nix/store/0igg77m8f8gygqh7ywrf5yrrz3q05mcp-pathway-compat-filepath-0.0.1.0/bin
7.48 s
> Libraries installed in:
7.48 s
> /nix/store/0igg77m8f8gygqh7ywrf5yrrz3q05mcp-pathway-compat-filepath-0.0.1.0/lib/ghc-9.6.7/lib/x86_64-linux-ghc-9.6.7/pathway-compat-filepath-0.0.1.0-Ck51GFznMiC2cxIfBMz4NH
7.48 s
> Dynamic Libraries installed in:
7.48 s
> /nix/store/0igg77m8f8gygqh7ywrf5yrrz3q05mcp-pathway-compat-filepath-0.0.1.0/lib/ghc-9.6.7/lib/x86_64-linux-ghc-9.6.7
7.48 s
> Private executables installed in:
7.48 s
> /nix/store/0igg77m8f8gygqh7ywrf5yrrz3q05mcp-pathway-compat-filepath-0.0.1.0/libexec/x86_64-linux-ghc-9.6.7/pathway-compat-filepath-0.0.1.0
7.48 s
> Data files installed in:
7.48 s
> /nix/store/0igg77m8f8gygqh7ywrf5yrrz3q05mcp-pathway-compat-filepath-0.0.1.0/share/x86_64-linux-ghc-9.6.7/pathway-compat-filepath-0.0.1.0
7.48 s
> Documentation installed in:
7.48 s
> /nix/store/h9ipqzh965180gvqq9glid6sh6h06105-pathway-compat-filepath-0.0.1.0-doc/share/doc/pathway-compat-filepath-0.0.1.0
7.48 s
> Configuration files installed in:
7.48 s
> /nix/store/0igg77m8f8gygqh7ywrf5yrrz3q05mcp-pathway-compat-filepath-0.0.1.0/etc
7.48 s
> No alex found
7.48 s
> Using ar found on system at:
7.48 s
> /nix/store/zjraf40s86y3iwhp626b934r5y6ldkbb-binutils-wrapper-2.46/bin/ar
7.48 s
> No c2hs found
7.48 s
> No cpphs found
7.48 s
> Using doctest version 0.24.3 found on system at:
7.48 s
> /nix/store/s48k56ayjjxwdbz9y7d8mnqwlcjfi1a8-doctest-0.24.3/bin/doctest
7.48 s
> Using gcc version 15.2.0 given by user at:
7.48 s
> /nix/store/29qjlshvklnyr67nhpprzgb9igmsfsjj-gcc-wrapper-15.2.0/bin/gcc
7.48 s
> Using ghc version 9.6.7 found on system at:
7.48 s
> /nix/store/2djpcnj8a25viv1y24h3mziy1gsy3fc6-ghc-9.6.7/bin/ghc
7.48 s
> Using ghc-pkg version 9.6.7 found on system at:
7.48 s
> /nix/store/2djpcnj8a25viv1y24h3mziy1gsy3fc6-ghc-9.6.7/bin/ghc-pkg-9.6.7
7.48 s
> No ghcjs found
7.48 s
> No ghcjs-pkg found
7.48 s
> No greencard found
7.48 s
> Using haddock version 2.29.2 found on system at:
7.48 s
> /nix/store/2djpcnj8a25viv1y24h3mziy1gsy3fc6-ghc-9.6.7/bin/haddock-ghc-9.6.7
7.48 s
> No happy found
7.48 s
> Using haskell-suite found on system at: haskell-suite-dummy-location
7.48 s
> Using haskell-suite-pkg found on system at: haskell-suite-pkg-dummy-location
7.48 s
> No hmake found
7.48 s
> Using hpc version 0.68 found on system at:
7.48 s
> /nix/store/2djpcnj8a25viv1y24h3mziy1gsy3fc6-ghc-9.6.7/bin/hpc-ghc-9.6.7
7.48 s
> Using hsc2hs version 0.68.9 found on system at:
7.48 s
> /nix/store/2djpcnj8a25viv1y24h3mziy1gsy3fc6-ghc-9.6.7/bin/hsc2hs-ghc-9.6.7
7.48 s
> Using hscolour version 1.25 found on system at:
7.48 s
> /nix/store/2x19jxh5g98bv0s06mdj71c1hmxi54yl-hscolour-1.25/bin/HsColour
7.48 s
> No jhc found
7.48 s
> Using ld found on system at:
7.48 s
> /nix/store/zjraf40s86y3iwhp626b934r5y6ldkbb-binutils-wrapper-2.46/bin/ld.gold
7.48 s
> No pkg-config found
7.48 s
> Using runghc version 9.6.7 found on system at:
7.48 s
> /nix/store/2djpcnj8a25viv1y24h3mziy1gsy3fc6-ghc-9.6.7/bin/runghc-9.6.7
7.48 s
> Using strip version 2.46 found on system at:
7.48 s
> /nix/store/29qjlshvklnyr67nhpprzgb9igmsfsjj-gcc-wrapper-15.2.0/bin/strip
7.48 s
> Using tar found on system at:
7.48 s
> /nix/store/z5mq2sam4484prf3kv6v6vjw1m0i7j24-gnutar-1.35/bin/tar
7.48 s
> No uhc found
7.48 s
> Running phase: buildPhase
7.48 s
> Preprocessing library for pathway-compat-filepath-0.0.1.0..
7.48 s
> Building library for pathway-compat-filepath-0.0.1.0..
7.48 s
> [ 1 of 10] Compiling Common.FilePath ( src/Common/FilePath.hs, dist/build/Common/FilePath.o, dist/build/Common/FilePath.dyn_o )
7.48 s
> [ 2 of 10] Compiling Common.OsPath ( src/Common/OsPath.hs, dist/build/Common/OsPath.o, dist/build/Common/OsPath.dyn_o )
7.48 s
>
7.48 s
> src/Common/OsPath.hs:90:23: error : [ GHC-83865 ]
7.48 s
> • Couldn't match type ‘OSS.OsString’ with ‘OsString’
7.48 s
> Expected: OsPath
7.48 s
> Actual: OSS.OsString
7.48 s
> NB: ‘OsString’
7.48 s
> is defined in ‘System.OsString.Internal.Types.Hidden’
7.48 s
> in package ‘filepath-1.4.301.0’
7.48 s
> ‘OSS.OsString’
7.48 s
> is defined in ‘System.OsString.Internal.Types’
7.48 s
> in package ‘os-string-2.0.10’
7.48 s
> • In the ‘parent’ field of a record
7.48 s
> In the expression:
7.48 s
> Format
7.48 s
> {Format.root = O.pack . pure $ O.pathSeparator,
7.48 s
> Format.current = mempty, Format.parent = OSS.unsafeEncodeUtf "..",
7.48 s
> Format.separator = O.pack . pure $ O.pathSeparator,
7.48 s
> Format.substitutions = mempty}
7.48 s
> In an equation for ‘localFormat’:
7.48 s
> localFormat
7.48 s
> = Format
7.48 s
> {Format.root = O.pack . pure $ O.pathSeparator,
7.48 s
> Format.current = mempty, Format.parent = OSS.unsafeEncodeUtf "..",
7.48 s
> Format.separator = O.pack . pure $ O.pathSeparator,
7.48 s
> Format.substitutions = mempty}
7.48 s
> |
7.48 s
> 90 | Format.parent = OSS.unsafeEncodeUtf ".." ,
7.48 s
> | ^^^^^^^^^^^^^^^^^^^^^^^^
7.48 s
> [ 3 of 10] Compiling System.FilePath.Thin ( src/System/FilePath/Thin.hs, dist/build/System/FilePath/Thin.o, dist/build/System/FilePath/Thin.dyn_o )
7.48 s
> [ 4 of 10] Compiling System.FilePath.Pathway ( src/System/FilePath/Pathway.hs, dist/build/System/FilePath/Pathway.o, dist/build/System/FilePath/Pathway.dyn_o )
7.48 s
> [ 5 of 10] Compiling System.FilePath.Overlay ( src/System/FilePath/Overlay.hs, dist/build/System/FilePath/Overlay.o, dist/build/System/FilePath/Overlay.dyn_o )
7.48 s
> [ 6 of 10] Compiling System.FilePath ( src/System/FilePath.hs, dist/build/System/FilePath.o, dist/build/System/FilePath.dyn_o )
7.48 s
For full logs, run:
7.48 s
nix log /nix/store/0xfx9r31aw74hs5sjbw3nqlrrvg2y7r8-pathway-compat-filepath-0.0.1.0.drv
7.48 s
error: Cannot build '/nix/store/0xfx9r31aw74hs5sjbw3nqlrrvg2y7r8-pathway-compat-filepath-0.0.1.0.drv '.
7.48 s
Reason: builder failed with exit code 1 .
7.48 s
Output paths:
7.48 s
/nix/store/0igg77m8f8gygqh7ywrf5yrrz3q05mcp-pathway-compat-filepath-0.0.1.0
7.48 s
/nix/store/h9ipqzh965180gvqq9glid6sh6h06105-pathway-compat-filepath-0.0.1.0-doc
7.48 s
Last 176 log lines:
7.48 s
> Running phase: setupCompilerEnvironmentPhase
7.48 s
> Build with /nix/store/2djpcnj8a25viv1y24h3mziy1gsy3fc6-ghc-9.6.7.
7.48 s
> Running phase: unpackPhase
7.48 s
> unpacking source archive /nix/store/56v5999xvkp18l2ygdvahppqdv4hrlnl-filepath
7.48 s
> source root is filepath
7.48 s
> Running phase: patchPhase
7.48 s
> Running phase: compileBuildDriverPhase
7.48 s
> setupCompileFlags: -package-db=/build/tmp.d3lPm5lwVP/setup-package.conf.d -threaded
7.48 s
> [1 of 2] Compiling Main ( Setup.hs, /build/tmp.d3lPm5lwVP/Main.o )
7.48 s
> [2 of 2] Linking Setup
7.48 s
> Running phase: updateAutotoolsGnuConfigScriptsPhase
7.48 s
> Running phase: configurePhase
7.48 s
> configureFlags: --verbose --prefix=/nix/store/0igg77m8f8gygqh7ywrf5yrrz3q05mcp-pathway-compat-filepath-0.0.1.0 --libdir=$prefix/lib/$compiler/lib --libsubdir=$abi/$libname --docdir=/nix/store/h9ipqzh965180gvqq9glid6sh6h06105-pathway-compat-filepath-0.0.1.0-doc/share/doc/pathway-compat-filepath-0.0.1.0 --with-gcc=gcc --package-db=/build/tmp.d3lPm5lwVP/package.conf.d --ghc-option=-j16 --ghc-option=+RTS --ghc-option=-A64M --ghc-option=-RTS --enable-library-profiling --profiling-detail=exported-functions --disable-profiling --enable-shared --disable-coverage --enable-static --disable-executable-dynamic --enable-tests --disable-benchmarks --enable-library-vanilla --disable-library-for-ghci --enable-split-sections --enable-library-stripping --enable-executable-stripping --ghc-option=-haddock --ghc-options=-Werror --extra-lib-dirs=/nix/store/pndhkk0l649lm1sj0mxk7cbwq26qd1ra-ncurses-6.6/lib --extra-lib-dirs=/nix/store/0djlg4g0b81w94k3vcaqsxsc2hh4kism-libffi-3.5.2/lib --extra-lib-dirs=/nix/store/md4paia7riiggyrj8p24c7a6vf8w7jz8-elfutils-0.194/lib --extra-lib-dirs=/nix/store/39vv2pf64gd8li48a4hpbhw2crzd8z5p-gmp-with-cxx-6.3.0/lib --extra-lib-dirs=/nix/store/7wwvald8lapkrsr72qanlw8blyn55ifx-numactl-2.0.18/lib --extra-lib-dirs=/nix/store/2djpcnj8a25viv1y24h3mziy1gsy3fc6-ghc-9.6.7/lib
7.48 s
> Using Parsec parser
7.48 s
> Configuring pathway-compat-filepath-0.0.1.0...
7.48 s
> Flags chosen: noisy-deprecations=True, verify-no-recursion=False
7.48 s
> Dependency base >=4.14.0 && <4.15 || >=4.15.0 && <4.16 || >=4.16.0 && <4.17 ||
7.48 s
> >=4.17.0 && <4.18 || >=4.18.0 && <4.19 || >=4.19.0 && <4.20 || >=4.20.0 &&
7.48 s
> <4.21 || >=4.21.0 && <4.22 || >=4.22.0 && <4.23: using base-4.18.3.0
7.48 s
> Dependency extra: using extra-1.8.1
7.48 s
> Dependency filepath >=1.4.2 && <1.5 || >=1.5.0 && <1.6: using
7.48 s
> filepath-1.4.301.0
7.48 s
> Dependency megaparsec >=9.0.1 && <9.1 || >=9.2.1 && <9.3 || >=9.5.0 && <9.6 ||
7.48 s
> >=9.7.0 && <9.8: using megaparsec-9.7.0
7.48 s
> Dependency os-string: using os-string-2.0.10
7.48 s
> Dependency pathway >=0.0.1 && <0.1: using pathway-0.0.1.0
7.48 s
> Dependency pathway-compat-base >=0.0.1 && <0.1: using
7.48 s
> pathway-compat-base-0.0.1.0
7.48 s
> Dependency pathway-internal >=0.0.1 && <0.1: using pathway-internal-0.0.1.0
7.48 s
> Dependency base >=4.14.0 && <4.15 || >=4.15.0 && <4.16 || >=4.16.0 && <4.17 ||
7.48 s
> >=4.17.0 && <4.18 || >=4.18.0 && <4.19 || >=4.19.0 && <4.20 || >=4.20.0 &&
7.48 s
> <4.21 || >=4.21.0 && <4.22 || >=4.22.0 && <4.23: using base-4.18.3.0
7.48 s
> Dependency doctest >=0.16.3 && <0.17 || >=0.18.1 && <0.19 || >=0.20.1 && <0.21
7.48 s
> || >=0.21.1 && <0.22 || >=0.22.2 && <0.23 || >=0.24.2 && <0.25: using
7.48 s
> doctest-0.24.3
7.48 s
> Dependency pathway-compat-filepath: using pathway-compat-filepath-0.0.1.0
7.48 s
> Source component graph:
7.48 s
> component lib
7.48 s
> component test:doctests dependency lib
7.48 s
> Configured component graph:
7.48 s
> component pathway-compat-filepath-0.0.1.0-Ck51GFznMiC2cxIfBMz4NH
7.48 s
> include base-4.18.3.0
7.48 s
> include extra-1.8.1-FU1frm3XcM88A49dBkmtgI
7.48 s
> include filepath-1.4.301.0
7.48 s
> include megaparsec-9.7.0-EpAk7LLR2KBGAKafJPbXz1
7.48 s
> include os-string-2.0.10-19KGKnZaj8J2ODUMyNXxJr
7.48 s
> include pathway-0.0.1.0-5VJXWbvreBAfybP2NROr3
7.48 s
> include pathway-compat-base-0.0.1.0-E02izPYkwmmGdAPlQBKjbP
7.48 s
> include pathway-internal-0.0.1.0-1xeSc3z2VhRIotiMz9hdL1
7.48 s
> component pathway-compat-filepath-0.0.1.0-Bh4LT0cz7im2Vo1hGnl75g-doctests
7.48 s
> include base-4.18.3.0
7.48 s
> include doctest-0.24.3-ACQNy8u8jPjC50l4I3tyiL
7.48 s
> include pathway-compat-filepath-0.0.1.0-Ck51GFznMiC2cxIfBMz4NH
7.48 s
> Linked component graph:
7.48 s
> unit pathway-compat-filepath-0.0.1.0-Ck51GFznMiC2cxIfBMz4NH
7.48 s
> include base-4.18.3.0
7.48 s
> include extra-1.8.1-FU1frm3XcM88A49dBkmtgI
7.48 s
> include filepath-1.4.301.0
7.48 s
> include megaparsec-9.7.0-EpAk7LLR2KBGAKafJPbXz1
7.48 s
> include os-string-2.0.10-19KGKnZaj8J2ODUMyNXxJr
7.48 s
> include pathway-0.0.1.0-5VJXWbvreBAfybP2NROr3
7.48 s
> include pathway-compat-base-0.0.1.0-E02izPYkwmmGdAPlQBKjbP
7.48 s
> include pathway-internal-0.0.1.0-1xeSc3z2VhRIotiMz9hdL1
7.48 s
> Common.FilePath=pathway-compat-filepath-0.0.1.0-Ck51GFznMiC2cxIfBMz4NH:Common.FilePath,Common.OsPath=pathway-compat-filepath-0.0.1.0-Ck51GFznMiC2cxIfBMz4NH:Common.OsPath,System.FilePath=pathway-compat-filepath-0.0.1.0-Ck51GFznMiC2cxIfBMz4NH:System.FilePath,System.FilePath.Overlay=pathway-compat-filepath-0.0.1.0-Ck51GFznMiC2cxIfBMz4NH:System.FilePath.Overlay,System.FilePath.Pathway=pathway-compat-filepath-0.0.1.0-Ck51GFznMiC2cxIfBMz4NH:System.FilePath.Pathway,System.FilePath.Thin=pathway-compat-filepath-0.0.1.0-Ck51GFznMiC2cxIfBMz4NH:System.FilePath.Thin,System.OsPath=pathway-compat-filepath-0.0.1.0-Ck51GFznMiC2cxIfBMz4NH:System.OsPath,System.OsPath.Overlay=pathway-compat-filepath-0.0.1.0-Ck51GFznMiC2cxIfBMz4NH:System.OsPath.Overlay,System.OsPath.Pathway=pathway-compat-filepath-0.0.1.0-Ck51GFznMiC2cxIfBMz4NH:System.OsPath.Pathway,System.OsPath.Thin=pathway-compat-filepath-0.0.1.0-Ck51GFznMiC2cxIfBMz4NH:System.OsPath.Thin
7.48 s
> unit pathway-compat-filepath-0.0.1.0-Bh4LT0cz7im2Vo1hGnl75g-doctests
7.48 s
> include base-4.18.3.0
7.48 s
> include doctest-0.24.3-ACQNy8u8jPjC50l4I3tyiL
7.48 s
> include pathway-compat-filepath-0.0.1.0-Ck51GFznMiC2cxIfBMz4NH
7.48 s
> Ready component graph:
7.48 s
> definite pathway-compat-filepath-0.0.1.0-Ck51GFznMiC2cxIfBMz4NH
7.48 s
> depends base-4.18.3.0
7.48 s
> depends extra-1.8.1-FU1frm3XcM88A49dBkmtgI
7.48 s
> depends filepath-1.4.301.0
7.48 s
> depends megaparsec-9.7.0-EpAk7LLR2KBGAKafJPbXz1
7.48 s
> depends os-string-2.0.10-19KGKnZaj8J2ODUMyNXxJr
7.48 s
> depends pathway-0.0.1.0-5VJXWbvreBAfybP2NROr3
7.48 s
> depends pathway-compat-base-0.0.1.0-E02izPYkwmmGdAPlQBKjbP
7.48 s
> depends pathway-internal-0.0.1.0-1xeSc3z2VhRIotiMz9hdL1
7.48 s
> definite pathway-compat-filepath-0.0.1.0-Bh4LT0cz7im2Vo1hGnl75g-doctests
7.48 s
> depends base-4.18.3.0
7.48 s
> depends doctest-0.24.3-ACQNy8u8jPjC50l4I3tyiL
7.48 s
> depends pathway-compat-filepath-0.0.1.0-Ck51GFznMiC2cxIfBMz4NH
7.48 s
> Using Cabal-3.10.3.0 compiled by ghc-9.6
7.48 s
> Using compiler: ghc-9.6.7
7.48 s
> Using install prefix:
7.48 s
> /nix/store/0igg77m8f8gygqh7ywrf5yrrz3q05mcp-pathway-compat-filepath-0.0.1.0
7.48 s
> Executables installed in:
7.48 s
> /nix/store/0igg77m8f8gygqh7ywrf5yrrz3q05mcp-pathway-compat-filepath-0.0.1.0/bin
7.48 s
> Libraries installed in:
7.48 s
> /nix/store/0igg77m8f8gygqh7ywrf5yrrz3q05mcp-pathway-compat-filepath-0.0.1.0/lib/ghc-9.6.7/lib/x86_64-linux-ghc-9.6.7/pathway-compat-filepath-0.0.1.0-Ck51GFznMiC2cxIfBMz4NH
7.48 s
> Dynamic Libraries installed in:
7.48 s
> /nix/store/0igg77m8f8gygqh7ywrf5yrrz3q05mcp-pathway-compat-filepath-0.0.1.0/lib/ghc-9.6.7/lib/x86_64-linux-ghc-9.6.7
7.48 s
> Private executables installed in:
7.48 s
> /nix/store/0igg77m8f8gygqh7ywrf5yrrz3q05mcp-pathway-compat-filepath-0.0.1.0/libexec/x86_64-linux-ghc-9.6.7/pathway-compat-filepath-0.0.1.0
7.48 s
> Data files installed in:
7.48 s
> /nix/store/0igg77m8f8gygqh7ywrf5yrrz3q05mcp-pathway-compat-filepath-0.0.1.0/share/x86_64-linux-ghc-9.6.7/pathway-compat-filepath-0.0.1.0
7.48 s
> Documentation installed in:
7.48 s
> /nix/store/h9ipqzh965180gvqq9glid6sh6h06105-pathway-compat-filepath-0.0.1.0-doc/share/doc/pathway-compat-filepath-0.0.1.0
7.48 s
> Configuration files installed in:
7.48 s
> /nix/store/0igg77m8f8gygqh7ywrf5yrrz3q05mcp-pathway-compat-filepath-0.0.1.0/etc
7.48 s
> No alex found
7.48 s
> Using ar found on system at:
7.48 s
> /nix/store/zjraf40s86y3iwhp626b934r5y6ldkbb-binutils-wrapper-2.46/bin/ar
7.48 s
> No c2hs found
7.48 s
> No cpphs found
7.48 s
> Using doctest version 0.24.3 found on system at:
7.48 s
> /nix/store/s48k56ayjjxwdbz9y7d8mnqwlcjfi1a8-doctest-0.24.3/bin/doctest
7.48 s
> Using gcc version 15.2.0 given by user at:
7.48 s
> /nix/store/29qjlshvklnyr67nhpprzgb9igmsfsjj-gcc-wrapper-15.2.0/bin/gcc
7.48 s
> Using ghc version 9.6.7 found on system at:
7.48 s
> /nix/store/2djpcnj8a25viv1y24h3mziy1gsy3fc6-ghc-9.6.7/bin/ghc
7.48 s
> Using ghc-pkg version 9.6.7 found on system at:
7.48 s
> /nix/store/2djpcnj8a25viv1y24h3mziy1gsy3fc6-ghc-9.6.7/bin/ghc-pkg-9.6.7
7.48 s
> No ghcjs found
7.48 s
> No ghcjs-pkg found
7.48 s
> No greencard found
7.48 s
> Using haddock version 2.29.2 found on system at:
7.48 s
> /nix/store/2djpcnj8a25viv1y24h3mziy1gsy3fc6-ghc-9.6.7/bin/haddock-ghc-9.6.7
7.48 s
> No happy found
7.48 s
> Using haskell-suite found on system at: haskell-suite-dummy-location
7.48 s
> Using haskell-suite-pkg found on system at: haskell-suite-pkg-dummy-location
7.48 s
> No hmake found
7.48 s
> Using hpc version 0.68 found on system at:
7.48 s
> /nix/store/2djpcnj8a25viv1y24h3mziy1gsy3fc6-ghc-9.6.7/bin/hpc-ghc-9.6.7
7.48 s
> Using hsc2hs version 0.68.9 found on system at:
7.48 s
> /nix/store/2djpcnj8a25viv1y24h3mziy1gsy3fc6-ghc-9.6.7/bin/hsc2hs-ghc-9.6.7
7.48 s
> Using hscolour version 1.25 found on system at:
7.48 s
> /nix/store/2x19jxh5g98bv0s06mdj71c1hmxi54yl-hscolour-1.25/bin/HsColour
7.48 s
> No jhc found
7.48 s
> Using ld found on system at:
7.48 s
> /nix/store/zjraf40s86y3iwhp626b934r5y6ldkbb-binutils-wrapper-2.46/bin/ld.gold
7.48 s
> No pkg-config found
7.48 s
> Using runghc version 9.6.7 found on system at:
7.48 s
> /nix/store/2djpcnj8a25viv1y24h3mziy1gsy3fc6-ghc-9.6.7/bin/runghc-9.6.7
7.48 s
> Using strip version 2.46 found on system at:
7.48 s
> /nix/store/29qjlshvklnyr67nhpprzgb9igmsfsjj-gcc-wrapper-15.2.0/bin/strip
7.48 s
> Using tar found on system at:
7.48 s
> /nix/store/z5mq2sam4484prf3kv6v6vjw1m0i7j24-gnutar-1.35/bin/tar
7.48 s
> No uhc found
7.48 s
> Running phase: buildPhase
7.48 s
> Preprocessing library for pathway-compat-filepath-0.0.1.0..
7.48 s
> Building library for pathway-compat-filepath-0.0.1.0..
7.48 s
> [ 1 of 10] Compiling Common.FilePath ( src/Common/FilePath.hs, dist/build/Common/FilePath.o, dist/build/Common/FilePath.dyn_o )
7.48 s
> [ 2 of 10] Compiling Common.OsPath ( src/Common/OsPath.hs, dist/build/Common/OsPath.o, dist/build/Common/OsPath.dyn_o )
7.48 s
>
7.48 s
> src/Common/OsPath.hs:90:23: error : [ GHC-83865 ]
7.48 s
> • Couldn't match type ‘OSS.OsString’ with ‘OsString’
7.48 s
> Expected: OsPath
7.48 s
> Actual: OSS.OsString
7.48 s
> NB: ‘OsString’
7.48 s
> is defined in ‘System.OsString.Internal.Types.Hidden’
7.48 s
> in package ‘filepath-1.4.301.0’
7.48 s
> ‘OSS.OsString’
7.48 s
> is defined in ‘System.OsString.Internal.Types’
7.48 s
> in package ‘os-string-2.0.10’
7.48 s
> • In the ‘parent’ field of a record
7.48 s
> In the expression:
7.48 s
> Format
7.48 s
> {Format.root = O.pack . pure $ O.pathSeparator,
7.48 s
> Format.current = mempty, Format.parent = OSS.unsafeEncodeUtf "..",
7.48 s
> Format.separator = O.pack . pure $ O.pathSeparator,
7.48 s
> Format.substitutions = mempty}
7.48 s
> In an equation for ‘localFormat’:
7.48 s
> localFormat
7.48 s
> = Format
7.48 s
> {Format.root = O.pack . pure $ O.pathSeparator,
7.48 s
> Format.current = mempty, Format.parent = OSS.unsafeEncodeUtf "..",
7.48 s
> Format.separator = O.pack . pure $ O.pathSeparator,
7.48 s
> Format.substitutions = mempty}
7.48 s
> |
7.48 s
> 90 | Format.parent = OSS.unsafeEncodeUtf ".." ,
7.48 s
> | ^^^^^^^^^^^^^^^^^^^^^^^^
7.48 s
> [ 3 of 10] Compiling System.FilePath.Thin ( src/System/FilePath/Thin.hs, dist/build/System/FilePath/Thin.o, dist/build/System/FilePath/Thin.dyn_o )
7.48 s
> [ 4 of 10] Compiling System.FilePath.Pathway ( src/System/FilePath/Pathway.hs, dist/build/System/FilePath/Pathway.o, dist/build/System/FilePath/Pathway.dyn_o )
7.48 s
> [ 5 of 10] Compiling System.FilePath.Overlay ( src/System/FilePath/Overlay.hs, dist/build/System/FilePath/Overlay.o, dist/build/System/FilePath/Overlay.dyn_o )
7.48 s
> [ 6 of 10] Compiling System.FilePath ( src/System/FilePath.hs, dist/build/System/FilePath.o, dist/build/System/FilePath.dyn_o )
7.48 s
For full logs, run:
7.48 s
nix log /nix/store/0xfx9r31aw74hs5sjbw3nqlrrvg2y7r8-pathway-compat-filepath-0.0.1.0.drv
7.48 s
error: Cannot build '/nix/store/71b14xy4wzcm037bxmlbg6i3w2h0s1fz-ghc-9.6.7-with-packages.drv '.
7.48 s
Reason: 1 dependency failed .
7.48 s
Output paths:
7.48 s
/nix/store/jhh1rv4hb7mxz7igxfavjiwi3fmqdhr4-ghc-9.6.7-with-packages
7.48 s
error: Cannot build '/nix/store/qxncbg1di4hjb5zqdb9f1gy8xjrprh5s-pathway-compat-directory-0.0.1.0.drv '.
7.48 s
Reason: 1 dependency failed .
7.48 s
Output paths:
7.48 s
/nix/store/i7m2drlr7v0x2fxggqqgd55pz7gs5fgh-pathway-compat-directory-0.0.1.0
7.48 s
/nix/store/ncplkscdjaxivdd29516xdj1qdqipqd4-pathway-compat-directory-0.0.1.0-doc
7.48 s
error: Cannot build '/nix/store/rhq1glrhz4npf6sdg8x56v34xyk1v6xr-pathway-compat-file-io-0.0.1.0.drv '.
7.48 s
Reason: 1 dependency failed .
7.48 s
Output paths:
7.48 s
/nix/store/dcl1g80506zngd1b0fc83l3kd4pn37pd-pathway-compat-file-io-0.0.1.0
7.48 s
/nix/store/p09awv2yah32fd68gjx7la6zrvdipjm8-pathway-compat-file-io-0.0.1.0-doc
7.48 s
error: Cannot build '/nix/store/c430j3jkyff0isy6y8zgjmqrzxagfl7j-pathway-compat-temporary-0.0.1.0.drv '.
7.48 s
Reason: 1 dependency failed .
7.48 s
Output paths:
7.48 s
/nix/store/2yvp81sa5xwik58a51zsawqcgivrpbaf-pathway-compat-temporary-0.0.1.0
7.48 s
/nix/store/4fj0nglrfjmwafh96wbmi1y4pj14h8z2-pathway-compat-temporary-0.0.1.0-doc
7.48 s
error: Cannot build '/nix/store/8vn4w4whsg96imc6nnvkpb1x1cdrxn3a-pathway-system-0.0.1.0.drv '.
7.48 s
Reason: 1 dependency failed .
7.48 s
Output paths:
7.48 s
/nix/store/3bq8q3g9lqsgna0f3pcncqilkiyhrra6-pathway-system-0.0.1.0-doc
7.48 s
/nix/store/v8hrvv875m3n5sqvibj8ffw1cvws4y0a-pathway-system-0.0.1.0
7.48 s
error: Build failed due to failed dependency
7.48 s
error: Cannot build '/nix/store/qg47f934x32d5kxxwpin0w03ij810y32-all-packages.drv '.
7.48 s
Reason: 1 dependency failed .
7.48 s
Output paths:
7.48 s
/nix/store/3pwkmh01p09qp3k06bbdak7z37jsgnv8-all-packages
7.49 s
Build failed due to failed dependency
7.52 s
Build failed.