1. 0.74 s $ /nix/store/9ypz3flqsrl5xl495mm8h645gadjsxi1-coreutils-9.11/bin/timeout --kill-after=15s 7200s /nix/store/23zk8sgzamrbmj1fday15szf7f2279s8-nix-2.34.7/bin/nix --extra-experimental-features nix-command --extra-experimental-features flakes --log-format internal-json build --no-link --print-out-paths git+https://github.com/sellout/pathway?ref=more-system&rev=bf654313bb47699f313cdd00e42ee12d835b5bed&shallow=1#packages.x86_64-linux.ghc967_all --print-build-logs
  2. 0.84 s warning: ignoring untrusted flake configuration setting 'allow-import-from-derivation'.
  3. 0.84 s Pass '--accept-flake-config' to trust it
  4. 0.84 s warning: ignoring untrusted flake configuration setting 'extra-experimental-features'.
  5. 0.84 s Pass '--accept-flake-config' to trust it
  6. 0.84 s warning: ignoring untrusted flake configuration setting 'extra-substituters'.
  7. 0.84 s Pass '--accept-flake-config' to trust it
  8. 0.84 s warning: ignoring untrusted flake configuration setting 'extra-trusted-public-keys'.
  9. 0.84 s Pass '--accept-flake-config' to trust it
  10. 0.84 s warning: ignoring untrusted flake configuration setting 'sandbox'.
  11. 0.84 s Pass '--accept-flake-config' to trust it
  12. 0.84 s warning: ignoring untrusted flake configuration setting 'use-registries'.
  13. 0.84 s Pass '--accept-flake-config' to trust it
  14. 0.84 s error (ignored): SQLite database '/var/cache/nix-ci-worker/eval-cache-v6/ce64b74b4de8d8ae91f7291e66459c5ea87d9e2f54a2343866e5476db495272f.sqlite' is busy
  15. 1.39 s
  16. 1.51 s Building /nix/store/c8ld59zcpq3bz2hf64lqj0fwbh40yx3x-cabal2nix-pathway-compat-filepath.drv
  17. 1.58 s [cabal2nix-pathway-compat-filepath:post-build] Uploading to cachix cache "sellout": /nix/store/bh07yxdrjhv0i6y9mgr1xwk62kzx7j4n-cabal2nix-pathway-compat-filepath
  18. 1.92 s [cabal2nix-pathway-compat-filepath:post-build] Nothing to push - all store paths are already on Cachix.
  19. 1.94 s [cabal2nix-pathway-compat-filepath:post-build] Uploading to the NixCI cache: /nix/store/bh07yxdrjhv0i6y9mgr1xwk62kzx7j4n-cabal2nix-pathway-compat-filepath
  20. 1.98 s [cabal2nix-pathway-compat-filepath:post-build] warning: 'warn-short-path-literals' is deprecated, use 'lint-short-path-literals = ignore' instead
  21. 2.14 s [cabal2nix-pathway-compat-filepath:post-build] copying 1 paths...
  22. 2.14 s [cabal2nix-pathway-compat-filepath:post-build] copying path '/nix/store/bh07yxdrjhv0i6y9mgr1xwk62kzx7j4n-cabal2nix-pathway-compat-filepath' to 'https://cache.nix-ci.com'...
  23. 2.20 s [cabal2nix-pathway-compat-filepath:post-build] warning: 'warn-short-path-literals' is deprecated, use 'lint-short-path-literals = ignore' instead
  24. 2.30 s [cabal2nix-pathway-compat-filepath:post-build] copying 0 paths...
  25. 2.31 s Uploaded cabal2nix-pathway-compat-filepath in 748ms
  26. 2.31 s Progress: 1 of 2 built
  27. 2.32 s Built cabal2nix-pathway-compat-filepath in 804ms
  28. 2.32 s Progress: 2 of 2 built
  29. 2.32 s
  30. 3.26 s Building /nix/store/0xfx9r31aw74hs5sjbw3nqlrrvg2y7r8-pathway-compat-filepath-0.0.1.0.drv
  31. 3.45 s [pathway-compat-filepath] Phase: setupCompilerEnvironmentPhase
  32. 3.46 s [pathway-compat-filepath] Build with /nix/store/2djpcnj8a25viv1y24h3mziy1gsy3fc6-ghc-9.6.7.
  33. 3.78 s [pathway-compat-filepath] Phase: unpackPhase
  34. 3.79 s [pathway-compat-filepath] unpacking source archive /nix/store/56v5999xvkp18l2ygdvahppqdv4hrlnl-filepath
  35. 3.80 s [pathway-compat-filepath] source root is filepath
  36. 3.81 s [pathway-compat-filepath] Phase: patchPhase
  37. 3.82 s [pathway-compat-filepath] Phase: compileBuildDriverPhase
  38. 3.83 s [pathway-compat-filepath] setupCompileFlags: -package-db=/build/tmp.d3lPm5lwVP/setup-package.conf.d -threaded
  39. 3.88 s [pathway-compat-filepath] [1 of 2] Compiling Main ( Setup.hs, /build/tmp.d3lPm5lwVP/Main.o )
  40. 3.94 s [pathway-compat-filepath] [2 of 2] Linking Setup
  41. 5.14 s [pathway-compat-filepath] Phase: updateAutotoolsGnuConfigScriptsPhase
  42. 5.16 s [pathway-compat-filepath] Phase: configurePhase
  43. 5.17 s [pathway-compat-filepath] configureFlags: --verbose --prefix=/nix/store/0igg77m8f8gygqh7ywrf5yrrz3q05mcp-pathway-compat-filepath-0.0.1.0 --libdir=$prefix/lib/$compiler/lib --libsubdir=$abi/$libname --docdir=/nix/store/h9ipqzh965180gvqq9glid6sh6h06105-pathway-compat-filepath-0.0.1.0-doc/share/doc/pathway-compat-filepath-0.0.1.0 --with-gcc=gcc --package-db=/build/tmp.d3lPm5lwVP/package.conf.d --ghc-option=-j16 --ghc-option=+RTS --ghc-option=-A64M --ghc-option=-RTS --enable-library-profiling --profiling-detail=exported-functions --disable-profiling --enable-shared --disable-coverage --enable-static --disable-executable-dynamic --enable-tests --disable-benchmarks --enable-library-vanilla --disable-library-for-ghci --enable-split-sections --enable-library-stripping --enable-executable-stripping --ghc-option=-haddock --ghc-options=-Werror --extra-lib-dirs=/nix/store/pndhkk0l649lm1sj0mxk7cbwq26qd1ra-ncurses-6.6/lib --extra-lib-dirs=/nix/store/0djlg4g0b81w94k3vcaqsxsc2hh4kism-libffi-3.5.2/lib --extra-lib-dirs=/nix/store/md4paia7riiggyrj8p24c7a6vf8w7jz8-elfutils-0.194/lib --extra-lib-dirs=/nix/store/39vv2pf64gd8li48a4hpbhw2crzd8z5p-gmp-with-cxx-6.3.0/lib --extra-lib-dirs=/nix/store/7wwvald8lapkrsr72qanlw8blyn55ifx-numactl-2.0.18/lib --extra-lib-dirs=/nix/store/2djpcnj8a25viv1y24h3mziy1gsy3fc6-ghc-9.6.7/lib
  44. 5.18 s [pathway-compat-filepath] Using Parsec parser
  45. 5.18 s [pathway-compat-filepath] Configuring pathway-compat-filepath-0.0.1.0...
  46. 5.60 s [pathway-compat-filepath] Flags chosen: noisy-deprecations=True, verify-no-recursion=False
  47. 5.60 s [pathway-compat-filepath] Dependency base >=4.14.0 && <4.15 || >=4.15.0 && <4.16 || >=4.16.0 && <4.17 ||
  48. 5.60 s [pathway-compat-filepath] >=4.17.0 && <4.18 || >=4.18.0 && <4.19 || >=4.19.0 && <4.20 || >=4.20.0 &&
  49. 5.60 s [pathway-compat-filepath] <4.21 || >=4.21.0 && <4.22 || >=4.22.0 && <4.23: using base-4.18.3.0
  50. 5.60 s [pathway-compat-filepath] Dependency extra: using extra-1.8.1
  51. 5.60 s [pathway-compat-filepath] Dependency filepath >=1.4.2 && <1.5 || >=1.5.0 && <1.6: using
  52. 5.60 s [pathway-compat-filepath] filepath-1.4.301.0
  53. 5.60 s [pathway-compat-filepath] Dependency megaparsec >=9.0.1 && <9.1 || >=9.2.1 && <9.3 || >=9.5.0 && <9.6 ||
  54. 5.60 s [pathway-compat-filepath] >=9.7.0 && <9.8: using megaparsec-9.7.0
  55. 5.60 s [pathway-compat-filepath] Dependency os-string: using os-string-2.0.10
  56. 5.60 s [pathway-compat-filepath] Dependency pathway >=0.0.1 && <0.1: using pathway-0.0.1.0
  57. 5.60 s [pathway-compat-filepath] Dependency pathway-compat-base >=0.0.1 && <0.1: using
  58. 5.60 s [pathway-compat-filepath] pathway-compat-base-0.0.1.0
  59. 5.60 s [pathway-compat-filepath] Dependency pathway-internal >=0.0.1 && <0.1: using pathway-internal-0.0.1.0
  60. 5.60 s [pathway-compat-filepath] Dependency base >=4.14.0 && <4.15 || >=4.15.0 && <4.16 || >=4.16.0 && <4.17 ||
  61. 5.60 s [pathway-compat-filepath] >=4.17.0 && <4.18 || >=4.18.0 && <4.19 || >=4.19.0 && <4.20 || >=4.20.0 &&
  62. 5.60 s [pathway-compat-filepath] <4.21 || >=4.21.0 && <4.22 || >=4.22.0 && <4.23: using base-4.18.3.0
  63. 5.60 s [pathway-compat-filepath] Dependency doctest >=0.16.3 && <0.17 || >=0.18.1 && <0.19 || >=0.20.1 && <0.21
  64. 5.60 s [pathway-compat-filepath] || >=0.21.1 && <0.22 || >=0.22.2 && <0.23 || >=0.24.2 && <0.25: using
  65. 5.60 s [pathway-compat-filepath] doctest-0.24.3
  66. 5.60 s [pathway-compat-filepath] Dependency pathway-compat-filepath: using pathway-compat-filepath-0.0.1.0
  67. 6.01 s [pathway-compat-filepath] Source component graph:
  68. 6.02 s [pathway-compat-filepath] component lib
  69. 6.02 s [pathway-compat-filepath] component test:doctests dependency lib
  70. 6.02 s [pathway-compat-filepath] Configured component graph:
  71. 6.02 s [pathway-compat-filepath] component pathway-compat-filepath-0.0.1.0-Ck51GFznMiC2cxIfBMz4NH
  72. 6.02 s [pathway-compat-filepath] include base-4.18.3.0
  73. 6.02 s [pathway-compat-filepath] include extra-1.8.1-FU1frm3XcM88A49dBkmtgI
  74. 6.02 s [pathway-compat-filepath] include filepath-1.4.301.0
  75. 6.02 s [pathway-compat-filepath] include megaparsec-9.7.0-EpAk7LLR2KBGAKafJPbXz1
  76. 6.02 s [pathway-compat-filepath] include os-string-2.0.10-19KGKnZaj8J2ODUMyNXxJr
  77. 6.02 s [pathway-compat-filepath] include pathway-0.0.1.0-5VJXWbvreBAfybP2NROr3
  78. 6.02 s [pathway-compat-filepath] include pathway-compat-base-0.0.1.0-E02izPYkwmmGdAPlQBKjbP
  79. 6.02 s [pathway-compat-filepath] include pathway-internal-0.0.1.0-1xeSc3z2VhRIotiMz9hdL1
  80. 6.02 s [pathway-compat-filepath] component pathway-compat-filepath-0.0.1.0-Bh4LT0cz7im2Vo1hGnl75g-doctests
  81. 6.02 s [pathway-compat-filepath] include base-4.18.3.0
  82. 6.02 s [pathway-compat-filepath] include doctest-0.24.3-ACQNy8u8jPjC50l4I3tyiL
  83. 6.02 s [pathway-compat-filepath] include pathway-compat-filepath-0.0.1.0-Ck51GFznMiC2cxIfBMz4NH
  84. 6.02 s [pathway-compat-filepath] Linked component graph:
  85. 6.02 s [pathway-compat-filepath] unit pathway-compat-filepath-0.0.1.0-Ck51GFznMiC2cxIfBMz4NH
  86. 6.02 s [pathway-compat-filepath] include base-4.18.3.0
  87. 6.02 s [pathway-compat-filepath] include extra-1.8.1-FU1frm3XcM88A49dBkmtgI
  88. 6.02 s [pathway-compat-filepath] include filepath-1.4.301.0
  89. 6.02 s [pathway-compat-filepath] include megaparsec-9.7.0-EpAk7LLR2KBGAKafJPbXz1
  90. 6.02 s [pathway-compat-filepath] include os-string-2.0.10-19KGKnZaj8J2ODUMyNXxJr
  91. 6.02 s [pathway-compat-filepath] include pathway-0.0.1.0-5VJXWbvreBAfybP2NROr3
  92. 6.02 s [pathway-compat-filepath] include pathway-compat-base-0.0.1.0-E02izPYkwmmGdAPlQBKjbP
  93. 6.02 s [pathway-compat-filepath] include pathway-internal-0.0.1.0-1xeSc3z2VhRIotiMz9hdL1
  94. 6.02 s [pathway-compat-filepath] Common.FilePath=pathway-compat-filepath-0.0.1.0-Ck51GFznMiC2cxIfBMz4NH:Common.FilePath,Common.OsPath=pathway-compat-filepath-0.0.1.0-Ck51GFznMiC2cxIfBMz4NH:Common.OsPath,System.FilePath=pathway-compat-filepath-0.0.1.0-Ck51GFznMiC2cxIfBMz4NH:System.FilePath,System.FilePath.Overlay=pathway-compat-filepath-0.0.1.0-Ck51GFznMiC2cxIfBMz4NH:System.FilePath.Overlay,System.FilePath.Pathway=pathway-compat-filepath-0.0.1.0-Ck51GFznMiC2cxIfBMz4NH:System.FilePath.Pathway,System.FilePath.Thin=pathway-compat-filepath-0.0.1.0-Ck51GFznMiC2cxIfBMz4NH:System.FilePath.Thin,System.OsPath=pathway-compat-filepath-0.0.1.0-Ck51GFznMiC2cxIfBMz4NH:System.OsPath,System.OsPath.Overlay=pathway-compat-filepath-0.0.1.0-Ck51GFznMiC2cxIfBMz4NH:System.OsPath.Overlay,System.OsPath.Pathway=pathway-compat-filepath-0.0.1.0-Ck51GFznMiC2cxIfBMz4NH:System.OsPath.Pathway,System.OsPath.Thin=pathway-compat-filepath-0.0.1.0-Ck51GFznMiC2cxIfBMz4NH:System.OsPath.Thin
  95. 6.02 s [pathway-compat-filepath] unit pathway-compat-filepath-0.0.1.0-Bh4LT0cz7im2Vo1hGnl75g-doctests
  96. 6.02 s [pathway-compat-filepath] include base-4.18.3.0
  97. 6.02 s [pathway-compat-filepath] include doctest-0.24.3-ACQNy8u8jPjC50l4I3tyiL
  98. 6.02 s [pathway-compat-filepath] include pathway-compat-filepath-0.0.1.0-Ck51GFznMiC2cxIfBMz4NH
  99. 6.02 s [pathway-compat-filepath] Ready component graph:
  100. 6.02 s [pathway-compat-filepath] definite pathway-compat-filepath-0.0.1.0-Ck51GFznMiC2cxIfBMz4NH
  101. 6.02 s [pathway-compat-filepath] depends base-4.18.3.0
  102. 6.02 s [pathway-compat-filepath] depends extra-1.8.1-FU1frm3XcM88A49dBkmtgI
  103. 6.02 s [pathway-compat-filepath] depends filepath-1.4.301.0
  104. 6.02 s [pathway-compat-filepath] depends megaparsec-9.7.0-EpAk7LLR2KBGAKafJPbXz1
  105. 6.03 s [pathway-compat-filepath] depends os-string-2.0.10-19KGKnZaj8J2ODUMyNXxJr
  106. 6.03 s [pathway-compat-filepath] depends pathway-0.0.1.0-5VJXWbvreBAfybP2NROr3
  107. 6.03 s [pathway-compat-filepath] depends pathway-compat-base-0.0.1.0-E02izPYkwmmGdAPlQBKjbP
  108. 6.03 s [pathway-compat-filepath] depends pathway-internal-0.0.1.0-1xeSc3z2VhRIotiMz9hdL1
  109. 6.03 s [pathway-compat-filepath] definite pathway-compat-filepath-0.0.1.0-Bh4LT0cz7im2Vo1hGnl75g-doctests
  110. 6.03 s [pathway-compat-filepath] depends base-4.18.3.0
  111. 6.03 s [pathway-compat-filepath] depends doctest-0.24.3-ACQNy8u8jPjC50l4I3tyiL
  112. 6.03 s [pathway-compat-filepath] depends pathway-compat-filepath-0.0.1.0-Ck51GFznMiC2cxIfBMz4NH
  113. 6.03 s [pathway-compat-filepath] Using Cabal-3.10.3.0 compiled by ghc-9.6
  114. 6.03 s [pathway-compat-filepath] Using compiler: ghc-9.6.7
  115. 6.03 s [pathway-compat-filepath] Using install prefix:
  116. 6.03 s [pathway-compat-filepath] /nix/store/0igg77m8f8gygqh7ywrf5yrrz3q05mcp-pathway-compat-filepath-0.0.1.0
  117. 6.03 s [pathway-compat-filepath] Executables installed in:
  118. 6.03 s [pathway-compat-filepath] /nix/store/0igg77m8f8gygqh7ywrf5yrrz3q05mcp-pathway-compat-filepath-0.0.1.0/bin
  119. 6.03 s [pathway-compat-filepath] Libraries installed in:
  120. 6.03 s [pathway-compat-filepath] /nix/store/0igg77m8f8gygqh7ywrf5yrrz3q05mcp-pathway-compat-filepath-0.0.1.0/lib/ghc-9.6.7/lib/x86_64-linux-ghc-9.6.7/pathway-compat-filepath-0.0.1.0-Ck51GFznMiC2cxIfBMz4NH
  121. 6.03 s [pathway-compat-filepath] Dynamic Libraries installed in:
  122. 6.03 s [pathway-compat-filepath] /nix/store/0igg77m8f8gygqh7ywrf5yrrz3q05mcp-pathway-compat-filepath-0.0.1.0/lib/ghc-9.6.7/lib/x86_64-linux-ghc-9.6.7
  123. 6.03 s [pathway-compat-filepath] Private executables installed in:
  124. 6.03 s [pathway-compat-filepath] /nix/store/0igg77m8f8gygqh7ywrf5yrrz3q05mcp-pathway-compat-filepath-0.0.1.0/libexec/x86_64-linux-ghc-9.6.7/pathway-compat-filepath-0.0.1.0
  125. 6.03 s [pathway-compat-filepath] Data files installed in:
  126. 6.03 s [pathway-compat-filepath] /nix/store/0igg77m8f8gygqh7ywrf5yrrz3q05mcp-pathway-compat-filepath-0.0.1.0/share/x86_64-linux-ghc-9.6.7/pathway-compat-filepath-0.0.1.0
  127. 6.03 s [pathway-compat-filepath] Documentation installed in:
  128. 6.03 s [pathway-compat-filepath] /nix/store/h9ipqzh965180gvqq9glid6sh6h06105-pathway-compat-filepath-0.0.1.0-doc/share/doc/pathway-compat-filepath-0.0.1.0
  129. 6.03 s [pathway-compat-filepath] Configuration files installed in:
  130. 6.03 s [pathway-compat-filepath] /nix/store/0igg77m8f8gygqh7ywrf5yrrz3q05mcp-pathway-compat-filepath-0.0.1.0/etc
  131. 6.03 s [pathway-compat-filepath] No alex found
  132. 6.03 s [pathway-compat-filepath] Using ar found on system at:
  133. 6.03 s [pathway-compat-filepath] /nix/store/zjraf40s86y3iwhp626b934r5y6ldkbb-binutils-wrapper-2.46/bin/ar
  134. 6.03 s [pathway-compat-filepath] No c2hs found
  135. 6.03 s [pathway-compat-filepath] No cpphs found
  136. 6.03 s [pathway-compat-filepath] Using doctest version 0.24.3 found on system at:
  137. 6.03 s [pathway-compat-filepath] /nix/store/s48k56ayjjxwdbz9y7d8mnqwlcjfi1a8-doctest-0.24.3/bin/doctest
  138. 6.03 s [pathway-compat-filepath] Using gcc version 15.2.0 given by user at:
  139. 6.03 s [pathway-compat-filepath] /nix/store/29qjlshvklnyr67nhpprzgb9igmsfsjj-gcc-wrapper-15.2.0/bin/gcc
  140. 6.03 s [pathway-compat-filepath] Using ghc version 9.6.7 found on system at:
  141. 6.03 s [pathway-compat-filepath] /nix/store/2djpcnj8a25viv1y24h3mziy1gsy3fc6-ghc-9.6.7/bin/ghc
  142. 6.03 s [pathway-compat-filepath] Using ghc-pkg version 9.6.7 found on system at:
  143. 6.03 s [pathway-compat-filepath] /nix/store/2djpcnj8a25viv1y24h3mziy1gsy3fc6-ghc-9.6.7/bin/ghc-pkg-9.6.7
  144. 6.03 s [pathway-compat-filepath] No ghcjs found
  145. 6.03 s [pathway-compat-filepath] No ghcjs-pkg found
  146. 6.03 s [pathway-compat-filepath] No greencard found
  147. 6.03 s [pathway-compat-filepath] Using haddock version 2.29.2 found on system at:
  148. 6.03 s [pathway-compat-filepath] /nix/store/2djpcnj8a25viv1y24h3mziy1gsy3fc6-ghc-9.6.7/bin/haddock-ghc-9.6.7
  149. 6.03 s [pathway-compat-filepath] No happy found
  150. 6.03 s [pathway-compat-filepath] Using haskell-suite found on system at: haskell-suite-dummy-location
  151. 6.03 s [pathway-compat-filepath] Using haskell-suite-pkg found on system at: haskell-suite-pkg-dummy-location
  152. 6.03 s [pathway-compat-filepath] No hmake found
  153. 6.03 s [pathway-compat-filepath] Using hpc version 0.68 found on system at:
  154. 6.03 s [pathway-compat-filepath] /nix/store/2djpcnj8a25viv1y24h3mziy1gsy3fc6-ghc-9.6.7/bin/hpc-ghc-9.6.7
  155. 6.03 s [pathway-compat-filepath] Using hsc2hs version 0.68.9 found on system at:
  156. 6.03 s [pathway-compat-filepath] /nix/store/2djpcnj8a25viv1y24h3mziy1gsy3fc6-ghc-9.6.7/bin/hsc2hs-ghc-9.6.7
  157. 6.03 s [pathway-compat-filepath] Using hscolour version 1.25 found on system at:
  158. 6.03 s [pathway-compat-filepath] /nix/store/2x19jxh5g98bv0s06mdj71c1hmxi54yl-hscolour-1.25/bin/HsColour
  159. 6.03 s [pathway-compat-filepath] No jhc found
  160. 6.03 s [pathway-compat-filepath] Using ld found on system at:
  161. 6.03 s [pathway-compat-filepath] /nix/store/zjraf40s86y3iwhp626b934r5y6ldkbb-binutils-wrapper-2.46/bin/ld.gold
  162. 6.03 s [pathway-compat-filepath] No pkg-config found
  163. 6.03 s [pathway-compat-filepath] Using runghc version 9.6.7 found on system at:
  164. 6.03 s [pathway-compat-filepath] /nix/store/2djpcnj8a25viv1y24h3mziy1gsy3fc6-ghc-9.6.7/bin/runghc-9.6.7
  165. 6.03 s [pathway-compat-filepath] Using strip version 2.46 found on system at:
  166. 6.03 s [pathway-compat-filepath] /nix/store/29qjlshvklnyr67nhpprzgb9igmsfsjj-gcc-wrapper-15.2.0/bin/strip
  167. 6.03 s [pathway-compat-filepath] Using tar found on system at:
  168. 6.03 s [pathway-compat-filepath] /nix/store/z5mq2sam4484prf3kv6v6vjw1m0i7j24-gnutar-1.35/bin/tar
  169. 6.03 s [pathway-compat-filepath] No uhc found
  170. 6.49 s [pathway-compat-filepath] Phase: buildPhase
  171. 6.58 s [pathway-compat-filepath] Preprocessing library for pathway-compat-filepath-0.0.1.0..
  172. 6.58 s [pathway-compat-filepath] Building library for pathway-compat-filepath-0.0.1.0..
  173. 6.68 s [pathway-compat-filepath] [ 1 of 10] Compiling Common.FilePath ( src/Common/FilePath.hs, dist/build/Common/FilePath.o, dist/build/Common/FilePath.dyn_o )
  174. 7.01 s [pathway-compat-filepath] [ 2 of 10] Compiling Common.OsPath ( src/Common/OsPath.hs, dist/build/Common/OsPath.o, dist/build/Common/OsPath.dyn_o )
  175. 7.01 s [pathway-compat-filepath]
  176. 7.01 s [pathway-compat-filepath] src/Common/OsPath.hs:90:23: error: [GHC-83865]
  177. 7.01 s [pathway-compat-filepath] • Couldn't match type ‘OSS.OsString’ with ‘OsString’
  178. 7.01 s [pathway-compat-filepath] Expected: OsPath
  179. 7.01 s [pathway-compat-filepath] Actual: OSS.OsString
  180. 7.01 s [pathway-compat-filepath] NB: ‘OsString’
  181. 7.01 s [pathway-compat-filepath] is defined in ‘System.OsString.Internal.Types.Hidden’
  182. 7.01 s [pathway-compat-filepath] in package ‘filepath-1.4.301.0’
  183. 7.01 s [pathway-compat-filepath] ‘OSS.OsString’
  184. 7.01 s [pathway-compat-filepath] is defined in ‘System.OsString.Internal.Types’
  185. 7.01 s [pathway-compat-filepath] in package ‘os-string-2.0.10’
  186. 7.01 s [pathway-compat-filepath] • In the ‘parent’ field of a record
  187. 7.01 s [pathway-compat-filepath] In the expression:
  188. 7.01 s [pathway-compat-filepath] Format
  189. 7.01 s [pathway-compat-filepath] {Format.root = O.pack . pure $ O.pathSeparator,
  190. 7.01 s [pathway-compat-filepath] Format.current = mempty, Format.parent = OSS.unsafeEncodeUtf "..",
  191. 7.01 s [pathway-compat-filepath] Format.separator = O.pack . pure $ O.pathSeparator,
  192. 7.01 s [pathway-compat-filepath] Format.substitutions = mempty}
  193. 7.01 s [pathway-compat-filepath] In an equation for ‘localFormat’:
  194. 7.01 s [pathway-compat-filepath] localFormat
  195. 7.01 s [pathway-compat-filepath] = Format
  196. 7.01 s [pathway-compat-filepath] {Format.root = O.pack . pure $ O.pathSeparator,
  197. 7.01 s [pathway-compat-filepath] Format.current = mempty, Format.parent = OSS.unsafeEncodeUtf "..",
  198. 7.01 s [pathway-compat-filepath] Format.separator = O.pack . pure $ O.pathSeparator,
  199. 7.01 s [pathway-compat-filepath] Format.substitutions = mempty}
  200. 7.01 s [pathway-compat-filepath] |
  201. 7.01 s [pathway-compat-filepath] 90 | Format.parent = OSS.unsafeEncodeUtf "..",
  202. 7.01 s [pathway-compat-filepath] | ^^^^^^^^^^^^^^^^^^^^^^^^
  203. 7.01 s [pathway-compat-filepath] [ 3 of 10] Compiling System.FilePath.Thin ( src/System/FilePath/Thin.hs, dist/build/System/FilePath/Thin.o, dist/build/System/FilePath/Thin.dyn_o )
  204. 7.11 s [pathway-compat-filepath] [ 4 of 10] Compiling System.FilePath.Pathway ( src/System/FilePath/Pathway.hs, dist/build/System/FilePath/Pathway.o, dist/build/System/FilePath/Pathway.dyn_o )
  205. 7.15 s [pathway-compat-filepath] [ 5 of 10] Compiling System.FilePath.Overlay ( src/System/FilePath/Overlay.hs, dist/build/System/FilePath/Overlay.o, dist/build/System/FilePath/Overlay.dyn_o )
  206. 7.17 s [pathway-compat-filepath] [ 6 of 10] Compiling System.FilePath ( src/System/FilePath.hs, dist/build/System/FilePath.o, dist/build/System/FilePath.dyn_o )
  207. 7.48 s Progress: 0 of 12 built (1 failed)
  208. 7.48 s Failed to build pathway-compat-filepath after 4.2s
  209. 7.48 s error: Cannot build '/nix/store/0xfx9r31aw74hs5sjbw3nqlrrvg2y7r8-pathway-compat-filepath-0.0.1.0.drv'.
  210. 7.48 s Reason: builder failed with exit code 1.
  211. 7.48 s Output paths:
  212. 7.48 s /nix/store/0igg77m8f8gygqh7ywrf5yrrz3q05mcp-pathway-compat-filepath-0.0.1.0
  213. 7.48 s /nix/store/h9ipqzh965180gvqq9glid6sh6h06105-pathway-compat-filepath-0.0.1.0-doc
  214. 7.48 s Last 176 log lines:
  215. 7.48 s > Running phase: setupCompilerEnvironmentPhase
  216. 7.48 s > Build with /nix/store/2djpcnj8a25viv1y24h3mziy1gsy3fc6-ghc-9.6.7.
  217. 7.48 s > Running phase: unpackPhase
  218. 7.48 s > unpacking source archive /nix/store/56v5999xvkp18l2ygdvahppqdv4hrlnl-filepath
  219. 7.48 s > source root is filepath
  220. 7.48 s > Running phase: patchPhase
  221. 7.48 s > Running phase: compileBuildDriverPhase
  222. 7.48 s > setupCompileFlags: -package-db=/build/tmp.d3lPm5lwVP/setup-package.conf.d -threaded
  223. 7.48 s > [1 of 2] Compiling Main ( Setup.hs, /build/tmp.d3lPm5lwVP/Main.o )
  224. 7.48 s > [2 of 2] Linking Setup
  225. 7.48 s > Running phase: updateAutotoolsGnuConfigScriptsPhase
  226. 7.48 s > Running phase: configurePhase
  227. 7.48 s > configureFlags: --verbose --prefix=/nix/store/0igg77m8f8gygqh7ywrf5yrrz3q05mcp-pathway-compat-filepath-0.0.1.0 --libdir=$prefix/lib/$compiler/lib --libsubdir=$abi/$libname --docdir=/nix/store/h9ipqzh965180gvqq9glid6sh6h06105-pathway-compat-filepath-0.0.1.0-doc/share/doc/pathway-compat-filepath-0.0.1.0 --with-gcc=gcc --package-db=/build/tmp.d3lPm5lwVP/package.conf.d --ghc-option=-j16 --ghc-option=+RTS --ghc-option=-A64M --ghc-option=-RTS --enable-library-profiling --profiling-detail=exported-functions --disable-profiling --enable-shared --disable-coverage --enable-static --disable-executable-dynamic --enable-tests --disable-benchmarks --enable-library-vanilla --disable-library-for-ghci --enable-split-sections --enable-library-stripping --enable-executable-stripping --ghc-option=-haddock --ghc-options=-Werror --extra-lib-dirs=/nix/store/pndhkk0l649lm1sj0mxk7cbwq26qd1ra-ncurses-6.6/lib --extra-lib-dirs=/nix/store/0djlg4g0b81w94k3vcaqsxsc2hh4kism-libffi-3.5.2/lib --extra-lib-dirs=/nix/store/md4paia7riiggyrj8p24c7a6vf8w7jz8-elfutils-0.194/lib --extra-lib-dirs=/nix/store/39vv2pf64gd8li48a4hpbhw2crzd8z5p-gmp-with-cxx-6.3.0/lib --extra-lib-dirs=/nix/store/7wwvald8lapkrsr72qanlw8blyn55ifx-numactl-2.0.18/lib --extra-lib-dirs=/nix/store/2djpcnj8a25viv1y24h3mziy1gsy3fc6-ghc-9.6.7/lib
  228. 7.48 s > Using Parsec parser
  229. 7.48 s > Configuring pathway-compat-filepath-0.0.1.0...
  230. 7.48 s > Flags chosen: noisy-deprecations=True, verify-no-recursion=False
  231. 7.48 s > Dependency base >=4.14.0 && <4.15 || >=4.15.0 && <4.16 || >=4.16.0 && <4.17 ||
  232. 7.48 s > >=4.17.0 && <4.18 || >=4.18.0 && <4.19 || >=4.19.0 && <4.20 || >=4.20.0 &&
  233. 7.48 s > <4.21 || >=4.21.0 && <4.22 || >=4.22.0 && <4.23: using base-4.18.3.0
  234. 7.48 s > Dependency extra: using extra-1.8.1
  235. 7.48 s > Dependency filepath >=1.4.2 && <1.5 || >=1.5.0 && <1.6: using
  236. 7.48 s > filepath-1.4.301.0
  237. 7.48 s > Dependency megaparsec >=9.0.1 && <9.1 || >=9.2.1 && <9.3 || >=9.5.0 && <9.6 ||
  238. 7.48 s > >=9.7.0 && <9.8: using megaparsec-9.7.0
  239. 7.48 s > Dependency os-string: using os-string-2.0.10
  240. 7.48 s > Dependency pathway >=0.0.1 && <0.1: using pathway-0.0.1.0
  241. 7.48 s > Dependency pathway-compat-base >=0.0.1 && <0.1: using
  242. 7.48 s > pathway-compat-base-0.0.1.0
  243. 7.48 s > Dependency pathway-internal >=0.0.1 && <0.1: using pathway-internal-0.0.1.0
  244. 7.48 s > Dependency base >=4.14.0 && <4.15 || >=4.15.0 && <4.16 || >=4.16.0 && <4.17 ||
  245. 7.48 s > >=4.17.0 && <4.18 || >=4.18.0 && <4.19 || >=4.19.0 && <4.20 || >=4.20.0 &&
  246. 7.48 s > <4.21 || >=4.21.0 && <4.22 || >=4.22.0 && <4.23: using base-4.18.3.0
  247. 7.48 s > Dependency doctest >=0.16.3 && <0.17 || >=0.18.1 && <0.19 || >=0.20.1 && <0.21
  248. 7.48 s > || >=0.21.1 && <0.22 || >=0.22.2 && <0.23 || >=0.24.2 && <0.25: using
  249. 7.48 s > doctest-0.24.3
  250. 7.48 s > Dependency pathway-compat-filepath: using pathway-compat-filepath-0.0.1.0
  251. 7.48 s > Source component graph:
  252. 7.48 s > component lib
  253. 7.48 s > component test:doctests dependency lib
  254. 7.48 s > Configured component graph:
  255. 7.48 s > component pathway-compat-filepath-0.0.1.0-Ck51GFznMiC2cxIfBMz4NH
  256. 7.48 s > include base-4.18.3.0
  257. 7.48 s > include extra-1.8.1-FU1frm3XcM88A49dBkmtgI
  258. 7.48 s > include filepath-1.4.301.0
  259. 7.48 s > include megaparsec-9.7.0-EpAk7LLR2KBGAKafJPbXz1
  260. 7.48 s > include os-string-2.0.10-19KGKnZaj8J2ODUMyNXxJr
  261. 7.48 s > include pathway-0.0.1.0-5VJXWbvreBAfybP2NROr3
  262. 7.48 s > include pathway-compat-base-0.0.1.0-E02izPYkwmmGdAPlQBKjbP
  263. 7.48 s > include pathway-internal-0.0.1.0-1xeSc3z2VhRIotiMz9hdL1
  264. 7.48 s > component pathway-compat-filepath-0.0.1.0-Bh4LT0cz7im2Vo1hGnl75g-doctests
  265. 7.48 s > include base-4.18.3.0
  266. 7.48 s > include doctest-0.24.3-ACQNy8u8jPjC50l4I3tyiL
  267. 7.48 s > include pathway-compat-filepath-0.0.1.0-Ck51GFznMiC2cxIfBMz4NH
  268. 7.48 s > Linked component graph:
  269. 7.48 s > unit pathway-compat-filepath-0.0.1.0-Ck51GFznMiC2cxIfBMz4NH
  270. 7.48 s > include base-4.18.3.0
  271. 7.48 s > include extra-1.8.1-FU1frm3XcM88A49dBkmtgI
  272. 7.48 s > include filepath-1.4.301.0
  273. 7.48 s > include megaparsec-9.7.0-EpAk7LLR2KBGAKafJPbXz1
  274. 7.48 s > include os-string-2.0.10-19KGKnZaj8J2ODUMyNXxJr
  275. 7.48 s > include pathway-0.0.1.0-5VJXWbvreBAfybP2NROr3
  276. 7.48 s > include pathway-compat-base-0.0.1.0-E02izPYkwmmGdAPlQBKjbP
  277. 7.48 s > include pathway-internal-0.0.1.0-1xeSc3z2VhRIotiMz9hdL1
  278. 7.48 s > Common.FilePath=pathway-compat-filepath-0.0.1.0-Ck51GFznMiC2cxIfBMz4NH:Common.FilePath,Common.OsPath=pathway-compat-filepath-0.0.1.0-Ck51GFznMiC2cxIfBMz4NH:Common.OsPath,System.FilePath=pathway-compat-filepath-0.0.1.0-Ck51GFznMiC2cxIfBMz4NH:System.FilePath,System.FilePath.Overlay=pathway-compat-filepath-0.0.1.0-Ck51GFznMiC2cxIfBMz4NH:System.FilePath.Overlay,System.FilePath.Pathway=pathway-compat-filepath-0.0.1.0-Ck51GFznMiC2cxIfBMz4NH:System.FilePath.Pathway,System.FilePath.Thin=pathway-compat-filepath-0.0.1.0-Ck51GFznMiC2cxIfBMz4NH:System.FilePath.Thin,System.OsPath=pathway-compat-filepath-0.0.1.0-Ck51GFznMiC2cxIfBMz4NH:System.OsPath,System.OsPath.Overlay=pathway-compat-filepath-0.0.1.0-Ck51GFznMiC2cxIfBMz4NH:System.OsPath.Overlay,System.OsPath.Pathway=pathway-compat-filepath-0.0.1.0-Ck51GFznMiC2cxIfBMz4NH:System.OsPath.Pathway,System.OsPath.Thin=pathway-compat-filepath-0.0.1.0-Ck51GFznMiC2cxIfBMz4NH:System.OsPath.Thin
  279. 7.48 s > unit pathway-compat-filepath-0.0.1.0-Bh4LT0cz7im2Vo1hGnl75g-doctests
  280. 7.48 s > include base-4.18.3.0
  281. 7.48 s > include doctest-0.24.3-ACQNy8u8jPjC50l4I3tyiL
  282. 7.48 s > include pathway-compat-filepath-0.0.1.0-Ck51GFznMiC2cxIfBMz4NH
  283. 7.48 s > Ready component graph:
  284. 7.48 s > definite pathway-compat-filepath-0.0.1.0-Ck51GFznMiC2cxIfBMz4NH
  285. 7.48 s > depends base-4.18.3.0
  286. 7.48 s > depends extra-1.8.1-FU1frm3XcM88A49dBkmtgI
  287. 7.48 s > depends filepath-1.4.301.0
  288. 7.48 s > depends megaparsec-9.7.0-EpAk7LLR2KBGAKafJPbXz1
  289. 7.48 s > depends os-string-2.0.10-19KGKnZaj8J2ODUMyNXxJr
  290. 7.48 s > depends pathway-0.0.1.0-5VJXWbvreBAfybP2NROr3
  291. 7.48 s > depends pathway-compat-base-0.0.1.0-E02izPYkwmmGdAPlQBKjbP
  292. 7.48 s > depends pathway-internal-0.0.1.0-1xeSc3z2VhRIotiMz9hdL1
  293. 7.48 s > definite pathway-compat-filepath-0.0.1.0-Bh4LT0cz7im2Vo1hGnl75g-doctests
  294. 7.48 s > depends base-4.18.3.0
  295. 7.48 s > depends doctest-0.24.3-ACQNy8u8jPjC50l4I3tyiL
  296. 7.48 s > depends pathway-compat-filepath-0.0.1.0-Ck51GFznMiC2cxIfBMz4NH
  297. 7.48 s > Using Cabal-3.10.3.0 compiled by ghc-9.6
  298. 7.48 s > Using compiler: ghc-9.6.7
  299. 7.48 s > Using install prefix:
  300. 7.48 s > /nix/store/0igg77m8f8gygqh7ywrf5yrrz3q05mcp-pathway-compat-filepath-0.0.1.0
  301. 7.48 s > Executables installed in:
  302. 7.48 s > /nix/store/0igg77m8f8gygqh7ywrf5yrrz3q05mcp-pathway-compat-filepath-0.0.1.0/bin
  303. 7.48 s > Libraries installed in:
  304. 7.48 s > /nix/store/0igg77m8f8gygqh7ywrf5yrrz3q05mcp-pathway-compat-filepath-0.0.1.0/lib/ghc-9.6.7/lib/x86_64-linux-ghc-9.6.7/pathway-compat-filepath-0.0.1.0-Ck51GFznMiC2cxIfBMz4NH
  305. 7.48 s > Dynamic Libraries installed in:
  306. 7.48 s > /nix/store/0igg77m8f8gygqh7ywrf5yrrz3q05mcp-pathway-compat-filepath-0.0.1.0/lib/ghc-9.6.7/lib/x86_64-linux-ghc-9.6.7
  307. 7.48 s > Private executables installed in:
  308. 7.48 s > /nix/store/0igg77m8f8gygqh7ywrf5yrrz3q05mcp-pathway-compat-filepath-0.0.1.0/libexec/x86_64-linux-ghc-9.6.7/pathway-compat-filepath-0.0.1.0
  309. 7.48 s > Data files installed in:
  310. 7.48 s > /nix/store/0igg77m8f8gygqh7ywrf5yrrz3q05mcp-pathway-compat-filepath-0.0.1.0/share/x86_64-linux-ghc-9.6.7/pathway-compat-filepath-0.0.1.0
  311. 7.48 s > Documentation installed in:
  312. 7.48 s > /nix/store/h9ipqzh965180gvqq9glid6sh6h06105-pathway-compat-filepath-0.0.1.0-doc/share/doc/pathway-compat-filepath-0.0.1.0
  313. 7.48 s > Configuration files installed in:
  314. 7.48 s > /nix/store/0igg77m8f8gygqh7ywrf5yrrz3q05mcp-pathway-compat-filepath-0.0.1.0/etc
  315. 7.48 s > No alex found
  316. 7.48 s > Using ar found on system at:
  317. 7.48 s > /nix/store/zjraf40s86y3iwhp626b934r5y6ldkbb-binutils-wrapper-2.46/bin/ar
  318. 7.48 s > No c2hs found
  319. 7.48 s > No cpphs found
  320. 7.48 s > Using doctest version 0.24.3 found on system at:
  321. 7.48 s > /nix/store/s48k56ayjjxwdbz9y7d8mnqwlcjfi1a8-doctest-0.24.3/bin/doctest
  322. 7.48 s > Using gcc version 15.2.0 given by user at:
  323. 7.48 s > /nix/store/29qjlshvklnyr67nhpprzgb9igmsfsjj-gcc-wrapper-15.2.0/bin/gcc
  324. 7.48 s > Using ghc version 9.6.7 found on system at:
  325. 7.48 s > /nix/store/2djpcnj8a25viv1y24h3mziy1gsy3fc6-ghc-9.6.7/bin/ghc
  326. 7.48 s > Using ghc-pkg version 9.6.7 found on system at:
  327. 7.48 s > /nix/store/2djpcnj8a25viv1y24h3mziy1gsy3fc6-ghc-9.6.7/bin/ghc-pkg-9.6.7
  328. 7.48 s > No ghcjs found
  329. 7.48 s > No ghcjs-pkg found
  330. 7.48 s > No greencard found
  331. 7.48 s > Using haddock version 2.29.2 found on system at:
  332. 7.48 s > /nix/store/2djpcnj8a25viv1y24h3mziy1gsy3fc6-ghc-9.6.7/bin/haddock-ghc-9.6.7
  333. 7.48 s > No happy found
  334. 7.48 s > Using haskell-suite found on system at: haskell-suite-dummy-location
  335. 7.48 s > Using haskell-suite-pkg found on system at: haskell-suite-pkg-dummy-location
  336. 7.48 s > No hmake found
  337. 7.48 s > Using hpc version 0.68 found on system at:
  338. 7.48 s > /nix/store/2djpcnj8a25viv1y24h3mziy1gsy3fc6-ghc-9.6.7/bin/hpc-ghc-9.6.7
  339. 7.48 s > Using hsc2hs version 0.68.9 found on system at:
  340. 7.48 s > /nix/store/2djpcnj8a25viv1y24h3mziy1gsy3fc6-ghc-9.6.7/bin/hsc2hs-ghc-9.6.7
  341. 7.48 s > Using hscolour version 1.25 found on system at:
  342. 7.48 s > /nix/store/2x19jxh5g98bv0s06mdj71c1hmxi54yl-hscolour-1.25/bin/HsColour
  343. 7.48 s > No jhc found
  344. 7.48 s > Using ld found on system at:
  345. 7.48 s > /nix/store/zjraf40s86y3iwhp626b934r5y6ldkbb-binutils-wrapper-2.46/bin/ld.gold
  346. 7.48 s > No pkg-config found
  347. 7.48 s > Using runghc version 9.6.7 found on system at:
  348. 7.48 s > /nix/store/2djpcnj8a25viv1y24h3mziy1gsy3fc6-ghc-9.6.7/bin/runghc-9.6.7
  349. 7.48 s > Using strip version 2.46 found on system at:
  350. 7.48 s > /nix/store/29qjlshvklnyr67nhpprzgb9igmsfsjj-gcc-wrapper-15.2.0/bin/strip
  351. 7.48 s > Using tar found on system at:
  352. 7.48 s > /nix/store/z5mq2sam4484prf3kv6v6vjw1m0i7j24-gnutar-1.35/bin/tar
  353. 7.48 s > No uhc found
  354. 7.48 s > Running phase: buildPhase
  355. 7.48 s > Preprocessing library for pathway-compat-filepath-0.0.1.0..
  356. 7.48 s > Building library for pathway-compat-filepath-0.0.1.0..
  357. 7.48 s > [ 1 of 10] Compiling Common.FilePath ( src/Common/FilePath.hs, dist/build/Common/FilePath.o, dist/build/Common/FilePath.dyn_o )
  358. 7.48 s > [ 2 of 10] Compiling Common.OsPath ( src/Common/OsPath.hs, dist/build/Common/OsPath.o, dist/build/Common/OsPath.dyn_o )
  359. 7.48 s >
  360. 7.48 s > src/Common/OsPath.hs:90:23: error: [GHC-83865]
  361. 7.48 s > • Couldn't match type ‘OSS.OsString’ with ‘OsString’
  362. 7.48 s > Expected: OsPath
  363. 7.48 s > Actual: OSS.OsString
  364. 7.48 s > NB: ‘OsString’
  365. 7.48 s > is defined in ‘System.OsString.Internal.Types.Hidden’
  366. 7.48 s > in package ‘filepath-1.4.301.0’
  367. 7.48 s > ‘OSS.OsString’
  368. 7.48 s > is defined in ‘System.OsString.Internal.Types’
  369. 7.48 s > in package ‘os-string-2.0.10’
  370. 7.48 s > • In the ‘parent’ field of a record
  371. 7.48 s > In the expression:
  372. 7.48 s > Format
  373. 7.48 s > {Format.root = O.pack . pure $ O.pathSeparator,
  374. 7.48 s > Format.current = mempty, Format.parent = OSS.unsafeEncodeUtf "..",
  375. 7.48 s > Format.separator = O.pack . pure $ O.pathSeparator,
  376. 7.48 s > Format.substitutions = mempty}
  377. 7.48 s > In an equation for ‘localFormat’:
  378. 7.48 s > localFormat
  379. 7.48 s > = Format
  380. 7.48 s > {Format.root = O.pack . pure $ O.pathSeparator,
  381. 7.48 s > Format.current = mempty, Format.parent = OSS.unsafeEncodeUtf "..",
  382. 7.48 s > Format.separator = O.pack . pure $ O.pathSeparator,
  383. 7.48 s > Format.substitutions = mempty}
  384. 7.48 s > |
  385. 7.48 s > 90 | Format.parent = OSS.unsafeEncodeUtf "..",
  386. 7.48 s > | ^^^^^^^^^^^^^^^^^^^^^^^^
  387. 7.48 s > [ 3 of 10] Compiling System.FilePath.Thin ( src/System/FilePath/Thin.hs, dist/build/System/FilePath/Thin.o, dist/build/System/FilePath/Thin.dyn_o )
  388. 7.48 s > [ 4 of 10] Compiling System.FilePath.Pathway ( src/System/FilePath/Pathway.hs, dist/build/System/FilePath/Pathway.o, dist/build/System/FilePath/Pathway.dyn_o )
  389. 7.48 s > [ 5 of 10] Compiling System.FilePath.Overlay ( src/System/FilePath/Overlay.hs, dist/build/System/FilePath/Overlay.o, dist/build/System/FilePath/Overlay.dyn_o )
  390. 7.48 s > [ 6 of 10] Compiling System.FilePath ( src/System/FilePath.hs, dist/build/System/FilePath.o, dist/build/System/FilePath.dyn_o )
  391. 7.48 s For full logs, run:
  392. 7.48 s nix log /nix/store/0xfx9r31aw74hs5sjbw3nqlrrvg2y7r8-pathway-compat-filepath-0.0.1.0.drv
  393. 7.48 s error: Cannot build '/nix/store/0xfx9r31aw74hs5sjbw3nqlrrvg2y7r8-pathway-compat-filepath-0.0.1.0.drv'.
  394. 7.48 s Reason: builder failed with exit code 1.
  395. 7.48 s Output paths:
  396. 7.48 s /nix/store/0igg77m8f8gygqh7ywrf5yrrz3q05mcp-pathway-compat-filepath-0.0.1.0
  397. 7.48 s /nix/store/h9ipqzh965180gvqq9glid6sh6h06105-pathway-compat-filepath-0.0.1.0-doc
  398. 7.48 s Last 176 log lines:
  399. 7.48 s > Running phase: setupCompilerEnvironmentPhase
  400. 7.48 s > Build with /nix/store/2djpcnj8a25viv1y24h3mziy1gsy3fc6-ghc-9.6.7.
  401. 7.48 s > Running phase: unpackPhase
  402. 7.48 s > unpacking source archive /nix/store/56v5999xvkp18l2ygdvahppqdv4hrlnl-filepath
  403. 7.48 s > source root is filepath
  404. 7.48 s > Running phase: patchPhase
  405. 7.48 s > Running phase: compileBuildDriverPhase
  406. 7.48 s > setupCompileFlags: -package-db=/build/tmp.d3lPm5lwVP/setup-package.conf.d -threaded
  407. 7.48 s > [1 of 2] Compiling Main ( Setup.hs, /build/tmp.d3lPm5lwVP/Main.o )
  408. 7.48 s > [2 of 2] Linking Setup
  409. 7.48 s > Running phase: updateAutotoolsGnuConfigScriptsPhase
  410. 7.48 s > Running phase: configurePhase
  411. 7.48 s > configureFlags: --verbose --prefix=/nix/store/0igg77m8f8gygqh7ywrf5yrrz3q05mcp-pathway-compat-filepath-0.0.1.0 --libdir=$prefix/lib/$compiler/lib --libsubdir=$abi/$libname --docdir=/nix/store/h9ipqzh965180gvqq9glid6sh6h06105-pathway-compat-filepath-0.0.1.0-doc/share/doc/pathway-compat-filepath-0.0.1.0 --with-gcc=gcc --package-db=/build/tmp.d3lPm5lwVP/package.conf.d --ghc-option=-j16 --ghc-option=+RTS --ghc-option=-A64M --ghc-option=-RTS --enable-library-profiling --profiling-detail=exported-functions --disable-profiling --enable-shared --disable-coverage --enable-static --disable-executable-dynamic --enable-tests --disable-benchmarks --enable-library-vanilla --disable-library-for-ghci --enable-split-sections --enable-library-stripping --enable-executable-stripping --ghc-option=-haddock --ghc-options=-Werror --extra-lib-dirs=/nix/store/pndhkk0l649lm1sj0mxk7cbwq26qd1ra-ncurses-6.6/lib --extra-lib-dirs=/nix/store/0djlg4g0b81w94k3vcaqsxsc2hh4kism-libffi-3.5.2/lib --extra-lib-dirs=/nix/store/md4paia7riiggyrj8p24c7a6vf8w7jz8-elfutils-0.194/lib --extra-lib-dirs=/nix/store/39vv2pf64gd8li48a4hpbhw2crzd8z5p-gmp-with-cxx-6.3.0/lib --extra-lib-dirs=/nix/store/7wwvald8lapkrsr72qanlw8blyn55ifx-numactl-2.0.18/lib --extra-lib-dirs=/nix/store/2djpcnj8a25viv1y24h3mziy1gsy3fc6-ghc-9.6.7/lib
  412. 7.48 s > Using Parsec parser
  413. 7.48 s > Configuring pathway-compat-filepath-0.0.1.0...
  414. 7.48 s > Flags chosen: noisy-deprecations=True, verify-no-recursion=False
  415. 7.48 s > Dependency base >=4.14.0 && <4.15 || >=4.15.0 && <4.16 || >=4.16.0 && <4.17 ||
  416. 7.48 s > >=4.17.0 && <4.18 || >=4.18.0 && <4.19 || >=4.19.0 && <4.20 || >=4.20.0 &&
  417. 7.48 s > <4.21 || >=4.21.0 && <4.22 || >=4.22.0 && <4.23: using base-4.18.3.0
  418. 7.48 s > Dependency extra: using extra-1.8.1
  419. 7.48 s > Dependency filepath >=1.4.2 && <1.5 || >=1.5.0 && <1.6: using
  420. 7.48 s > filepath-1.4.301.0
  421. 7.48 s > Dependency megaparsec >=9.0.1 && <9.1 || >=9.2.1 && <9.3 || >=9.5.0 && <9.6 ||
  422. 7.48 s > >=9.7.0 && <9.8: using megaparsec-9.7.0
  423. 7.48 s > Dependency os-string: using os-string-2.0.10
  424. 7.48 s > Dependency pathway >=0.0.1 && <0.1: using pathway-0.0.1.0
  425. 7.48 s > Dependency pathway-compat-base >=0.0.1 && <0.1: using
  426. 7.48 s > pathway-compat-base-0.0.1.0
  427. 7.48 s > Dependency pathway-internal >=0.0.1 && <0.1: using pathway-internal-0.0.1.0
  428. 7.48 s > Dependency base >=4.14.0 && <4.15 || >=4.15.0 && <4.16 || >=4.16.0 && <4.17 ||
  429. 7.48 s > >=4.17.0 && <4.18 || >=4.18.0 && <4.19 || >=4.19.0 && <4.20 || >=4.20.0 &&
  430. 7.48 s > <4.21 || >=4.21.0 && <4.22 || >=4.22.0 && <4.23: using base-4.18.3.0
  431. 7.48 s > Dependency doctest >=0.16.3 && <0.17 || >=0.18.1 && <0.19 || >=0.20.1 && <0.21
  432. 7.48 s > || >=0.21.1 && <0.22 || >=0.22.2 && <0.23 || >=0.24.2 && <0.25: using
  433. 7.48 s > doctest-0.24.3
  434. 7.48 s > Dependency pathway-compat-filepath: using pathway-compat-filepath-0.0.1.0
  435. 7.48 s > Source component graph:
  436. 7.48 s > component lib
  437. 7.48 s > component test:doctests dependency lib
  438. 7.48 s > Configured component graph:
  439. 7.48 s > component pathway-compat-filepath-0.0.1.0-Ck51GFznMiC2cxIfBMz4NH
  440. 7.48 s > include base-4.18.3.0
  441. 7.48 s > include extra-1.8.1-FU1frm3XcM88A49dBkmtgI
  442. 7.48 s > include filepath-1.4.301.0
  443. 7.48 s > include megaparsec-9.7.0-EpAk7LLR2KBGAKafJPbXz1
  444. 7.48 s > include os-string-2.0.10-19KGKnZaj8J2ODUMyNXxJr
  445. 7.48 s > include pathway-0.0.1.0-5VJXWbvreBAfybP2NROr3
  446. 7.48 s > include pathway-compat-base-0.0.1.0-E02izPYkwmmGdAPlQBKjbP
  447. 7.48 s > include pathway-internal-0.0.1.0-1xeSc3z2VhRIotiMz9hdL1
  448. 7.48 s > component pathway-compat-filepath-0.0.1.0-Bh4LT0cz7im2Vo1hGnl75g-doctests
  449. 7.48 s > include base-4.18.3.0
  450. 7.48 s > include doctest-0.24.3-ACQNy8u8jPjC50l4I3tyiL
  451. 7.48 s > include pathway-compat-filepath-0.0.1.0-Ck51GFznMiC2cxIfBMz4NH
  452. 7.48 s > Linked component graph:
  453. 7.48 s > unit pathway-compat-filepath-0.0.1.0-Ck51GFznMiC2cxIfBMz4NH
  454. 7.48 s > include base-4.18.3.0
  455. 7.48 s > include extra-1.8.1-FU1frm3XcM88A49dBkmtgI
  456. 7.48 s > include filepath-1.4.301.0
  457. 7.48 s > include megaparsec-9.7.0-EpAk7LLR2KBGAKafJPbXz1
  458. 7.48 s > include os-string-2.0.10-19KGKnZaj8J2ODUMyNXxJr
  459. 7.48 s > include pathway-0.0.1.0-5VJXWbvreBAfybP2NROr3
  460. 7.48 s > include pathway-compat-base-0.0.1.0-E02izPYkwmmGdAPlQBKjbP
  461. 7.48 s > include pathway-internal-0.0.1.0-1xeSc3z2VhRIotiMz9hdL1
  462. 7.48 s > Common.FilePath=pathway-compat-filepath-0.0.1.0-Ck51GFznMiC2cxIfBMz4NH:Common.FilePath,Common.OsPath=pathway-compat-filepath-0.0.1.0-Ck51GFznMiC2cxIfBMz4NH:Common.OsPath,System.FilePath=pathway-compat-filepath-0.0.1.0-Ck51GFznMiC2cxIfBMz4NH:System.FilePath,System.FilePath.Overlay=pathway-compat-filepath-0.0.1.0-Ck51GFznMiC2cxIfBMz4NH:System.FilePath.Overlay,System.FilePath.Pathway=pathway-compat-filepath-0.0.1.0-Ck51GFznMiC2cxIfBMz4NH:System.FilePath.Pathway,System.FilePath.Thin=pathway-compat-filepath-0.0.1.0-Ck51GFznMiC2cxIfBMz4NH:System.FilePath.Thin,System.OsPath=pathway-compat-filepath-0.0.1.0-Ck51GFznMiC2cxIfBMz4NH:System.OsPath,System.OsPath.Overlay=pathway-compat-filepath-0.0.1.0-Ck51GFznMiC2cxIfBMz4NH:System.OsPath.Overlay,System.OsPath.Pathway=pathway-compat-filepath-0.0.1.0-Ck51GFznMiC2cxIfBMz4NH:System.OsPath.Pathway,System.OsPath.Thin=pathway-compat-filepath-0.0.1.0-Ck51GFznMiC2cxIfBMz4NH:System.OsPath.Thin
  463. 7.48 s > unit pathway-compat-filepath-0.0.1.0-Bh4LT0cz7im2Vo1hGnl75g-doctests
  464. 7.48 s > include base-4.18.3.0
  465. 7.48 s > include doctest-0.24.3-ACQNy8u8jPjC50l4I3tyiL
  466. 7.48 s > include pathway-compat-filepath-0.0.1.0-Ck51GFznMiC2cxIfBMz4NH
  467. 7.48 s > Ready component graph:
  468. 7.48 s > definite pathway-compat-filepath-0.0.1.0-Ck51GFznMiC2cxIfBMz4NH
  469. 7.48 s > depends base-4.18.3.0
  470. 7.48 s > depends extra-1.8.1-FU1frm3XcM88A49dBkmtgI
  471. 7.48 s > depends filepath-1.4.301.0
  472. 7.48 s > depends megaparsec-9.7.0-EpAk7LLR2KBGAKafJPbXz1
  473. 7.48 s > depends os-string-2.0.10-19KGKnZaj8J2ODUMyNXxJr
  474. 7.48 s > depends pathway-0.0.1.0-5VJXWbvreBAfybP2NROr3
  475. 7.48 s > depends pathway-compat-base-0.0.1.0-E02izPYkwmmGdAPlQBKjbP
  476. 7.48 s > depends pathway-internal-0.0.1.0-1xeSc3z2VhRIotiMz9hdL1
  477. 7.48 s > definite pathway-compat-filepath-0.0.1.0-Bh4LT0cz7im2Vo1hGnl75g-doctests
  478. 7.48 s > depends base-4.18.3.0
  479. 7.48 s > depends doctest-0.24.3-ACQNy8u8jPjC50l4I3tyiL
  480. 7.48 s > depends pathway-compat-filepath-0.0.1.0-Ck51GFznMiC2cxIfBMz4NH
  481. 7.48 s > Using Cabal-3.10.3.0 compiled by ghc-9.6
  482. 7.48 s > Using compiler: ghc-9.6.7
  483. 7.48 s > Using install prefix:
  484. 7.48 s > /nix/store/0igg77m8f8gygqh7ywrf5yrrz3q05mcp-pathway-compat-filepath-0.0.1.0
  485. 7.48 s > Executables installed in:
  486. 7.48 s > /nix/store/0igg77m8f8gygqh7ywrf5yrrz3q05mcp-pathway-compat-filepath-0.0.1.0/bin
  487. 7.48 s > Libraries installed in:
  488. 7.48 s > /nix/store/0igg77m8f8gygqh7ywrf5yrrz3q05mcp-pathway-compat-filepath-0.0.1.0/lib/ghc-9.6.7/lib/x86_64-linux-ghc-9.6.7/pathway-compat-filepath-0.0.1.0-Ck51GFznMiC2cxIfBMz4NH
  489. 7.48 s > Dynamic Libraries installed in:
  490. 7.48 s > /nix/store/0igg77m8f8gygqh7ywrf5yrrz3q05mcp-pathway-compat-filepath-0.0.1.0/lib/ghc-9.6.7/lib/x86_64-linux-ghc-9.6.7
  491. 7.48 s > Private executables installed in:
  492. 7.48 s > /nix/store/0igg77m8f8gygqh7ywrf5yrrz3q05mcp-pathway-compat-filepath-0.0.1.0/libexec/x86_64-linux-ghc-9.6.7/pathway-compat-filepath-0.0.1.0
  493. 7.48 s > Data files installed in:
  494. 7.48 s > /nix/store/0igg77m8f8gygqh7ywrf5yrrz3q05mcp-pathway-compat-filepath-0.0.1.0/share/x86_64-linux-ghc-9.6.7/pathway-compat-filepath-0.0.1.0
  495. 7.48 s > Documentation installed in:
  496. 7.48 s > /nix/store/h9ipqzh965180gvqq9glid6sh6h06105-pathway-compat-filepath-0.0.1.0-doc/share/doc/pathway-compat-filepath-0.0.1.0
  497. 7.48 s > Configuration files installed in:
  498. 7.48 s > /nix/store/0igg77m8f8gygqh7ywrf5yrrz3q05mcp-pathway-compat-filepath-0.0.1.0/etc
  499. 7.48 s > No alex found
  500. 7.48 s > Using ar found on system at:
  501. 7.48 s > /nix/store/zjraf40s86y3iwhp626b934r5y6ldkbb-binutils-wrapper-2.46/bin/ar
  502. 7.48 s > No c2hs found
  503. 7.48 s > No cpphs found
  504. 7.48 s > Using doctest version 0.24.3 found on system at:
  505. 7.48 s > /nix/store/s48k56ayjjxwdbz9y7d8mnqwlcjfi1a8-doctest-0.24.3/bin/doctest
  506. 7.48 s > Using gcc version 15.2.0 given by user at:
  507. 7.48 s > /nix/store/29qjlshvklnyr67nhpprzgb9igmsfsjj-gcc-wrapper-15.2.0/bin/gcc
  508. 7.48 s > Using ghc version 9.6.7 found on system at:
  509. 7.48 s > /nix/store/2djpcnj8a25viv1y24h3mziy1gsy3fc6-ghc-9.6.7/bin/ghc
  510. 7.48 s > Using ghc-pkg version 9.6.7 found on system at:
  511. 7.48 s > /nix/store/2djpcnj8a25viv1y24h3mziy1gsy3fc6-ghc-9.6.7/bin/ghc-pkg-9.6.7
  512. 7.48 s > No ghcjs found
  513. 7.48 s > No ghcjs-pkg found
  514. 7.48 s > No greencard found
  515. 7.48 s > Using haddock version 2.29.2 found on system at:
  516. 7.48 s > /nix/store/2djpcnj8a25viv1y24h3mziy1gsy3fc6-ghc-9.6.7/bin/haddock-ghc-9.6.7
  517. 7.48 s > No happy found
  518. 7.48 s > Using haskell-suite found on system at: haskell-suite-dummy-location
  519. 7.48 s > Using haskell-suite-pkg found on system at: haskell-suite-pkg-dummy-location
  520. 7.48 s > No hmake found
  521. 7.48 s > Using hpc version 0.68 found on system at:
  522. 7.48 s > /nix/store/2djpcnj8a25viv1y24h3mziy1gsy3fc6-ghc-9.6.7/bin/hpc-ghc-9.6.7
  523. 7.48 s > Using hsc2hs version 0.68.9 found on system at:
  524. 7.48 s > /nix/store/2djpcnj8a25viv1y24h3mziy1gsy3fc6-ghc-9.6.7/bin/hsc2hs-ghc-9.6.7
  525. 7.48 s > Using hscolour version 1.25 found on system at:
  526. 7.48 s > /nix/store/2x19jxh5g98bv0s06mdj71c1hmxi54yl-hscolour-1.25/bin/HsColour
  527. 7.48 s > No jhc found
  528. 7.48 s > Using ld found on system at:
  529. 7.48 s > /nix/store/zjraf40s86y3iwhp626b934r5y6ldkbb-binutils-wrapper-2.46/bin/ld.gold
  530. 7.48 s > No pkg-config found
  531. 7.48 s > Using runghc version 9.6.7 found on system at:
  532. 7.48 s > /nix/store/2djpcnj8a25viv1y24h3mziy1gsy3fc6-ghc-9.6.7/bin/runghc-9.6.7
  533. 7.48 s > Using strip version 2.46 found on system at:
  534. 7.48 s > /nix/store/29qjlshvklnyr67nhpprzgb9igmsfsjj-gcc-wrapper-15.2.0/bin/strip
  535. 7.48 s > Using tar found on system at:
  536. 7.48 s > /nix/store/z5mq2sam4484prf3kv6v6vjw1m0i7j24-gnutar-1.35/bin/tar
  537. 7.48 s > No uhc found
  538. 7.48 s > Running phase: buildPhase
  539. 7.48 s > Preprocessing library for pathway-compat-filepath-0.0.1.0..
  540. 7.48 s > Building library for pathway-compat-filepath-0.0.1.0..
  541. 7.48 s > [ 1 of 10] Compiling Common.FilePath ( src/Common/FilePath.hs, dist/build/Common/FilePath.o, dist/build/Common/FilePath.dyn_o )
  542. 7.48 s > [ 2 of 10] Compiling Common.OsPath ( src/Common/OsPath.hs, dist/build/Common/OsPath.o, dist/build/Common/OsPath.dyn_o )
  543. 7.48 s >
  544. 7.48 s > src/Common/OsPath.hs:90:23: error: [GHC-83865]
  545. 7.48 s > • Couldn't match type ‘OSS.OsString’ with ‘OsString’
  546. 7.48 s > Expected: OsPath
  547. 7.48 s > Actual: OSS.OsString
  548. 7.48 s > NB: ‘OsString’
  549. 7.48 s > is defined in ‘System.OsString.Internal.Types.Hidden’
  550. 7.48 s > in package ‘filepath-1.4.301.0’
  551. 7.48 s > ‘OSS.OsString’
  552. 7.48 s > is defined in ‘System.OsString.Internal.Types’
  553. 7.48 s > in package ‘os-string-2.0.10’
  554. 7.48 s > • In the ‘parent’ field of a record
  555. 7.48 s > In the expression:
  556. 7.48 s > Format
  557. 7.48 s > {Format.root = O.pack . pure $ O.pathSeparator,
  558. 7.48 s > Format.current = mempty, Format.parent = OSS.unsafeEncodeUtf "..",
  559. 7.48 s > Format.separator = O.pack . pure $ O.pathSeparator,
  560. 7.48 s > Format.substitutions = mempty}
  561. 7.48 s > In an equation for ‘localFormat’:
  562. 7.48 s > localFormat
  563. 7.48 s > = Format
  564. 7.48 s > {Format.root = O.pack . pure $ O.pathSeparator,
  565. 7.48 s > Format.current = mempty, Format.parent = OSS.unsafeEncodeUtf "..",
  566. 7.48 s > Format.separator = O.pack . pure $ O.pathSeparator,
  567. 7.48 s > Format.substitutions = mempty}
  568. 7.48 s > |
  569. 7.48 s > 90 | Format.parent = OSS.unsafeEncodeUtf "..",
  570. 7.48 s > | ^^^^^^^^^^^^^^^^^^^^^^^^
  571. 7.48 s > [ 3 of 10] Compiling System.FilePath.Thin ( src/System/FilePath/Thin.hs, dist/build/System/FilePath/Thin.o, dist/build/System/FilePath/Thin.dyn_o )
  572. 7.48 s > [ 4 of 10] Compiling System.FilePath.Pathway ( src/System/FilePath/Pathway.hs, dist/build/System/FilePath/Pathway.o, dist/build/System/FilePath/Pathway.dyn_o )
  573. 7.48 s > [ 5 of 10] Compiling System.FilePath.Overlay ( src/System/FilePath/Overlay.hs, dist/build/System/FilePath/Overlay.o, dist/build/System/FilePath/Overlay.dyn_o )
  574. 7.48 s > [ 6 of 10] Compiling System.FilePath ( src/System/FilePath.hs, dist/build/System/FilePath.o, dist/build/System/FilePath.dyn_o )
  575. 7.48 s For full logs, run:
  576. 7.48 s nix log /nix/store/0xfx9r31aw74hs5sjbw3nqlrrvg2y7r8-pathway-compat-filepath-0.0.1.0.drv
  577. 7.48 s error: Cannot build '/nix/store/71b14xy4wzcm037bxmlbg6i3w2h0s1fz-ghc-9.6.7-with-packages.drv'.
  578. 7.48 s Reason: 1 dependency failed.
  579. 7.48 s Output paths:
  580. 7.48 s /nix/store/jhh1rv4hb7mxz7igxfavjiwi3fmqdhr4-ghc-9.6.7-with-packages
  581. 7.48 s error: Cannot build '/nix/store/qxncbg1di4hjb5zqdb9f1gy8xjrprh5s-pathway-compat-directory-0.0.1.0.drv'.
  582. 7.48 s Reason: 1 dependency failed.
  583. 7.48 s Output paths:
  584. 7.48 s /nix/store/i7m2drlr7v0x2fxggqqgd55pz7gs5fgh-pathway-compat-directory-0.0.1.0
  585. 7.48 s /nix/store/ncplkscdjaxivdd29516xdj1qdqipqd4-pathway-compat-directory-0.0.1.0-doc
  586. 7.48 s error: Cannot build '/nix/store/rhq1glrhz4npf6sdg8x56v34xyk1v6xr-pathway-compat-file-io-0.0.1.0.drv'.
  587. 7.48 s Reason: 1 dependency failed.
  588. 7.48 s Output paths:
  589. 7.48 s /nix/store/dcl1g80506zngd1b0fc83l3kd4pn37pd-pathway-compat-file-io-0.0.1.0
  590. 7.48 s /nix/store/p09awv2yah32fd68gjx7la6zrvdipjm8-pathway-compat-file-io-0.0.1.0-doc
  591. 7.48 s error: Cannot build '/nix/store/c430j3jkyff0isy6y8zgjmqrzxagfl7j-pathway-compat-temporary-0.0.1.0.drv'.
  592. 7.48 s Reason: 1 dependency failed.
  593. 7.48 s Output paths:
  594. 7.48 s /nix/store/2yvp81sa5xwik58a51zsawqcgivrpbaf-pathway-compat-temporary-0.0.1.0
  595. 7.48 s /nix/store/4fj0nglrfjmwafh96wbmi1y4pj14h8z2-pathway-compat-temporary-0.0.1.0-doc
  596. 7.48 s error: Cannot build '/nix/store/8vn4w4whsg96imc6nnvkpb1x1cdrxn3a-pathway-system-0.0.1.0.drv'.
  597. 7.48 s Reason: 1 dependency failed.
  598. 7.48 s Output paths:
  599. 7.48 s /nix/store/3bq8q3g9lqsgna0f3pcncqilkiyhrra6-pathway-system-0.0.1.0-doc
  600. 7.48 s /nix/store/v8hrvv875m3n5sqvibj8ffw1cvws4y0a-pathway-system-0.0.1.0
  601. 7.48 s error: Build failed due to failed dependency
  602. 7.48 s error: Cannot build '/nix/store/qg47f934x32d5kxxwpin0w03ij810y32-all-packages.drv'.
  603. 7.48 s Reason: 1 dependency failed.
  604. 7.48 s Output paths:
  605. 7.48 s /nix/store/3pwkmh01p09qp3k06bbdak7z37jsgnv8-all-packages
  606. 7.49 s Build failed due to failed dependency
  607. 7.52 s Build failed.