1. 0.70 s $ /nix/store/9ypz3flqsrl5xl495mm8h645gadjsxi1-coreutils-9.11/bin/timeout --kill-after=15s 7200s /nix/store/23zk8sgzamrbmj1fday15szf7f2279s8-nix-2.34.7/bin/nix --extra-experimental-features nix-command --extra-experimental-features flakes --log-format internal-json build --no-link --print-out-paths git+https://github.com/sellout/pathway?ref=more-system&rev=bf654313bb47699f313cdd00e42ee12d835b5bed&shallow=1#packages.x86_64-linux.ghc984_all --print-build-logs
  2. 0.72 s warning: ignoring untrusted flake configuration setting 'allow-import-from-derivation'.
  3. 0.72 s Pass '--accept-flake-config' to trust it
  4. 0.72 s warning: ignoring untrusted flake configuration setting 'extra-experimental-features'.
  5. 0.72 s Pass '--accept-flake-config' to trust it
  6. 0.72 s warning: ignoring untrusted flake configuration setting 'extra-substituters'.
  7. 0.72 s Pass '--accept-flake-config' to trust it
  8. 0.72 s warning: ignoring untrusted flake configuration setting 'extra-trusted-public-keys'.
  9. 0.72 s Pass '--accept-flake-config' to trust it
  10. 0.72 s warning: ignoring untrusted flake configuration setting 'sandbox'.
  11. 0.72 s Pass '--accept-flake-config' to trust it
  12. 0.72 s warning: ignoring untrusted flake configuration setting 'use-registries'.
  13. 0.72 s Pass '--accept-flake-config' to trust it
  14. 1.46 s
  15. 1.48 s Building /nix/store/bhfppmv1iv09ifi5yzfps31vjhqmvrf8-cabal2nix-pathway.drv
  16. 1.55 s [cabal2nix-pathway:post-build] Uploading to cachix cache "sellout": /nix/store/546v9m0h79qksrj2n10gmamab0142r59-cabal2nix-pathway
  17. 2.01 s [cabal2nix-pathway:post-build] Nothing to push - all store paths are already on Cachix.
  18. 2.02 s [cabal2nix-pathway:post-build] Uploading to the NixCI cache: /nix/store/546v9m0h79qksrj2n10gmamab0142r59-cabal2nix-pathway
  19. 2.05 s [cabal2nix-pathway:post-build] warning: 'warn-short-path-literals' is deprecated, use 'lint-short-path-literals = ignore' instead
  20. 2.25 s [cabal2nix-pathway:post-build] copying 1 paths...
  21. 2.25 s [cabal2nix-pathway:post-build] copying path '/nix/store/546v9m0h79qksrj2n10gmamab0142r59-cabal2nix-pathway' to 'https://cache.nix-ci.com'...
  22. 2.29 s [cabal2nix-pathway:post-build] warning: 'warn-short-path-literals' is deprecated, use 'lint-short-path-literals = ignore' instead
  23. 2.39 s [cabal2nix-pathway:post-build] copying 0 paths...
  24. 2.41 s Uploaded cabal2nix-pathway in 868ms
  25. 2.41 s Progress: 1 of 2 built
  26. 2.41 s Built cabal2nix-pathway in 924ms
  27. 2.41 s Progress: 2 of 2 built
  28. 2.41 s
  29. 2.44 s Building /nix/store/h10gz5c02z1yspdjsz1k3lb3sdiqcabn-cabal2nix-pathway-compat-base.drv
  30. 2.50 s [cabal2nix-pathway-compat-base:post-build] Uploading to cachix cache "sellout": /nix/store/80fsb017zf2nx1g4klwnlfg5higgxafm-cabal2nix-pathway-compat-base
  31. 2.95 s [cabal2nix-pathway-compat-base:post-build] Nothing to push - all store paths are already on Cachix.
  32. 2.97 s [cabal2nix-pathway-compat-base:post-build] Uploading to the NixCI cache: /nix/store/80fsb017zf2nx1g4klwnlfg5higgxafm-cabal2nix-pathway-compat-base
  33. 3.00 s [cabal2nix-pathway-compat-base:post-build] warning: 'warn-short-path-literals' is deprecated, use 'lint-short-path-literals = ignore' instead
  34. 3.13 s [cabal2nix-pathway-compat-base:post-build] copying 1 paths...
  35. 3.13 s [cabal2nix-pathway-compat-base:post-build] copying path '/nix/store/80fsb017zf2nx1g4klwnlfg5higgxafm-cabal2nix-pathway-compat-base' to 'https://cache.nix-ci.com'...
  36. 3.18 s [cabal2nix-pathway-compat-base:post-build] warning: 'warn-short-path-literals' is deprecated, use 'lint-short-path-literals = ignore' instead
  37. 3.28 s [cabal2nix-pathway-compat-base:post-build] copying 0 paths...
  38. 3.30 s Uploaded cabal2nix-pathway-compat-base in 806ms
  39. 3.30 s Progress: 1 of 2 built
  40. 3.30 s Built cabal2nix-pathway-compat-base in 860ms
  41. 3.30 s Progress: 2 of 2 built
  42. 3.30 s
  43. 3.32 s Building /nix/store/ighdl8s3x2l2nk09vqx2mchic4n3arpb-cabal2nix-pathway-compat-directory.drv
  44. 3.39 s [cabal2nix-pathway-compat-directory:post-build] Uploading to cachix cache "sellout": /nix/store/q04713d6l156iddqafvfy7rgrlpm8g9h-cabal2nix-pathway-compat-directory
  45. 3.74 s [cabal2nix-pathway-compat-directory:post-build] Nothing to push - all store paths are already on Cachix.
  46. 3.76 s [cabal2nix-pathway-compat-directory:post-build] Uploading to the NixCI cache: /nix/store/q04713d6l156iddqafvfy7rgrlpm8g9h-cabal2nix-pathway-compat-directory
  47. 3.79 s [cabal2nix-pathway-compat-directory:post-build] warning: 'warn-short-path-literals' is deprecated, use 'lint-short-path-literals = ignore' instead
  48. 3.93 s [cabal2nix-pathway-compat-directory:post-build] copying 1 paths...
  49. 3.93 s [cabal2nix-pathway-compat-directory:post-build] copying path '/nix/store/q04713d6l156iddqafvfy7rgrlpm8g9h-cabal2nix-pathway-compat-directory' to 'https://cache.nix-ci.com'...
  50. 3.98 s [cabal2nix-pathway-compat-directory:post-build] warning: 'warn-short-path-literals' is deprecated, use 'lint-short-path-literals = ignore' instead
  51. 4.08 s [cabal2nix-pathway-compat-directory:post-build] copying 0 paths...
  52. 4.10 s Uploaded cabal2nix-pathway-compat-directory in 720ms
  53. 4.10 s Progress: 1 of 2 built
  54. 4.10 s Built cabal2nix-pathway-compat-directory in 773ms
  55. 4.10 s Progress: 2 of 2 built
  56. 4.10 s
  57. 4.12 s Building /nix/store/cz1n9mzpsp3pk4sj2s2gkgj6nyrkypmx-cabal2nix-pathway-compat-file-io.drv
  58. 4.18 s [cabal2nix-pathway-compat-file-io:post-build] Uploading to cachix cache "sellout": /nix/store/i4hmqqwns70i0igvsfk0qnz8y6mgl7yx-cabal2nix-pathway-compat-file-io
  59. 4.54 s [cabal2nix-pathway-compat-file-io:post-build] Nothing to push - all store paths are already on Cachix.
  60. 4.55 s [cabal2nix-pathway-compat-file-io:post-build] Uploading to the NixCI cache: /nix/store/i4hmqqwns70i0igvsfk0qnz8y6mgl7yx-cabal2nix-pathway-compat-file-io
  61. 4.59 s [cabal2nix-pathway-compat-file-io:post-build] warning: 'warn-short-path-literals' is deprecated, use 'lint-short-path-literals = ignore' instead
  62. 4.72 s [cabal2nix-pathway-compat-file-io:post-build] copying 1 paths...
  63. 4.72 s [cabal2nix-pathway-compat-file-io:post-build] copying path '/nix/store/i4hmqqwns70i0igvsfk0qnz8y6mgl7yx-cabal2nix-pathway-compat-file-io' to 'https://cache.nix-ci.com'...
  64. 4.77 s [cabal2nix-pathway-compat-file-io:post-build] warning: 'warn-short-path-literals' is deprecated, use 'lint-short-path-literals = ignore' instead
  65. 4.87 s [cabal2nix-pathway-compat-file-io:post-build] copying 0 paths...
  66. 4.88 s Uploaded cabal2nix-pathway-compat-file-io in 708ms
  67. 4.88 s Progress: 1 of 2 built
  68. 4.88 s Built cabal2nix-pathway-compat-file-io in 761ms
  69. 4.88 s Progress: 2 of 2 built
  70. 4.89 s
  71. 4.91 s Building /nix/store/vlm4356sprvx9zi5m8xp8m75p3hcfgmf-cabal2nix-pathway-compat-filepath.drv
  72. 4.97 s [cabal2nix-pathway-compat-filepath:post-build] Uploading to cachix cache "sellout": /nix/store/6gldlv2yx4h21fkjv19wdfnip7ypwgx8-cabal2nix-pathway-compat-filepath
  73. 5.33 s [cabal2nix-pathway-compat-filepath:post-build] Nothing to push - all store paths are already on Cachix.
  74. 5.35 s [cabal2nix-pathway-compat-filepath:post-build] Uploading to the NixCI cache: /nix/store/6gldlv2yx4h21fkjv19wdfnip7ypwgx8-cabal2nix-pathway-compat-filepath
  75. 5.38 s [cabal2nix-pathway-compat-filepath:post-build] warning: 'warn-short-path-literals' is deprecated, use 'lint-short-path-literals = ignore' instead
  76. 5.51 s [cabal2nix-pathway-compat-filepath:post-build] copying 1 paths...
  77. 5.51 s [cabal2nix-pathway-compat-filepath:post-build] copying path '/nix/store/6gldlv2yx4h21fkjv19wdfnip7ypwgx8-cabal2nix-pathway-compat-filepath' to 'https://cache.nix-ci.com'...
  78. 5.56 s [cabal2nix-pathway-compat-filepath:post-build] warning: 'warn-short-path-literals' is deprecated, use 'lint-short-path-literals = ignore' instead
  79. 5.67 s [cabal2nix-pathway-compat-filepath:post-build] copying 0 paths...
  80. 5.69 s Uploaded cabal2nix-pathway-compat-filepath in 723ms
  81. 5.69 s Progress: 1 of 2 built
  82. 5.69 s Built cabal2nix-pathway-compat-filepath in 777ms
  83. 5.69 s Progress: 2 of 2 built
  84. 5.69 s
  85. 5.71 s Building /nix/store/qax74nnqwpysfys43skdbg0bwg6kal0s-cabal2nix-pathway-compat-temporary.drv
  86. 6.54 s [cabal2nix-pathway-compat-temporary:post-build] Uploading to cachix cache "sellout": /nix/store/mfyf5gzil8p50csd4v5g1k3wi5pwcvqi-cabal2nix-pathway-compat-temporary
  87. 6.54 s [cabal2nix-pathway-compat-temporary:post-build] Nothing to push - all store paths are already on Cachix.
  88. 6.54 s [cabal2nix-pathway-compat-temporary:post-build] Uploading to the NixCI cache: /nix/store/mfyf5gzil8p50csd4v5g1k3wi5pwcvqi-cabal2nix-pathway-compat-temporary
  89. 6.54 s [cabal2nix-pathway-compat-temporary:post-build] warning: 'warn-short-path-literals' is deprecated, use 'lint-short-path-literals = ignore' instead
  90. 6.54 s [cabal2nix-pathway-compat-temporary:post-build] copying 1 paths...
  91. 6.54 s [cabal2nix-pathway-compat-temporary:post-build] copying path '/nix/store/mfyf5gzil8p50csd4v5g1k3wi5pwcvqi-cabal2nix-pathway-compat-temporary' to 'https://cache.nix-ci.com'...
  92. 6.54 s [cabal2nix-pathway-compat-temporary:post-build] warning: 'warn-short-path-literals' is deprecated, use 'lint-short-path-literals = ignore' instead
  93. 6.54 s [cabal2nix-pathway-compat-temporary:post-build] copying 0 paths...
  94. 6.54 s Uploaded cabal2nix-pathway-compat-temporary in 0ms
  95. 6.54 s Progress: 1 of 2 built
  96. 6.54 s Built cabal2nix-pathway-compat-temporary in 828ms
  97. 6.54 s Progress: 2 of 2 built
  98. 6.54 s
  99. 6.54 s Building /nix/store/fy7qr52yyzwgcnk8gwn668ddnkf2avwg-cabal2nix-pathway-internal.drv
  100. 6.60 s [cabal2nix-pathway-internal:post-build] Uploading to cachix cache "sellout": /nix/store/jj1gh9gbjwld2pxcrbl1hdx2r290ai9w-cabal2nix-pathway-internal
  101. 7.04 s [cabal2nix-pathway-internal:post-build] Nothing to push - all store paths are already on Cachix.
  102. 7.06 s [cabal2nix-pathway-internal:post-build] Uploading to the NixCI cache: /nix/store/jj1gh9gbjwld2pxcrbl1hdx2r290ai9w-cabal2nix-pathway-internal
  103. 7.10 s [cabal2nix-pathway-internal:post-build] warning: 'warn-short-path-literals' is deprecated, use 'lint-short-path-literals = ignore' instead
  104. 7.24 s [cabal2nix-pathway-internal:post-build] copying 1 paths...
  105. 7.24 s [cabal2nix-pathway-internal:post-build] copying path '/nix/store/jj1gh9gbjwld2pxcrbl1hdx2r290ai9w-cabal2nix-pathway-internal' to 'https://cache.nix-ci.com'...
  106. 7.29 s [cabal2nix-pathway-internal:post-build] warning: 'warn-short-path-literals' is deprecated, use 'lint-short-path-literals = ignore' instead
  107. 7.40 s [cabal2nix-pathway-internal:post-build] copying 0 paths...
  108. 7.41 s Uploaded cabal2nix-pathway-internal in 828ms
  109. 7.42 s Progress: 1 of 2 built
  110. 7.42 s Built cabal2nix-pathway-internal in 871ms
  111. 7.42 s Progress: 2 of 2 built
  112. 7.42 s
  113. 7.44 s Building /nix/store/5yrd4sjgjw7b2004zdb6j5jyfpfaa015-cabal2nix-pathway-path.drv
  114. 7.51 s [cabal2nix-pathway-path:post-build] Uploading to cachix cache "sellout": /nix/store/phrvfim08rz8lqfrqcrv1imvivrwz8lw-cabal2nix-pathway-path
  115. 7.87 s [cabal2nix-pathway-path:post-build] Nothing to push - all store paths are already on Cachix.
  116. 7.88 s [cabal2nix-pathway-path:post-build] Uploading to the NixCI cache: /nix/store/phrvfim08rz8lqfrqcrv1imvivrwz8lw-cabal2nix-pathway-path
  117. 7.92 s [cabal2nix-pathway-path:post-build] warning: 'warn-short-path-literals' is deprecated, use 'lint-short-path-literals = ignore' instead
  118. 8.07 s [cabal2nix-pathway-path:post-build] copying 1 paths...
  119. 8.07 s [cabal2nix-pathway-path:post-build] copying path '/nix/store/phrvfim08rz8lqfrqcrv1imvivrwz8lw-cabal2nix-pathway-path' to 'https://cache.nix-ci.com'...
  120. 8.13 s [cabal2nix-pathway-path:post-build] warning: 'warn-short-path-literals' is deprecated, use 'lint-short-path-literals = ignore' instead
  121. 8.23 s [cabal2nix-pathway-path:post-build] copying 0 paths...
  122. 8.24 s Uploaded cabal2nix-pathway-path in 746ms
  123. 8.25 s Progress: 1 of 2 built
  124. 8.25 s Built cabal2nix-pathway-path in 804ms
  125. 8.25 s Progress: 2 of 2 built
  126. 8.25 s
  127. 8.28 s Building /nix/store/h8ma0w6hif39zn70hfbjmr77a0c3y6bk-cabal2nix-pathway-quickcheck.drv
  128. 8.34 s [cabal2nix-pathway-quickcheck:post-build] Uploading to cachix cache "sellout": /nix/store/l507wyrax7fhin6i3ymc7qv07yzcx7gs-cabal2nix-pathway-quickcheck
  129. 8.69 s [cabal2nix-pathway-quickcheck:post-build] Nothing to push - all store paths are already on Cachix.
  130. 8.71 s [cabal2nix-pathway-quickcheck:post-build] Uploading to the NixCI cache: /nix/store/l507wyrax7fhin6i3ymc7qv07yzcx7gs-cabal2nix-pathway-quickcheck
  131. 8.75 s [cabal2nix-pathway-quickcheck:post-build] warning: 'warn-short-path-literals' is deprecated, use 'lint-short-path-literals = ignore' instead
  132. 8.91 s [cabal2nix-pathway-quickcheck:post-build] copying 1 paths...
  133. 8.91 s [cabal2nix-pathway-quickcheck:post-build] copying path '/nix/store/l507wyrax7fhin6i3ymc7qv07yzcx7gs-cabal2nix-pathway-quickcheck' to 'https://cache.nix-ci.com'...
  134. 8.97 s [cabal2nix-pathway-quickcheck:post-build] warning: 'warn-short-path-literals' is deprecated, use 'lint-short-path-literals = ignore' instead
  135. 9.07 s [cabal2nix-pathway-quickcheck:post-build] copying 0 paths...
  136. 9.09 s Uploaded cabal2nix-pathway-quickcheck in 757ms
  137. 9.09 s Progress: 1 of 2 built
  138. 9.09 s Built cabal2nix-pathway-quickcheck in 813ms
  139. 9.09 s Progress: 2 of 2 built
  140. 9.09 s
  141. 9.12 s Building /nix/store/89zimkf0qixsz4ks330cjrc8kaw50qw1-cabal2nix-pathway-system.drv
  142. 9.19 s [cabal2nix-pathway-system:post-build] Uploading to cachix cache "sellout": /nix/store/2rmv2kjpmi9ga933gnzf976v3x7cbid2-cabal2nix-pathway-system
  143. 9.57 s [cabal2nix-pathway-system:post-build] Nothing to push - all store paths are already on Cachix.
  144. 9.58 s [cabal2nix-pathway-system:post-build] Uploading to the NixCI cache: /nix/store/2rmv2kjpmi9ga933gnzf976v3x7cbid2-cabal2nix-pathway-system
  145. 9.62 s [cabal2nix-pathway-system:post-build] warning: 'warn-short-path-literals' is deprecated, use 'lint-short-path-literals = ignore' instead
  146. 9.76 s [cabal2nix-pathway-system:post-build] copying 1 paths...
  147. 9.76 s [cabal2nix-pathway-system:post-build] copying path '/nix/store/2rmv2kjpmi9ga933gnzf976v3x7cbid2-cabal2nix-pathway-system' to 'https://cache.nix-ci.com'...
  148. 9.82 s [cabal2nix-pathway-system:post-build] warning: 'warn-short-path-literals' is deprecated, use 'lint-short-path-literals = ignore' instead
  149. 9.92 s [cabal2nix-pathway-system:post-build] copying 0 paths...
  150. 9.94 s Uploaded cabal2nix-pathway-system in 764ms
  151. 9.94 s Progress: 1 of 2 built
  152. 9.94 s Built cabal2nix-pathway-system in 823ms
  153. 9.94 s Progress: 2 of 2 built
  154. 9.94 s
  155. 10.93 s Downloading cached colour-2.3.7-data from https://cache.nix-ci.com
  156. 10.96 s Downloading cached ghc-9.8.4-doc from https://cache.nix-ci.com
  157. 10.96 s Downloading cached hscolour from https://cache.nix-ci.com
  158. 10.96 s Downloaded cached colour-2.3.7-data (2696 B) in 27ms
  159. 10.96 s Progress: 0 of 103 built, 1 of 174 downloaded from cache (2 downloading)
  160. 10.98 s Downloaded cached hscolour (2.5 MiB) in 19ms
  161. 10.98 s Progress: 0 of 103 built, 2 of 174 downloaded from cache (1 downloading)
  162. 12.64 s Downloaded cached ghc-9.8.4-doc (687 MiB) in 1.6s
  163. 12.64 s Progress: 0 of 102 built, 3 of 174 downloaded from cache
  164. 12.64 s Downloading cached OneTuple-0.4.2.1-doc from https://cache.nix-ci.com
  165. 12.64 s Downloading cached StateVar-1.2.2-doc from https://cache.nix-ci.com
  166. 12.64 s Downloading cached assoc-1.1.1-doc from https://cache.nix-ci.com
  167. 12.64 s Downloading cached base-orphans-0.9.4-doc from https://cache.nix-ci.com
  168. 12.64 s Downloading cached cabal-doctest-1.0.12-doc from https://cache.nix-ci.com
  169. 12.64 s Downloading cached call-stack-0.4.0-doc from https://cache.nix-ci.com
  170. 12.64 s Downloading cached character-ps-0.1-doc from https://cache.nix-ci.com
  171. 12.64 s Downloading cached clock-0.8.4-doc from https://cache.nix-ci.com
  172. 12.64 s Downloading cached code-page-0.2.1-doc from https://cache.nix-ci.com
  173. 12.64 s Downloading cached colour-2.3.7-doc from https://cache.nix-ci.com
  174. 12.64 s Downloading cached dlist-1.0-doc from https://cache.nix-ci.com
  175. 12.64 s Downloading cached file-io-0.1.6-doc from https://cache.nix-ci.com
  176. 12.64 s Downloading cached ghc from https://cache.nix-ci.com
  177. 12.64 s Downloading cached ghc-paths-0.1.0.12-doc from https://cache.nix-ci.com
  178. 12.64 s Downloading cached indexed-traversable-0.1.4-doc from https://cache.nix-ci.com
  179. 12.65 s Downloading cached integer-logarithms-1.0.5-doc from https://cache.nix-ci.com
  180. 12.66 s Downloaded cached OneTuple-0.4.2.1-doc (270 KiB) in 25ms
  181. 12.66 s Progress: 0 of 101 built, 4 of 174 downloaded from cache (15 downloading)
  182. 12.66 s Downloading cached old-locale-1.0.0.7-doc from https://cache.nix-ci.com
  183. 12.67 s Downloaded cached clock-0.8.4-doc (517 KiB) in 29ms
  184. 12.67 s Progress: 0 of 101 built, 5 of 174 downloaded from cache (15 downloading)
  185. 12.67 s Downloading cached os-string-2.0.10-doc from https://cache.nix-ci.com
  186. 12.67 s Downloaded cached StateVar-1.2.2-doc (299 KiB) in 33ms
  187. 12.67 s Progress: 0 of 101 built, 6 of 174 downloaded from cache (15 downloading)
  188. 12.67 s Downloaded cached cabal-doctest-1.0.12-doc (358 KiB) in 33ms
  189. 12.67 s Downloading cached extra-1.8.1-doc from https://cache.nix-ci.com
  190. 12.67 s Progress: 0 of 101 built, 7 of 174 downloaded from cache (15 downloading)
  191. 12.67 s Downloading cached contravariant-1.5.6-doc from https://cache.nix-ci.com
  192. 12.67 s Downloaded cached dlist-1.0-doc (532 KiB) in 33ms
  193. 12.67 s Progress: 0 of 101 built, 8 of 174 downloaded from cache (15 downloading)
  194. 12.67 s Downloading cached parallel-3.2.2.0-doc from https://cache.nix-ci.com
  195. 12.68 s Downloaded cached call-stack-0.4.0-doc (203 KiB) in 37ms
  196. 12.68 s Progress: 0 of 101 built, 9 of 174 downloaded from cache (15 downloading)
  197. 12.68 s Downloading cached parser-combinators-1.3.1-doc from https://cache.nix-ci.com
  198. 12.68 s Downloaded cached code-page-0.2.1-doc (276 KiB) in 38ms
  199. 12.68 s Progress: 0 of 101 built, 10 of 174 downloaded from cache (15 downloading)
  200. 12.68 s Downloading cached prettyprinter-1.7.1-doc from https://cache.nix-ci.com
  201. 12.68 s Downloaded cached base-orphans-0.9.4-doc (1.1 MiB) in 43ms
  202. 12.68 s Progress: 0 of 101 built, 11 of 174 downloaded from cache (15 downloading)
  203. 12.68 s Downloaded cached assoc-1.1.1-doc (192 KiB) in 43ms
  204. 12.68 s Downloading cached primitive-0.9.1.0-doc from https://cache.nix-ci.com
  205. 12.68 s Progress: 0 of 101 built, 12 of 174 downloaded from cache (15 downloading)
  206. 12.68 s Downloading cached reflection-2.1.9-doc from https://cache.nix-ci.com
  207. 12.68 s Downloaded cached character-ps-0.1-doc (1 MiB) in 43ms
  208. 12.68 s Progress: 0 of 101 built, 13 of 174 downloaded from cache (15 downloading)
  209. 12.68 s Downloading cached splitmix-0.1.3.2-doc from https://cache.nix-ci.com
  210. 12.68 s Downloaded cached indexed-traversable-0.1.4-doc (1.1 MiB) in 44ms
  211. 12.68 s Progress: 0 of 101 built, 14 of 174 downloaded from cache (15 downloading)
  212. 12.68 s Downloading cached syb-0.7.2.4-doc from https://cache.nix-ci.com
  213. 12.68 s Downloaded cached file-io-0.1.6-doc (679 KiB) in 46ms
  214. 12.68 s Progress: 0 of 101 built, 15 of 174 downloaded from cache (15 downloading)
  215. 12.68 s Downloading cached tagged-0.8.9-doc from https://cache.nix-ci.com
  216. 12.69 s Downloaded cached colour-2.3.7-doc (2 MiB) in 48ms
  217. 12.69 s Progress: 0 of 101 built, 16 of 174 downloaded from cache (15 downloading)
  218. 12.69 s Downloading cached th-abstraction-0.7.2.0-doc from https://cache.nix-ci.com
  219. 12.69 s Downloaded cached integer-logarithms-1.0.5-doc (354 KiB) in 35ms
  220. 12.69 s Progress: 0 of 101 built, 17 of 174 downloaded from cache (15 downloading)
  221. 12.69 s Downloading cached ansi-terminal-types-1.1.3-doc from https://cache.nix-ci.com
  222. 12.69 s Downloaded cached ghc-paths-0.1.0.12-doc (121 KiB) in 54ms
  223. 12.69 s Progress: 0 of 101 built, 18 of 174 downloaded from cache (15 downloading)
  224. 12.69 s Downloaded cached old-locale-1.0.0.7-doc (164 KiB) in 30ms
  225. 12.69 s Downloading cached th-compat-0.1.7-doc from https://cache.nix-ci.com
  226. 12.69 s Progress: 0 of 101 built, 19 of 174 downloaded from cache (15 downloading)
  227. 12.69 s Downloading cached transformers-base-0.4.6.1-doc from https://cache.nix-ci.com
  228. 12.70 s Downloaded cached contravariant-1.5.6-doc (947 KiB) in 28ms
  229. 12.70 s Progress: 0 of 101 built, 20 of 174 downloaded from cache (15 downloading)
  230. 12.70 s Downloading cached old-time-1.1.1.0-doc from https://cache.nix-ci.com
  231. 12.70 s Downloaded cached parallel-3.2.2.0-doc (1 MiB) in 31ms
  232. 12.70 s Progress: 0 of 101 built, 21 of 174 downloaded from cache (15 downloading)
  233. 12.70 s Downloading cached transformers-compat-0.7.2-doc from https://cache.nix-ci.com
  234. 12.71 s Downloaded cached os-string-2.0.10-doc (3.6 MiB) in 42ms
  235. 12.71 s Progress: 0 of 101 built, 22 of 174 downloaded from cache (15 downloading)
  236. 12.71 s Downloading cached unliftio-core-0.2.1.0-doc from https://cache.nix-ci.com
  237. 12.71 s Downloaded cached reflection-2.1.9-doc (570 KiB) in 29ms
  238. 12.71 s Progress: 0 of 101 built, 23 of 174 downloaded from cache (15 downloading)
  239. 12.71 s Downloading cached hashable-1.5.1.0-doc from https://cache.nix-ci.com
  240. 12.71 s Downloaded cached parser-combinators-1.3.1-doc (905 KiB) in 38ms
  241. 12.71 s Progress: 0 of 101 built, 24 of 174 downloaded from cache (15 downloading)
  242. 12.72 s Downloading cached vector-stream-0.1.0.1-doc from https://cache.nix-ci.com
  243. 12.72 s Downloaded cached splitmix-0.1.3.2-doc (551 KiB) in 34ms
  244. 12.72 s Progress: 0 of 101 built, 25 of 174 downloaded from cache (15 downloading)
  245. 12.72 s Downloading cached random-1.2.1.3-doc from https://cache.nix-ci.com
  246. 12.72 s Downloaded cached tagged-0.8.9-doc (612 KiB) in 33ms
  247. 12.72 s Progress: 0 of 101 built, 26 of 174 downloaded from cache (15 downloading)
  248. 12.72 s Downloading cached distributive-0.6.3-doc from https://cache.nix-ci.com
  249. 12.72 s Downloaded cached extra-1.8.1-doc (3.1 MiB) in 48ms
  250. 12.72 s Progress: 0 of 101 built, 27 of 174 downloaded from cache (15 downloading)
  251. 12.72 s Downloaded cached ansi-terminal-types-1.1.3-doc (661 KiB) in 31ms
  252. 12.72 s Progress: 0 of 101 built, 28 of 174 downloaded from cache (14 downloading)
  253. 12.72 s Downloading cached ansi-terminal-1.1.5-doc from https://cache.nix-ci.com
  254. 12.73 s Downloaded cached transformers-base-0.4.6.1-doc (182 KiB) in 31ms
  255. 12.73 s Progress: 0 of 101 built, 29 of 174 downloaded from cache (14 downloading)
  256. 12.73 s Downloaded cached syb-0.7.2.4-doc (1.2 MiB) in 43ms
  257. 12.73 s Progress: 0 of 101 built, 30 of 174 downloaded from cache (13 downloading)
  258. 12.73 s Downloaded cached th-abstraction-0.7.2.0-doc (2.1 MiB) in 42ms
  259. 12.73 s Progress: 0 of 101 built, 31 of 174 downloaded from cache (12 downloading)
  260. 12.73 s Downloaded cached prettyprinter-1.7.1-doc (3.1 MiB) in 52ms
  261. 12.73 s Progress: 0 of 101 built, 32 of 174 downloaded from cache (11 downloading)
  262. 12.73 s Downloaded cached th-compat-0.1.7-doc (519 KiB) in 37ms
  263. 12.73 s Progress: 0 of 101 built, 33 of 174 downloaded from cache (10 downloading)
  264. 12.73 s Downloading cached network-uri-2.6.4.2-doc from https://cache.nix-ci.com
  265. 12.73 s Downloaded cached primitive-0.9.1.0-doc (5.4 MiB) in 53ms
  266. 12.73 s Progress: 0 of 101 built, 34 of 174 downloaded from cache (10 downloading)
  267. 12.73 s Downloading cached integer-conversion-0.1.1-doc from https://cache.nix-ci.com
  268. 12.74 s Downloaded cached unliftio-core-0.2.1.0-doc (270 KiB) in 29ms
  269. 12.74 s Progress: 0 of 101 built, 35 of 174 downloaded from cache (10 downloading)
  270. 12.74 s Downloaded cached transformers-compat-0.7.2-doc (1.9 MiB) in 39ms
  271. 12.74 s Progress: 0 of 101 built, 36 of 174 downloaded from cache (9 downloading)
  272. 12.75 s Downloaded cached hashable-1.5.1.0-doc (1.2 MiB) in 37ms
  273. 12.75 s Progress: 0 of 101 built, 37 of 174 downloaded from cache (8 downloading)
  274. 12.75 s Downloading cached case-insensitive-1.2.1.0-doc from https://cache.nix-ci.com
  275. 12.75 s Downloading cached data-fix-0.3.4-doc from https://cache.nix-ci.com
  276. 12.75 s Downloading cached scientific-0.3.8.1-doc from https://cache.nix-ci.com
  277. 12.75 s Downloading cached text-short-0.1.6.1-doc from https://cache.nix-ci.com
  278. 12.75 s Downloading cached these-1.2.1-doc from https://cache.nix-ci.com
  279. 12.75 s Downloading cached time-compat-1.9.9-doc from https://cache.nix-ci.com
  280. 12.75 s Downloading cached unordered-containers-0.2.20.1-doc from https://cache.nix-ci.com
  281. 12.75 s Downloaded cached distributive-0.6.3-doc (488 KiB) in 32ms
  282. 12.75 s Progress: 0 of 101 built, 38 of 174 downloaded from cache (14 downloading)
  283. 12.75 s Downloading cached comonad-5.0.10-doc from https://cache.nix-ci.com
  284. 12.75 s Downloaded cached vector-stream-0.1.0.1-doc (1.5 MiB) in 36ms
  285. 12.75 s Progress: 0 of 101 built, 39 of 174 downloaded from cache (14 downloading)
  286. 12.76 s Downloaded cached ansi-terminal-1.1.5-doc (871 KiB) in 35ms
  287. 12.76 s Progress: 0 of 101 built, 40 of 174 downloaded from cache (13 downloading)
  288. 12.76 s Downloading cached prettyprinter-ansi-terminal-1.1.3-doc from https://cache.nix-ci.com
  289. 12.76 s Downloaded cached random-1.2.1.3-doc (2.5 MiB) in 39ms
  290. 12.76 s Progress: 0 of 101 built, 41 of 174 downloaded from cache (13 downloading)
  291. 12.76 s Downloading cached QuickCheck-2.15.0.1-doc from https://cache.nix-ci.com
  292. 12.76 s Downloading cached temporary-1.3-doc from https://cache.nix-ci.com
  293. 12.76 s Downloading cached uuid-types-1.0.6.1-doc from https://cache.nix-ci.com
  294. 12.76 s Downloaded cached network-uri-2.6.4.2-doc (1 MiB) in 32ms
  295. 12.76 s Progress: 0 of 101 built, 42 of 174 downloaded from cache (15 downloading)
  296. 12.76 s Downloaded cached integer-conversion-0.1.1-doc (241 KiB) in 29ms
  297. 12.76 s Progress: 0 of 101 built, 43 of 174 downloaded from cache (14 downloading)
  298. 12.78 s Downloaded cached data-fix-0.3.4-doc (426 KiB) in 26ms
  299. 12.78 s Progress: 0 of 101 built, 44 of 174 downloaded from cache (13 downloading)
  300. 12.78 s Downloaded cached case-insensitive-1.2.1.0-doc (270 KiB) in 27ms
  301. 12.78 s Progress: 0 of 101 built, 45 of 174 downloaded from cache (12 downloading)
  302. 12.78 s Downloaded cached these-1.2.1-doc (1 MiB) in 33ms
  303. 12.78 s Progress: 0 of 101 built, 46 of 174 downloaded from cache (11 downloading)
  304. 12.78 s Downloading cached strict-0.5.1-doc from https://cache.nix-ci.com
  305. 12.78 s Downloaded cached scientific-0.3.8.1-doc (990 KiB) in 34ms
  306. 12.78 s Downloaded cached prettyprinter-ansi-terminal-1.1.3-doc (518 KiB) in 27ms
  307. 12.78 s Progress: 0 of 101 built, 47 of 174 downloaded from cache (11 downloading)
  308. 12.78 s Progress: 0 of 101 built, 48 of 174 downloaded from cache (11 downloading)
  309. 12.78 s Downloading cached megaparsec-9.7.0-doc from https://cache.nix-ci.com
  310. 12.78 s Downloading cached optparse-applicative-0.18.1.0-doc from https://cache.nix-ci.com
  311. 12.79 s Downloaded cached text-short-0.1.6.1-doc (1.1 MiB) in 38ms
  312. 12.79 s Progress: 0 of 101 built, 49 of 174 downloaded from cache (11 downloading)
  313. 12.79 s Downloaded cached temporary-1.3-doc (238 KiB) in 31ms
  314. 12.79 s Progress: 0 of 101 built, 50 of 174 downloaded from cache (10 downloading)
  315. 12.79 s Downloading cached doctest-0.24.3-doc from https://cache.nix-ci.com
  316. 12.79 s Downloaded cached uuid-types-1.0.6.1-doc (596 KiB) in 32ms
  317. 12.79 s Progress: 0 of 101 built, 51 of 174 downloaded from cache (10 downloading)
  318. 12.79 s Downloaded cached comonad-5.0.10-doc (1.5 MiB) in 39ms
  319. 12.79 s Downloaded cached time-compat-1.9.9-doc (2.4 MiB) in 41ms
  320. 12.79 s Progress: 0 of 101 built, 52 of 174 downloaded from cache (9 downloading)
  321. 12.79 s Progress: 0 of 101 built, 53 of 174 downloaded from cache (9 downloading)
  322. 12.79 s Downloading cached bifunctors-5.6.3-doc from https://cache.nix-ci.com
  323. 12.79 s Downloading cached text-iso8601-0.1.1.1-doc from https://cache.nix-ci.com
  324. 12.80 s Downloaded cached unordered-containers-0.2.20.1-doc (4.5 MiB) in 50ms
  325. 12.80 s Progress: 0 of 101 built, 54 of 174 downloaded from cache (9 downloading)
  326. 12.80 s Downloading cached indexed-traversable-instances-0.1.2.1-doc from https://cache.nix-ci.com
  327. 12.81 s Downloaded cached QuickCheck-2.15.0.1-doc (6.2 MiB) in 51ms
  328. 12.81 s Progress: 0 of 101 built, 55 of 174 downloaded from cache (9 downloading)
  329. 12.82 s Downloaded cached strict-0.5.1-doc (1.5 MiB) in 39ms
  330. 12.82 s Progress: 0 of 101 built, 56 of 174 downloaded from cache (8 downloading)
  331. 12.83 s Downloaded cached old-time-1.1.1.0-doc (537 KiB) in 124ms
  332. 12.83 s Progress: 0 of 101 built, 57 of 174 downloaded from cache (7 downloading)
  333. 12.83 s Downloading cached quickcheck-instances-0.3.33-doc from https://cache.nix-ci.com
  334. 12.83 s Downloaded cached text-iso8601-0.1.1.1-doc (573 KiB) in 35ms
  335. 12.83 s Progress: 0 of 101 built, 58 of 174 downloaded from cache (7 downloading)
  336. 12.83 s Downloaded cached doctest-0.24.3-doc (1.6 MiB) in 40ms
  337. 12.83 s Progress: 0 of 101 built, 59 of 174 downloaded from cache (6 downloading)
  338. 12.83 s Downloaded cached indexed-traversable-instances-0.1.2.1-doc (186 KiB) in 32ms
  339. 12.83 s Progress: 0 of 101 built, 60 of 174 downloaded from cache (5 downloading)
  340. 12.83 s Downloading cached witherable-0.5-doc from https://cache.nix-ci.com
  341. 12.84 s Downloaded cached optparse-applicative-0.18.1.0-doc (3.9 MiB) in 50ms
  342. 12.84 s Progress: 0 of 101 built, 61 of 174 downloaded from cache (5 downloading)
  343. 12.84 s Downloading cached tasty-1.5.4-doc from https://cache.nix-ci.com
  344. 12.84 s Downloaded cached bifunctors-5.6.3-doc (3.5 MiB) in 47ms
  345. 12.84 s Progress: 0 of 101 built, 62 of 174 downloaded from cache (5 downloading)
  346. 12.84 s Downloading cached profunctors-5.6.3-doc from https://cache.nix-ci.com
  347. 12.84 s Downloading cached semigroupoids-6.0.2-doc from https://cache.nix-ci.com
  348. 12.84 s Downloaded cached megaparsec-9.7.0-doc (5.2 MiB) in 55ms
  349. 12.84 s Progress: 0 of 101 built, 63 of 174 downloaded from cache (6 downloading)
  350. 12.86 s Downloaded cached quickcheck-instances-0.3.33-doc (1.5 MiB) in 36ms
  351. 12.86 s Progress: 0 of 101 built, 64 of 174 downloaded from cache (5 downloading)
  352. 12.87 s Downloaded cached witherable-0.5-doc (1.1 MiB) in 33ms
  353. 12.87 s Progress: 0 of 101 built, 65 of 174 downloaded from cache (4 downloading)
  354. 12.87 s Downloaded cached tasty-1.5.4-doc (3.3 MiB) in 37ms
  355. 12.87 s Progress: 0 of 101 built, 66 of 174 downloaded from cache (3 downloading)
  356. 12.89 s Downloaded cached profunctors-5.6.3-doc (5.2 MiB) in 46ms
  357. 12.89 s Progress: 0 of 101 built, 67 of 174 downloaded from cache (2 downloading)
  358. 12.89 s Downloading cached invariant-0.6.5-doc from https://cache.nix-ci.com
  359. 12.89 s Downloaded cached semigroupoids-6.0.2-doc (5.8 MiB) in 49ms
  360. 12.89 s Progress: 0 of 101 built, 68 of 174 downloaded from cache (2 downloading)
  361. 12.89 s Downloading cached either-5.0.3-doc from https://cache.nix-ci.com
  362. 12.89 s Downloading cached free-5.2-doc from https://cache.nix-ci.com
  363. 12.89 s Downloading cached semialign-1.3.1.1-doc from https://cache.nix-ci.com
  364. 12.92 s Downloaded cached invariant-0.6.5-doc (2.1 MiB) in 32ms
  365. 12.92 s Progress: 0 of 101 built, 69 of 174 downloaded from cache (4 downloading)
  366. 12.92 s Downloaded cached either-5.0.3-doc (453 KiB) in 33ms
  367. 12.92 s Progress: 0 of 101 built, 70 of 174 downloaded from cache (3 downloading)
  368. 12.92 s Downloaded cached semialign-1.3.1.1-doc (1.3 MiB) in 36ms
  369. 12.92 s Progress: 0 of 101 built, 71 of 174 downloaded from cache (2 downloading)
  370. 12.93 s Downloading cached aeson-2.2.4.1-doc from https://cache.nix-ci.com
  371. 12.93 s Downloaded cached free-5.2-doc (6 MiB) in 44ms
  372. 12.93 s Progress: 0 of 101 built, 72 of 174 downloaded from cache (2 downloading)
  373. 12.93 s Downloading cached adjunctions-4.4.4-doc from https://cache.nix-ci.com
  374. 12.93 s Downloading cached recursion-schemes-5.2.3-doc from https://cache.nix-ci.com
  375. 12.95 s Downloaded cached recursion-schemes-5.2.3-doc (2 MiB) in 13ms
  376. 12.95 s Progress: 0 of 101 built, 73 of 174 downloaded from cache (3 downloading)
  377. 12.95 s Downloading cached variant-1.0.2-doc from https://cache.nix-ci.com
  378. 12.97 s Downloaded cached adjunctions-4.4.4-doc (2 MiB) in 40ms
  379. 12.97 s Progress: 0 of 101 built, 74 of 174 downloaded from cache (3 downloading)
  380. 12.97 s Downloading cached kan-extensions-5.2.8-doc from https://cache.nix-ci.com
  381. 12.98 s Downloaded cached variant-1.0.2-doc (4.9 MiB) in 31ms
  382. 12.98 s Progress: 0 of 101 built, 75 of 174 downloaded from cache (3 downloading)
  383. 12.99 s Downloaded cached aeson-2.2.4.1-doc (14 MiB) in 63ms
  384. 12.99 s Progress: 0 of 101 built, 76 of 174 downloaded from cache (2 downloading)
  385. 13.02 s Downloaded cached kan-extensions-5.2.8-doc (2.3 MiB) in 46ms
  386. 13.02 s Progress: 0 of 101 built, 77 of 174 downloaded from cache (1 downloading)
  387. 13.02 s Downloading cached lens-5.3.6-doc from https://cache.nix-ci.com
  388. 13.13 s Downloaded cached lens-5.3.6-doc (34.8 MiB) in 108ms
  389. 13.13 s Progress: 0 of 101 built, 78 of 174 downloaded from cache (1 downloading)
  390. 13.13 s Downloading cached yaya-0.6.2.3-doc from https://cache.nix-ci.com
  391. 13.15 s Downloaded cached yaya-0.6.2.3-doc (2.7 MiB) in 19ms
  392. 13.15 s Progress: 0 of 101 built, 79 of 174 downloaded from cache (1 downloading)
  393. 13.15 s Downloading cached pathway-internal-0.0.1.0-doc from https://cache.nix-ci.com
  394. 13.15 s Downloading cached yaya-containers-0.1.2.2-doc from https://cache.nix-ci.com
  395. 13.15 s Downloading cached yaya-quickcheck-0.2.0.3-doc from https://cache.nix-ci.com
  396. 13.15 s Downloading cached yaya-unsafe-0.4.1.4-doc from https://cache.nix-ci.com
  397. 13.16 s Downloaded cached yaya-quickcheck-0.2.0.3-doc (269 KiB) in 15ms
  398. 13.16 s Progress: 0 of 101 built, 80 of 174 downloaded from cache (4 downloading)
  399. 13.16 s Downloaded cached pathway-internal-0.0.1.0-doc (612 KiB) in 15ms
  400. 13.16 s Progress: 0 of 101 built, 81 of 174 downloaded from cache (3 downloading)
  401. 13.16 s Downloading cached pathway-quickcheck-0.0.1.0-doc from https://cache.nix-ci.com
  402. 13.17 s Downloaded cached yaya-unsafe-0.4.1.4-doc (661 KiB) in 17ms
  403. 13.17 s Progress: 0 of 100 built, 82 of 174 downloaded from cache (3 downloading)
  404. 13.17 s Downloaded cached yaya-containers-0.1.2.2-doc (1.1 MiB) in 18ms
  405. 13.17 s Progress: 0 of 100 built, 83 of 174 downloaded from cache (2 downloading)
  406. 13.17 s Downloading cached pathway-0.0.1.0-doc from https://cache.nix-ci.com
  407. 13.17 s Downloaded cached pathway-quickcheck-0.0.1.0-doc (217 KiB) in 8ms
  408. 13.17 s Progress: 0 of 100 built, 84 of 174 downloaded from cache (2 downloading)
  409. 13.18 s Downloaded cached pathway-0.0.1.0-doc (1.3 MiB) in 11ms
  410. 13.18 s Progress: 0 of 99 built, 85 of 174 downloaded from cache (1 downloading)
  411. 13.18 s Downloading cached pathway-compat-base-0.0.1.0-doc from https://cache.nix-ci.com
  412. 13.18 s Downloading cached pathway-path-0.0.1.0-doc from https://cache.nix-ci.com
  413. 13.19 s Downloaded cached pathway-path-0.0.1.0-doc (263 KiB) in 10ms
  414. 13.19 s Progress: 0 of 98 built, 86 of 174 downloaded from cache (2 downloading)
  415. 13.20 s Downloaded cached pathway-compat-base-0.0.1.0-doc (1.9 MiB) in 18ms
  416. 13.20 s Progress: 0 of 97 built, 87 of 174 downloaded from cache (1 downloading)
  417. 16.87 s Downloaded cached ghc (1.8 GiB) in 4.2s
  418. 16.87 s Progress: 0 of 96 built, 88 of 174 downloaded from cache
  419. 16.88 s Downloading cached OneTuple from https://cache.nix-ci.com
  420. 18.43 s Downloading cached StateVar from https://cache.nix-ci.com
  421. 18.43 s Downloading cached assoc from https://cache.nix-ci.com
  422. 18.43 s Downloading cached base-orphans from https://cache.nix-ci.com
  423. 18.43 s Downloading cached call-stack from https://cache.nix-ci.com
  424. 18.43 s Downloading cached cabal-doctest from https://cache.nix-ci.com
  425. 18.43 s Downloading cached character-ps from https://cache.nix-ci.com
  426. 18.43 s Downloading cached clock from https://cache.nix-ci.com
  427. 18.43 s Downloading cached code-page from https://cache.nix-ci.com
  428. 18.43 s Downloading cached colour from https://cache.nix-ci.com
  429. 18.43 s Downloading cached dlist from https://cache.nix-ci.com
  430. 18.43 s Downloading cached file-io from https://cache.nix-ci.com
  431. 18.43 s Downloading cached indexed-traversable from https://cache.nix-ci.com
  432. 18.43 s Downloading cached ghc-paths from https://cache.nix-ci.com
  433. 18.43 s Downloading cached integer-logarithms from https://cache.nix-ci.com
  434. 18.43 s Downloading cached old-locale from https://cache.nix-ci.com
  435. 18.44 s Downloaded cached OneTuple (75 KiB) in 1.5s
  436. 18.44 s Progress: 0 of 95 built, 89 of 174 downloaded from cache (15 downloading)
  437. 18.44 s Downloading cached os-string from https://cache.nix-ci.com
  438. 18.44 s Downloaded cached ghc-paths (101 KiB) in 7ms
  439. 18.44 s Progress: 0 of 94 built, 90 of 174 downloaded from cache (15 downloading)
  440. 18.44 s Downloading cached parallel from https://cache.nix-ci.com
  441. 18.44 s Downloaded cached assoc (168 KiB) in 8ms
  442. 18.44 s Progress: 0 of 94 built, 91 of 174 downloaded from cache (15 downloading)
  443. 18.44 s Downloading cached parser-combinators from https://cache.nix-ci.com
  444. 18.45 s Downloaded cached character-ps (2.2 MiB) in 11ms
  445. 18.45 s Progress: 0 of 93 built, 92 of 174 downloaded from cache (15 downloading)
  446. 18.45 s Downloading cached prettyprinter from https://cache.nix-ci.com
  447. 18.45 s Downloaded cached StateVar (380 KiB) in 12ms
  448. 18.45 s Progress: 0 of 92 built, 93 of 174 downloaded from cache (15 downloading)
  449. 18.45 s Downloading cached primitive from https://cache.nix-ci.com
  450. 18.45 s Downloaded cached old-locale (534 KiB) in 14ms
  451. 18.45 s Progress: 0 of 91 built, 94 of 174 downloaded from cache (15 downloading)
  452. 18.45 s Downloading cached contravariant from https://cache.nix-ci.com
  453. 18.45 s Downloaded cached file-io (1.1 MiB) in 15ms
  454. 18.45 s Progress: 0 of 90 built, 95 of 174 downloaded from cache (15 downloading)
  455. 18.45 s Downloading cached old-time from https://cache.nix-ci.com
  456. 18.45 s Downloaded cached code-page (366 KiB) in 18ms
  457. 18.45 s Progress: 0 of 89 built, 96 of 174 downloaded from cache (15 downloading)
  458. 18.45 s Downloading cached reflection from https://cache.nix-ci.com
  459. 18.46 s Downloaded cached call-stack (280 KiB) in 21ms
  460. 18.46 s Progress: 0 of 89 built, 97 of 174 downloaded from cache (15 downloading)
  461. 18.46 s Downloaded cached cabal-doctest (770 KiB) in 21ms
  462. 18.46 s Downloading cached splitmix from https://cache.nix-ci.com
  463. 18.46 s Progress: 0 of 88 built, 98 of 174 downloaded from cache (15 downloading)
  464. 18.46 s Downloading cached syb from https://cache.nix-ci.com
  465. 18.46 s Downloaded cached dlist (1.4 MiB) in 23ms
  466. 18.46 s Progress: 0 of 87 built, 99 of 174 downloaded from cache (15 downloading)
  467. 18.46 s Downloading cached tagged from https://cache.nix-ci.com
  468. 18.46 s Downloaded cached integer-logarithms (911 KiB) in 27ms
  469. 18.46 s Progress: 0 of 86 built, 100 of 174 downloaded from cache (15 downloading)
  470. 18.46 s Downloading cached th-abstraction from https://cache.nix-ci.com
  471. 18.46 s Downloaded cached colour (5.5 MiB) in 28ms
  472. 18.46 s Progress: 0 of 85 built, 101 of 174 downloaded from cache (15 downloading)
  473. 18.46 s Downloading cached th-compat from https://cache.nix-ci.com
  474. 18.47 s Downloaded cached base-orphans (1.8 MiB) in 38ms
  475. 18.47 s Downloaded cached parallel (1.4 MiB) in 30ms
  476. 18.47 s Progress: 0 of 84 built, 102 of 174 downloaded from cache (15 downloading)
  477. 18.47 s Downloading cached ansi-terminal-types from https://cache.nix-ci.com
  478. 18.47 s Downloaded cached parser-combinators (1.9 MiB) in 30ms
  479. 18.47 s Downloaded cached clock (1.8 MiB) in 39ms
  480. 18.47 s Progress: 0 of 83 built, 103 of 174 downloaded from cache (15 downloading)
  481. 18.47 s Progress: 0 of 83 built, 104 of 174 downloaded from cache (14 downloading)
  482. 18.47 s Progress: 0 of 83 built, 105 of 174 downloaded from cache (13 downloading)
  483. 18.47 s Downloading cached transformers-compat from https://cache.nix-ci.com
  484. 18.47 s Downloading cached unliftio-core from https://cache.nix-ci.com
  485. 18.47 s Downloading cached vector-stream from https://cache.nix-ci.com
  486. 18.48 s Downloaded cached splitmix (877 KiB) in 20ms
  487. 18.48 s Progress: 0 of 80 built, 106 of 174 downloaded from cache (15 downloading)
  488. 18.48 s Downloading cached extra from https://cache.nix-ci.com
  489. 18.48 s Downloaded cached indexed-traversable (3.8 MiB) in 42ms
  490. 18.48 s Progress: 0 of 79 built, 107 of 174 downloaded from cache (15 downloading)
  491. 18.48 s Downloaded cached contravariant (1.9 MiB) in 28ms
  492. 18.48 s Downloading cached random from https://cache.nix-ci.com
  493. 18.48 s Progress: 0 of 78 built, 108 of 174 downloaded from cache (15 downloading)
  494. 18.48 s Downloaded cached old-time (2.3 MiB) in 28ms
  495. 18.48 s Progress: 0 of 77 built, 109 of 174 downloaded from cache (14 downloading)
  496. 18.48 s Downloaded cached tagged (1.6 MiB) in 20ms
  497. 18.48 s Progress: 0 of 76 built, 110 of 174 downloaded from cache (13 downloading)
  498. 18.48 s Downloading cached distributive from https://cache.nix-ci.com
  499. 18.48 s Downloaded cached syb (2.8 MiB) in 27ms
  500. 18.48 s Progress: 0 of 75 built, 111 of 174 downloaded from cache (13 downloading)
  501. 18.49 s Downloaded cached th-compat (566 KiB) in 27ms
  502. 18.49 s Progress: 0 of 75 built, 112 of 174 downloaded from cache (12 downloading)
  503. 18.49 s Downloaded cached reflection (6 MiB) in 38ms
  504. 18.49 s Progress: 0 of 74 built, 113 of 174 downloaded from cache (12 downloading)
  505. 18.49 s Downloading cached network-uri from https://cache.nix-ci.com
  506. 18.49 s Downloaded cached os-string (5.9 MiB) in 51ms
  507. 18.49 s Progress: 0 of 73 built, 114 of 174 downloaded from cache (11 downloading)
  508. 18.49 s Downloading cached hashable from https://cache.nix-ci.com
  509. 18.50 s Downloaded cached unliftio-core (390 KiB) in 21ms
  510. 18.50 s Progress: 0 of 72 built, 115 of 174 downloaded from cache (11 downloading)
  511. 18.50 s Downloaded cached th-abstraction (5.6 MiB) in 37ms
  512. 18.50 s Progress: 0 of 71 built, 116 of 174 downloaded from cache (10 downloading)
  513. 18.50 s Downloaded cached vector-stream (3.1 MiB) in 28ms
  514. 18.50 s Downloaded cached distributive (1.2 MiB) in 22ms
  515. 18.50 s Progress: 0 of 70 built, 117 of 174 downloaded from cache (9 downloading)
  516. 18.50 s Downloaded cached ansi-terminal-types (3.3 MiB) in 29ms
  517. 18.50 s Progress: 0 of 69 built, 118 of 174 downloaded from cache (8 downloading)
  518. 18.50 s Progress: 0 of 69 built, 119 of 174 downloaded from cache (7 downloading)
  519. 18.50 s Downloading cached ansi-terminal from https://cache.nix-ci.com
  520. 18.50 s Downloading cached comonad from https://cache.nix-ci.com
  521. 18.51 s Downloaded cached transformers-compat (3.4 MiB) in 32ms
  522. 18.51 s Progress: 0 of 67 built, 120 of 174 downloaded from cache (8 downloading)
  523. 18.51 s Downloaded cached primitive (8.7 MiB) in 59ms
  524. 18.51 s Downloading cached transformers-base from https://cache.nix-ci.com
  525. 18.51 s Progress: 0 of 66 built, 121 of 174 downloaded from cache (8 downloading)
  526. 18.51 s Downloading cached integer-conversion from https://cache.nix-ci.com
  527. 18.51 s Downloaded cached prettyprinter (8.7 MiB) in 64ms
  528. 18.51 s Progress: 0 of 65 built, 122 of 174 downloaded from cache (8 downloading)
  529. 18.51 s Downloaded cached hashable (3.3 MiB) in 21ms
  530. 18.51 s Downloaded cached extra (4.1 MiB) in 37ms
  531. 18.51 s Progress: 0 of 64 built, 123 of 174 downloaded from cache (7 downloading)
  532. 18.52 s Downloading cached case-insensitive from https://cache.nix-ci.com
  533. 18.52 s Downloading cached data-fix from https://cache.nix-ci.com
  534. 18.52 s Downloading cached scientific from https://cache.nix-ci.com
  535. 18.52 s Downloading cached text-short from https://cache.nix-ci.com
  536. 18.52 s Downloading cached these from https://cache.nix-ci.com
  537. 18.52 s Downloading cached time-compat from https://cache.nix-ci.com
  538. 18.52 s Downloading cached unordered-containers from https://cache.nix-ci.com
  539. 18.52 s Progress: 0 of 63 built, 124 of 174 downloaded from cache (13 downloading)
  540. 18.52 s Downloaded cached network-uri (5.2 MiB) in 26ms
  541. 18.52 s Progress: 0 of 62 built, 125 of 174 downloaded from cache (12 downloading)
  542. 18.52 s Downloaded cached random (8.8 MiB) in 41ms
  543. 18.52 s Progress: 0 of 61 built, 126 of 174 downloaded from cache (11 downloading)
  544. 18.52 s Downloading cached QuickCheck from https://cache.nix-ci.com
  545. 18.52 s Downloading cached temporary from https://cache.nix-ci.com
  546. 18.52 s Downloading cached uuid-types from https://cache.nix-ci.com
  547. 18.52 s Downloaded cached integer-conversion (193 KiB) in 13ms
  548. 18.52 s Progress: 0 of 60 built, 127 of 174 downloaded from cache (13 downloading)
  549. 18.52 s Downloaded cached ansi-terminal (1.2 MiB) in 19ms
  550. 18.52 s Progress: 0 of 59 built, 128 of 174 downloaded from cache (12 downloading)
  551. 18.52 s Downloading cached prettyprinter-ansi-terminal from https://cache.nix-ci.com
  552. 18.53 s Downloaded cached transformers-base (588 KiB) in 18ms
  553. 18.53 s Progress: 0 of 58 built, 129 of 174 downloaded from cache (12 downloading)
  554. 18.53 s Downloaded cached case-insensitive (943 KiB) in 16ms
  555. 18.53 s Progress: 0 of 57 built, 130 of 174 downloaded from cache (11 downloading)
  556. 18.53 s Downloaded cached comonad (3.1 MiB) in 27ms
  557. 18.53 s Progress: 0 of 56 built, 131 of 174 downloaded from cache (10 downloading)
  558. 18.53 s Downloading cached bifunctors from https://cache.nix-ci.com
  559. 18.53 s Downloaded cached data-fix (1.1 MiB) in 19ms
  560. 18.53 s Progress: 0 of 55 built, 132 of 174 downloaded from cache (10 downloading)
  561. 18.53 s Downloaded cached temporary (306 KiB) in 14ms
  562. 18.53 s Progress: 0 of 54 built, 133 of 174 downloaded from cache (9 downloading)
  563. 18.54 s Downloading cached doctest from https://cache.nix-ci.com
  564. 18.54 s Downloaded cached text-short (1.7 MiB) in 22ms
  565. 18.54 s Progress: 0 of 53 built, 134 of 174 downloaded from cache (9 downloading)
  566. 18.54 s Downloaded cached uuid-types (1.6 MiB) in 18ms
  567. 18.54 s Progress: 0 of 52 built, 135 of 174 downloaded from cache (8 downloading)
  568. 18.54 s Downloaded cached these (3.1 MiB) in 24ms
  569. 18.54 s Progress: 0 of 51 built, 136 of 174 downloaded from cache (7 downloading)
  570. 18.54 s Downloading cached strict from https://cache.nix-ci.com
  571. 18.54 s Downloaded cached time-compat (2.9 MiB) in 27ms
  572. 18.54 s Progress: 0 of 50 built, 137 of 174 downloaded from cache (7 downloading)
  573. 18.54 s Downloading cached text-iso8601 from https://cache.nix-ci.com
  574. 18.54 s Downloaded cached scientific (2.9 MiB) in 27ms
  575. 18.54 s Progress: 0 of 49 built, 138 of 174 downloaded from cache (7 downloading)
  576. 18.54 s Downloading cached megaparsec from https://cache.nix-ci.com
  577. 18.55 s Downloaded cached prettyprinter-ansi-terminal (1.4 MiB) in 23ms
  578. 18.55 s Progress: 0 of 48 built, 139 of 174 downloaded from cache (7 downloading)
  579. 18.55 s Downloading cached optparse-applicative from https://cache.nix-ci.com
  580. 18.56 s Downloaded cached unordered-containers (9.3 MiB) in 42ms
  581. 18.56 s Progress: 0 of 47 built, 140 of 174 downloaded from cache (7 downloading)
  582. 18.58 s Downloaded cached text-iso8601 (3 MiB) in 35ms
  583. 18.58 s Progress: 0 of 46 built, 141 of 174 downloaded from cache (6 downloading)
  584. 18.59 s Downloaded cached strict (5.2 MiB) in 46ms
  585. 18.59 s Progress: 0 of 45 built, 142 of 174 downloaded from cache (5 downloading)
  586. 18.60 s Downloaded cached QuickCheck (19.9 MiB) in 81ms
  587. 18.60 s Progress: 0 of 44 built, 143 of 174 downloaded from cache (4 downloading)
  588. 18.60 s Downloaded cached bifunctors (15.7 MiB) in 71ms
  589. 18.60 s Progress: 0 of 43 built, 144 of 174 downloaded from cache (3 downloading)
  590. 18.60 s Downloading cached profunctors from https://cache.nix-ci.com
  591. 18.60 s Downloading cached semigroupoids from https://cache.nix-ci.com
  592. 18.61 s Downloaded cached optparse-applicative (8.7 MiB) in 57ms
  593. 18.61 s Progress: 0 of 42 built, 145 of 174 downloaded from cache (4 downloading)
  594. 18.61 s Downloading cached tasty from https://cache.nix-ci.com
  595. 18.62 s Downloaded cached megaparsec (15.6 MiB) in 73ms
  596. 18.62 s Progress: 0 of 41 built, 146 of 174 downloaded from cache (4 downloading)
  597. 18.65 s Downloaded cached profunctors (10.5 MiB) in 49ms
  598. 18.66 s Downloaded cached semigroupoids (11.9 MiB) in 56ms
  599. 18.66 s Progress: 0 of 40 built, 147 of 174 downloaded from cache (3 downloading)
  600. 18.66 s Downloading cached invariant from https://cache.nix-ci.com
  601. 18.66 s Progress: 0 of 39 built, 148 of 174 downloaded from cache (3 downloading)
  602. 18.66 s Downloading cached either from https://cache.nix-ci.com
  603. 18.66 s Downloading cached free from https://cache.nix-ci.com
  604. 18.66 s Downloaded cached tasty (9.5 MiB) in 55ms
  605. 18.66 s Progress: 0 of 38 built, 149 of 174 downloaded from cache (4 downloading)
  606. 18.66 s Downloading cached vector from https://cache.nix-ci.com
  607. 18.67 s Downloaded cached either (885 KiB) in 8ms
  608. 18.67 s Progress: 0 of 37 built, 150 of 174 downloaded from cache (4 downloading)
  609. 18.68 s Downloaded cached invariant (5.4 MiB) in 18ms
  610. 18.68 s Progress: 0 of 36 built, 151 of 174 downloaded from cache (3 downloading)
  611. 18.72 s Downloaded cached free (22.5 MiB) in 54ms
  612. 18.72 s Progress: 0 of 35 built, 152 of 174 downloaded from cache (2 downloading)
  613. 18.72 s Downloading cached adjunctions from https://cache.nix-ci.com
  614. 18.72 s Downloading cached recursion-schemes from https://cache.nix-ci.com
  615. 18.73 s Downloaded cached adjunctions (6 MiB) in 15ms
  616. 18.73 s Progress: 0 of 34 built, 153 of 174 downloaded from cache (3 downloading)
  617. 18.73 s Downloading cached kan-extensions from https://cache.nix-ci.com
  618. 18.74 s Downloaded cached doctest (68.8 MiB) in 202ms
  619. 18.74 s Progress: 0 of 33 built, 154 of 174 downloaded from cache (3 downloading)
  620. 18.74 s Downloaded cached recursion-schemes (6.7 MiB) in 25ms
  621. 18.74 s Progress: 0 of 32 built, 155 of 174 downloaded from cache (2 downloading)
  622. 18.74 s Downloading cached variant from https://cache.nix-ci.com
  623. 18.75 s Downloaded cached kan-extensions (7 MiB) in 14ms
  624. 18.75 s Progress: 0 of 31 built, 156 of 174 downloaded from cache (2 downloading)
  625. 18.75 s Downloaded cached vector (57.1 MiB) in 89ms
  626. 18.75 s Progress: 0 of 30 built, 157 of 174 downloaded from cache (1 downloading)
  627. 18.75 s Downloading cached indexed-traversable-instances from https://cache.nix-ci.com
  628. 18.75 s Downloading cached quickcheck-instances from https://cache.nix-ci.com
  629. 18.75 s Downloaded cached variant (10.9 MiB) in 11ms
  630. 18.75 s Progress: 0 of 29 built, 158 of 174 downloaded from cache (2 downloading)
  631. 18.75 s Downloaded cached indexed-traversable-instances (359 KiB) in 2ms
  632. 18.75 s Progress: 0 of 28 built, 159 of 174 downloaded from cache (1 downloading)
  633. 18.75 s Downloading cached lens from https://cache.nix-ci.com
  634. 18.75 s Downloading cached semialign from https://cache.nix-ci.com
  635. 18.75 s Downloading cached witherable from https://cache.nix-ci.com
  636. 18.76 s Downloaded cached quickcheck-instances (5.5 MiB) in 12ms
  637. 18.76 s Progress: 0 of 27 built, 160 of 174 downloaded from cache (3 downloading)
  638. 18.77 s Downloaded cached witherable (4.4 MiB) in 11ms
  639. 18.77 s Progress: 0 of 26 built, 161 of 174 downloaded from cache (2 downloading)
  640. 18.78 s Downloaded cached semialign (3.7 MiB) in 29ms
  641. 18.78 s Progress: 0 of 25 built, 162 of 174 downloaded from cache (1 downloading)
  642. 18.78 s Downloading cached aeson from https://cache.nix-ci.com
  643. 18.83 s Downloaded cached lens (59.2 MiB) in 75ms
  644. 18.83 s Progress: 0 of 24 built, 163 of 174 downloaded from cache (1 downloading)
  645. 18.83 s Downloading cached yaya from https://cache.nix-ci.com
  646. 18.83 s Downloaded cached aeson (47.7 MiB) in 45ms
  647. 18.83 s Progress: 0 of 23 built, 164 of 174 downloaded from cache (1 downloading)
  648. 18.83 s Downloading cached path from https://cache.nix-ci.com
  649. 18.84 s Downloaded cached path (10.1 MiB) in 7ms
  650. 18.84 s Progress: 0 of 22 built, 165 of 174 downloaded from cache (1 downloading)
  651. 18.84 s Downloaded cached yaya (5.3 MiB) in 7ms
  652. 18.84 s Progress: 0 of 21 built, 166 of 174 downloaded from cache
  653. 18.84 s Downloading cached pathway-internal from https://cache.nix-ci.com
  654. 18.84 s Downloading cached yaya-containers from https://cache.nix-ci.com
  655. 18.84 s Downloading cached yaya-quickcheck from https://cache.nix-ci.com
  656. 18.84 s Downloading cached yaya-unsafe from https://cache.nix-ci.com
  657. 18.84 s Downloaded cached yaya-quickcheck (351 KiB) in 1ms
  658. 18.84 s Progress: 0 of 20 built, 167 of 174 downloaded from cache (3 downloading)
  659. 18.84 s Downloaded cached yaya-unsafe (1 MiB) in 2ms
  660. 18.84 s Progress: 0 of 19 built, 168 of 174 downloaded from cache (2 downloading)
  661. 18.84 s Downloaded cached pathway-internal (2 MiB) in 3ms
  662. 18.84 s Progress: 0 of 18 built, 169 of 174 downloaded from cache (1 downloading)
  663. 18.84 s Downloading cached pathway-quickcheck from https://cache.nix-ci.com
  664. 18.84 s Downloaded cached yaya-containers (3.5 MiB) in 3ms
  665. 18.84 s Progress: 0 of 17 built, 170 of 174 downloaded from cache (1 downloading)
  666. 18.84 s Downloaded cached pathway-quickcheck (179 KiB) in 0ms
  667. 18.84 s Downloading cached pathway from https://cache.nix-ci.com
  668. 18.84 s Progress: 0 of 16 built, 171 of 174 downloaded from cache (1 downloading)
  669. 18.84 s Downloaded cached pathway (2.7 MiB) in 1ms
  670. 18.84 s Progress: 0 of 15 built, 172 of 174 downloaded from cache
  671. 18.84 s Downloading cached pathway-compat-base from https://cache.nix-ci.com
  672. 18.84 s Downloading cached pathway-path from https://cache.nix-ci.com
  673. 18.84 s Downloaded cached pathway-path (217 KiB) in 0ms
  674. 18.84 s Progress: 0 of 14 built, 173 of 174 downloaded from cache (1 downloading)
  675. 18.84 s Downloaded cached pathway-compat-base (2 MiB) in 1ms
  676. 18.84 s Progress: 0 of 13 built, 174 of 174 downloaded from cache
  677. 18.84 s Building /nix/store/gwlaydb47f6yhlx7hsgqq7s0m612k39r-pathway-compat-filepath-0.0.1.0.drv
  678. 18.84 s [pathway-compat-filepath] Phase: setupCompilerEnvironmentPhase
  679. 18.84 s [pathway-compat-filepath] Build with /nix/store/7r9b0bl984hdgd70nf5p8raa55kml491-ghc-9.8.4.
  680. 18.96 s [pathway-compat-filepath] Phase: unpackPhase
  681. 18.97 s [pathway-compat-filepath] unpacking source archive /nix/store/56v5999xvkp18l2ygdvahppqdv4hrlnl-filepath
  682. 18.97 s [pathway-compat-filepath] source root is filepath
  683. 18.99 s [pathway-compat-filepath] Phase: patchPhase
  684. 19.00 s [pathway-compat-filepath] Phase: compileBuildDriverPhase
  685. 19.00 s [pathway-compat-filepath] setupCompileFlags: -package-db=/build/tmp.hsoEC5z0By/setup-package.conf.d -threaded
  686. 19.05 s [pathway-compat-filepath] [1 of 2] Compiling Main ( Setup.hs, /build/tmp.hsoEC5z0By/Main.o )
  687. 19.09 s [pathway-compat-filepath] [2 of 2] Linking Setup
  688. 20.94 s [pathway-compat-filepath] Phase: updateAutotoolsGnuConfigScriptsPhase
  689. 20.95 s [pathway-compat-filepath] Phase: configurePhase
  690. 20.96 s [pathway-compat-filepath] configureFlags: --verbose --prefix=/nix/store/knqi4mpp2gcy2djhvikk6m439c94gw16-pathway-compat-filepath-0.0.1.0 --libdir=$prefix/lib/$compiler/lib --libsubdir=$abi/$libname --docdir=/nix/store/brb3ys0mr106j2xs2nqwq5rszfngk13w-pathway-compat-filepath-0.0.1.0-doc/share/doc/pathway-compat-filepath-0.0.1.0 --with-gcc=gcc --package-db=/build/tmp.hsoEC5z0By/package.conf.d --ghc-option=-j16 --ghc-option=+RTS --ghc-option=-A64M --ghc-option=-RTS --enable-library-profiling --profiling-detail=exported-functions --disable-profiling --enable-shared --disable-coverage --enable-static --disable-executable-dynamic --enable-tests --disable-benchmarks --enable-library-vanilla --disable-library-for-ghci --enable-split-sections --enable-library-stripping --enable-executable-stripping --ghc-option=-haddock --ghc-options=-Werror --extra-lib-dirs=/nix/store/pndhkk0l649lm1sj0mxk7cbwq26qd1ra-ncurses-6.6/lib --extra-lib-dirs=/nix/store/0djlg4g0b81w94k3vcaqsxsc2hh4kism-libffi-3.5.2/lib --extra-lib-dirs=/nix/store/md4paia7riiggyrj8p24c7a6vf8w7jz8-elfutils-0.194/lib --extra-lib-dirs=/nix/store/39vv2pf64gd8li48a4hpbhw2crzd8z5p-gmp-with-cxx-6.3.0/lib --extra-lib-dirs=/nix/store/7wwvald8lapkrsr72qanlw8blyn55ifx-numactl-2.0.18/lib --extra-lib-dirs=/nix/store/7r9b0bl984hdgd70nf5p8raa55kml491-ghc-9.8.4/lib
  691. 20.97 s [pathway-compat-filepath] Using Parsec parser
  692. 20.97 s [pathway-compat-filepath] Configuring pathway-compat-filepath-0.0.1.0...
  693. 21.28 s [pathway-compat-filepath] Flags chosen: noisy-deprecations=True, verify-no-recursion=False
  694. 21.28 s [pathway-compat-filepath] Dependency base >=4.14.0 && <4.15 || >=4.15.0 && <4.16 || >=4.16.0 && <4.17 ||
  695. 21.28 s [pathway-compat-filepath] >=4.17.0 && <4.18 || >=4.18.0 && <4.19 || >=4.19.0 && <4.20 || >=4.20.0 &&
  696. 21.28 s [pathway-compat-filepath] <4.21 || >=4.21.0 && <4.22 || >=4.22.0 && <4.23: using base-4.19.2.0
  697. 21.28 s [pathway-compat-filepath] Dependency extra: using extra-1.8.1
  698. 21.28 s [pathway-compat-filepath] Dependency filepath >=1.4.2 && <1.5 || >=1.5.0 && <1.6: using
  699. 21.28 s [pathway-compat-filepath] filepath-1.4.301.0
  700. 21.28 s [pathway-compat-filepath] Dependency megaparsec >=9.0.1 && <9.1 || >=9.2.1 && <9.3 || >=9.5.0 && <9.6 ||
  701. 21.28 s [pathway-compat-filepath] >=9.7.0 && <9.8: using megaparsec-9.7.0
  702. 21.28 s [pathway-compat-filepath] Dependency os-string: using os-string-2.0.10
  703. 21.28 s [pathway-compat-filepath] Dependency pathway >=0.0.1 && <0.1: using pathway-0.0.1.0
  704. 21.28 s [pathway-compat-filepath] Dependency pathway-compat-base >=0.0.1 && <0.1: using
  705. 21.28 s [pathway-compat-filepath] pathway-compat-base-0.0.1.0
  706. 21.28 s [pathway-compat-filepath] Dependency pathway-internal >=0.0.1 && <0.1: using pathway-internal-0.0.1.0
  707. 21.28 s [pathway-compat-filepath] Dependency base >=4.14.0 && <4.15 || >=4.15.0 && <4.16 || >=4.16.0 && <4.17 ||
  708. 21.28 s [pathway-compat-filepath] >=4.17.0 && <4.18 || >=4.18.0 && <4.19 || >=4.19.0 && <4.20 || >=4.20.0 &&
  709. 21.28 s [pathway-compat-filepath] <4.21 || >=4.21.0 && <4.22 || >=4.22.0 && <4.23: using base-4.19.2.0
  710. 21.28 s [pathway-compat-filepath] Dependency doctest >=0.16.3 && <0.17 || >=0.18.1 && <0.19 || >=0.20.1 && <0.21
  711. 21.28 s [pathway-compat-filepath] || >=0.21.1 && <0.22 || >=0.22.2 && <0.23 || >=0.24.2 && <0.25: using
  712. 21.28 s [pathway-compat-filepath] doctest-0.24.3
  713. 21.28 s [pathway-compat-filepath] Dependency pathway-compat-filepath: using pathway-compat-filepath-0.0.1.0
  714. 21.60 s [pathway-compat-filepath] Source component graph:
  715. 21.60 s [pathway-compat-filepath] component lib
  716. 21.60 s [pathway-compat-filepath] component test:doctests dependency lib
  717. 21.60 s [pathway-compat-filepath] Configured component graph:
  718. 21.60 s [pathway-compat-filepath] component pathway-compat-filepath-0.0.1.0-6KN1Vlb8yPeBopmlZtXyrR
  719. 21.60 s [pathway-compat-filepath] include base-4.19.2.0-934f
  720. 21.60 s [pathway-compat-filepath] include extra-1.8.1-F4oHgTKCper3ZiIUPZjGPK
  721. 21.60 s [pathway-compat-filepath] include filepath-1.4.301.0-6e15
  722. 21.60 s [pathway-compat-filepath] include megaparsec-9.7.0-10vHZAF1maw9O8p2gXs66N
  723. 21.60 s [pathway-compat-filepath] include os-string-2.0.10-HbyG8qgShpTHKXL8bZ3UK8
  724. 21.60 s [pathway-compat-filepath] include pathway-0.0.1.0-H5uD0SRA9755UrSqFBaCYE
  725. 21.60 s [pathway-compat-filepath] include pathway-compat-base-0.0.1.0-8ldj6SPXbxq2Shd8yFeOpr
  726. 21.60 s [pathway-compat-filepath] include pathway-internal-0.0.1.0-Lnjdb2M8cxN196wSdsfQUK
  727. 21.60 s [pathway-compat-filepath] component pathway-compat-filepath-0.0.1.0-LoaDJ8tbb2m5kfHmaP2B9c-doctests
  728. 21.60 s [pathway-compat-filepath] include base-4.19.2.0-934f
  729. 21.60 s [pathway-compat-filepath] include doctest-0.24.3-1aDs7zEYV5r7raSsXr9TQC
  730. 21.60 s [pathway-compat-filepath] include pathway-compat-filepath-0.0.1.0-6KN1Vlb8yPeBopmlZtXyrR
  731. 21.60 s [pathway-compat-filepath] Linked component graph:
  732. 21.60 s [pathway-compat-filepath] unit pathway-compat-filepath-0.0.1.0-6KN1Vlb8yPeBopmlZtXyrR
  733. 21.60 s [pathway-compat-filepath] include base-4.19.2.0-934f
  734. 21.60 s [pathway-compat-filepath] include extra-1.8.1-F4oHgTKCper3ZiIUPZjGPK
  735. 21.60 s [pathway-compat-filepath] include filepath-1.4.301.0-6e15
  736. 21.60 s [pathway-compat-filepath] include megaparsec-9.7.0-10vHZAF1maw9O8p2gXs66N
  737. 21.60 s [pathway-compat-filepath] include os-string-2.0.10-HbyG8qgShpTHKXL8bZ3UK8
  738. 21.60 s [pathway-compat-filepath] include pathway-0.0.1.0-H5uD0SRA9755UrSqFBaCYE
  739. 21.60 s [pathway-compat-filepath] include pathway-compat-base-0.0.1.0-8ldj6SPXbxq2Shd8yFeOpr
  740. 21.60 s [pathway-compat-filepath] include pathway-internal-0.0.1.0-Lnjdb2M8cxN196wSdsfQUK
  741. 21.60 s [pathway-compat-filepath] Common.FilePath=pathway-compat-filepath-0.0.1.0-6KN1Vlb8yPeBopmlZtXyrR:Common.FilePath,Common.OsPath=pathway-compat-filepath-0.0.1.0-6KN1Vlb8yPeBopmlZtXyrR:Common.OsPath,System.FilePath=pathway-compat-filepath-0.0.1.0-6KN1Vlb8yPeBopmlZtXyrR:System.FilePath,System.FilePath.Overlay=pathway-compat-filepath-0.0.1.0-6KN1Vlb8yPeBopmlZtXyrR:System.FilePath.Overlay,System.FilePath.Pathway=pathway-compat-filepath-0.0.1.0-6KN1Vlb8yPeBopmlZtXyrR:System.FilePath.Pathway,System.FilePath.Thin=pathway-compat-filepath-0.0.1.0-6KN1Vlb8yPeBopmlZtXyrR:System.FilePath.Thin,System.OsPath=pathway-compat-filepath-0.0.1.0-6KN1Vlb8yPeBopmlZtXyrR:System.OsPath,System.OsPath.Overlay=pathway-compat-filepath-0.0.1.0-6KN1Vlb8yPeBopmlZtXyrR:System.OsPath.Overlay,System.OsPath.Pathway=pathway-compat-filepath-0.0.1.0-6KN1Vlb8yPeBopmlZtXyrR:System.OsPath.Pathway,System.OsPath.Thin=pathway-compat-filepath-0.0.1.0-6KN1Vlb8yPeBopmlZtXyrR:System.OsPath.Thin
  742. 21.60 s [pathway-compat-filepath] unit pathway-compat-filepath-0.0.1.0-LoaDJ8tbb2m5kfHmaP2B9c-doctests
  743. 21.60 s [pathway-compat-filepath] include base-4.19.2.0-934f
  744. 21.60 s [pathway-compat-filepath] include doctest-0.24.3-1aDs7zEYV5r7raSsXr9TQC
  745. 21.60 s [pathway-compat-filepath] include pathway-compat-filepath-0.0.1.0-6KN1Vlb8yPeBopmlZtXyrR
  746. 21.60 s [pathway-compat-filepath] Ready component graph:
  747. 21.60 s [pathway-compat-filepath] definite pathway-compat-filepath-0.0.1.0-6KN1Vlb8yPeBopmlZtXyrR
  748. 21.60 s [pathway-compat-filepath] depends base-4.19.2.0-934f
  749. 21.60 s [pathway-compat-filepath] depends extra-1.8.1-F4oHgTKCper3ZiIUPZjGPK
  750. 21.60 s [pathway-compat-filepath] depends filepath-1.4.301.0-6e15
  751. 21.60 s [pathway-compat-filepath] depends megaparsec-9.7.0-10vHZAF1maw9O8p2gXs66N
  752. 21.60 s [pathway-compat-filepath] depends os-string-2.0.10-HbyG8qgShpTHKXL8bZ3UK8
  753. 21.60 s [pathway-compat-filepath] depends pathway-0.0.1.0-H5uD0SRA9755UrSqFBaCYE
  754. 21.60 s [pathway-compat-filepath] depends pathway-compat-base-0.0.1.0-8ldj6SPXbxq2Shd8yFeOpr
  755. 21.60 s [pathway-compat-filepath] depends pathway-internal-0.0.1.0-Lnjdb2M8cxN196wSdsfQUK
  756. 21.60 s [pathway-compat-filepath] definite pathway-compat-filepath-0.0.1.0-LoaDJ8tbb2m5kfHmaP2B9c-doctests
  757. 21.60 s [pathway-compat-filepath] depends base-4.19.2.0-934f
  758. 21.60 s [pathway-compat-filepath] depends doctest-0.24.3-1aDs7zEYV5r7raSsXr9TQC
  759. 21.60 s [pathway-compat-filepath] depends pathway-compat-filepath-0.0.1.0-6KN1Vlb8yPeBopmlZtXyrR
  760. 21.60 s [pathway-compat-filepath] Using Cabal-3.10.3.0 compiled by ghc-9.8
  761. 21.60 s [pathway-compat-filepath] Using compiler: ghc-9.8.4
  762. 21.60 s [pathway-compat-filepath] Using install prefix:
  763. 21.60 s [pathway-compat-filepath] /nix/store/knqi4mpp2gcy2djhvikk6m439c94gw16-pathway-compat-filepath-0.0.1.0
  764. 21.60 s [pathway-compat-filepath] Executables installed in:
  765. 21.60 s [pathway-compat-filepath] /nix/store/knqi4mpp2gcy2djhvikk6m439c94gw16-pathway-compat-filepath-0.0.1.0/bin
  766. 21.60 s [pathway-compat-filepath] Libraries installed in:
  767. 21.60 s [pathway-compat-filepath] /nix/store/knqi4mpp2gcy2djhvikk6m439c94gw16-pathway-compat-filepath-0.0.1.0/lib/ghc-9.8.4/lib/x86_64-linux-ghc-9.8.4/pathway-compat-filepath-0.0.1.0-6KN1Vlb8yPeBopmlZtXyrR
  768. 21.60 s [pathway-compat-filepath] Dynamic Libraries installed in:
  769. 21.60 s [pathway-compat-filepath] /nix/store/knqi4mpp2gcy2djhvikk6m439c94gw16-pathway-compat-filepath-0.0.1.0/lib/ghc-9.8.4/lib/x86_64-linux-ghc-9.8.4
  770. 21.60 s [pathway-compat-filepath] Private executables installed in:
  771. 21.60 s [pathway-compat-filepath] /nix/store/knqi4mpp2gcy2djhvikk6m439c94gw16-pathway-compat-filepath-0.0.1.0/libexec/x86_64-linux-ghc-9.8.4/pathway-compat-filepath-0.0.1.0
  772. 21.60 s [pathway-compat-filepath] Data files installed in:
  773. 21.60 s [pathway-compat-filepath] /nix/store/knqi4mpp2gcy2djhvikk6m439c94gw16-pathway-compat-filepath-0.0.1.0/share/x86_64-linux-ghc-9.8.4/pathway-compat-filepath-0.0.1.0
  774. 21.60 s [pathway-compat-filepath] Documentation installed in:
  775. 21.60 s [pathway-compat-filepath] /nix/store/brb3ys0mr106j2xs2nqwq5rszfngk13w-pathway-compat-filepath-0.0.1.0-doc/share/doc/pathway-compat-filepath-0.0.1.0
  776. 21.60 s [pathway-compat-filepath] Configuration files installed in:
  777. 21.60 s [pathway-compat-filepath] /nix/store/knqi4mpp2gcy2djhvikk6m439c94gw16-pathway-compat-filepath-0.0.1.0/etc
  778. 21.60 s [pathway-compat-filepath] No alex found
  779. 21.60 s [pathway-compat-filepath] Using ar found on system at:
  780. 21.60 s [pathway-compat-filepath] /nix/store/zjraf40s86y3iwhp626b934r5y6ldkbb-binutils-wrapper-2.46/bin/ar
  781. 21.60 s [pathway-compat-filepath] No c2hs found
  782. 21.60 s [pathway-compat-filepath] No cpphs found
  783. 21.60 s [pathway-compat-filepath] Using doctest version 0.24.3 found on system at:
  784. 21.60 s [pathway-compat-filepath] /nix/store/2y183b1vsybv0157vfr59yhdwjkpqfkn-doctest-0.24.3/bin/doctest
  785. 21.60 s [pathway-compat-filepath] Using gcc version 15.2.0 given by user at:
  786. 21.60 s [pathway-compat-filepath] /nix/store/29qjlshvklnyr67nhpprzgb9igmsfsjj-gcc-wrapper-15.2.0/bin/gcc
  787. 21.60 s [pathway-compat-filepath] Using ghc version 9.8.4 found on system at:
  788. 21.60 s [pathway-compat-filepath] /nix/store/7r9b0bl984hdgd70nf5p8raa55kml491-ghc-9.8.4/bin/ghc
  789. 21.60 s [pathway-compat-filepath] Using ghc-pkg version 9.8.4 found on system at:
  790. 21.60 s [pathway-compat-filepath] /nix/store/7r9b0bl984hdgd70nf5p8raa55kml491-ghc-9.8.4/bin/ghc-pkg-9.8.4
  791. 21.60 s [pathway-compat-filepath] No ghcjs found
  792. 21.60 s [pathway-compat-filepath] No ghcjs-pkg found
  793. 21.60 s [pathway-compat-filepath] No greencard found
  794. 21.60 s [pathway-compat-filepath] Using haddock version 2.30.0 found on system at:
  795. 21.60 s [pathway-compat-filepath] /nix/store/7r9b0bl984hdgd70nf5p8raa55kml491-ghc-9.8.4/bin/haddock-ghc-9.8.4
  796. 21.60 s [pathway-compat-filepath] No happy found
  797. 21.60 s [pathway-compat-filepath] Using haskell-suite found on system at: haskell-suite-dummy-location
  798. 21.60 s [pathway-compat-filepath] Using haskell-suite-pkg found on system at: haskell-suite-pkg-dummy-location
  799. 21.60 s [pathway-compat-filepath] No hmake found
  800. 21.60 s [pathway-compat-filepath] Using hpc version 0.69 found on system at:
  801. 21.60 s [pathway-compat-filepath] /nix/store/7r9b0bl984hdgd70nf5p8raa55kml491-ghc-9.8.4/bin/hpc-ghc-9.8.4
  802. 21.60 s [pathway-compat-filepath] Using hsc2hs version 0.68.10 found on system at:
  803. 21.60 s [pathway-compat-filepath] /nix/store/7r9b0bl984hdgd70nf5p8raa55kml491-ghc-9.8.4/bin/hsc2hs-ghc-9.8.4
  804. 21.60 s [pathway-compat-filepath] Using hscolour version 1.25 found on system at:
  805. 21.60 s [pathway-compat-filepath] /nix/store/awnxn98rlw62rrjwli6d2lb4d27mrzzw-hscolour-1.25/bin/HsColour
  806. 21.60 s [pathway-compat-filepath] No jhc found
  807. 21.60 s [pathway-compat-filepath] Using ld found on system at:
  808. 21.60 s [pathway-compat-filepath] /nix/store/zjraf40s86y3iwhp626b934r5y6ldkbb-binutils-wrapper-2.46/bin/ld.gold
  809. 21.60 s [pathway-compat-filepath] No pkg-config found
  810. 21.60 s [pathway-compat-filepath] Using runghc version 9.8.4 found on system at:
  811. 21.60 s [pathway-compat-filepath] /nix/store/7r9b0bl984hdgd70nf5p8raa55kml491-ghc-9.8.4/bin/runghc-9.8.4
  812. 21.60 s [pathway-compat-filepath] Using strip version 2.46 found on system at:
  813. 21.60 s [pathway-compat-filepath] /nix/store/29qjlshvklnyr67nhpprzgb9igmsfsjj-gcc-wrapper-15.2.0/bin/strip
  814. 21.60 s [pathway-compat-filepath] Using tar found on system at:
  815. 21.60 s [pathway-compat-filepath] /nix/store/z5mq2sam4484prf3kv6v6vjw1m0i7j24-gnutar-1.35/bin/tar
  816. 21.60 s [pathway-compat-filepath] No uhc found
  817. 22.07 s [pathway-compat-filepath] Phase: buildPhase
  818. 22.35 s [pathway-compat-filepath] Preprocessing library for pathway-compat-filepath-0.0.1.0..
  819. 22.41 s [pathway-compat-filepath] Building library for pathway-compat-filepath-0.0.1.0..
  820. 22.43 s [pathway-compat-filepath] [ 1 of 10] Compiling Common.FilePath ( src/Common/FilePath.hs, dist/build/Common/FilePath.o, dist/build/Common/FilePath.dyn_o )
  821. 23.07 s [pathway-compat-filepath] [ 2 of 10] Compiling Common.OsPath ( src/Common/OsPath.hs, dist/build/Common/OsPath.o, dist/build/Common/OsPath.dyn_o )
  822. 23.07 s [pathway-compat-filepath]
  823. 23.07 s [pathway-compat-filepath] src/Common/OsPath.hs:90:23: error: [GHC-83865]
  824. 23.07 s [pathway-compat-filepath] • Couldn't match type ‘OSS.OsString’ with ‘OsString’
  825. 23.07 s [pathway-compat-filepath] Expected: OsPath
  826. 23.07 s [pathway-compat-filepath] Actual: OSS.OsString
  827. 23.07 s [pathway-compat-filepath] NB: ‘OsString’
  828. 23.07 s [pathway-compat-filepath] is defined in ‘System.OsString.Internal.Types.Hidden’
  829. 23.07 s [pathway-compat-filepath] in package ‘filepath-1.4.301.0’
  830. 23.07 s [pathway-compat-filepath] ‘OSS.OsString’
  831. 23.07 s [pathway-compat-filepath] is defined in ‘System.OsString.Internal.Types’
  832. 23.07 s [pathway-compat-filepath] in package ‘os-string-2.0.10’
  833. 23.07 s [pathway-compat-filepath] • In the ‘parent’ field of a record
  834. 23.07 s [pathway-compat-filepath] In the expression:
  835. 23.07 s [pathway-compat-filepath] Format
  836. 23.07 s [pathway-compat-filepath] {root = O.pack . pure $ O.pathSeparator, current = mempty,
  837. 23.07 s [pathway-compat-filepath] parent = OSS.unsafeEncodeUtf "..",
  838. 23.07 s [pathway-compat-filepath] separator = O.pack . pure $ O.pathSeparator,
  839. 23.07 s [pathway-compat-filepath] substitutions = mempty}
  840. 23.07 s [pathway-compat-filepath] In an equation for ‘localFormat’:
  841. 23.07 s [pathway-compat-filepath] localFormat
  842. 23.07 s [pathway-compat-filepath] = Format
  843. 23.07 s [pathway-compat-filepath] {root = O.pack . pure $ O.pathSeparator, current = mempty,
  844. 23.07 s [pathway-compat-filepath] parent = OSS.unsafeEncodeUtf "..",
  845. 23.07 s [pathway-compat-filepath] separator = O.pack . pure $ O.pathSeparator,
  846. 23.07 s [pathway-compat-filepath] substitutions = mempty}
  847. 23.07 s [pathway-compat-filepath] |
  848. 23.07 s [pathway-compat-filepath] 90 | Format.parent = OSS.unsafeEncodeUtf "..",
  849. 23.07 s [pathway-compat-filepath] | ^^^^^^^^^^^^^^^^^^^^^^^^
  850. 23.07 s [pathway-compat-filepath] [ 3 of 10] Compiling System.FilePath.Thin ( src/System/FilePath/Thin.hs, dist/build/System/FilePath/Thin.o, dist/build/System/FilePath/Thin.dyn_o )
  851. 23.17 s [pathway-compat-filepath] [ 4 of 10] Compiling System.FilePath.Pathway ( src/System/FilePath/Pathway.hs, dist/build/System/FilePath/Pathway.o, dist/build/System/FilePath/Pathway.dyn_o )
  852. 23.19 s [pathway-compat-filepath] [ 5 of 10] Compiling System.FilePath.Overlay ( src/System/FilePath/Overlay.hs, dist/build/System/FilePath/Overlay.o, dist/build/System/FilePath/Overlay.dyn_o )
  853. 23.21 s [pathway-compat-filepath] [ 6 of 10] Compiling System.FilePath ( src/System/FilePath.hs, dist/build/System/FilePath.o, dist/build/System/FilePath.dyn_o )
  854. 23.32 s Progress: 0 of 12 built (1 failed), 174 of 174 downloaded from cache
  855. 23.32 s Failed to build pathway-compat-filepath after 4.4s
  856. 23.32 s error: Cannot build '/nix/store/gwlaydb47f6yhlx7hsgqq7s0m612k39r-pathway-compat-filepath-0.0.1.0.drv'.
  857. 23.32 s Reason: builder failed with exit code 1.
  858. 23.32 s Output paths:
  859. 23.32 s /nix/store/brb3ys0mr106j2xs2nqwq5rszfngk13w-pathway-compat-filepath-0.0.1.0-doc
  860. 23.32 s /nix/store/knqi4mpp2gcy2djhvikk6m439c94gw16-pathway-compat-filepath-0.0.1.0
  861. 23.32 s Last 176 log lines:
  862. 23.32 s > Running phase: setupCompilerEnvironmentPhase
  863. 23.32 s > Build with /nix/store/7r9b0bl984hdgd70nf5p8raa55kml491-ghc-9.8.4.
  864. 23.32 s > Running phase: unpackPhase
  865. 23.32 s > unpacking source archive /nix/store/56v5999xvkp18l2ygdvahppqdv4hrlnl-filepath
  866. 23.32 s > source root is filepath
  867. 23.32 s > Running phase: patchPhase
  868. 23.32 s > Running phase: compileBuildDriverPhase
  869. 23.32 s > setupCompileFlags: -package-db=/build/tmp.hsoEC5z0By/setup-package.conf.d -threaded
  870. 23.32 s > [1 of 2] Compiling Main ( Setup.hs, /build/tmp.hsoEC5z0By/Main.o )
  871. 23.32 s > [2 of 2] Linking Setup
  872. 23.32 s > Running phase: updateAutotoolsGnuConfigScriptsPhase
  873. 23.32 s > Running phase: configurePhase
  874. 23.32 s > configureFlags: --verbose --prefix=/nix/store/knqi4mpp2gcy2djhvikk6m439c94gw16-pathway-compat-filepath-0.0.1.0 --libdir=$prefix/lib/$compiler/lib --libsubdir=$abi/$libname --docdir=/nix/store/brb3ys0mr106j2xs2nqwq5rszfngk13w-pathway-compat-filepath-0.0.1.0-doc/share/doc/pathway-compat-filepath-0.0.1.0 --with-gcc=gcc --package-db=/build/tmp.hsoEC5z0By/package.conf.d --ghc-option=-j16 --ghc-option=+RTS --ghc-option=-A64M --ghc-option=-RTS --enable-library-profiling --profiling-detail=exported-functions --disable-profiling --enable-shared --disable-coverage --enable-static --disable-executable-dynamic --enable-tests --disable-benchmarks --enable-library-vanilla --disable-library-for-ghci --enable-split-sections --enable-library-stripping --enable-executable-stripping --ghc-option=-haddock --ghc-options=-Werror --extra-lib-dirs=/nix/store/pndhkk0l649lm1sj0mxk7cbwq26qd1ra-ncurses-6.6/lib --extra-lib-dirs=/nix/store/0djlg4g0b81w94k3vcaqsxsc2hh4kism-libffi-3.5.2/lib --extra-lib-dirs=/nix/store/md4paia7riiggyrj8p24c7a6vf8w7jz8-elfutils-0.194/lib --extra-lib-dirs=/nix/store/39vv2pf64gd8li48a4hpbhw2crzd8z5p-gmp-with-cxx-6.3.0/lib --extra-lib-dirs=/nix/store/7wwvald8lapkrsr72qanlw8blyn55ifx-numactl-2.0.18/lib --extra-lib-dirs=/nix/store/7r9b0bl984hdgd70nf5p8raa55kml491-ghc-9.8.4/lib
  875. 23.32 s > Using Parsec parser
  876. 23.32 s > Configuring pathway-compat-filepath-0.0.1.0...
  877. 23.32 s > Flags chosen: noisy-deprecations=True, verify-no-recursion=False
  878. 23.32 s > Dependency base >=4.14.0 && <4.15 || >=4.15.0 && <4.16 || >=4.16.0 && <4.17 ||
  879. 23.32 s > >=4.17.0 && <4.18 || >=4.18.0 && <4.19 || >=4.19.0 && <4.20 || >=4.20.0 &&
  880. 23.32 s > <4.21 || >=4.21.0 && <4.22 || >=4.22.0 && <4.23: using base-4.19.2.0
  881. 23.32 s > Dependency extra: using extra-1.8.1
  882. 23.32 s > Dependency filepath >=1.4.2 && <1.5 || >=1.5.0 && <1.6: using
  883. 23.32 s > filepath-1.4.301.0
  884. 23.32 s > Dependency megaparsec >=9.0.1 && <9.1 || >=9.2.1 && <9.3 || >=9.5.0 && <9.6 ||
  885. 23.32 s > >=9.7.0 && <9.8: using megaparsec-9.7.0
  886. 23.32 s > Dependency os-string: using os-string-2.0.10
  887. 23.32 s > Dependency pathway >=0.0.1 && <0.1: using pathway-0.0.1.0
  888. 23.32 s > Dependency pathway-compat-base >=0.0.1 && <0.1: using
  889. 23.32 s > pathway-compat-base-0.0.1.0
  890. 23.32 s > Dependency pathway-internal >=0.0.1 && <0.1: using pathway-internal-0.0.1.0
  891. 23.32 s > Dependency base >=4.14.0 && <4.15 || >=4.15.0 && <4.16 || >=4.16.0 && <4.17 ||
  892. 23.32 s > >=4.17.0 && <4.18 || >=4.18.0 && <4.19 || >=4.19.0 && <4.20 || >=4.20.0 &&
  893. 23.32 s > <4.21 || >=4.21.0 && <4.22 || >=4.22.0 && <4.23: using base-4.19.2.0
  894. 23.32 s > Dependency doctest >=0.16.3 && <0.17 || >=0.18.1 && <0.19 || >=0.20.1 && <0.21
  895. 23.32 s > || >=0.21.1 && <0.22 || >=0.22.2 && <0.23 || >=0.24.2 && <0.25: using
  896. 23.32 s > doctest-0.24.3
  897. 23.32 s > Dependency pathway-compat-filepath: using pathway-compat-filepath-0.0.1.0
  898. 23.32 s > Source component graph:
  899. 23.32 s > component lib
  900. 23.32 s > component test:doctests dependency lib
  901. 23.32 s > Configured component graph:
  902. 23.32 s > component pathway-compat-filepath-0.0.1.0-6KN1Vlb8yPeBopmlZtXyrR
  903. 23.32 s > include base-4.19.2.0-934f
  904. 23.32 s > include extra-1.8.1-F4oHgTKCper3ZiIUPZjGPK
  905. 23.32 s > include filepath-1.4.301.0-6e15
  906. 23.32 s > include megaparsec-9.7.0-10vHZAF1maw9O8p2gXs66N
  907. 23.32 s > include os-string-2.0.10-HbyG8qgShpTHKXL8bZ3UK8
  908. 23.32 s > include pathway-0.0.1.0-H5uD0SRA9755UrSqFBaCYE
  909. 23.32 s > include pathway-compat-base-0.0.1.0-8ldj6SPXbxq2Shd8yFeOpr
  910. 23.32 s > include pathway-internal-0.0.1.0-Lnjdb2M8cxN196wSdsfQUK
  911. 23.32 s > component pathway-compat-filepath-0.0.1.0-LoaDJ8tbb2m5kfHmaP2B9c-doctests
  912. 23.32 s > include base-4.19.2.0-934f
  913. 23.32 s > include doctest-0.24.3-1aDs7zEYV5r7raSsXr9TQC
  914. 23.32 s > include pathway-compat-filepath-0.0.1.0-6KN1Vlb8yPeBopmlZtXyrR
  915. 23.32 s > Linked component graph:
  916. 23.32 s > unit pathway-compat-filepath-0.0.1.0-6KN1Vlb8yPeBopmlZtXyrR
  917. 23.32 s > include base-4.19.2.0-934f
  918. 23.32 s > include extra-1.8.1-F4oHgTKCper3ZiIUPZjGPK
  919. 23.32 s > include filepath-1.4.301.0-6e15
  920. 23.32 s > include megaparsec-9.7.0-10vHZAF1maw9O8p2gXs66N
  921. 23.32 s > include os-string-2.0.10-HbyG8qgShpTHKXL8bZ3UK8
  922. 23.32 s > include pathway-0.0.1.0-H5uD0SRA9755UrSqFBaCYE
  923. 23.32 s > include pathway-compat-base-0.0.1.0-8ldj6SPXbxq2Shd8yFeOpr
  924. 23.32 s > include pathway-internal-0.0.1.0-Lnjdb2M8cxN196wSdsfQUK
  925. 23.32 s > Common.FilePath=pathway-compat-filepath-0.0.1.0-6KN1Vlb8yPeBopmlZtXyrR:Common.FilePath,Common.OsPath=pathway-compat-filepath-0.0.1.0-6KN1Vlb8yPeBopmlZtXyrR:Common.OsPath,System.FilePath=pathway-compat-filepath-0.0.1.0-6KN1Vlb8yPeBopmlZtXyrR:System.FilePath,System.FilePath.Overlay=pathway-compat-filepath-0.0.1.0-6KN1Vlb8yPeBopmlZtXyrR:System.FilePath.Overlay,System.FilePath.Pathway=pathway-compat-filepath-0.0.1.0-6KN1Vlb8yPeBopmlZtXyrR:System.FilePath.Pathway,System.FilePath.Thin=pathway-compat-filepath-0.0.1.0-6KN1Vlb8yPeBopmlZtXyrR:System.FilePath.Thin,System.OsPath=pathway-compat-filepath-0.0.1.0-6KN1Vlb8yPeBopmlZtXyrR:System.OsPath,System.OsPath.Overlay=pathway-compat-filepath-0.0.1.0-6KN1Vlb8yPeBopmlZtXyrR:System.OsPath.Overlay,System.OsPath.Pathway=pathway-compat-filepath-0.0.1.0-6KN1Vlb8yPeBopmlZtXyrR:System.OsPath.Pathway,System.OsPath.Thin=pathway-compat-filepath-0.0.1.0-6KN1Vlb8yPeBopmlZtXyrR:System.OsPath.Thin
  926. 23.32 s > unit pathway-compat-filepath-0.0.1.0-LoaDJ8tbb2m5kfHmaP2B9c-doctests
  927. 23.32 s > include base-4.19.2.0-934f
  928. 23.32 s > include doctest-0.24.3-1aDs7zEYV5r7raSsXr9TQC
  929. 23.32 s > include pathway-compat-filepath-0.0.1.0-6KN1Vlb8yPeBopmlZtXyrR
  930. 23.32 s > Ready component graph:
  931. 23.32 s > definite pathway-compat-filepath-0.0.1.0-6KN1Vlb8yPeBopmlZtXyrR
  932. 23.32 s > depends base-4.19.2.0-934f
  933. 23.32 s > depends extra-1.8.1-F4oHgTKCper3ZiIUPZjGPK
  934. 23.32 s > depends filepath-1.4.301.0-6e15
  935. 23.32 s > depends megaparsec-9.7.0-10vHZAF1maw9O8p2gXs66N
  936. 23.32 s > depends os-string-2.0.10-HbyG8qgShpTHKXL8bZ3UK8
  937. 23.32 s > depends pathway-0.0.1.0-H5uD0SRA9755UrSqFBaCYE
  938. 23.32 s > depends pathway-compat-base-0.0.1.0-8ldj6SPXbxq2Shd8yFeOpr
  939. 23.32 s > depends pathway-internal-0.0.1.0-Lnjdb2M8cxN196wSdsfQUK
  940. 23.32 s > definite pathway-compat-filepath-0.0.1.0-LoaDJ8tbb2m5kfHmaP2B9c-doctests
  941. 23.32 s > depends base-4.19.2.0-934f
  942. 23.32 s > depends doctest-0.24.3-1aDs7zEYV5r7raSsXr9TQC
  943. 23.32 s > depends pathway-compat-filepath-0.0.1.0-6KN1Vlb8yPeBopmlZtXyrR
  944. 23.32 s > Using Cabal-3.10.3.0 compiled by ghc-9.8
  945. 23.32 s > Using compiler: ghc-9.8.4
  946. 23.32 s > Using install prefix:
  947. 23.32 s > /nix/store/knqi4mpp2gcy2djhvikk6m439c94gw16-pathway-compat-filepath-0.0.1.0
  948. 23.32 s > Executables installed in:
  949. 23.32 s > /nix/store/knqi4mpp2gcy2djhvikk6m439c94gw16-pathway-compat-filepath-0.0.1.0/bin
  950. 23.32 s > Libraries installed in:
  951. 23.32 s > /nix/store/knqi4mpp2gcy2djhvikk6m439c94gw16-pathway-compat-filepath-0.0.1.0/lib/ghc-9.8.4/lib/x86_64-linux-ghc-9.8.4/pathway-compat-filepath-0.0.1.0-6KN1Vlb8yPeBopmlZtXyrR
  952. 23.32 s > Dynamic Libraries installed in:
  953. 23.32 s > /nix/store/knqi4mpp2gcy2djhvikk6m439c94gw16-pathway-compat-filepath-0.0.1.0/lib/ghc-9.8.4/lib/x86_64-linux-ghc-9.8.4
  954. 23.32 s > Private executables installed in:
  955. 23.32 s > /nix/store/knqi4mpp2gcy2djhvikk6m439c94gw16-pathway-compat-filepath-0.0.1.0/libexec/x86_64-linux-ghc-9.8.4/pathway-compat-filepath-0.0.1.0
  956. 23.32 s > Data files installed in:
  957. 23.32 s > /nix/store/knqi4mpp2gcy2djhvikk6m439c94gw16-pathway-compat-filepath-0.0.1.0/share/x86_64-linux-ghc-9.8.4/pathway-compat-filepath-0.0.1.0
  958. 23.32 s > Documentation installed in:
  959. 23.32 s > /nix/store/brb3ys0mr106j2xs2nqwq5rszfngk13w-pathway-compat-filepath-0.0.1.0-doc/share/doc/pathway-compat-filepath-0.0.1.0
  960. 23.32 s > Configuration files installed in:
  961. 23.32 s > /nix/store/knqi4mpp2gcy2djhvikk6m439c94gw16-pathway-compat-filepath-0.0.1.0/etc
  962. 23.32 s > No alex found
  963. 23.32 s > Using ar found on system at:
  964. 23.32 s > /nix/store/zjraf40s86y3iwhp626b934r5y6ldkbb-binutils-wrapper-2.46/bin/ar
  965. 23.32 s > No c2hs found
  966. 23.32 s > No cpphs found
  967. 23.32 s > Using doctest version 0.24.3 found on system at:
  968. 23.32 s > /nix/store/2y183b1vsybv0157vfr59yhdwjkpqfkn-doctest-0.24.3/bin/doctest
  969. 23.32 s > Using gcc version 15.2.0 given by user at:
  970. 23.32 s > /nix/store/29qjlshvklnyr67nhpprzgb9igmsfsjj-gcc-wrapper-15.2.0/bin/gcc
  971. 23.32 s > Using ghc version 9.8.4 found on system at:
  972. 23.32 s > /nix/store/7r9b0bl984hdgd70nf5p8raa55kml491-ghc-9.8.4/bin/ghc
  973. 23.32 s > Using ghc-pkg version 9.8.4 found on system at:
  974. 23.32 s > /nix/store/7r9b0bl984hdgd70nf5p8raa55kml491-ghc-9.8.4/bin/ghc-pkg-9.8.4
  975. 23.32 s > No ghcjs found
  976. 23.32 s > No ghcjs-pkg found
  977. 23.32 s > No greencard found
  978. 23.32 s > Using haddock version 2.30.0 found on system at:
  979. 23.32 s > /nix/store/7r9b0bl984hdgd70nf5p8raa55kml491-ghc-9.8.4/bin/haddock-ghc-9.8.4
  980. 23.32 s > No happy found
  981. 23.32 s > Using haskell-suite found on system at: haskell-suite-dummy-location
  982. 23.32 s > Using haskell-suite-pkg found on system at: haskell-suite-pkg-dummy-location
  983. 23.32 s > No hmake found
  984. 23.32 s > Using hpc version 0.69 found on system at:
  985. 23.32 s > /nix/store/7r9b0bl984hdgd70nf5p8raa55kml491-ghc-9.8.4/bin/hpc-ghc-9.8.4
  986. 23.32 s > Using hsc2hs version 0.68.10 found on system at:
  987. 23.32 s > /nix/store/7r9b0bl984hdgd70nf5p8raa55kml491-ghc-9.8.4/bin/hsc2hs-ghc-9.8.4
  988. 23.32 s > Using hscolour version 1.25 found on system at:
  989. 23.32 s > /nix/store/awnxn98rlw62rrjwli6d2lb4d27mrzzw-hscolour-1.25/bin/HsColour
  990. 23.32 s > No jhc found
  991. 23.32 s > Using ld found on system at:
  992. 23.32 s > /nix/store/zjraf40s86y3iwhp626b934r5y6ldkbb-binutils-wrapper-2.46/bin/ld.gold
  993. 23.32 s > No pkg-config found
  994. 23.32 s > Using runghc version 9.8.4 found on system at:
  995. 23.32 s > /nix/store/7r9b0bl984hdgd70nf5p8raa55kml491-ghc-9.8.4/bin/runghc-9.8.4
  996. 23.32 s > Using strip version 2.46 found on system at:
  997. 23.32 s > /nix/store/29qjlshvklnyr67nhpprzgb9igmsfsjj-gcc-wrapper-15.2.0/bin/strip
  998. 23.32 s > Using tar found on system at:
  999. 23.32 s > /nix/store/z5mq2sam4484prf3kv6v6vjw1m0i7j24-gnutar-1.35/bin/tar
  1000. 23.32 s > No uhc found
  1001. 23.32 s > Running phase: buildPhase
  1002. 23.32 s > Preprocessing library for pathway-compat-filepath-0.0.1.0..
  1003. 23.32 s > Building library for pathway-compat-filepath-0.0.1.0..
  1004. 23.32 s > [ 1 of 10] Compiling Common.FilePath ( src/Common/FilePath.hs, dist/build/Common/FilePath.o, dist/build/Common/FilePath.dyn_o )
  1005. 23.32 s > [ 2 of 10] Compiling Common.OsPath ( src/Common/OsPath.hs, dist/build/Common/OsPath.o, dist/build/Common/OsPath.dyn_o )
  1006. 23.32 s >
  1007. 23.32 s > src/Common/OsPath.hs:90:23: error: [GHC-83865]
  1008. 23.32 s > • Couldn't match type ‘OSS.OsString’ with ‘OsString’
  1009. 23.32 s > Expected: OsPath
  1010. 23.32 s > Actual: OSS.OsString
  1011. 23.32 s > NB: ‘OsString’
  1012. 23.32 s > is defined in ‘System.OsString.Internal.Types.Hidden’
  1013. 23.32 s > in package ‘filepath-1.4.301.0’
  1014. 23.32 s > ‘OSS.OsString’
  1015. 23.32 s > is defined in ‘System.OsString.Internal.Types’
  1016. 23.32 s > in package ‘os-string-2.0.10’
  1017. 23.32 s > • In the ‘parent’ field of a record
  1018. 23.32 s > In the expression:
  1019. 23.32 s > Format
  1020. 23.32 s > {root = O.pack . pure $ O.pathSeparator, current = mempty,
  1021. 23.32 s > parent = OSS.unsafeEncodeUtf "..",
  1022. 23.32 s > separator = O.pack . pure $ O.pathSeparator,
  1023. 23.32 s > substitutions = mempty}
  1024. 23.32 s > In an equation for ‘localFormat’:
  1025. 23.32 s > localFormat
  1026. 23.32 s > = Format
  1027. 23.32 s > {root = O.pack . pure $ O.pathSeparator, current = mempty,
  1028. 23.32 s > parent = OSS.unsafeEncodeUtf "..",
  1029. 23.32 s > separator = O.pack . pure $ O.pathSeparator,
  1030. 23.32 s > substitutions = mempty}
  1031. 23.32 s > |
  1032. 23.32 s > 90 | Format.parent = OSS.unsafeEncodeUtf "..",
  1033. 23.32 s > | ^^^^^^^^^^^^^^^^^^^^^^^^
  1034. 23.32 s > [ 3 of 10] Compiling System.FilePath.Thin ( src/System/FilePath/Thin.hs, dist/build/System/FilePath/Thin.o, dist/build/System/FilePath/Thin.dyn_o )
  1035. 23.32 s > [ 4 of 10] Compiling System.FilePath.Pathway ( src/System/FilePath/Pathway.hs, dist/build/System/FilePath/Pathway.o, dist/build/System/FilePath/Pathway.dyn_o )
  1036. 23.32 s > [ 5 of 10] Compiling System.FilePath.Overlay ( src/System/FilePath/Overlay.hs, dist/build/System/FilePath/Overlay.o, dist/build/System/FilePath/Overlay.dyn_o )
  1037. 23.32 s > [ 6 of 10] Compiling System.FilePath ( src/System/FilePath.hs, dist/build/System/FilePath.o, dist/build/System/FilePath.dyn_o )
  1038. 23.32 s For full logs, run:
  1039. 23.32 s nix log /nix/store/gwlaydb47f6yhlx7hsgqq7s0m612k39r-pathway-compat-filepath-0.0.1.0.drv
  1040. 23.32 s error: Cannot build '/nix/store/gwlaydb47f6yhlx7hsgqq7s0m612k39r-pathway-compat-filepath-0.0.1.0.drv'.
  1041. 23.32 s Reason: builder failed with exit code 1.
  1042. 23.32 s Output paths:
  1043. 23.32 s /nix/store/brb3ys0mr106j2xs2nqwq5rszfngk13w-pathway-compat-filepath-0.0.1.0-doc
  1044. 23.32 s /nix/store/knqi4mpp2gcy2djhvikk6m439c94gw16-pathway-compat-filepath-0.0.1.0
  1045. 23.32 s Last 176 log lines:
  1046. 23.32 s > Running phase: setupCompilerEnvironmentPhase
  1047. 23.32 s > Build with /nix/store/7r9b0bl984hdgd70nf5p8raa55kml491-ghc-9.8.4.
  1048. 23.32 s > Running phase: unpackPhase
  1049. 23.32 s > unpacking source archive /nix/store/56v5999xvkp18l2ygdvahppqdv4hrlnl-filepath
  1050. 23.32 s > source root is filepath
  1051. 23.32 s > Running phase: patchPhase
  1052. 23.32 s > Running phase: compileBuildDriverPhase
  1053. 23.32 s > setupCompileFlags: -package-db=/build/tmp.hsoEC5z0By/setup-package.conf.d -threaded
  1054. 23.32 s > [1 of 2] Compiling Main ( Setup.hs, /build/tmp.hsoEC5z0By/Main.o )
  1055. 23.32 s > [2 of 2] Linking Setup
  1056. 23.32 s > Running phase: updateAutotoolsGnuConfigScriptsPhase
  1057. 23.32 s > Running phase: configurePhase
  1058. 23.32 s > configureFlags: --verbose --prefix=/nix/store/knqi4mpp2gcy2djhvikk6m439c94gw16-pathway-compat-filepath-0.0.1.0 --libdir=$prefix/lib/$compiler/lib --libsubdir=$abi/$libname --docdir=/nix/store/brb3ys0mr106j2xs2nqwq5rszfngk13w-pathway-compat-filepath-0.0.1.0-doc/share/doc/pathway-compat-filepath-0.0.1.0 --with-gcc=gcc --package-db=/build/tmp.hsoEC5z0By/package.conf.d --ghc-option=-j16 --ghc-option=+RTS --ghc-option=-A64M --ghc-option=-RTS --enable-library-profiling --profiling-detail=exported-functions --disable-profiling --enable-shared --disable-coverage --enable-static --disable-executable-dynamic --enable-tests --disable-benchmarks --enable-library-vanilla --disable-library-for-ghci --enable-split-sections --enable-library-stripping --enable-executable-stripping --ghc-option=-haddock --ghc-options=-Werror --extra-lib-dirs=/nix/store/pndhkk0l649lm1sj0mxk7cbwq26qd1ra-ncurses-6.6/lib --extra-lib-dirs=/nix/store/0djlg4g0b81w94k3vcaqsxsc2hh4kism-libffi-3.5.2/lib --extra-lib-dirs=/nix/store/md4paia7riiggyrj8p24c7a6vf8w7jz8-elfutils-0.194/lib --extra-lib-dirs=/nix/store/39vv2pf64gd8li48a4hpbhw2crzd8z5p-gmp-with-cxx-6.3.0/lib --extra-lib-dirs=/nix/store/7wwvald8lapkrsr72qanlw8blyn55ifx-numactl-2.0.18/lib --extra-lib-dirs=/nix/store/7r9b0bl984hdgd70nf5p8raa55kml491-ghc-9.8.4/lib
  1059. 23.32 s > Using Parsec parser
  1060. 23.32 s > Configuring pathway-compat-filepath-0.0.1.0...
  1061. 23.32 s > Flags chosen: noisy-deprecations=True, verify-no-recursion=False
  1062. 23.32 s > Dependency base >=4.14.0 && <4.15 || >=4.15.0 && <4.16 || >=4.16.0 && <4.17 ||
  1063. 23.32 s > >=4.17.0 && <4.18 || >=4.18.0 && <4.19 || >=4.19.0 && <4.20 || >=4.20.0 &&
  1064. 23.32 s > <4.21 || >=4.21.0 && <4.22 || >=4.22.0 && <4.23: using base-4.19.2.0
  1065. 23.32 s > Dependency extra: using extra-1.8.1
  1066. 23.32 s > Dependency filepath >=1.4.2 && <1.5 || >=1.5.0 && <1.6: using
  1067. 23.32 s > filepath-1.4.301.0
  1068. 23.32 s > Dependency megaparsec >=9.0.1 && <9.1 || >=9.2.1 && <9.3 || >=9.5.0 && <9.6 ||
  1069. 23.32 s > >=9.7.0 && <9.8: using megaparsec-9.7.0
  1070. 23.32 s > Dependency os-string: using os-string-2.0.10
  1071. 23.32 s > Dependency pathway >=0.0.1 && <0.1: using pathway-0.0.1.0
  1072. 23.32 s > Dependency pathway-compat-base >=0.0.1 && <0.1: using
  1073. 23.32 s > pathway-compat-base-0.0.1.0
  1074. 23.32 s > Dependency pathway-internal >=0.0.1 && <0.1: using pathway-internal-0.0.1.0
  1075. 23.32 s > Dependency base >=4.14.0 && <4.15 || >=4.15.0 && <4.16 || >=4.16.0 && <4.17 ||
  1076. 23.32 s > >=4.17.0 && <4.18 || >=4.18.0 && <4.19 || >=4.19.0 && <4.20 || >=4.20.0 &&
  1077. 23.32 s > <4.21 || >=4.21.0 && <4.22 || >=4.22.0 && <4.23: using base-4.19.2.0
  1078. 23.32 s > Dependency doctest >=0.16.3 && <0.17 || >=0.18.1 && <0.19 || >=0.20.1 && <0.21
  1079. 23.32 s > || >=0.21.1 && <0.22 || >=0.22.2 && <0.23 || >=0.24.2 && <0.25: using
  1080. 23.32 s > doctest-0.24.3
  1081. 23.32 s > Dependency pathway-compat-filepath: using pathway-compat-filepath-0.0.1.0
  1082. 23.32 s > Source component graph:
  1083. 23.32 s > component lib
  1084. 23.32 s > component test:doctests dependency lib
  1085. 23.32 s > Configured component graph:
  1086. 23.32 s > component pathway-compat-filepath-0.0.1.0-6KN1Vlb8yPeBopmlZtXyrR
  1087. 23.32 s > include base-4.19.2.0-934f
  1088. 23.32 s > include extra-1.8.1-F4oHgTKCper3ZiIUPZjGPK
  1089. 23.32 s > include filepath-1.4.301.0-6e15
  1090. 23.32 s > include megaparsec-9.7.0-10vHZAF1maw9O8p2gXs66N
  1091. 23.32 s > include os-string-2.0.10-HbyG8qgShpTHKXL8bZ3UK8
  1092. 23.32 s > include pathway-0.0.1.0-H5uD0SRA9755UrSqFBaCYE
  1093. 23.32 s > include pathway-compat-base-0.0.1.0-8ldj6SPXbxq2Shd8yFeOpr
  1094. 23.32 s > include pathway-internal-0.0.1.0-Lnjdb2M8cxN196wSdsfQUK
  1095. 23.32 s > component pathway-compat-filepath-0.0.1.0-LoaDJ8tbb2m5kfHmaP2B9c-doctests
  1096. 23.32 s > include base-4.19.2.0-934f
  1097. 23.32 s > include doctest-0.24.3-1aDs7zEYV5r7raSsXr9TQC
  1098. 23.32 s > include pathway-compat-filepath-0.0.1.0-6KN1Vlb8yPeBopmlZtXyrR
  1099. 23.32 s > Linked component graph:
  1100. 23.32 s > unit pathway-compat-filepath-0.0.1.0-6KN1Vlb8yPeBopmlZtXyrR
  1101. 23.32 s > include base-4.19.2.0-934f
  1102. 23.32 s > include extra-1.8.1-F4oHgTKCper3ZiIUPZjGPK
  1103. 23.32 s > include filepath-1.4.301.0-6e15
  1104. 23.32 s > include megaparsec-9.7.0-10vHZAF1maw9O8p2gXs66N
  1105. 23.32 s > include os-string-2.0.10-HbyG8qgShpTHKXL8bZ3UK8
  1106. 23.32 s > include pathway-0.0.1.0-H5uD0SRA9755UrSqFBaCYE
  1107. 23.32 s > include pathway-compat-base-0.0.1.0-8ldj6SPXbxq2Shd8yFeOpr
  1108. 23.32 s > include pathway-internal-0.0.1.0-Lnjdb2M8cxN196wSdsfQUK
  1109. 23.32 s > Common.FilePath=pathway-compat-filepath-0.0.1.0-6KN1Vlb8yPeBopmlZtXyrR:Common.FilePath,Common.OsPath=pathway-compat-filepath-0.0.1.0-6KN1Vlb8yPeBopmlZtXyrR:Common.OsPath,System.FilePath=pathway-compat-filepath-0.0.1.0-6KN1Vlb8yPeBopmlZtXyrR:System.FilePath,System.FilePath.Overlay=pathway-compat-filepath-0.0.1.0-6KN1Vlb8yPeBopmlZtXyrR:System.FilePath.Overlay,System.FilePath.Pathway=pathway-compat-filepath-0.0.1.0-6KN1Vlb8yPeBopmlZtXyrR:System.FilePath.Pathway,System.FilePath.Thin=pathway-compat-filepath-0.0.1.0-6KN1Vlb8yPeBopmlZtXyrR:System.FilePath.Thin,System.OsPath=pathway-compat-filepath-0.0.1.0-6KN1Vlb8yPeBopmlZtXyrR:System.OsPath,System.OsPath.Overlay=pathway-compat-filepath-0.0.1.0-6KN1Vlb8yPeBopmlZtXyrR:System.OsPath.Overlay,System.OsPath.Pathway=pathway-compat-filepath-0.0.1.0-6KN1Vlb8yPeBopmlZtXyrR:System.OsPath.Pathway,System.OsPath.Thin=pathway-compat-filepath-0.0.1.0-6KN1Vlb8yPeBopmlZtXyrR:System.OsPath.Thin
  1110. 23.32 s > unit pathway-compat-filepath-0.0.1.0-LoaDJ8tbb2m5kfHmaP2B9c-doctests
  1111. 23.32 s > include base-4.19.2.0-934f
  1112. 23.32 s > include doctest-0.24.3-1aDs7zEYV5r7raSsXr9TQC
  1113. 23.32 s > include pathway-compat-filepath-0.0.1.0-6KN1Vlb8yPeBopmlZtXyrR
  1114. 23.32 s > Ready component graph:
  1115. 23.32 s > definite pathway-compat-filepath-0.0.1.0-6KN1Vlb8yPeBopmlZtXyrR
  1116. 23.32 s > depends base-4.19.2.0-934f
  1117. 23.32 s > depends extra-1.8.1-F4oHgTKCper3ZiIUPZjGPK
  1118. 23.32 s > depends filepath-1.4.301.0-6e15
  1119. 23.32 s > depends megaparsec-9.7.0-10vHZAF1maw9O8p2gXs66N
  1120. 23.32 s > depends os-string-2.0.10-HbyG8qgShpTHKXL8bZ3UK8
  1121. 23.32 s > depends pathway-0.0.1.0-H5uD0SRA9755UrSqFBaCYE
  1122. 23.32 s > depends pathway-compat-base-0.0.1.0-8ldj6SPXbxq2Shd8yFeOpr
  1123. 23.32 s > depends pathway-internal-0.0.1.0-Lnjdb2M8cxN196wSdsfQUK
  1124. 23.32 s > definite pathway-compat-filepath-0.0.1.0-LoaDJ8tbb2m5kfHmaP2B9c-doctests
  1125. 23.32 s > depends base-4.19.2.0-934f
  1126. 23.32 s > depends doctest-0.24.3-1aDs7zEYV5r7raSsXr9TQC
  1127. 23.32 s > depends pathway-compat-filepath-0.0.1.0-6KN1Vlb8yPeBopmlZtXyrR
  1128. 23.32 s > Using Cabal-3.10.3.0 compiled by ghc-9.8
  1129. 23.32 s > Using compiler: ghc-9.8.4
  1130. 23.32 s > Using install prefix:
  1131. 23.32 s > /nix/store/knqi4mpp2gcy2djhvikk6m439c94gw16-pathway-compat-filepath-0.0.1.0
  1132. 23.32 s > Executables installed in:
  1133. 23.32 s > /nix/store/knqi4mpp2gcy2djhvikk6m439c94gw16-pathway-compat-filepath-0.0.1.0/bin
  1134. 23.32 s > Libraries installed in:
  1135. 23.32 s > /nix/store/knqi4mpp2gcy2djhvikk6m439c94gw16-pathway-compat-filepath-0.0.1.0/lib/ghc-9.8.4/lib/x86_64-linux-ghc-9.8.4/pathway-compat-filepath-0.0.1.0-6KN1Vlb8yPeBopmlZtXyrR
  1136. 23.32 s > Dynamic Libraries installed in:
  1137. 23.32 s > /nix/store/knqi4mpp2gcy2djhvikk6m439c94gw16-pathway-compat-filepath-0.0.1.0/lib/ghc-9.8.4/lib/x86_64-linux-ghc-9.8.4
  1138. 23.32 s > Private executables installed in:
  1139. 23.32 s > /nix/store/knqi4mpp2gcy2djhvikk6m439c94gw16-pathway-compat-filepath-0.0.1.0/libexec/x86_64-linux-ghc-9.8.4/pathway-compat-filepath-0.0.1.0
  1140. 23.32 s > Data files installed in:
  1141. 23.32 s > /nix/store/knqi4mpp2gcy2djhvikk6m439c94gw16-pathway-compat-filepath-0.0.1.0/share/x86_64-linux-ghc-9.8.4/pathway-compat-filepath-0.0.1.0
  1142. 23.32 s > Documentation installed in:
  1143. 23.32 s > /nix/store/brb3ys0mr106j2xs2nqwq5rszfngk13w-pathway-compat-filepath-0.0.1.0-doc/share/doc/pathway-compat-filepath-0.0.1.0
  1144. 23.32 s > Configuration files installed in:
  1145. 23.32 s > /nix/store/knqi4mpp2gcy2djhvikk6m439c94gw16-pathway-compat-filepath-0.0.1.0/etc
  1146. 23.32 s > No alex found
  1147. 23.32 s > Using ar found on system at:
  1148. 23.32 s > /nix/store/zjraf40s86y3iwhp626b934r5y6ldkbb-binutils-wrapper-2.46/bin/ar
  1149. 23.32 s > No c2hs found
  1150. 23.32 s > No cpphs found
  1151. 23.32 s > Using doctest version 0.24.3 found on system at:
  1152. 23.32 s > /nix/store/2y183b1vsybv0157vfr59yhdwjkpqfkn-doctest-0.24.3/bin/doctest
  1153. 23.32 s > Using gcc version 15.2.0 given by user at:
  1154. 23.32 s > /nix/store/29qjlshvklnyr67nhpprzgb9igmsfsjj-gcc-wrapper-15.2.0/bin/gcc
  1155. 23.32 s > Using ghc version 9.8.4 found on system at:
  1156. 23.32 s > /nix/store/7r9b0bl984hdgd70nf5p8raa55kml491-ghc-9.8.4/bin/ghc
  1157. 23.32 s > Using ghc-pkg version 9.8.4 found on system at:
  1158. 23.32 s > /nix/store/7r9b0bl984hdgd70nf5p8raa55kml491-ghc-9.8.4/bin/ghc-pkg-9.8.4
  1159. 23.32 s > No ghcjs found
  1160. 23.32 s > No ghcjs-pkg found
  1161. 23.32 s > No greencard found
  1162. 23.32 s > Using haddock version 2.30.0 found on system at:
  1163. 23.32 s > /nix/store/7r9b0bl984hdgd70nf5p8raa55kml491-ghc-9.8.4/bin/haddock-ghc-9.8.4
  1164. 23.32 s > No happy found
  1165. 23.32 s > Using haskell-suite found on system at: haskell-suite-dummy-location
  1166. 23.32 s > Using haskell-suite-pkg found on system at: haskell-suite-pkg-dummy-location
  1167. 23.32 s > No hmake found
  1168. 23.32 s > Using hpc version 0.69 found on system at:
  1169. 23.32 s > /nix/store/7r9b0bl984hdgd70nf5p8raa55kml491-ghc-9.8.4/bin/hpc-ghc-9.8.4
  1170. 23.32 s > Using hsc2hs version 0.68.10 found on system at:
  1171. 23.32 s > /nix/store/7r9b0bl984hdgd70nf5p8raa55kml491-ghc-9.8.4/bin/hsc2hs-ghc-9.8.4
  1172. 23.32 s > Using hscolour version 1.25 found on system at:
  1173. 23.32 s > /nix/store/awnxn98rlw62rrjwli6d2lb4d27mrzzw-hscolour-1.25/bin/HsColour
  1174. 23.32 s > No jhc found
  1175. 23.32 s > Using ld found on system at:
  1176. 23.32 s > /nix/store/zjraf40s86y3iwhp626b934r5y6ldkbb-binutils-wrapper-2.46/bin/ld.gold
  1177. 23.32 s > No pkg-config found
  1178. 23.32 s > Using runghc version 9.8.4 found on system at:
  1179. 23.32 s > /nix/store/7r9b0bl984hdgd70nf5p8raa55kml491-ghc-9.8.4/bin/runghc-9.8.4
  1180. 23.32 s > Using strip version 2.46 found on system at:
  1181. 23.32 s > /nix/store/29qjlshvklnyr67nhpprzgb9igmsfsjj-gcc-wrapper-15.2.0/bin/strip
  1182. 23.32 s > Using tar found on system at:
  1183. 23.32 s > /nix/store/z5mq2sam4484prf3kv6v6vjw1m0i7j24-gnutar-1.35/bin/tar
  1184. 23.32 s > No uhc found
  1185. 23.32 s > Running phase: buildPhase
  1186. 23.32 s > Preprocessing library for pathway-compat-filepath-0.0.1.0..
  1187. 23.32 s > Building library for pathway-compat-filepath-0.0.1.0..
  1188. 23.32 s > [ 1 of 10] Compiling Common.FilePath ( src/Common/FilePath.hs, dist/build/Common/FilePath.o, dist/build/Common/FilePath.dyn_o )
  1189. 23.32 s > [ 2 of 10] Compiling Common.OsPath ( src/Common/OsPath.hs, dist/build/Common/OsPath.o, dist/build/Common/OsPath.dyn_o )
  1190. 23.32 s >
  1191. 23.32 s > src/Common/OsPath.hs:90:23: error: [GHC-83865]
  1192. 23.32 s > • Couldn't match type ‘OSS.OsString’ with ‘OsString’
  1193. 23.32 s > Expected: OsPath
  1194. 23.32 s > Actual: OSS.OsString
  1195. 23.32 s > NB: ‘OsString’
  1196. 23.32 s > is defined in ‘System.OsString.Internal.Types.Hidden’
  1197. 23.32 s > in package ‘filepath-1.4.301.0’
  1198. 23.32 s > ‘OSS.OsString’
  1199. 23.32 s > is defined in ‘System.OsString.Internal.Types’
  1200. 23.32 s > in package ‘os-string-2.0.10’
  1201. 23.32 s > • In the ‘parent’ field of a record
  1202. 23.32 s > In the expression:
  1203. 23.32 s > Format
  1204. 23.32 s > {root = O.pack . pure $ O.pathSeparator, current = mempty,
  1205. 23.32 s > parent = OSS.unsafeEncodeUtf "..",
  1206. 23.32 s > separator = O.pack . pure $ O.pathSeparator,
  1207. 23.32 s > substitutions = mempty}
  1208. 23.32 s > In an equation for ‘localFormat’:
  1209. 23.32 s > localFormat
  1210. 23.32 s > = Format
  1211. 23.32 s > {root = O.pack . pure $ O.pathSeparator, current = mempty,
  1212. 23.32 s > parent = OSS.unsafeEncodeUtf "..",
  1213. 23.32 s > separator = O.pack . pure $ O.pathSeparator,
  1214. 23.32 s > substitutions = mempty}
  1215. 23.32 s > |
  1216. 23.32 s > 90 | Format.parent = OSS.unsafeEncodeUtf "..",
  1217. 23.32 s > | ^^^^^^^^^^^^^^^^^^^^^^^^
  1218. 23.32 s > [ 3 of 10] Compiling System.FilePath.Thin ( src/System/FilePath/Thin.hs, dist/build/System/FilePath/Thin.o, dist/build/System/FilePath/Thin.dyn_o )
  1219. 23.32 s > [ 4 of 10] Compiling System.FilePath.Pathway ( src/System/FilePath/Pathway.hs, dist/build/System/FilePath/Pathway.o, dist/build/System/FilePath/Pathway.dyn_o )
  1220. 23.32 s > [ 5 of 10] Compiling System.FilePath.Overlay ( src/System/FilePath/Overlay.hs, dist/build/System/FilePath/Overlay.o, dist/build/System/FilePath/Overlay.dyn_o )
  1221. 23.32 s > [ 6 of 10] Compiling System.FilePath ( src/System/FilePath.hs, dist/build/System/FilePath.o, dist/build/System/FilePath.dyn_o )
  1222. 23.32 s For full logs, run:
  1223. 23.32 s nix log /nix/store/gwlaydb47f6yhlx7hsgqq7s0m612k39r-pathway-compat-filepath-0.0.1.0.drv
  1224. 23.32 s error: Cannot build '/nix/store/a28ihy0b969pwxwh925yhrdh6iklyv31-ghc-9.8.4-with-packages.drv'.
  1225. 23.32 s Reason: 1 dependency failed.
  1226. 23.32 s Output paths:
  1227. 23.32 s /nix/store/f47c3sqmfcbdna77yvv3zvndirn9fi35-ghc-9.8.4-with-packages
  1228. 23.32 s error: Cannot build '/nix/store/cijxvsyixgap1kwhz9cm8ird83kbmbhn-pathway-compat-directory-0.0.1.0.drv'.
  1229. 23.32 s Reason: 1 dependency failed.
  1230. 23.32 s Output paths:
  1231. 23.32 s /nix/store/778vdqwf41vzalr7jkjccdjmn1c5aa4c-pathway-compat-directory-0.0.1.0-doc
  1232. 23.32 s /nix/store/m4jqkrqxzf5yffr8mrra9qw0vva59qx1-pathway-compat-directory-0.0.1.0
  1233. 23.32 s error: Cannot build '/nix/store/3vy9ph7hwp5rxb70p8wqv7aj4sw59zkv-pathway-compat-file-io-0.0.1.0.drv'.
  1234. 23.32 s Reason: 1 dependency failed.
  1235. 23.32 s Output paths:
  1236. 23.32 s /nix/store/0bkghz6pg1sh43wpglszfz85kwxh1slh-pathway-compat-file-io-0.0.1.0-doc
  1237. 23.32 s /nix/store/fi58mdj0jksk51y9cpb7pv8gsdcyalv6-pathway-compat-file-io-0.0.1.0
  1238. 23.32 s error: Cannot build '/nix/store/lvyysbgzywa8rw8xjjwr4ycmka1xmx05-pathway-compat-temporary-0.0.1.0.drv'.
  1239. 23.32 s Reason: 1 dependency failed.
  1240. 23.32 s Output paths:
  1241. 23.32 s /nix/store/2jf61xx1szaq3ixvjlisixnb51ipdk6g-pathway-compat-temporary-0.0.1.0-doc
  1242. 23.32 s /nix/store/ifh2czq9h1qzw1i0l0c7bj4nhvx1g7ic-pathway-compat-temporary-0.0.1.0
  1243. 23.32 s error: Cannot build '/nix/store/56dvk8jffxl3fviyasvi4k4z94pw19jr-pathway-system-0.0.1.0.drv'.
  1244. 23.32 s Reason: 1 dependency failed.
  1245. 23.32 s Output paths:
  1246. 23.32 s /nix/store/pmqpjy6lr5f5xlihnic0nx55mhfw2gln-pathway-system-0.0.1.0
  1247. 23.32 s /nix/store/w7v65phm85dmsqf6rnkimibj4wdhm833-pathway-system-0.0.1.0-doc
  1248. 23.32 s error: Build failed due to failed dependency
  1249. 23.32 s error: Cannot build '/nix/store/hb0lkyckyih75smvvc4h529mxzi4i14x-all-packages.drv'.
  1250. 23.32 s Reason: 1 dependency failed.
  1251. 23.32 s Output paths:
  1252. 23.32 s /nix/store/4p28hza07d5xpn2maqhpangh4fjq464w-all-packages
  1253. 23.33 s Build failed due to failed dependency
  1254. 23.36 s Build failed.