build packages.x86_64-linux.crate-test-binaries-gammaloop-integration-tests

Reproduce this run
Original Run
  1. 0.00 s $ /nix/store/9ypz3flqsrl5xl495mm8h645gadjsxi1-coreutils-9.11/bin/timeout --kill-after=15s 7200s /nix/store/23zk8sgzamrbmj1fday15szf7f2279s8-nix-2.34.7/bin/nix --extra-experimental-features nix-command --extra-experimental-features flakes --log-format internal-json build --no-link --print-out-paths git+https://github.com/alphal00p/gammaloop?ref=advanced_sampling&rev=882f80eb025a2aa807219cff35cbd70349e28440&shallow=1#packages.x86_64-linux.crate-test-binaries-gammaloop-integration-tests --print-build-logs
  2. 0.33 s
  3. 1.77 s Building /nix/store/v9fbvg5phx65q4bhq8lmx1ry55wprvwq-gammaloop-crate-test-binaries-gammaloop-integration-tests-b8cda0d438c96d4f-deps-0.1.0.drv
  4. 1.91 s [gammaloop-crate-test-binaries-gammaloop-integration-tests-b8cda0d438c96d4f-deps] Phase: unpackPhase
  5. 1.91 s [gammaloop-crate-test-binaries-gammaloop-integration-tests-b8cda0d438c96d4f-deps] unpacking source archive /nix/store/psvx16ar2vc9znc7wxbw3d2kjs3lpq85-source
  6. 3.98 s [gammaloop-crate-test-binaries-gammaloop-integration-tests-b8cda0d438c96d4f-deps] source root is source
  7. 4.00 s [gammaloop-crate-test-binaries-gammaloop-integration-tests-b8cda0d438c96d4f-deps] Phase: patchPhase
  8. 4.07 s [gammaloop-crate-test-binaries-gammaloop-integration-tests-b8cda0d438c96d4f-deps] Executing configureCargoCommonVars
  9. 4.07 s [gammaloop-crate-test-binaries-gammaloop-integration-tests-b8cda0d438c96d4f-deps] copying cargo artifacts from /nix/store/h781ax8lrlxrkl5z98111my201cmakhz-gammaloop-crate-test-binaries-gammaloop-integration-tests-b8cda0d438c96d4f-inputs/target to target
  10. 4.07 s [gammaloop-crate-test-binaries-gammaloop-integration-tests-b8cda0d438c96d4f-deps] will deep copy artifacts (instead of symlinking) as requested
  11. 19.46 s [gammaloop-crate-test-binaries-gammaloop-integration-tests-b8cda0d438c96d4f-deps] Phase: updateAutotoolsGnuConfigScriptsPhase
  12. 19.50 s [gammaloop-crate-test-binaries-gammaloop-integration-tests-b8cda0d438c96d4f-deps] Phase: configurePhase
  13. 19.51 s [gammaloop-crate-test-binaries-gammaloop-integration-tests-b8cda0d438c96d4f-deps] will append /build/source/.cargo-home/config.toml with contents of /nix/store/5drf77x6km4ky7gwlrzdx9bbd6fz09g3-vendor-cargo-deps/config.toml
  14. 19.51 s [gammaloop-crate-test-binaries-gammaloop-integration-tests-b8cda0d438c96d4f-deps] default configurePhase, nothing to do
  15. 19.51 s [gammaloop-crate-test-binaries-gammaloop-integration-tests-b8cda0d438c96d4f-deps] Phase: buildPhase
  16. 19.51 s [gammaloop-crate-test-binaries-gammaloop-integration-tests-b8cda0d438c96d4f-deps] +++ command cargo --version
  17. 19.52 s [gammaloop-crate-test-binaries-gammaloop-integration-tests-b8cda0d438c96d4f-deps] cargo 1.97.0 (c980f4866 2026-06-30)
  18. 19.53 s [gammaloop-crate-test-binaries-gammaloop-integration-tests-b8cda0d438c96d4f-deps] +++ command cargo test --profile ci-optim --no-run --offline -p gammaloop-integration-tests
  19. 20.01 s [gammaloop-crate-test-binaries-gammaloop-integration-tests-b8cda0d438c96d4f-deps] Compiling gammaloop-integration-tests v0.1.0 (/build/source/tests)
  20. 20.20 s [gammaloop-crate-test-binaries-gammaloop-integration-tests-b8cda0d438c96d4f-deps] error[E0560]: struct `CutInfo` has no field named `lmb_channel_id`
  21. 20.20 s [gammaloop-crate-test-binaries-gammaloop-integration-tests-b8cda0d438c96d4f-deps] --> tests/tests/test_differential.rs:86:13
  22. 20.20 s [gammaloop-crate-test-binaries-gammaloop-integration-tests-b8cda0d438c96d4f-deps] |
  23. 20.20 s [gammaloop-crate-test-binaries-gammaloop-integration-tests-b8cda0d438c96d4f-deps] 86 | lmb_channel_id: None,
  24. 20.20 s [gammaloop-crate-test-binaries-gammaloop-integration-tests-b8cda0d438c96d4f-deps] | ^^^^^^^^^^^^^^ `CutInfo` does not have this field
  25. 20.20 s [gammaloop-crate-test-binaries-gammaloop-integration-tests-b8cda0d438c96d4f-deps] |
  26. 20.20 s [gammaloop-crate-test-binaries-gammaloop-integration-tests-b8cda0d438c96d4f-deps] = note: available fields are: `sampling_channel_id`, `sampling_channel_edge_ids`
  27. 20.20 s [gammaloop-crate-test-binaries-gammaloop-integration-tests-b8cda0d438c96d4f-deps]
  28. 20.20 s [gammaloop-crate-test-binaries-gammaloop-integration-tests-b8cda0d438c96d4f-deps] error[E0560]: struct `CutInfo` has no field named `lmb_channel_edge_ids`
  29. 20.20 s [gammaloop-crate-test-binaries-gammaloop-integration-tests-b8cda0d438c96d4f-deps] --> tests/tests/test_differential.rs:87:13
  30. 20.20 s [gammaloop-crate-test-binaries-gammaloop-integration-tests-b8cda0d438c96d4f-deps] |
  31. 20.20 s [gammaloop-crate-test-binaries-gammaloop-integration-tests-b8cda0d438c96d4f-deps] 87 | lmb_channel_edge_ids: None,
  32. 20.20 s [gammaloop-crate-test-binaries-gammaloop-integration-tests-b8cda0d438c96d4f-deps] | ^^^^^^^^^^^^^^^^^^^^ `CutInfo` does not have this field
  33. 20.20 s [gammaloop-crate-test-binaries-gammaloop-integration-tests-b8cda0d438c96d4f-deps] |
  34. 20.20 s [gammaloop-crate-test-binaries-gammaloop-integration-tests-b8cda0d438c96d4f-deps] = note: available fields are: `sampling_channel_id`, `sampling_channel_edge_ids`
  35. 20.20 s [gammaloop-crate-test-binaries-gammaloop-integration-tests-b8cda0d438c96d4f-deps]
  36. 20.21 s [gammaloop-crate-test-binaries-gammaloop-integration-tests-b8cda0d438c96d4f-deps] error[E0063]: missing field `reference_moments` in initializer of `GraphEvaluationResult<_>`
  37. 20.21 s [gammaloop-crate-test-binaries-gammaloop-integration-tests-b8cda0d438c96d4f-deps] --> tests/tests/test_differential.rs:532:19
  38. 20.21 s [gammaloop-crate-test-binaries-gammaloop-integration-tests-b8cda0d438c96d4f-deps] |
  39. 20.21 s [gammaloop-crate-test-binaries-gammaloop-integration-tests-b8cda0d438c96d4f-deps] 532 | let mut lhs = GraphEvaluationResult {
  40. 20.21 s [gammaloop-crate-test-binaries-gammaloop-integration-tests-b8cda0d438c96d4f-deps] | ^^^^^^^^^^^^^^^^^^^^^ missing `reference_moments`
  41. 20.21 s [gammaloop-crate-test-binaries-gammaloop-integration-tests-b8cda0d438c96d4f-deps]
  42. 20.21 s [gammaloop-crate-test-binaries-gammaloop-integration-tests-b8cda0d438c96d4f-deps] error[E0063]: missing field `reference_moments` in initializer of `GraphEvaluationResult<_>`
  43. 20.21 s [gammaloop-crate-test-binaries-gammaloop-integration-tests-b8cda0d438c96d4f-deps] --> tests/tests/test_differential.rs:539:15
  44. 20.21 s [gammaloop-crate-test-binaries-gammaloop-integration-tests-b8cda0d438c96d4f-deps] |
  45. 20.21 s [gammaloop-crate-test-binaries-gammaloop-integration-tests-b8cda0d438c96d4f-deps] 539 | let rhs = GraphEvaluationResult {
  46. 20.21 s [gammaloop-crate-test-binaries-gammaloop-integration-tests-b8cda0d438c96d4f-deps] | ^^^^^^^^^^^^^^^^^^^^^ missing `reference_moments`
  47. 20.21 s [gammaloop-crate-test-binaries-gammaloop-integration-tests-b8cda0d438c96d4f-deps]
  48. 20.28 s [gammaloop-crate-test-binaries-gammaloop-integration-tests-b8cda0d438c96d4f-deps] Some errors have detailed explanations: E0063, E0560.
  49. 20.28 s [gammaloop-crate-test-binaries-gammaloop-integration-tests-b8cda0d438c96d4f-deps] For more information about an error, try `rustc --explain E0063`.
  50. 20.31 s [gammaloop-crate-test-binaries-gammaloop-integration-tests-b8cda0d438c96d4f-deps] error: could not compile `gammaloop-integration-tests` (test "test_differential") due to 4 previous errors
  51. 20.31 s [gammaloop-crate-test-binaries-gammaloop-integration-tests-b8cda0d438c96d4f-deps] warning: build failed, waiting for other jobs to finish...
  52. 22.32 s [gammaloop-crate-test-binaries-gammaloop-integration-tests-b8cda0d438c96d4f-deps] error[E0609]: no field `lmb_channel_id` on type `CutInfo`
  53. 22.32 s [gammaloop-crate-test-binaries-gammaloop-integration-tests-b8cda0d438c96d4f-deps] --> tests/tests/test_runs/utils.rs:568:36
  54. 22.32 s [gammaloop-crate-test-binaries-gammaloop-integration-tests-b8cda0d438c96d4f-deps] |
  55. 22.32 s [gammaloop-crate-test-binaries-gammaloop-integration-tests-b8cda0d438c96d4f-deps] 568 | event.cut_info.lmb_channel_id,
  56. 22.32 s [gammaloop-crate-test-binaries-gammaloop-integration-tests-b8cda0d438c96d4f-deps] | ^^^^^^^^^^^^^^ unknown field
  57. 22.32 s [gammaloop-crate-test-binaries-gammaloop-integration-tests-b8cda0d438c96d4f-deps] |
  58. 22.32 s [gammaloop-crate-test-binaries-gammaloop-integration-tests-b8cda0d438c96d4f-deps] = note: available fields are: `particle_pdgs`, `cut_id`, `graph_id`, `graph_group_id`, `orientation_id` ... and 2 others
  59. 22.32 s [gammaloop-crate-test-binaries-gammaloop-integration-tests-b8cda0d438c96d4f-deps]
  60. 22.32 s [gammaloop-crate-test-binaries-gammaloop-integration-tests-b8cda0d438c96d4f-deps] error[E0609]: no field `lmb_channel_id` on type `CutInfo`
  61. 22.32 s [gammaloop-crate-test-binaries-gammaloop-integration-tests-b8cda0d438c96d4f-deps] --> tests/tests/test_runs/utils.rs:580:36
  62. 22.32 s [gammaloop-crate-test-binaries-gammaloop-integration-tests-b8cda0d438c96d4f-deps] |
  63. 22.32 s [gammaloop-crate-test-binaries-gammaloop-integration-tests-b8cda0d438c96d4f-deps] 580 | event.cut_info.lmb_channel_id,
  64. 22.33 s [gammaloop-crate-test-binaries-gammaloop-integration-tests-b8cda0d438c96d4f-deps] | ^^^^^^^^^^^^^^ unknown field
  65. 22.33 s [gammaloop-crate-test-binaries-gammaloop-integration-tests-b8cda0d438c96d4f-deps] |
  66. 22.33 s [gammaloop-crate-test-binaries-gammaloop-integration-tests-b8cda0d438c96d4f-deps] = note: available fields are: `particle_pdgs`, `cut_id`, `graph_id`, `graph_group_id`, `orientation_id` ... and 2 others
  67. 22.33 s [gammaloop-crate-test-binaries-gammaloop-integration-tests-b8cda0d438c96d4f-deps]
  68. 24.72 s [gammaloop-crate-test-binaries-gammaloop-integration-tests-b8cda0d438c96d4f-deps] For more information about this error, try `rustc --explain E0609`.
  69. 24.80 s [gammaloop-crate-test-binaries-gammaloop-integration-tests-b8cda0d438c96d4f-deps] error: could not compile `gammaloop-integration-tests` (test "test_runs") due to 2 previous errors
  70. 107.73 s Progress: 0 of 2 built (1 failed)
  71. 107.73 s Failed to build gammaloop-crate-test-binaries-gammaloop-integration-tests-b8cda0d438c96d4f-deps after 1m45s
  72. 107.73 s error: Cannot build '/nix/store/v9fbvg5phx65q4bhq8lmx1ry55wprvwq-gammaloop-crate-test-binaries-gammaloop-integration-tests-b8cda0d438c96d4f-deps-0.1.0.drv'.
  73. 107.73 s Reason: builder failed with exit code 101.
  74. 107.73 s Output paths:
  75. 107.73 s /nix/store/b1q2fmylzf4462mgj0dkx0lrx8mwckbw-gammaloop-crate-test-binaries-gammaloop-integration-tests-b8cda0d438c96d4f-deps-0.1.0
  76. 107.73 s Last 66 log lines:
  77. 107.73 s > Running phase: unpackPhase
  78. 107.73 s > unpacking source archive /nix/store/psvx16ar2vc9znc7wxbw3d2kjs3lpq85-source
  79. 107.73 s > source root is source
  80. 107.73 s > Running phase: patchPhase
  81. 107.73 s > Executing configureCargoCommonVars
  82. 107.73 s > copying cargo artifacts from /nix/store/h781ax8lrlxrkl5z98111my201cmakhz-gammaloop-crate-test-binaries-gammaloop-integration-tests-b8cda0d438c96d4f-inputs/target to target
  83. 107.73 s > will deep copy artifacts (instead of symlinking) as requested
  84. 107.73 s > Running phase: updateAutotoolsGnuConfigScriptsPhase
  85. 107.73 s > Running phase: configurePhase
  86. 107.73 s > will append /build/source/.cargo-home/config.toml with contents of /nix/store/5drf77x6km4ky7gwlrzdx9bbd6fz09g3-vendor-cargo-deps/config.toml
  87. 107.73 s > default configurePhase, nothing to do
  88. 107.73 s > Running phase: buildPhase
  89. 107.73 s > +++ command cargo --version
  90. 107.73 s > cargo 1.97.0 (c980f4866 2026-06-30)
  91. 107.73 s > +++ command cargo test --profile ci-optim --no-run --offline -p gammaloop-integration-tests
  92. 107.73 s > Compiling gammaloop-integration-tests v0.1.0 (/build/source/tests)
  93. 107.73 s > error[E0560]: struct `CutInfo` has no field named `lmb_channel_id`
  94. 107.73 s > --> tests/tests/test_differential.rs:86:13
  95. 107.73 s > |
  96. 107.73 s > 86 | lmb_channel_id: None,
  97. 107.73 s > | ^^^^^^^^^^^^^^ `CutInfo` does not have this field
  98. 107.73 s > |
  99. 107.73 s > = note: available fields are: `sampling_channel_id`, `sampling_channel_edge_ids`
  100. 107.73 s >
  101. 107.73 s > error[E0560]: struct `CutInfo` has no field named `lmb_channel_edge_ids`
  102. 107.73 s > --> tests/tests/test_differential.rs:87:13
  103. 107.73 s > |
  104. 107.73 s > 87 | lmb_channel_edge_ids: None,
  105. 107.73 s > | ^^^^^^^^^^^^^^^^^^^^ `CutInfo` does not have this field
  106. 107.73 s > |
  107. 107.73 s > = note: available fields are: `sampling_channel_id`, `sampling_channel_edge_ids`
  108. 107.73 s >
  109. 107.73 s > error[E0063]: missing field `reference_moments` in initializer of `GraphEvaluationResult<_>`
  110. 107.73 s > --> tests/tests/test_differential.rs:532:19
  111. 107.73 s > |
  112. 107.73 s > 532 | let mut lhs = GraphEvaluationResult {
  113. 107.73 s > | ^^^^^^^^^^^^^^^^^^^^^ missing `reference_moments`
  114. 107.73 s >
  115. 107.73 s > error[E0063]: missing field `reference_moments` in initializer of `GraphEvaluationResult<_>`
  116. 107.73 s > --> tests/tests/test_differential.rs:539:15
  117. 107.73 s > |
  118. 107.73 s > 539 | let rhs = GraphEvaluationResult {
  119. 107.73 s > | ^^^^^^^^^^^^^^^^^^^^^ missing `reference_moments`
  120. 107.73 s >
  121. 107.73 s > Some errors have detailed explanations: E0063, E0560.
  122. 107.73 s > For more information about an error, try `rustc --explain E0063`.
  123. 107.73 s > error: could not compile `gammaloop-integration-tests` (test "test_differential") due to 4 previous errors
  124. 107.73 s > warning: build failed, waiting for other jobs to finish...
  125. 107.73 s > error[E0609]: no field `lmb_channel_id` on type `CutInfo`
  126. 107.73 s > --> tests/tests/test_runs/utils.rs:568:36
  127. 107.73 s > |
  128. 107.73 s > 568 | event.cut_info.lmb_channel_id,
  129. 107.73 s > | ^^^^^^^^^^^^^^ unknown field
  130. 107.73 s > |
  131. 107.73 s > = note: available fields are: `particle_pdgs`, `cut_id`, `graph_id`, `graph_group_id`, `orientation_id` ... and 2 others
  132. 107.73 s >
  133. 107.73 s > error[E0609]: no field `lmb_channel_id` on type `CutInfo`
  134. 107.73 s > --> tests/tests/test_runs/utils.rs:580:36
  135. 107.73 s > |
  136. 107.73 s > 580 | event.cut_info.lmb_channel_id,
  137. 107.73 s > | ^^^^^^^^^^^^^^ unknown field
  138. 107.73 s > |
  139. 107.73 s > = note: available fields are: `particle_pdgs`, `cut_id`, `graph_id`, `graph_group_id`, `orientation_id` ... and 2 others
  140. 107.73 s >
  141. 107.73 s > For more information about this error, try `rustc --explain E0609`.
  142. 107.73 s > error: could not compile `gammaloop-integration-tests` (test "test_runs") due to 2 previous errors
  143. 107.73 s For full logs, run:
  144. 107.73 s nix log /nix/store/v9fbvg5phx65q4bhq8lmx1ry55wprvwq-gammaloop-crate-test-binaries-gammaloop-integration-tests-b8cda0d438c96d4f-deps-0.1.0.drv
  145. 107.73 s error: Cannot build '/nix/store/c6zrwslkp5lhq3ydjwrggl8i8r0jnzfm-nix-ci-artifact-barrier-crate-test-binaries-gammaloop-integration-tests.drv'.
  146. 107.73 s Reason: 1 dependency failed.
  147. 107.73 s Output paths:
  148. 107.73 s /nix/store/9aycp10dl431wml081vyh6pl5lcqhs1z-nix-ci-artifact-barrier-crate-test-binaries-gammaloop-integration-tests
  149. 107.73 s Build failed due to failed dependency
  150. 107.74 s Build failed.