0.00 s
$ /nix/store/9ypz3flqsrl5xl495mm8h645gadjsxi1-coreutils-9.11/bin/timeout --kill-after=15s 7200s /nix/store/23zk8sgzamrbmj1fday15szf7f2279s8-nix-2.34.7/bin/nix --extra-experimental-features nix-command --extra-experimental-features flakes --log-format internal-json build --no-link --print-out-paths git+https://github.com/alphal00p/gammaloop?ref=advanced_sampling&rev=882f80eb025a2aa807219cff35cbd70349e28440&shallow=1#packages.x86_64-linux.crate-test-binaries-gammaloop-integration-tests --print-build-logs
0.33 s
1.77 s
Building /nix/store/v9fbvg5phx65q4bhq8lmx1ry55wprvwq-gammaloop-crate-test-binaries-gammaloop-integration-tests-b8cda0d438c96d4f-deps-0.1.0.drv
1.91 s
[gammaloop-crate-test-binaries-gammaloop-integration-tests-b8cda0d438c96d4f-deps] Phase: unpackPhase
1.91 s
[gammaloop-crate-test-binaries-gammaloop-integration-tests-b8cda0d438c96d4f-deps] unpacking source archive /nix/store/psvx16ar2vc9znc7wxbw3d2kjs3lpq85-source
3.98 s
[gammaloop-crate-test-binaries-gammaloop-integration-tests-b8cda0d438c96d4f-deps] source root is source
4.00 s
[gammaloop-crate-test-binaries-gammaloop-integration-tests-b8cda0d438c96d4f-deps] Phase: patchPhase
4.07 s
[gammaloop-crate-test-binaries-gammaloop-integration-tests-b8cda0d438c96d4f-deps] Executing configureCargoCommonVars
4.07 s
[gammaloop-crate-test-binaries-gammaloop-integration-tests-b8cda0d438c96d4f-deps] copying cargo artifacts from /nix/store/h781ax8lrlxrkl5z98111my201cmakhz-gammaloop-crate-test-binaries-gammaloop-integration-tests-b8cda0d438c96d4f-inputs/target to target
4.07 s
[gammaloop-crate-test-binaries-gammaloop-integration-tests-b8cda0d438c96d4f-deps] will deep copy artifacts (instead of symlinking) as requested
19.46 s
[gammaloop-crate-test-binaries-gammaloop-integration-tests-b8cda0d438c96d4f-deps] Phase: updateAutotoolsGnuConfigScriptsPhase
19.50 s
[gammaloop-crate-test-binaries-gammaloop-integration-tests-b8cda0d438c96d4f-deps] Phase: configurePhase
19.51 s
[gammaloop-crate-test-binaries-gammaloop-integration-tests-b8cda0d438c96d4f-deps] will append /build/source/.cargo-home/config.toml with contents of /nix/store/5drf77x6km4ky7gwlrzdx9bbd6fz09g3-vendor-cargo-deps/config.toml
19.51 s
[gammaloop-crate-test-binaries-gammaloop-integration-tests-b8cda0d438c96d4f-deps] default configurePhase, nothing to do
19.51 s
[gammaloop-crate-test-binaries-gammaloop-integration-tests-b8cda0d438c96d4f-deps] Phase: buildPhase
19.51 s
[gammaloop-crate-test-binaries-gammaloop-integration-tests-b8cda0d438c96d4f-deps] +++ command cargo --version
19.52 s
[gammaloop-crate-test-binaries-gammaloop-integration-tests-b8cda0d438c96d4f-deps] cargo 1.97.0 (c980f4866 2026-06-30)
19.53 s
[gammaloop-crate-test-binaries-gammaloop-integration-tests-b8cda0d438c96d4f-deps] +++ command cargo test --profile ci-optim --no-run --offline -p gammaloop-integration-tests
20.01 s
[gammaloop-crate-test-binaries-gammaloop-integration-tests-b8cda0d438c96d4f-deps] Compiling gammaloop-integration-tests v0.1.0 (/build/source/tests)
20.20 s
[gammaloop-crate-test-binaries-gammaloop-integration-tests-b8cda0d438c96d4f-deps] error[E0560] : struct `CutInfo` has no field named `lmb_channel_id`
20.20 s
[gammaloop-crate-test-binaries-gammaloop-integration-tests-b8cda0d438c96d4f-deps] --> tests/tests/test_differential.rs:86:13
20.20 s
[gammaloop-crate-test-binaries-gammaloop-integration-tests-b8cda0d438c96d4f-deps] |
20.20 s
[gammaloop-crate-test-binaries-gammaloop-integration-tests-b8cda0d438c96d4f-deps] 86 | lmb_channel_id: None,
20.20 s
[gammaloop-crate-test-binaries-gammaloop-integration-tests-b8cda0d438c96d4f-deps] | ^^^^^^^^^^^^^^ `CutInfo` does not have this field
20.20 s
[gammaloop-crate-test-binaries-gammaloop-integration-tests-b8cda0d438c96d4f-deps] |
20.20 s
[gammaloop-crate-test-binaries-gammaloop-integration-tests-b8cda0d438c96d4f-deps] = note : available fields are: `sampling_channel_id`, `sampling_channel_edge_ids`
20.20 s
[gammaloop-crate-test-binaries-gammaloop-integration-tests-b8cda0d438c96d4f-deps]
20.20 s
[gammaloop-crate-test-binaries-gammaloop-integration-tests-b8cda0d438c96d4f-deps] error[E0560] : struct `CutInfo` has no field named `lmb_channel_edge_ids`
20.20 s
[gammaloop-crate-test-binaries-gammaloop-integration-tests-b8cda0d438c96d4f-deps] --> tests/tests/test_differential.rs:87:13
20.20 s
[gammaloop-crate-test-binaries-gammaloop-integration-tests-b8cda0d438c96d4f-deps] |
20.20 s
[gammaloop-crate-test-binaries-gammaloop-integration-tests-b8cda0d438c96d4f-deps] 87 | lmb_channel_edge_ids: None,
20.20 s
[gammaloop-crate-test-binaries-gammaloop-integration-tests-b8cda0d438c96d4f-deps] | ^^^^^^^^^^^^^^^^^^^^ `CutInfo` does not have this field
20.20 s
[gammaloop-crate-test-binaries-gammaloop-integration-tests-b8cda0d438c96d4f-deps] |
20.20 s
[gammaloop-crate-test-binaries-gammaloop-integration-tests-b8cda0d438c96d4f-deps] = note : available fields are: `sampling_channel_id`, `sampling_channel_edge_ids`
20.20 s
[gammaloop-crate-test-binaries-gammaloop-integration-tests-b8cda0d438c96d4f-deps]
20.21 s
[gammaloop-crate-test-binaries-gammaloop-integration-tests-b8cda0d438c96d4f-deps] error[E0063] : missing field `reference_moments` in initializer of `GraphEvaluationResult<_>`
20.21 s
[gammaloop-crate-test-binaries-gammaloop-integration-tests-b8cda0d438c96d4f-deps] --> tests/tests/test_differential.rs:532:19
20.21 s
[gammaloop-crate-test-binaries-gammaloop-integration-tests-b8cda0d438c96d4f-deps] |
20.21 s
[gammaloop-crate-test-binaries-gammaloop-integration-tests-b8cda0d438c96d4f-deps] 532 | let mut lhs = GraphEvaluationResult {
20.21 s
[gammaloop-crate-test-binaries-gammaloop-integration-tests-b8cda0d438c96d4f-deps] | ^^^^^^^^^^^^^^^^^^^^^ missing `reference_moments`
20.21 s
[gammaloop-crate-test-binaries-gammaloop-integration-tests-b8cda0d438c96d4f-deps]
20.21 s
[gammaloop-crate-test-binaries-gammaloop-integration-tests-b8cda0d438c96d4f-deps] error[E0063] : missing field `reference_moments` in initializer of `GraphEvaluationResult<_>`
20.21 s
[gammaloop-crate-test-binaries-gammaloop-integration-tests-b8cda0d438c96d4f-deps] --> tests/tests/test_differential.rs:539:15
20.21 s
[gammaloop-crate-test-binaries-gammaloop-integration-tests-b8cda0d438c96d4f-deps] |
20.21 s
[gammaloop-crate-test-binaries-gammaloop-integration-tests-b8cda0d438c96d4f-deps] 539 | let rhs = GraphEvaluationResult {
20.21 s
[gammaloop-crate-test-binaries-gammaloop-integration-tests-b8cda0d438c96d4f-deps] | ^^^^^^^^^^^^^^^^^^^^^ missing `reference_moments`
20.21 s
[gammaloop-crate-test-binaries-gammaloop-integration-tests-b8cda0d438c96d4f-deps]
20.28 s
[gammaloop-crate-test-binaries-gammaloop-integration-tests-b8cda0d438c96d4f-deps] Some errors have detailed explanations: E0063, E0560.
20.28 s
[gammaloop-crate-test-binaries-gammaloop-integration-tests-b8cda0d438c96d4f-deps] For more information about an error, try `rustc --explain E0063`.
20.31 s
[gammaloop-crate-test-binaries-gammaloop-integration-tests-b8cda0d438c96d4f-deps] error : could not compile `gammaloop-integration-tests` (test "test_differential") due to 4 previous errors
20.31 s
[gammaloop-crate-test-binaries-gammaloop-integration-tests-b8cda0d438c96d4f-deps] warning : build failed, waiting for other jobs to finish...
22.32 s
[gammaloop-crate-test-binaries-gammaloop-integration-tests-b8cda0d438c96d4f-deps] error[E0609] : no field `lmb_channel_id` on type `CutInfo`
22.32 s
[gammaloop-crate-test-binaries-gammaloop-integration-tests-b8cda0d438c96d4f-deps] --> tests/tests/test_runs/utils.rs:568:36
22.32 s
[gammaloop-crate-test-binaries-gammaloop-integration-tests-b8cda0d438c96d4f-deps] |
22.32 s
[gammaloop-crate-test-binaries-gammaloop-integration-tests-b8cda0d438c96d4f-deps] 568 | event.cut_info.lmb_channel_id,
22.32 s
[gammaloop-crate-test-binaries-gammaloop-integration-tests-b8cda0d438c96d4f-deps] | ^^^^^^^^^^^^^^ unknown field
22.32 s
[gammaloop-crate-test-binaries-gammaloop-integration-tests-b8cda0d438c96d4f-deps] |
22.32 s
[gammaloop-crate-test-binaries-gammaloop-integration-tests-b8cda0d438c96d4f-deps] = note : available fields are: `particle_pdgs`, `cut_id`, `graph_id`, `graph_group_id`, `orientation_id` ... and 2 others
22.32 s
[gammaloop-crate-test-binaries-gammaloop-integration-tests-b8cda0d438c96d4f-deps]
22.32 s
[gammaloop-crate-test-binaries-gammaloop-integration-tests-b8cda0d438c96d4f-deps] error[E0609] : no field `lmb_channel_id` on type `CutInfo`
22.32 s
[gammaloop-crate-test-binaries-gammaloop-integration-tests-b8cda0d438c96d4f-deps] --> tests/tests/test_runs/utils.rs:580:36
22.32 s
[gammaloop-crate-test-binaries-gammaloop-integration-tests-b8cda0d438c96d4f-deps] |
22.32 s
[gammaloop-crate-test-binaries-gammaloop-integration-tests-b8cda0d438c96d4f-deps] 580 | event.cut_info.lmb_channel_id,
22.33 s
[gammaloop-crate-test-binaries-gammaloop-integration-tests-b8cda0d438c96d4f-deps] | ^^^^^^^^^^^^^^ unknown field
22.33 s
[gammaloop-crate-test-binaries-gammaloop-integration-tests-b8cda0d438c96d4f-deps] |
22.33 s
[gammaloop-crate-test-binaries-gammaloop-integration-tests-b8cda0d438c96d4f-deps] = note : available fields are: `particle_pdgs`, `cut_id`, `graph_id`, `graph_group_id`, `orientation_id` ... and 2 others
22.33 s
[gammaloop-crate-test-binaries-gammaloop-integration-tests-b8cda0d438c96d4f-deps]
24.72 s
[gammaloop-crate-test-binaries-gammaloop-integration-tests-b8cda0d438c96d4f-deps] For more information about this error, try `rustc --explain E0609`.
24.80 s
[gammaloop-crate-test-binaries-gammaloop-integration-tests-b8cda0d438c96d4f-deps] error : could not compile `gammaloop-integration-tests` (test "test_runs") due to 2 previous errors
107.73 s
Progress: 0 of 2 built (1 failed)
107.73 s
Failed to build gammaloop-crate-test-binaries-gammaloop-integration-tests-b8cda0d438c96d4f-deps after 1m45s
107.73 s
error: Cannot build '/nix/store/v9fbvg5phx65q4bhq8lmx1ry55wprvwq-gammaloop-crate-test-binaries-gammaloop-integration-tests-b8cda0d438c96d4f-deps-0.1.0.drv '.
107.73 s
Reason: builder failed with exit code 101 .
107.73 s
Output paths:
107.73 s
/nix/store/b1q2fmylzf4462mgj0dkx0lrx8mwckbw-gammaloop-crate-test-binaries-gammaloop-integration-tests-b8cda0d438c96d4f-deps-0.1.0
107.73 s
Last 66 log lines:
107.73 s
> Running phase: unpackPhase
107.73 s
> unpacking source archive /nix/store/psvx16ar2vc9znc7wxbw3d2kjs3lpq85-source
107.73 s
> source root is source
107.73 s
> Running phase: patchPhase
107.73 s
> Executing configureCargoCommonVars
107.73 s
> copying cargo artifacts from /nix/store/h781ax8lrlxrkl5z98111my201cmakhz-gammaloop-crate-test-binaries-gammaloop-integration-tests-b8cda0d438c96d4f-inputs/target to target
107.73 s
> will deep copy artifacts (instead of symlinking) as requested
107.73 s
> Running phase: updateAutotoolsGnuConfigScriptsPhase
107.73 s
> Running phase: configurePhase
107.73 s
> will append /build/source/.cargo-home/config.toml with contents of /nix/store/5drf77x6km4ky7gwlrzdx9bbd6fz09g3-vendor-cargo-deps/config.toml
107.73 s
> default configurePhase, nothing to do
107.73 s
> Running phase: buildPhase
107.73 s
> +++ command cargo --version
107.73 s
> cargo 1.97.0 (c980f4866 2026-06-30)
107.73 s
> +++ command cargo test --profile ci-optim --no-run --offline -p gammaloop-integration-tests
107.73 s
> Compiling gammaloop-integration-tests v0.1.0 (/build/source/tests)
107.73 s
> error[E0560] : struct `CutInfo` has no field named `lmb_channel_id`
107.73 s
> --> tests/tests/test_differential.rs:86:13
107.73 s
> |
107.73 s
> 86 | lmb_channel_id: None,
107.73 s
> | ^^^^^^^^^^^^^^ `CutInfo` does not have this field
107.73 s
> |
107.73 s
> = note : available fields are: `sampling_channel_id`, `sampling_channel_edge_ids`
107.73 s
>
107.73 s
> error[E0560] : struct `CutInfo` has no field named `lmb_channel_edge_ids`
107.73 s
> --> tests/tests/test_differential.rs:87:13
107.73 s
> |
107.73 s
> 87 | lmb_channel_edge_ids: None,
107.73 s
> | ^^^^^^^^^^^^^^^^^^^^ `CutInfo` does not have this field
107.73 s
> |
107.73 s
> = note : available fields are: `sampling_channel_id`, `sampling_channel_edge_ids`
107.73 s
>
107.73 s
> error[E0063] : missing field `reference_moments` in initializer of `GraphEvaluationResult<_>`
107.73 s
> --> tests/tests/test_differential.rs:532:19
107.73 s
> |
107.73 s
> 532 | let mut lhs = GraphEvaluationResult {
107.73 s
> | ^^^^^^^^^^^^^^^^^^^^^ missing `reference_moments`
107.73 s
>
107.73 s
> error[E0063] : missing field `reference_moments` in initializer of `GraphEvaluationResult<_>`
107.73 s
> --> tests/tests/test_differential.rs:539:15
107.73 s
> |
107.73 s
> 539 | let rhs = GraphEvaluationResult {
107.73 s
> | ^^^^^^^^^^^^^^^^^^^^^ missing `reference_moments`
107.73 s
>
107.73 s
> Some errors have detailed explanations: E0063, E0560.
107.73 s
> For more information about an error, try `rustc --explain E0063`.
107.73 s
> error : could not compile `gammaloop-integration-tests` (test "test_differential") due to 4 previous errors
107.73 s
> warning : build failed, waiting for other jobs to finish...
107.73 s
> error[E0609] : no field `lmb_channel_id` on type `CutInfo`
107.73 s
> --> tests/tests/test_runs/utils.rs:568:36
107.73 s
> |
107.73 s
> 568 | event.cut_info.lmb_channel_id,
107.73 s
> | ^^^^^^^^^^^^^^ unknown field
107.73 s
> |
107.73 s
> = note : available fields are: `particle_pdgs`, `cut_id`, `graph_id`, `graph_group_id`, `orientation_id` ... and 2 others
107.73 s
>
107.73 s
> error[E0609] : no field `lmb_channel_id` on type `CutInfo`
107.73 s
> --> tests/tests/test_runs/utils.rs:580:36
107.73 s
> |
107.73 s
> 580 | event.cut_info.lmb_channel_id,
107.73 s
> | ^^^^^^^^^^^^^^ unknown field
107.73 s
> |
107.73 s
> = note : available fields are: `particle_pdgs`, `cut_id`, `graph_id`, `graph_group_id`, `orientation_id` ... and 2 others
107.73 s
>
107.73 s
> For more information about this error, try `rustc --explain E0609`.
107.73 s
> error : could not compile `gammaloop-integration-tests` (test "test_runs") due to 2 previous errors
107.73 s
For full logs, run:
107.73 s
nix log /nix/store/v9fbvg5phx65q4bhq8lmx1ry55wprvwq-gammaloop-crate-test-binaries-gammaloop-integration-tests-b8cda0d438c96d4f-deps-0.1.0.drv
107.73 s
error: Cannot build '/nix/store/c6zrwslkp5lhq3ydjwrggl8i8r0jnzfm-nix-ci-artifact-barrier-crate-test-binaries-gammaloop-integration-tests.drv '.
107.73 s
Reason: 1 dependency failed .
107.73 s
Output paths:
107.73 s
/nix/store/9aycp10dl431wml081vyh6pl5lcqhs1z-nix-ci-artifact-barrier-crate-test-binaries-gammaloop-integration-tests
107.73 s
Build failed due to failed dependency
107.74 s
Build failed.