24.09 s[gammaloop-ci-test-binary-dependencies-d6e55b48f8214f9c-gammaloop-integration-tests-dev-dependency.toml:post-build] Uploading to the NixCI cache: /nix/store/lfx53ya8cr1igbixws20ksh85z7d7in6-gammaloop-ci-test-binary-dependencies-d6e55b48f8214f9c-gammaloop-integration-tests-dev-dependency.toml
24.35 s[gammaloop-ci-test-binary-dependencies-d6e55b48f8214f9c-gammaloop-integration-tests-dev-dependency.toml:post-build] warning: 'warn-short-path-literals' is deprecated, use 'lint-short-path-literals = ignore' instead
25.05 sBuilt gammaloop-ci-test-binary-dependencies-d6e55b48f8214f9c-gammaloop-integration-tests-dev-dependency.toml in 5.2s
54.50 s[gammaloop-crate-test-binaries-gammaloop-integration-tests-d6e55b48f8214f9c-inputs:post-build] Uploading to the NixCI cache: /nix/store/lbq8625kkpxw489cfdbm9v7l3acvl202-gammaloop-crate-test-binaries-gammaloop-integration-tests-d6e55b48f8214f9c-inputs
54.58 s[gammaloop-crate-test-binaries-gammaloop-integration-tests-d6e55b48f8214f9c-inputs:post-build] warning: 'warn-short-path-literals' is deprecated, use 'lint-short-path-literals = ignore' instead
54.65 s[gammaloop-crate-test-binaries-gammaloop-integration-tests-d6e55b48f8214f9c-inputs:post-build] copying path '/nix/store/lbq8625kkpxw489cfdbm9v7l3acvl202-gammaloop-crate-test-binaries-gammaloop-integration-tests-d6e55b48f8214f9c-inputs' to 'https://cache.nix-ci.com'...
616.58 s[gammaloop-crate-test-binaries-gammaloop-integration-tests-d6e55b48f8214f9c-inputs:post-build] warning: unable to upload 'https://cache.nix-ci.com/nar/05p8mpwk0k3zd9a4nvq51d5yxl442xr9d91v2d51mlab5kjbrjha.nar.xz': Timeout was reached (28) Operation too slow. Less than 1 bytes/sec transferred the last 300 seconds; retrying in 341 ms (attempt 1/5)
658.48 s[gammaloop-crate-test-binaries-gammaloop-integration-tests-d6e55b48f8214f9c-inputs:post-build] warning: 'warn-short-path-literals' is deprecated, use 'lint-short-path-literals = ignore' instead
659.39 s[gammaloop-crate-test-binaries-gammaloop-integration-tests-d6e55b48f8214f9c-deps] copying cargo artifacts from /nix/store/lbq8625kkpxw489cfdbm9v7l3acvl202-gammaloop-crate-test-binaries-gammaloop-integration-tests-d6e55b48f8214f9c-inputs/target to target
659.39 s[gammaloop-crate-test-binaries-gammaloop-integration-tests-d6e55b48f8214f9c-deps] will deep copy artifacts (instead of symlinking) as requested
664.17 s[gammaloop-crate-test-binaries-gammaloop-integration-tests-d6e55b48f8214f9c-deps] will append /build/source/.cargo-home/config.toml with contents of /nix/store/5drf77x6km4ky7gwlrzdx9bbd6fz09g3-vendor-cargo-deps/config.toml
664.18 s[gammaloop-crate-test-binaries-gammaloop-integration-tests-d6e55b48f8214f9c-deps] default configurePhase, nothing to do
664.91 s[gammaloop-crate-test-binaries-gammaloop-integration-tests-d6e55b48f8214f9c-deps] error[E0560]: struct `CutInfo` has no field named `lmb_channel_id`
664.91 s[gammaloop-crate-test-binaries-gammaloop-integration-tests-d6e55b48f8214f9c-deps] error[E0560]: struct `CutInfo` has no field named `lmb_channel_edge_ids`
664.92 s[gammaloop-crate-test-binaries-gammaloop-integration-tests-d6e55b48f8214f9c-deps] error[E0063]: missing field `reference_moments` in initializer of `GraphEvaluationResult<_>`
664.92 s[gammaloop-crate-test-binaries-gammaloop-integration-tests-d6e55b48f8214f9c-deps] error[E0063]: missing field `reference_moments` in initializer of `GraphEvaluationResult<_>`
664.99 s[gammaloop-crate-test-binaries-gammaloop-integration-tests-d6e55b48f8214f9c-deps] Some errors have detailed explanations: E0063, E0560.
664.99 s[gammaloop-crate-test-binaries-gammaloop-integration-tests-d6e55b48f8214f9c-deps] For more information about an error, try `rustc --explain E0063`.
664.99 s[gammaloop-crate-test-binaries-gammaloop-integration-tests-d6e55b48f8214f9c-deps] error: could not compile `gammaloop-integration-tests` (test "test_differential") due to 4 previous errors
664.99 s[gammaloop-crate-test-binaries-gammaloop-integration-tests-d6e55b48f8214f9c-deps] warning: build failed, waiting for other jobs to finish...
666.11 s[gammaloop-crate-test-binaries-gammaloop-integration-tests-d6e55b48f8214f9c-deps] error[E0609]: no field `lmb_channel_id` on type `CutInfo`
666.88 s[gammaloop-crate-test-binaries-gammaloop-integration-tests-d6e55b48f8214f9c-deps] For more information about this error, try `rustc --explain E0609`.
666.91 s[gammaloop-crate-test-binaries-gammaloop-integration-tests-d6e55b48f8214f9c-deps] error: could not compile `gammaloop-integration-tests` (test "test_runs") due to 2 previous errors
873.04 s > copying cargo artifacts from /nix/store/lbq8625kkpxw489cfdbm9v7l3acvl202-gammaloop-crate-test-binaries-gammaloop-integration-tests-d6e55b48f8214f9c-inputs/target to target
873.04 s > will deep copy artifacts (instead of symlinking) as requested
873.04 s > Running phase: updateAutotoolsGnuConfigScriptsPhase
873.04 s > will append /build/source/.cargo-home/config.toml with contents of /nix/store/5drf77x6km4ky7gwlrzdx9bbd6fz09g3-vendor-cargo-deps/config.toml