build packages.x86_64-linux.crate-test-binaries-python-api-gammaloop-integration-tests

Reproduce this run
Retry Run
  1. 0.01 s $ /nix/store/9ypz3flqsrl5xl495mm8h645gadjsxi1-coreutils-9.11/bin/timeout --kill-after=15s 7200s /nix/store/23zk8sgzamrbmj1fday15szf7f2279s8-nix-2.34.7/bin/nix --extra-experimental-features nix-command --extra-experimental-features flakes --log-format internal-json build --no-link --print-out-paths git+https://github.com/alphal00p/gammaloop?ref=advanced_sampling&rev=882f80eb025a2aa807219cff35cbd70349e28440&shallow=1#packages.x86_64-linux.crate-test-binaries-python-api-gammaloop-integration-tests --print-build-logs
  2. 18.67 s
  3. 19.81 s Building /nix/store/25cw93xc9r5ymlp634wywx92mcvp6416-gammaloop-ci-test-binary-dependencies-d6e55b48f8214f9c-gammaloop-integration-tests-dev-dependency.toml.drv
  4. 23.75 s Building /nix/store/b6n8q9ybk66h863ihia9v5dxf6bzxgsg-gammaloop-crate-test-binaries-gammaloop-integration-tests-d6e55b48f8214f9c-inputs.drv
  5. 24.09 s [gammaloop-ci-test-binary-dependencies-d6e55b48f8214f9c-gammaloop-integration-tests-dev-dependency.toml:post-build] Uploading to the NixCI cache: /nix/store/lfx53ya8cr1igbixws20ksh85z7d7in6-gammaloop-ci-test-binary-dependencies-d6e55b48f8214f9c-gammaloop-integration-tests-dev-dependency.toml
  6. 24.35 s [gammaloop-ci-test-binary-dependencies-d6e55b48f8214f9c-gammaloop-integration-tests-dev-dependency.toml:post-build] warning: 'warn-short-path-literals' is deprecated, use 'lint-short-path-literals = ignore' instead
  7. 24.49 s [gammaloop-ci-test-binary-dependencies-d6e55b48f8214f9c-gammaloop-integration-tests-dev-dependency.toml:post-build] copying 0 paths...
  8. 24.78 s [gammaloop-ci-test-binary-dependencies-d6e55b48f8214f9c-gammaloop-integration-tests-dev-dependency.toml:post-build] warning: 'warn-short-path-literals' is deprecated, use 'lint-short-path-literals = ignore' instead
  9. 24.97 s [gammaloop-ci-test-binary-dependencies-d6e55b48f8214f9c-gammaloop-integration-tests-dev-dependency.toml:post-build] copying 0 paths...
  10. 25.05 s Uploaded gammaloop-ci-test-binary-dependencies-d6e55b48f8214f9c-gammaloop-integration-tests-dev-dependency.toml in 1.2s
  11. 25.05 s Progress: 1 of 5 built (1 building)
  12. 25.05 s Built gammaloop-ci-test-binary-dependencies-d6e55b48f8214f9c-gammaloop-integration-tests-dev-dependency.toml in 5.2s
  13. 54.50 s [gammaloop-crate-test-binaries-gammaloop-integration-tests-d6e55b48f8214f9c-inputs:post-build] Uploading to the NixCI cache: /nix/store/lbq8625kkpxw489cfdbm9v7l3acvl202-gammaloop-crate-test-binaries-gammaloop-integration-tests-d6e55b48f8214f9c-inputs
  14. 54.58 s [gammaloop-crate-test-binaries-gammaloop-integration-tests-d6e55b48f8214f9c-inputs:post-build] warning: 'warn-short-path-literals' is deprecated, use 'lint-short-path-literals = ignore' instead
  15. 54.65 s [gammaloop-crate-test-binaries-gammaloop-integration-tests-d6e55b48f8214f9c-inputs:post-build] copying 1 paths...
  16. 54.65 s [gammaloop-crate-test-binaries-gammaloop-integration-tests-d6e55b48f8214f9c-inputs:post-build] copying path '/nix/store/lbq8625kkpxw489cfdbm9v7l3acvl202-gammaloop-crate-test-binaries-gammaloop-integration-tests-d6e55b48f8214f9c-inputs' to 'https://cache.nix-ci.com'...
  17. 616.58 s [gammaloop-crate-test-binaries-gammaloop-integration-tests-d6e55b48f8214f9c-inputs:post-build] warning: unable to upload 'https://cache.nix-ci.com/nar/05p8mpwk0k3zd9a4nvq51d5yxl442xr9d91v2d51mlab5kjbrjha.nar.xz': Timeout was reached (28) Operation too slow. Less than 1 bytes/sec transferred the last 300 seconds; retrying in 341 ms (attempt 1/5)
  18. 658.48 s [gammaloop-crate-test-binaries-gammaloop-integration-tests-d6e55b48f8214f9c-inputs:post-build] warning: 'warn-short-path-literals' is deprecated, use 'lint-short-path-literals = ignore' instead
  19. 658.70 s [gammaloop-crate-test-binaries-gammaloop-integration-tests-d6e55b48f8214f9c-inputs:post-build] copying 1 paths...
  20. 658.70 s [gammaloop-crate-test-binaries-gammaloop-integration-tests-d6e55b48f8214f9c-inputs:post-build] copying path '/nix/store/b6n8q9ybk66h863ihia9v5dxf6bzxgsg-gammaloop-crate-test-binaries-gammaloop-integration-tests-d6e55b48f8214f9c-inputs.drv' to 'https://cache.nix-ci.com'...
  21. 658.85 s Uploaded gammaloop-crate-test-binaries-gammaloop-integration-tests-d6e55b48f8214f9c-inputs in 10m04s
  22. 658.85 s Progress: 2 of 5 built
  23. 658.85 s Built gammaloop-crate-test-binaries-gammaloop-integration-tests-d6e55b48f8214f9c-inputs in 10m35s
  24. 658.93 s Building /nix/store/9gqz2qklpvbkmqyxpxlldnnjgjw6m19h-gammaloop-crate-test-binaries-gammaloop-integration-tests-d6e55b48f8214f9c-deps-0.1.0.drv
  25. 658.99 s [gammaloop-crate-test-binaries-gammaloop-integration-tests-d6e55b48f8214f9c-deps] Phase: unpackPhase
  26. 659.00 s [gammaloop-crate-test-binaries-gammaloop-integration-tests-d6e55b48f8214f9c-deps] unpacking source archive /nix/store/psvx16ar2vc9znc7wxbw3d2kjs3lpq85-source
  27. 659.29 s [gammaloop-crate-test-binaries-gammaloop-integration-tests-d6e55b48f8214f9c-deps] source root is source
  28. 659.31 s [gammaloop-crate-test-binaries-gammaloop-integration-tests-d6e55b48f8214f9c-deps] Phase: patchPhase
  29. 659.39 s [gammaloop-crate-test-binaries-gammaloop-integration-tests-d6e55b48f8214f9c-deps] Executing configureCargoCommonVars
  30. 659.39 s [gammaloop-crate-test-binaries-gammaloop-integration-tests-d6e55b48f8214f9c-deps] copying cargo artifacts from /nix/store/lbq8625kkpxw489cfdbm9v7l3acvl202-gammaloop-crate-test-binaries-gammaloop-integration-tests-d6e55b48f8214f9c-inputs/target to target
  31. 659.39 s [gammaloop-crate-test-binaries-gammaloop-integration-tests-d6e55b48f8214f9c-deps] will deep copy artifacts (instead of symlinking) as requested
  32. 663.28 s [gammaloop-crate-test-binaries-gammaloop-integration-tests-d6e55b48f8214f9c-deps] Phase: updateAutotoolsGnuConfigScriptsPhase
  33. 664.17 s [gammaloop-crate-test-binaries-gammaloop-integration-tests-d6e55b48f8214f9c-deps] Phase: configurePhase
  34. 664.17 s [gammaloop-crate-test-binaries-gammaloop-integration-tests-d6e55b48f8214f9c-deps] will append /build/source/.cargo-home/config.toml with contents of /nix/store/5drf77x6km4ky7gwlrzdx9bbd6fz09g3-vendor-cargo-deps/config.toml
  35. 664.18 s [gammaloop-crate-test-binaries-gammaloop-integration-tests-d6e55b48f8214f9c-deps] default configurePhase, nothing to do
  36. 664.18 s [gammaloop-crate-test-binaries-gammaloop-integration-tests-d6e55b48f8214f9c-deps] Phase: buildPhase
  37. 664.18 s [gammaloop-crate-test-binaries-gammaloop-integration-tests-d6e55b48f8214f9c-deps] +++ command cargo --version
  38. 664.19 s [gammaloop-crate-test-binaries-gammaloop-integration-tests-d6e55b48f8214f9c-deps] cargo 1.97.0 (c980f4866 2026-06-30)
  39. 664.19 s [gammaloop-crate-test-binaries-gammaloop-integration-tests-d6e55b48f8214f9c-deps] +++ command cargo test --profile ci-optim --no-run --offline -p gammaloop-integration-tests --features gammaloop-integration-tests/python-api-tests
  40. 664.77 s [gammaloop-crate-test-binaries-gammaloop-integration-tests-d6e55b48f8214f9c-deps] Compiling gammaloop-integration-tests v0.1.0 (/build/source/tests)
  41. 664.91 s [gammaloop-crate-test-binaries-gammaloop-integration-tests-d6e55b48f8214f9c-deps] error[E0560]: struct `CutInfo` has no field named `lmb_channel_id`
  42. 664.91 s [gammaloop-crate-test-binaries-gammaloop-integration-tests-d6e55b48f8214f9c-deps] --> tests/tests/test_differential.rs:86:13
  43. 664.91 s [gammaloop-crate-test-binaries-gammaloop-integration-tests-d6e55b48f8214f9c-deps] |
  44. 664.91 s [gammaloop-crate-test-binaries-gammaloop-integration-tests-d6e55b48f8214f9c-deps] 86 | lmb_channel_id: None,
  45. 664.91 s [gammaloop-crate-test-binaries-gammaloop-integration-tests-d6e55b48f8214f9c-deps] | ^^^^^^^^^^^^^^ `CutInfo` does not have this field
  46. 664.91 s [gammaloop-crate-test-binaries-gammaloop-integration-tests-d6e55b48f8214f9c-deps] |
  47. 664.91 s [gammaloop-crate-test-binaries-gammaloop-integration-tests-d6e55b48f8214f9c-deps] = note: available fields are: `sampling_channel_id`, `sampling_channel_edge_ids`
  48. 664.91 s [gammaloop-crate-test-binaries-gammaloop-integration-tests-d6e55b48f8214f9c-deps]
  49. 664.91 s [gammaloop-crate-test-binaries-gammaloop-integration-tests-d6e55b48f8214f9c-deps] error[E0560]: struct `CutInfo` has no field named `lmb_channel_edge_ids`
  50. 664.91 s [gammaloop-crate-test-binaries-gammaloop-integration-tests-d6e55b48f8214f9c-deps] --> tests/tests/test_differential.rs:87:13
  51. 664.91 s [gammaloop-crate-test-binaries-gammaloop-integration-tests-d6e55b48f8214f9c-deps] |
  52. 664.91 s [gammaloop-crate-test-binaries-gammaloop-integration-tests-d6e55b48f8214f9c-deps] 87 | lmb_channel_edge_ids: None,
  53. 664.91 s [gammaloop-crate-test-binaries-gammaloop-integration-tests-d6e55b48f8214f9c-deps] | ^^^^^^^^^^^^^^^^^^^^ `CutInfo` does not have this field
  54. 664.91 s [gammaloop-crate-test-binaries-gammaloop-integration-tests-d6e55b48f8214f9c-deps] |
  55. 664.91 s [gammaloop-crate-test-binaries-gammaloop-integration-tests-d6e55b48f8214f9c-deps] = note: available fields are: `sampling_channel_id`, `sampling_channel_edge_ids`
  56. 664.91 s [gammaloop-crate-test-binaries-gammaloop-integration-tests-d6e55b48f8214f9c-deps]
  57. 664.92 s [gammaloop-crate-test-binaries-gammaloop-integration-tests-d6e55b48f8214f9c-deps] error[E0063]: missing field `reference_moments` in initializer of `GraphEvaluationResult<_>`
  58. 664.92 s [gammaloop-crate-test-binaries-gammaloop-integration-tests-d6e55b48f8214f9c-deps] --> tests/tests/test_differential.rs:532:19
  59. 664.92 s [gammaloop-crate-test-binaries-gammaloop-integration-tests-d6e55b48f8214f9c-deps] |
  60. 664.92 s [gammaloop-crate-test-binaries-gammaloop-integration-tests-d6e55b48f8214f9c-deps] 532 | let mut lhs = GraphEvaluationResult {
  61. 664.92 s [gammaloop-crate-test-binaries-gammaloop-integration-tests-d6e55b48f8214f9c-deps] | ^^^^^^^^^^^^^^^^^^^^^ missing `reference_moments`
  62. 664.92 s [gammaloop-crate-test-binaries-gammaloop-integration-tests-d6e55b48f8214f9c-deps]
  63. 664.92 s [gammaloop-crate-test-binaries-gammaloop-integration-tests-d6e55b48f8214f9c-deps] error[E0063]: missing field `reference_moments` in initializer of `GraphEvaluationResult<_>`
  64. 664.92 s [gammaloop-crate-test-binaries-gammaloop-integration-tests-d6e55b48f8214f9c-deps] --> tests/tests/test_differential.rs:539:15
  65. 664.92 s [gammaloop-crate-test-binaries-gammaloop-integration-tests-d6e55b48f8214f9c-deps] |
  66. 664.92 s [gammaloop-crate-test-binaries-gammaloop-integration-tests-d6e55b48f8214f9c-deps] 539 | let rhs = GraphEvaluationResult {
  67. 664.92 s [gammaloop-crate-test-binaries-gammaloop-integration-tests-d6e55b48f8214f9c-deps] | ^^^^^^^^^^^^^^^^^^^^^ missing `reference_moments`
  68. 664.92 s [gammaloop-crate-test-binaries-gammaloop-integration-tests-d6e55b48f8214f9c-deps]
  69. 664.99 s [gammaloop-crate-test-binaries-gammaloop-integration-tests-d6e55b48f8214f9c-deps] Some errors have detailed explanations: E0063, E0560.
  70. 664.99 s [gammaloop-crate-test-binaries-gammaloop-integration-tests-d6e55b48f8214f9c-deps] For more information about an error, try `rustc --explain E0063`.
  71. 664.99 s [gammaloop-crate-test-binaries-gammaloop-integration-tests-d6e55b48f8214f9c-deps] error: could not compile `gammaloop-integration-tests` (test "test_differential") due to 4 previous errors
  72. 664.99 s [gammaloop-crate-test-binaries-gammaloop-integration-tests-d6e55b48f8214f9c-deps] warning: build failed, waiting for other jobs to finish...
  73. 666.11 s [gammaloop-crate-test-binaries-gammaloop-integration-tests-d6e55b48f8214f9c-deps] error[E0609]: no field `lmb_channel_id` on type `CutInfo`
  74. 666.11 s [gammaloop-crate-test-binaries-gammaloop-integration-tests-d6e55b48f8214f9c-deps] --> tests/tests/test_runs/utils.rs:568:36
  75. 666.11 s [gammaloop-crate-test-binaries-gammaloop-integration-tests-d6e55b48f8214f9c-deps] |
  76. 666.11 s [gammaloop-crate-test-binaries-gammaloop-integration-tests-d6e55b48f8214f9c-deps] 568 | event.cut_info.lmb_channel_id,
  77. 666.11 s [gammaloop-crate-test-binaries-gammaloop-integration-tests-d6e55b48f8214f9c-deps] | ^^^^^^^^^^^^^^ unknown field
  78. 666.11 s [gammaloop-crate-test-binaries-gammaloop-integration-tests-d6e55b48f8214f9c-deps] |
  79. 666.11 s [gammaloop-crate-test-binaries-gammaloop-integration-tests-d6e55b48f8214f9c-deps] = note: available fields are: `particle_pdgs`, `cut_id`, `graph_id`, `graph_group_id`, `orientation_id` ... and 2 others
  80. 666.11 s [gammaloop-crate-test-binaries-gammaloop-integration-tests-d6e55b48f8214f9c-deps]
  81. 666.11 s [gammaloop-crate-test-binaries-gammaloop-integration-tests-d6e55b48f8214f9c-deps] error[E0609]: no field `lmb_channel_id` on type `CutInfo`
  82. 666.11 s [gammaloop-crate-test-binaries-gammaloop-integration-tests-d6e55b48f8214f9c-deps] --> tests/tests/test_runs/utils.rs:580:36
  83. 666.11 s [gammaloop-crate-test-binaries-gammaloop-integration-tests-d6e55b48f8214f9c-deps] |
  84. 666.11 s [gammaloop-crate-test-binaries-gammaloop-integration-tests-d6e55b48f8214f9c-deps] 580 | event.cut_info.lmb_channel_id,
  85. 666.11 s [gammaloop-crate-test-binaries-gammaloop-integration-tests-d6e55b48f8214f9c-deps] | ^^^^^^^^^^^^^^ unknown field
  86. 666.11 s [gammaloop-crate-test-binaries-gammaloop-integration-tests-d6e55b48f8214f9c-deps] |
  87. 666.11 s [gammaloop-crate-test-binaries-gammaloop-integration-tests-d6e55b48f8214f9c-deps] = note: available fields are: `particle_pdgs`, `cut_id`, `graph_id`, `graph_group_id`, `orientation_id` ... and 2 others
  88. 666.11 s [gammaloop-crate-test-binaries-gammaloop-integration-tests-d6e55b48f8214f9c-deps]
  89. 666.88 s [gammaloop-crate-test-binaries-gammaloop-integration-tests-d6e55b48f8214f9c-deps] For more information about this error, try `rustc --explain E0609`.
  90. 666.91 s [gammaloop-crate-test-binaries-gammaloop-integration-tests-d6e55b48f8214f9c-deps] error: could not compile `gammaloop-integration-tests` (test "test_runs") due to 2 previous errors
  91. 873.04 s Progress: 2 of 4 built (1 failed)
  92. 873.04 s Failed to build gammaloop-crate-test-binaries-gammaloop-integration-tests-d6e55b48f8214f9c-deps after 3m34s
  93. 873.04 s error: Cannot build '/nix/store/9gqz2qklpvbkmqyxpxlldnnjgjw6m19h-gammaloop-crate-test-binaries-gammaloop-integration-tests-d6e55b48f8214f9c-deps-0.1.0.drv'.
  94. 873.04 s Reason: builder failed with exit code 101.
  95. 873.04 s Output paths:
  96. 873.04 s /nix/store/65h8vs44a15wq075p7ng0zxbkvs81sd3-gammaloop-crate-test-binaries-gammaloop-integration-tests-d6e55b48f8214f9c-deps-0.1.0
  97. 873.04 s Last 66 log lines:
  98. 873.04 s > Running phase: unpackPhase
  99. 873.04 s > unpacking source archive /nix/store/psvx16ar2vc9znc7wxbw3d2kjs3lpq85-source
  100. 873.04 s > source root is source
  101. 873.04 s > Running phase: patchPhase
  102. 873.04 s > Executing configureCargoCommonVars
  103. 873.04 s > copying cargo artifacts from /nix/store/lbq8625kkpxw489cfdbm9v7l3acvl202-gammaloop-crate-test-binaries-gammaloop-integration-tests-d6e55b48f8214f9c-inputs/target to target
  104. 873.04 s > will deep copy artifacts (instead of symlinking) as requested
  105. 873.04 s > Running phase: updateAutotoolsGnuConfigScriptsPhase
  106. 873.04 s > Running phase: configurePhase
  107. 873.04 s > will append /build/source/.cargo-home/config.toml with contents of /nix/store/5drf77x6km4ky7gwlrzdx9bbd6fz09g3-vendor-cargo-deps/config.toml
  108. 873.04 s > default configurePhase, nothing to do
  109. 873.04 s > Running phase: buildPhase
  110. 873.04 s > +++ command cargo --version
  111. 873.04 s > cargo 1.97.0 (c980f4866 2026-06-30)
  112. 873.04 s > +++ command cargo test --profile ci-optim --no-run --offline -p gammaloop-integration-tests --features gammaloop-integration-tests/python-api-tests
  113. 873.04 s > Compiling gammaloop-integration-tests v0.1.0 (/build/source/tests)
  114. 873.04 s > error[E0560]: struct `CutInfo` has no field named `lmb_channel_id`
  115. 873.04 s > --> tests/tests/test_differential.rs:86:13
  116. 873.04 s > |
  117. 873.04 s > 86 | lmb_channel_id: None,
  118. 873.04 s > | ^^^^^^^^^^^^^^ `CutInfo` does not have this field
  119. 873.04 s > |
  120. 873.04 s > = note: available fields are: `sampling_channel_id`, `sampling_channel_edge_ids`
  121. 873.04 s >
  122. 873.04 s > error[E0560]: struct `CutInfo` has no field named `lmb_channel_edge_ids`
  123. 873.04 s > --> tests/tests/test_differential.rs:87:13
  124. 873.04 s > |
  125. 873.04 s > 87 | lmb_channel_edge_ids: None,
  126. 873.04 s > | ^^^^^^^^^^^^^^^^^^^^ `CutInfo` does not have this field
  127. 873.04 s > |
  128. 873.04 s > = note: available fields are: `sampling_channel_id`, `sampling_channel_edge_ids`
  129. 873.04 s >
  130. 873.04 s > error[E0063]: missing field `reference_moments` in initializer of `GraphEvaluationResult<_>`
  131. 873.04 s > --> tests/tests/test_differential.rs:532:19
  132. 873.04 s > |
  133. 873.04 s > 532 | let mut lhs = GraphEvaluationResult {
  134. 873.04 s > | ^^^^^^^^^^^^^^^^^^^^^ missing `reference_moments`
  135. 873.04 s >
  136. 873.04 s > error[E0063]: missing field `reference_moments` in initializer of `GraphEvaluationResult<_>`
  137. 873.04 s > --> tests/tests/test_differential.rs:539:15
  138. 873.04 s > |
  139. 873.04 s > 539 | let rhs = GraphEvaluationResult {
  140. 873.04 s > | ^^^^^^^^^^^^^^^^^^^^^ missing `reference_moments`
  141. 873.04 s >
  142. 873.04 s > Some errors have detailed explanations: E0063, E0560.
  143. 873.04 s > For more information about an error, try `rustc --explain E0063`.
  144. 873.04 s > error: could not compile `gammaloop-integration-tests` (test "test_differential") due to 4 previous errors
  145. 873.04 s > warning: build failed, waiting for other jobs to finish...
  146. 873.04 s > error[E0609]: no field `lmb_channel_id` on type `CutInfo`
  147. 873.04 s > --> tests/tests/test_runs/utils.rs:568:36
  148. 873.04 s > |
  149. 873.04 s > 568 | event.cut_info.lmb_channel_id,
  150. 873.04 s > | ^^^^^^^^^^^^^^ unknown field
  151. 873.04 s > |
  152. 873.04 s > = note: available fields are: `particle_pdgs`, `cut_id`, `graph_id`, `graph_group_id`, `orientation_id` ... and 2 others
  153. 873.04 s >
  154. 873.04 s > error[E0609]: no field `lmb_channel_id` on type `CutInfo`
  155. 873.04 s > --> tests/tests/test_runs/utils.rs:580:36
  156. 873.04 s > |
  157. 873.04 s > 580 | event.cut_info.lmb_channel_id,
  158. 873.04 s > | ^^^^^^^^^^^^^^ unknown field
  159. 873.04 s > |
  160. 873.04 s > = note: available fields are: `particle_pdgs`, `cut_id`, `graph_id`, `graph_group_id`, `orientation_id` ... and 2 others
  161. 873.04 s >
  162. 873.04 s > For more information about this error, try `rustc --explain E0609`.
  163. 873.04 s > error: could not compile `gammaloop-integration-tests` (test "test_runs") due to 2 previous errors
  164. 873.04 s For full logs, run:
  165. 873.04 s nix log /nix/store/9gqz2qklpvbkmqyxpxlldnnjgjw6m19h-gammaloop-crate-test-binaries-gammaloop-integration-tests-d6e55b48f8214f9c-deps-0.1.0.drv
  166. 873.04 s error: Cannot build '/nix/store/crf1awdjhpk94g1i2s18y6v8qqxq50m4-nix-ci-artifact-barrier-crate-test-binaries-python-api-gammaloop-integration-tests.drv'.
  167. 873.04 s Reason: 1 dependency failed.
  168. 873.04 s Output paths:
  169. 873.04 s /nix/store/82kfala1gnhakn0sd4ykgr2hqg645wd7-nix-ci-artifact-barrier-crate-test-binaries-python-api-gammaloop-integration-tests
  170. 873.05 s Build failed due to failed dependency
  171. 873.24 s Build failed.