0.00 s
$ /nix/store/9ypz3flqsrl5xl495mm8h645gadjsxi1-coreutils-9.11/bin/timeout --kill-after=15s 7200s /nix/store/23zk8sgzamrbmj1fday15szf7f2279s8-nix-2.34.7/bin/nix --extra-experimental-features nix-command --extra-experimental-features flakes --log-format internal-json build --no-link --print-out-paths git+https://github.com/alphal00p/gammaloop?ref=advanced_sampling&rev=882f80eb025a2aa807219cff35cbd70349e28440&shallow=1#packages.x86_64-linux.crate-test-binaries-python-api-gammaloop-integration-tests --print-build-logs
15.61 s
16.26 s
Downloading cached gammaloop-python-module from https://cache.nix-ci.com
16.26 s
Downloading cached gammaloop-crate-test-dependencies-d6e55b48f8214f9c-inputs from https://cache.nix-ci.com
17.97 s
Downloaded cached gammaloop-python-module (147.3 MiB) in 1.7s
17.97 s
Progress: 0 of 4 built, 1 of 4 downloaded from cache (1 downloading)
42.47 s
Downloaded cached gammaloop-crate-test-dependencies-d6e55b48f8214f9c-inputs (3.1 GiB) in 26.2s
42.47 s
Progress: 0 of 3 built, 2 of 4 downloaded from cache
42.47 s
Downloading cached gammaloop-crate-test-dependencies-d6e55b48f8214f9c-deps from https://cache.nix-ci.com
42.78 s
Downloaded cached gammaloop-crate-test-dependencies-d6e55b48f8214f9c-deps (30 MiB) in 310ms
42.78 s
Progress: 0 of 3 built, 3 of 4 downloaded from cache
42.78 s
Downloading cached gammaloop-crate-test-binaries-gammaloop-integration-tests-d6e55b48f8214f9c-inputs from https://cache.nix-ci.com
74.78 s
Downloaded cached gammaloop-crate-test-binaries-gammaloop-integration-tests-d6e55b48f8214f9c-inputs (3.2 GiB) in 32.0s
74.78 s
Progress: 0 of 3 built, 4 of 4 downloaded from cache
74.94 s
Building /nix/store/9gqz2qklpvbkmqyxpxlldnnjgjw6m19h-gammaloop-crate-test-binaries-gammaloop-integration-tests-d6e55b48f8214f9c-deps-0.1.0.drv
75.02 s
[gammaloop-crate-test-binaries-gammaloop-integration-tests-d6e55b48f8214f9c-deps] Phase: unpackPhase
75.02 s
[gammaloop-crate-test-binaries-gammaloop-integration-tests-d6e55b48f8214f9c-deps] unpacking source archive /nix/store/psvx16ar2vc9znc7wxbw3d2kjs3lpq85-source
75.09 s
[gammaloop-crate-test-binaries-gammaloop-integration-tests-d6e55b48f8214f9c-deps] source root is source
75.11 s
[gammaloop-crate-test-binaries-gammaloop-integration-tests-d6e55b48f8214f9c-deps] Phase: patchPhase
75.20 s
[gammaloop-crate-test-binaries-gammaloop-integration-tests-d6e55b48f8214f9c-deps] Executing configureCargoCommonVars
75.20 s
[gammaloop-crate-test-binaries-gammaloop-integration-tests-d6e55b48f8214f9c-deps] copying cargo artifacts from /nix/store/lbq8625kkpxw489cfdbm9v7l3acvl202-gammaloop-crate-test-binaries-gammaloop-integration-tests-d6e55b48f8214f9c-inputs/target to target
75.20 s
[gammaloop-crate-test-binaries-gammaloop-integration-tests-d6e55b48f8214f9c-deps] will deep copy artifacts (instead of symlinking) as requested
77.79 s
[gammaloop-crate-test-binaries-gammaloop-integration-tests-d6e55b48f8214f9c-deps] Phase: updateAutotoolsGnuConfigScriptsPhase
77.89 s
[gammaloop-crate-test-binaries-gammaloop-integration-tests-d6e55b48f8214f9c-deps] Phase: configurePhase
78.78 s
[gammaloop-crate-test-binaries-gammaloop-integration-tests-d6e55b48f8214f9c-deps] will append /build/source/.cargo-home/config.toml with contents of /nix/store/5drf77x6km4ky7gwlrzdx9bbd6fz09g3-vendor-cargo-deps/config.toml
78.80 s
[gammaloop-crate-test-binaries-gammaloop-integration-tests-d6e55b48f8214f9c-deps] default configurePhase, nothing to do
78.81 s
[gammaloop-crate-test-binaries-gammaloop-integration-tests-d6e55b48f8214f9c-deps] Phase: buildPhase
78.83 s
[gammaloop-crate-test-binaries-gammaloop-integration-tests-d6e55b48f8214f9c-deps] +++ command cargo --version
78.84 s
[gammaloop-crate-test-binaries-gammaloop-integration-tests-d6e55b48f8214f9c-deps] cargo 1.97.0 (c980f4866 2026-06-30)
78.84 s
[gammaloop-crate-test-binaries-gammaloop-integration-tests-d6e55b48f8214f9c-deps] +++ command cargo test --profile ci-optim --no-run --offline -p gammaloop-integration-tests --features gammaloop-integration-tests/python-api-tests
80.06 s
[gammaloop-crate-test-binaries-gammaloop-integration-tests-d6e55b48f8214f9c-deps] Compiling gammaloop-integration-tests v0.1.0 (/build/source/tests)
80.18 s
[gammaloop-crate-test-binaries-gammaloop-integration-tests-d6e55b48f8214f9c-deps] error[E0560] : struct `CutInfo` has no field named `lmb_channel_id`
80.18 s
[gammaloop-crate-test-binaries-gammaloop-integration-tests-d6e55b48f8214f9c-deps] --> tests/tests/test_differential.rs:86:13
80.18 s
[gammaloop-crate-test-binaries-gammaloop-integration-tests-d6e55b48f8214f9c-deps] |
80.18 s
[gammaloop-crate-test-binaries-gammaloop-integration-tests-d6e55b48f8214f9c-deps] 86 | lmb_channel_id: None,
80.18 s
[gammaloop-crate-test-binaries-gammaloop-integration-tests-d6e55b48f8214f9c-deps] | ^^^^^^^^^^^^^^ `CutInfo` does not have this field
80.18 s
[gammaloop-crate-test-binaries-gammaloop-integration-tests-d6e55b48f8214f9c-deps] |
80.18 s
[gammaloop-crate-test-binaries-gammaloop-integration-tests-d6e55b48f8214f9c-deps] = note : available fields are: `sampling_channel_id`, `sampling_channel_edge_ids`
80.18 s
[gammaloop-crate-test-binaries-gammaloop-integration-tests-d6e55b48f8214f9c-deps]
80.18 s
[gammaloop-crate-test-binaries-gammaloop-integration-tests-d6e55b48f8214f9c-deps] error[E0560] : struct `CutInfo` has no field named `lmb_channel_edge_ids`
80.18 s
[gammaloop-crate-test-binaries-gammaloop-integration-tests-d6e55b48f8214f9c-deps] --> tests/tests/test_differential.rs:87:13
80.18 s
[gammaloop-crate-test-binaries-gammaloop-integration-tests-d6e55b48f8214f9c-deps] |
80.18 s
[gammaloop-crate-test-binaries-gammaloop-integration-tests-d6e55b48f8214f9c-deps] 87 | lmb_channel_edge_ids: None,
80.18 s
[gammaloop-crate-test-binaries-gammaloop-integration-tests-d6e55b48f8214f9c-deps] | ^^^^^^^^^^^^^^^^^^^^ `CutInfo` does not have this field
80.18 s
[gammaloop-crate-test-binaries-gammaloop-integration-tests-d6e55b48f8214f9c-deps] |
80.18 s
[gammaloop-crate-test-binaries-gammaloop-integration-tests-d6e55b48f8214f9c-deps] = note : available fields are: `sampling_channel_id`, `sampling_channel_edge_ids`
80.18 s
[gammaloop-crate-test-binaries-gammaloop-integration-tests-d6e55b48f8214f9c-deps]
80.20 s
[gammaloop-crate-test-binaries-gammaloop-integration-tests-d6e55b48f8214f9c-deps] error[E0063] : missing field `reference_moments` in initializer of `GraphEvaluationResult<_>`
80.20 s
[gammaloop-crate-test-binaries-gammaloop-integration-tests-d6e55b48f8214f9c-deps] --> tests/tests/test_differential.rs:532:19
80.20 s
[gammaloop-crate-test-binaries-gammaloop-integration-tests-d6e55b48f8214f9c-deps] |
80.20 s
[gammaloop-crate-test-binaries-gammaloop-integration-tests-d6e55b48f8214f9c-deps] 532 | let mut lhs = GraphEvaluationResult {
80.20 s
[gammaloop-crate-test-binaries-gammaloop-integration-tests-d6e55b48f8214f9c-deps] | ^^^^^^^^^^^^^^^^^^^^^ missing `reference_moments`
80.20 s
[gammaloop-crate-test-binaries-gammaloop-integration-tests-d6e55b48f8214f9c-deps]
80.20 s
[gammaloop-crate-test-binaries-gammaloop-integration-tests-d6e55b48f8214f9c-deps] error[E0063] : missing field `reference_moments` in initializer of `GraphEvaluationResult<_>`
80.20 s
[gammaloop-crate-test-binaries-gammaloop-integration-tests-d6e55b48f8214f9c-deps] --> tests/tests/test_differential.rs:539:15
80.20 s
[gammaloop-crate-test-binaries-gammaloop-integration-tests-d6e55b48f8214f9c-deps] |
80.20 s
[gammaloop-crate-test-binaries-gammaloop-integration-tests-d6e55b48f8214f9c-deps] 539 | let rhs = GraphEvaluationResult {
80.20 s
[gammaloop-crate-test-binaries-gammaloop-integration-tests-d6e55b48f8214f9c-deps] | ^^^^^^^^^^^^^^^^^^^^^ missing `reference_moments`
80.20 s
[gammaloop-crate-test-binaries-gammaloop-integration-tests-d6e55b48f8214f9c-deps]
80.38 s
[gammaloop-crate-test-binaries-gammaloop-integration-tests-d6e55b48f8214f9c-deps] Some errors have detailed explanations: E0063, E0560.
80.38 s
[gammaloop-crate-test-binaries-gammaloop-integration-tests-d6e55b48f8214f9c-deps] For more information about an error, try `rustc --explain E0063`.
80.39 s
[gammaloop-crate-test-binaries-gammaloop-integration-tests-d6e55b48f8214f9c-deps] error : could not compile `gammaloop-integration-tests` (test "test_differential") due to 4 previous errors
80.39 s
[gammaloop-crate-test-binaries-gammaloop-integration-tests-d6e55b48f8214f9c-deps] warning : build failed, waiting for other jobs to finish...
83.25 s
[gammaloop-crate-test-binaries-gammaloop-integration-tests-d6e55b48f8214f9c-deps] error[E0609] : no field `lmb_channel_id` on type `CutInfo`
83.25 s
[gammaloop-crate-test-binaries-gammaloop-integration-tests-d6e55b48f8214f9c-deps] --> tests/tests/test_runs/utils.rs:568:36
83.25 s
[gammaloop-crate-test-binaries-gammaloop-integration-tests-d6e55b48f8214f9c-deps] |
83.25 s
[gammaloop-crate-test-binaries-gammaloop-integration-tests-d6e55b48f8214f9c-deps] 568 | event.cut_info.lmb_channel_id,
83.25 s
[gammaloop-crate-test-binaries-gammaloop-integration-tests-d6e55b48f8214f9c-deps] | ^^^^^^^^^^^^^^ unknown field
83.25 s
[gammaloop-crate-test-binaries-gammaloop-integration-tests-d6e55b48f8214f9c-deps] |
83.25 s
[gammaloop-crate-test-binaries-gammaloop-integration-tests-d6e55b48f8214f9c-deps] = note : available fields are: `particle_pdgs`, `cut_id`, `graph_id`, `graph_group_id`, `orientation_id` ... and 2 others
83.25 s
[gammaloop-crate-test-binaries-gammaloop-integration-tests-d6e55b48f8214f9c-deps]
83.25 s
[gammaloop-crate-test-binaries-gammaloop-integration-tests-d6e55b48f8214f9c-deps] error[E0609] : no field `lmb_channel_id` on type `CutInfo`
83.25 s
[gammaloop-crate-test-binaries-gammaloop-integration-tests-d6e55b48f8214f9c-deps] --> tests/tests/test_runs/utils.rs:580:36
83.25 s
[gammaloop-crate-test-binaries-gammaloop-integration-tests-d6e55b48f8214f9c-deps] |
83.25 s
[gammaloop-crate-test-binaries-gammaloop-integration-tests-d6e55b48f8214f9c-deps] 580 | event.cut_info.lmb_channel_id,
83.25 s
[gammaloop-crate-test-binaries-gammaloop-integration-tests-d6e55b48f8214f9c-deps] | ^^^^^^^^^^^^^^ unknown field
83.25 s
[gammaloop-crate-test-binaries-gammaloop-integration-tests-d6e55b48f8214f9c-deps] |
83.25 s
[gammaloop-crate-test-binaries-gammaloop-integration-tests-d6e55b48f8214f9c-deps] = note : available fields are: `particle_pdgs`, `cut_id`, `graph_id`, `graph_group_id`, `orientation_id` ... and 2 others
83.25 s
[gammaloop-crate-test-binaries-gammaloop-integration-tests-d6e55b48f8214f9c-deps]
85.22 s
[gammaloop-crate-test-binaries-gammaloop-integration-tests-d6e55b48f8214f9c-deps] For more information about this error, try `rustc --explain E0609`.
85.27 s
[gammaloop-crate-test-binaries-gammaloop-integration-tests-d6e55b48f8214f9c-deps] error : could not compile `gammaloop-integration-tests` (test "test_runs") due to 2 previous errors
203.44 s
Progress: 0 of 2 built (1 failed), 4 of 4 downloaded from cache
203.44 s
Failed to build gammaloop-crate-test-binaries-gammaloop-integration-tests-d6e55b48f8214f9c-deps after 2m08s
203.44 s
error: Cannot build '/nix/store/9gqz2qklpvbkmqyxpxlldnnjgjw6m19h-gammaloop-crate-test-binaries-gammaloop-integration-tests-d6e55b48f8214f9c-deps-0.1.0.drv '.
203.44 s
Reason: builder failed with exit code 101 .
203.44 s
Output paths:
203.44 s
/nix/store/65h8vs44a15wq075p7ng0zxbkvs81sd3-gammaloop-crate-test-binaries-gammaloop-integration-tests-d6e55b48f8214f9c-deps-0.1.0
203.44 s
Last 66 log lines:
203.44 s
> Running phase: unpackPhase
203.44 s
> unpacking source archive /nix/store/psvx16ar2vc9znc7wxbw3d2kjs3lpq85-source
203.44 s
> source root is source
203.44 s
> Running phase: patchPhase
203.44 s
> Executing configureCargoCommonVars
203.44 s
> copying cargo artifacts from /nix/store/lbq8625kkpxw489cfdbm9v7l3acvl202-gammaloop-crate-test-binaries-gammaloop-integration-tests-d6e55b48f8214f9c-inputs/target to target
203.44 s
> will deep copy artifacts (instead of symlinking) as requested
203.44 s
> Running phase: updateAutotoolsGnuConfigScriptsPhase
203.44 s
> Running phase: configurePhase
203.44 s
> will append /build/source/.cargo-home/config.toml with contents of /nix/store/5drf77x6km4ky7gwlrzdx9bbd6fz09g3-vendor-cargo-deps/config.toml
203.44 s
> default configurePhase, nothing to do
203.44 s
> Running phase: buildPhase
203.44 s
> +++ command cargo --version
203.44 s
> cargo 1.97.0 (c980f4866 2026-06-30)
203.44 s
> +++ command cargo test --profile ci-optim --no-run --offline -p gammaloop-integration-tests --features gammaloop-integration-tests/python-api-tests
203.44 s
> Compiling gammaloop-integration-tests v0.1.0 (/build/source/tests)
203.44 s
> error[E0560] : struct `CutInfo` has no field named `lmb_channel_id`
203.44 s
> --> tests/tests/test_differential.rs:86:13
203.44 s
> |
203.44 s
> 86 | lmb_channel_id: None,
203.44 s
> | ^^^^^^^^^^^^^^ `CutInfo` does not have this field
203.44 s
> |
203.44 s
> = note : available fields are: `sampling_channel_id`, `sampling_channel_edge_ids`
203.44 s
>
203.44 s
> error[E0560] : struct `CutInfo` has no field named `lmb_channel_edge_ids`
203.44 s
> --> tests/tests/test_differential.rs:87:13
203.44 s
> |
203.44 s
> 87 | lmb_channel_edge_ids: None,
203.44 s
> | ^^^^^^^^^^^^^^^^^^^^ `CutInfo` does not have this field
203.44 s
> |
203.44 s
> = note : available fields are: `sampling_channel_id`, `sampling_channel_edge_ids`
203.44 s
>
203.44 s
> error[E0063] : missing field `reference_moments` in initializer of `GraphEvaluationResult<_>`
203.44 s
> --> tests/tests/test_differential.rs:532:19
203.44 s
> |
203.44 s
> 532 | let mut lhs = GraphEvaluationResult {
203.44 s
> | ^^^^^^^^^^^^^^^^^^^^^ missing `reference_moments`
203.44 s
>
203.44 s
> error[E0063] : missing field `reference_moments` in initializer of `GraphEvaluationResult<_>`
203.44 s
> --> tests/tests/test_differential.rs:539:15
203.44 s
> |
203.44 s
> 539 | let rhs = GraphEvaluationResult {
203.44 s
> | ^^^^^^^^^^^^^^^^^^^^^ missing `reference_moments`
203.44 s
>
203.44 s
> Some errors have detailed explanations: E0063, E0560.
203.44 s
> For more information about an error, try `rustc --explain E0063`.
203.44 s
> error : could not compile `gammaloop-integration-tests` (test "test_differential") due to 4 previous errors
203.44 s
> warning : build failed, waiting for other jobs to finish...
203.44 s
> error[E0609] : no field `lmb_channel_id` on type `CutInfo`
203.44 s
> --> tests/tests/test_runs/utils.rs:568:36
203.44 s
> |
203.44 s
> 568 | event.cut_info.lmb_channel_id,
203.44 s
> | ^^^^^^^^^^^^^^ unknown field
203.44 s
> |
203.44 s
> = note : available fields are: `particle_pdgs`, `cut_id`, `graph_id`, `graph_group_id`, `orientation_id` ... and 2 others
203.44 s
>
203.44 s
> error[E0609] : no field `lmb_channel_id` on type `CutInfo`
203.44 s
> --> tests/tests/test_runs/utils.rs:580:36
203.44 s
> |
203.44 s
> 580 | event.cut_info.lmb_channel_id,
203.44 s
> | ^^^^^^^^^^^^^^ unknown field
203.44 s
> |
203.44 s
> = note : available fields are: `particle_pdgs`, `cut_id`, `graph_id`, `graph_group_id`, `orientation_id` ... and 2 others
203.44 s
>
203.44 s
> For more information about this error, try `rustc --explain E0609`.
203.44 s
> error : could not compile `gammaloop-integration-tests` (test "test_runs") due to 2 previous errors
203.44 s
For full logs, run:
203.44 s
nix log /nix/store/9gqz2qklpvbkmqyxpxlldnnjgjw6m19h-gammaloop-crate-test-binaries-gammaloop-integration-tests-d6e55b48f8214f9c-deps-0.1.0.drv
203.44 s
error: Cannot build '/nix/store/crf1awdjhpk94g1i2s18y6v8qqxq50m4-nix-ci-artifact-barrier-crate-test-binaries-python-api-gammaloop-integration-tests.drv '.
203.44 s
Reason: 1 dependency failed .
203.44 s
Output paths:
203.44 s
/nix/store/82kfala1gnhakn0sd4ykgr2hqg645wd7-nix-ci-artifact-barrier-crate-test-binaries-python-api-gammaloop-integration-tests
203.45 s
Build failed due to failed dependency
203.57 s
Build failed.