build packages.x86_64-linux.crate-test-binaries-python-api-gammaloop-integration-tests

Reproduce this run
Original Run
  1. 0.00 s $ /nix/store/9ypz3flqsrl5xl495mm8h645gadjsxi1-coreutils-9.11/bin/timeout --kill-after=15s 7200s /nix/store/23zk8sgzamrbmj1fday15szf7f2279s8-nix-2.34.7/bin/nix --extra-experimental-features nix-command --extra-experimental-features flakes --log-format internal-json build --no-link --print-out-paths git+https://github.com/alphal00p/gammaloop?ref=advanced_sampling&rev=882f80eb025a2aa807219cff35cbd70349e28440&shallow=1#packages.x86_64-linux.crate-test-binaries-python-api-gammaloop-integration-tests --print-build-logs
  2. 15.61 s
  3. 16.26 s Downloading cached gammaloop-python-module from https://cache.nix-ci.com
  4. 16.26 s Downloading cached gammaloop-crate-test-dependencies-d6e55b48f8214f9c-inputs from https://cache.nix-ci.com
  5. 17.97 s Downloaded cached gammaloop-python-module (147.3 MiB) in 1.7s
  6. 17.97 s Progress: 0 of 4 built, 1 of 4 downloaded from cache (1 downloading)
  7. 42.47 s Downloaded cached gammaloop-crate-test-dependencies-d6e55b48f8214f9c-inputs (3.1 GiB) in 26.2s
  8. 42.47 s Progress: 0 of 3 built, 2 of 4 downloaded from cache
  9. 42.47 s Downloading cached gammaloop-crate-test-dependencies-d6e55b48f8214f9c-deps from https://cache.nix-ci.com
  10. 42.78 s Downloaded cached gammaloop-crate-test-dependencies-d6e55b48f8214f9c-deps (30 MiB) in 310ms
  11. 42.78 s Progress: 0 of 3 built, 3 of 4 downloaded from cache
  12. 42.78 s Downloading cached gammaloop-crate-test-binaries-gammaloop-integration-tests-d6e55b48f8214f9c-inputs from https://cache.nix-ci.com
  13. 74.78 s Downloaded cached gammaloop-crate-test-binaries-gammaloop-integration-tests-d6e55b48f8214f9c-inputs (3.2 GiB) in 32.0s
  14. 74.78 s Progress: 0 of 3 built, 4 of 4 downloaded from cache
  15. 74.94 s Building /nix/store/9gqz2qklpvbkmqyxpxlldnnjgjw6m19h-gammaloop-crate-test-binaries-gammaloop-integration-tests-d6e55b48f8214f9c-deps-0.1.0.drv
  16. 75.02 s [gammaloop-crate-test-binaries-gammaloop-integration-tests-d6e55b48f8214f9c-deps] Phase: unpackPhase
  17. 75.02 s [gammaloop-crate-test-binaries-gammaloop-integration-tests-d6e55b48f8214f9c-deps] unpacking source archive /nix/store/psvx16ar2vc9znc7wxbw3d2kjs3lpq85-source
  18. 75.09 s [gammaloop-crate-test-binaries-gammaloop-integration-tests-d6e55b48f8214f9c-deps] source root is source
  19. 75.11 s [gammaloop-crate-test-binaries-gammaloop-integration-tests-d6e55b48f8214f9c-deps] Phase: patchPhase
  20. 75.20 s [gammaloop-crate-test-binaries-gammaloop-integration-tests-d6e55b48f8214f9c-deps] Executing configureCargoCommonVars
  21. 75.20 s [gammaloop-crate-test-binaries-gammaloop-integration-tests-d6e55b48f8214f9c-deps] copying cargo artifacts from /nix/store/lbq8625kkpxw489cfdbm9v7l3acvl202-gammaloop-crate-test-binaries-gammaloop-integration-tests-d6e55b48f8214f9c-inputs/target to target
  22. 75.20 s [gammaloop-crate-test-binaries-gammaloop-integration-tests-d6e55b48f8214f9c-deps] will deep copy artifacts (instead of symlinking) as requested
  23. 77.79 s [gammaloop-crate-test-binaries-gammaloop-integration-tests-d6e55b48f8214f9c-deps] Phase: updateAutotoolsGnuConfigScriptsPhase
  24. 77.89 s [gammaloop-crate-test-binaries-gammaloop-integration-tests-d6e55b48f8214f9c-deps] Phase: configurePhase
  25. 78.78 s [gammaloop-crate-test-binaries-gammaloop-integration-tests-d6e55b48f8214f9c-deps] will append /build/source/.cargo-home/config.toml with contents of /nix/store/5drf77x6km4ky7gwlrzdx9bbd6fz09g3-vendor-cargo-deps/config.toml
  26. 78.80 s [gammaloop-crate-test-binaries-gammaloop-integration-tests-d6e55b48f8214f9c-deps] default configurePhase, nothing to do
  27. 78.81 s [gammaloop-crate-test-binaries-gammaloop-integration-tests-d6e55b48f8214f9c-deps] Phase: buildPhase
  28. 78.83 s [gammaloop-crate-test-binaries-gammaloop-integration-tests-d6e55b48f8214f9c-deps] +++ command cargo --version
  29. 78.84 s [gammaloop-crate-test-binaries-gammaloop-integration-tests-d6e55b48f8214f9c-deps] cargo 1.97.0 (c980f4866 2026-06-30)
  30. 78.84 s [gammaloop-crate-test-binaries-gammaloop-integration-tests-d6e55b48f8214f9c-deps] +++ command cargo test --profile ci-optim --no-run --offline -p gammaloop-integration-tests --features gammaloop-integration-tests/python-api-tests
  31. 80.06 s [gammaloop-crate-test-binaries-gammaloop-integration-tests-d6e55b48f8214f9c-deps] Compiling gammaloop-integration-tests v0.1.0 (/build/source/tests)
  32. 80.18 s [gammaloop-crate-test-binaries-gammaloop-integration-tests-d6e55b48f8214f9c-deps] error[E0560]: struct `CutInfo` has no field named `lmb_channel_id`
  33. 80.18 s [gammaloop-crate-test-binaries-gammaloop-integration-tests-d6e55b48f8214f9c-deps] --> tests/tests/test_differential.rs:86:13
  34. 80.18 s [gammaloop-crate-test-binaries-gammaloop-integration-tests-d6e55b48f8214f9c-deps] |
  35. 80.18 s [gammaloop-crate-test-binaries-gammaloop-integration-tests-d6e55b48f8214f9c-deps] 86 | lmb_channel_id: None,
  36. 80.18 s [gammaloop-crate-test-binaries-gammaloop-integration-tests-d6e55b48f8214f9c-deps] | ^^^^^^^^^^^^^^ `CutInfo` does not have this field
  37. 80.18 s [gammaloop-crate-test-binaries-gammaloop-integration-tests-d6e55b48f8214f9c-deps] |
  38. 80.18 s [gammaloop-crate-test-binaries-gammaloop-integration-tests-d6e55b48f8214f9c-deps] = note: available fields are: `sampling_channel_id`, `sampling_channel_edge_ids`
  39. 80.18 s [gammaloop-crate-test-binaries-gammaloop-integration-tests-d6e55b48f8214f9c-deps]
  40. 80.18 s [gammaloop-crate-test-binaries-gammaloop-integration-tests-d6e55b48f8214f9c-deps] error[E0560]: struct `CutInfo` has no field named `lmb_channel_edge_ids`
  41. 80.18 s [gammaloop-crate-test-binaries-gammaloop-integration-tests-d6e55b48f8214f9c-deps] --> tests/tests/test_differential.rs:87:13
  42. 80.18 s [gammaloop-crate-test-binaries-gammaloop-integration-tests-d6e55b48f8214f9c-deps] |
  43. 80.18 s [gammaloop-crate-test-binaries-gammaloop-integration-tests-d6e55b48f8214f9c-deps] 87 | lmb_channel_edge_ids: None,
  44. 80.18 s [gammaloop-crate-test-binaries-gammaloop-integration-tests-d6e55b48f8214f9c-deps] | ^^^^^^^^^^^^^^^^^^^^ `CutInfo` does not have this field
  45. 80.18 s [gammaloop-crate-test-binaries-gammaloop-integration-tests-d6e55b48f8214f9c-deps] |
  46. 80.18 s [gammaloop-crate-test-binaries-gammaloop-integration-tests-d6e55b48f8214f9c-deps] = note: available fields are: `sampling_channel_id`, `sampling_channel_edge_ids`
  47. 80.18 s [gammaloop-crate-test-binaries-gammaloop-integration-tests-d6e55b48f8214f9c-deps]
  48. 80.20 s [gammaloop-crate-test-binaries-gammaloop-integration-tests-d6e55b48f8214f9c-deps] error[E0063]: missing field `reference_moments` in initializer of `GraphEvaluationResult<_>`
  49. 80.20 s [gammaloop-crate-test-binaries-gammaloop-integration-tests-d6e55b48f8214f9c-deps] --> tests/tests/test_differential.rs:532:19
  50. 80.20 s [gammaloop-crate-test-binaries-gammaloop-integration-tests-d6e55b48f8214f9c-deps] |
  51. 80.20 s [gammaloop-crate-test-binaries-gammaloop-integration-tests-d6e55b48f8214f9c-deps] 532 | let mut lhs = GraphEvaluationResult {
  52. 80.20 s [gammaloop-crate-test-binaries-gammaloop-integration-tests-d6e55b48f8214f9c-deps] | ^^^^^^^^^^^^^^^^^^^^^ missing `reference_moments`
  53. 80.20 s [gammaloop-crate-test-binaries-gammaloop-integration-tests-d6e55b48f8214f9c-deps]
  54. 80.20 s [gammaloop-crate-test-binaries-gammaloop-integration-tests-d6e55b48f8214f9c-deps] error[E0063]: missing field `reference_moments` in initializer of `GraphEvaluationResult<_>`
  55. 80.20 s [gammaloop-crate-test-binaries-gammaloop-integration-tests-d6e55b48f8214f9c-deps] --> tests/tests/test_differential.rs:539:15
  56. 80.20 s [gammaloop-crate-test-binaries-gammaloop-integration-tests-d6e55b48f8214f9c-deps] |
  57. 80.20 s [gammaloop-crate-test-binaries-gammaloop-integration-tests-d6e55b48f8214f9c-deps] 539 | let rhs = GraphEvaluationResult {
  58. 80.20 s [gammaloop-crate-test-binaries-gammaloop-integration-tests-d6e55b48f8214f9c-deps] | ^^^^^^^^^^^^^^^^^^^^^ missing `reference_moments`
  59. 80.20 s [gammaloop-crate-test-binaries-gammaloop-integration-tests-d6e55b48f8214f9c-deps]
  60. 80.38 s [gammaloop-crate-test-binaries-gammaloop-integration-tests-d6e55b48f8214f9c-deps] Some errors have detailed explanations: E0063, E0560.
  61. 80.38 s [gammaloop-crate-test-binaries-gammaloop-integration-tests-d6e55b48f8214f9c-deps] For more information about an error, try `rustc --explain E0063`.
  62. 80.39 s [gammaloop-crate-test-binaries-gammaloop-integration-tests-d6e55b48f8214f9c-deps] error: could not compile `gammaloop-integration-tests` (test "test_differential") due to 4 previous errors
  63. 80.39 s [gammaloop-crate-test-binaries-gammaloop-integration-tests-d6e55b48f8214f9c-deps] warning: build failed, waiting for other jobs to finish...
  64. 83.25 s [gammaloop-crate-test-binaries-gammaloop-integration-tests-d6e55b48f8214f9c-deps] error[E0609]: no field `lmb_channel_id` on type `CutInfo`
  65. 83.25 s [gammaloop-crate-test-binaries-gammaloop-integration-tests-d6e55b48f8214f9c-deps] --> tests/tests/test_runs/utils.rs:568:36
  66. 83.25 s [gammaloop-crate-test-binaries-gammaloop-integration-tests-d6e55b48f8214f9c-deps] |
  67. 83.25 s [gammaloop-crate-test-binaries-gammaloop-integration-tests-d6e55b48f8214f9c-deps] 568 | event.cut_info.lmb_channel_id,
  68. 83.25 s [gammaloop-crate-test-binaries-gammaloop-integration-tests-d6e55b48f8214f9c-deps] | ^^^^^^^^^^^^^^ unknown field
  69. 83.25 s [gammaloop-crate-test-binaries-gammaloop-integration-tests-d6e55b48f8214f9c-deps] |
  70. 83.25 s [gammaloop-crate-test-binaries-gammaloop-integration-tests-d6e55b48f8214f9c-deps] = note: available fields are: `particle_pdgs`, `cut_id`, `graph_id`, `graph_group_id`, `orientation_id` ... and 2 others
  71. 83.25 s [gammaloop-crate-test-binaries-gammaloop-integration-tests-d6e55b48f8214f9c-deps]
  72. 83.25 s [gammaloop-crate-test-binaries-gammaloop-integration-tests-d6e55b48f8214f9c-deps] error[E0609]: no field `lmb_channel_id` on type `CutInfo`
  73. 83.25 s [gammaloop-crate-test-binaries-gammaloop-integration-tests-d6e55b48f8214f9c-deps] --> tests/tests/test_runs/utils.rs:580:36
  74. 83.25 s [gammaloop-crate-test-binaries-gammaloop-integration-tests-d6e55b48f8214f9c-deps] |
  75. 83.25 s [gammaloop-crate-test-binaries-gammaloop-integration-tests-d6e55b48f8214f9c-deps] 580 | event.cut_info.lmb_channel_id,
  76. 83.25 s [gammaloop-crate-test-binaries-gammaloop-integration-tests-d6e55b48f8214f9c-deps] | ^^^^^^^^^^^^^^ unknown field
  77. 83.25 s [gammaloop-crate-test-binaries-gammaloop-integration-tests-d6e55b48f8214f9c-deps] |
  78. 83.25 s [gammaloop-crate-test-binaries-gammaloop-integration-tests-d6e55b48f8214f9c-deps] = note: available fields are: `particle_pdgs`, `cut_id`, `graph_id`, `graph_group_id`, `orientation_id` ... and 2 others
  79. 83.25 s [gammaloop-crate-test-binaries-gammaloop-integration-tests-d6e55b48f8214f9c-deps]
  80. 85.22 s [gammaloop-crate-test-binaries-gammaloop-integration-tests-d6e55b48f8214f9c-deps] For more information about this error, try `rustc --explain E0609`.
  81. 85.27 s [gammaloop-crate-test-binaries-gammaloop-integration-tests-d6e55b48f8214f9c-deps] error: could not compile `gammaloop-integration-tests` (test "test_runs") due to 2 previous errors
  82. 203.44 s Progress: 0 of 2 built (1 failed), 4 of 4 downloaded from cache
  83. 203.44 s Failed to build gammaloop-crate-test-binaries-gammaloop-integration-tests-d6e55b48f8214f9c-deps after 2m08s
  84. 203.44 s error: Cannot build '/nix/store/9gqz2qklpvbkmqyxpxlldnnjgjw6m19h-gammaloop-crate-test-binaries-gammaloop-integration-tests-d6e55b48f8214f9c-deps-0.1.0.drv'.
  85. 203.44 s Reason: builder failed with exit code 101.
  86. 203.44 s Output paths:
  87. 203.44 s /nix/store/65h8vs44a15wq075p7ng0zxbkvs81sd3-gammaloop-crate-test-binaries-gammaloop-integration-tests-d6e55b48f8214f9c-deps-0.1.0
  88. 203.44 s Last 66 log lines:
  89. 203.44 s > Running phase: unpackPhase
  90. 203.44 s > unpacking source archive /nix/store/psvx16ar2vc9znc7wxbw3d2kjs3lpq85-source
  91. 203.44 s > source root is source
  92. 203.44 s > Running phase: patchPhase
  93. 203.44 s > Executing configureCargoCommonVars
  94. 203.44 s > copying cargo artifacts from /nix/store/lbq8625kkpxw489cfdbm9v7l3acvl202-gammaloop-crate-test-binaries-gammaloop-integration-tests-d6e55b48f8214f9c-inputs/target to target
  95. 203.44 s > will deep copy artifacts (instead of symlinking) as requested
  96. 203.44 s > Running phase: updateAutotoolsGnuConfigScriptsPhase
  97. 203.44 s > Running phase: configurePhase
  98. 203.44 s > will append /build/source/.cargo-home/config.toml with contents of /nix/store/5drf77x6km4ky7gwlrzdx9bbd6fz09g3-vendor-cargo-deps/config.toml
  99. 203.44 s > default configurePhase, nothing to do
  100. 203.44 s > Running phase: buildPhase
  101. 203.44 s > +++ command cargo --version
  102. 203.44 s > cargo 1.97.0 (c980f4866 2026-06-30)
  103. 203.44 s > +++ command cargo test --profile ci-optim --no-run --offline -p gammaloop-integration-tests --features gammaloop-integration-tests/python-api-tests
  104. 203.44 s > Compiling gammaloop-integration-tests v0.1.0 (/build/source/tests)
  105. 203.44 s > error[E0560]: struct `CutInfo` has no field named `lmb_channel_id`
  106. 203.44 s > --> tests/tests/test_differential.rs:86:13
  107. 203.44 s > |
  108. 203.44 s > 86 | lmb_channel_id: None,
  109. 203.44 s > | ^^^^^^^^^^^^^^ `CutInfo` does not have this field
  110. 203.44 s > |
  111. 203.44 s > = note: available fields are: `sampling_channel_id`, `sampling_channel_edge_ids`
  112. 203.44 s >
  113. 203.44 s > error[E0560]: struct `CutInfo` has no field named `lmb_channel_edge_ids`
  114. 203.44 s > --> tests/tests/test_differential.rs:87:13
  115. 203.44 s > |
  116. 203.44 s > 87 | lmb_channel_edge_ids: None,
  117. 203.44 s > | ^^^^^^^^^^^^^^^^^^^^ `CutInfo` does not have this field
  118. 203.44 s > |
  119. 203.44 s > = note: available fields are: `sampling_channel_id`, `sampling_channel_edge_ids`
  120. 203.44 s >
  121. 203.44 s > error[E0063]: missing field `reference_moments` in initializer of `GraphEvaluationResult<_>`
  122. 203.44 s > --> tests/tests/test_differential.rs:532:19
  123. 203.44 s > |
  124. 203.44 s > 532 | let mut lhs = GraphEvaluationResult {
  125. 203.44 s > | ^^^^^^^^^^^^^^^^^^^^^ missing `reference_moments`
  126. 203.44 s >
  127. 203.44 s > error[E0063]: missing field `reference_moments` in initializer of `GraphEvaluationResult<_>`
  128. 203.44 s > --> tests/tests/test_differential.rs:539:15
  129. 203.44 s > |
  130. 203.44 s > 539 | let rhs = GraphEvaluationResult {
  131. 203.44 s > | ^^^^^^^^^^^^^^^^^^^^^ missing `reference_moments`
  132. 203.44 s >
  133. 203.44 s > Some errors have detailed explanations: E0063, E0560.
  134. 203.44 s > For more information about an error, try `rustc --explain E0063`.
  135. 203.44 s > error: could not compile `gammaloop-integration-tests` (test "test_differential") due to 4 previous errors
  136. 203.44 s > warning: build failed, waiting for other jobs to finish...
  137. 203.44 s > error[E0609]: no field `lmb_channel_id` on type `CutInfo`
  138. 203.44 s > --> tests/tests/test_runs/utils.rs:568:36
  139. 203.44 s > |
  140. 203.44 s > 568 | event.cut_info.lmb_channel_id,
  141. 203.44 s > | ^^^^^^^^^^^^^^ unknown field
  142. 203.44 s > |
  143. 203.44 s > = note: available fields are: `particle_pdgs`, `cut_id`, `graph_id`, `graph_group_id`, `orientation_id` ... and 2 others
  144. 203.44 s >
  145. 203.44 s > error[E0609]: no field `lmb_channel_id` on type `CutInfo`
  146. 203.44 s > --> tests/tests/test_runs/utils.rs:580:36
  147. 203.44 s > |
  148. 203.44 s > 580 | event.cut_info.lmb_channel_id,
  149. 203.44 s > | ^^^^^^^^^^^^^^ unknown field
  150. 203.44 s > |
  151. 203.44 s > = note: available fields are: `particle_pdgs`, `cut_id`, `graph_id`, `graph_group_id`, `orientation_id` ... and 2 others
  152. 203.44 s >
  153. 203.44 s > For more information about this error, try `rustc --explain E0609`.
  154. 203.44 s > error: could not compile `gammaloop-integration-tests` (test "test_runs") due to 2 previous errors
  155. 203.44 s For full logs, run:
  156. 203.44 s nix log /nix/store/9gqz2qklpvbkmqyxpxlldnnjgjw6m19h-gammaloop-crate-test-binaries-gammaloop-integration-tests-d6e55b48f8214f9c-deps-0.1.0.drv
  157. 203.44 s error: Cannot build '/nix/store/crf1awdjhpk94g1i2s18y6v8qqxq50m4-nix-ci-artifact-barrier-crate-test-binaries-python-api-gammaloop-integration-tests.drv'.
  158. 203.44 s Reason: 1 dependency failed.
  159. 203.44 s Output paths:
  160. 203.44 s /nix/store/82kfala1gnhakn0sd4ykgr2hqg645wd7-nix-ci-artifact-barrier-crate-test-binaries-python-api-gammaloop-integration-tests
  161. 203.45 s Build failed due to failed dependency
  162. 203.57 s Build failed.