build checks.x86_64-linux.gammaloop-check
0.00 s
$ /nix/store/9ypz3flqsrl5xl495mm8h645gadjsxi1-coreutils-9.11/bin/timeout --kill-after=15s 7200s /nix/store/23zk8sgzamrbmj1fday15szf7f2279s8-nix-2.34.7/bin/nix --extra-experimental-features nix-command --extra-experimental-features flakes --log-format internal-json build --no-link --print-out-paths git+https://github.com/alphal00p/gammaloop?ref=advanced_sampling&rev=f89addb17aa58fe7067932d90976b4f2b7c7d41d&shallow=1#checks.x86_64-linux.gammaloop-check --print-build-logs
3.76 s
4.11 s
Building /nix/store/hf02q68sy1ndsdmim1xajah34f6rdf0z-gammaloop-workspace-check-0.1.0.drv
4.21 s
[gammaloop-workspace-check] Phase: unpackPhase
4.22 s
[gammaloop-workspace-check] unpacking source archive /nix/store/l80k18lnsv2ddgrh2zxvwqqdfi489njz-source
4.46 s
[gammaloop-workspace-check] source root is source
4.50 s
[gammaloop-workspace-check] Phase: patchPhase
4.51 s
[gammaloop-workspace-check] Executing configureCargoCommonVars
4.51 s
[gammaloop-workspace-check] decompressing cargo artifacts from /nix/store/50vpxlcgfxf2d57i27v3d10zjwxxbm2r-gammaloop-workspace-deps-deps-0.1.0/target.tar.zst to target
6.47 s
[gammaloop-workspace-check] Phase: updateAutotoolsGnuConfigScriptsPhase
6.53 s
[gammaloop-workspace-check] Phase: configurePhase
6.53 s
[gammaloop-workspace-check] will append /build/source/.cargo-home/config.toml with contents of /nix/store/5drf77x6km4ky7gwlrzdx9bbd6fz09g3-vendor-cargo-deps/config.toml
6.53 s
[gammaloop-workspace-check] default configurePhase, nothing to do
6.54 s
[gammaloop-workspace-check] Phase: buildPhase
6.54 s
[gammaloop-workspace-check] +++ command cargo --version
6.55 s
[gammaloop-workspace-check] cargo 1.97.0 (c980f4866 2026-06-30)
6.59 s
[gammaloop-workspace-check] +++ command cargo check --profile ci-optim --locked --workspace --features gammaloop-tracing-filter/clap,gammaloop-tracing-filter/symbolica,idenso/bincode,idenso/reference-cases,linnet/bincode,linnet/drawing,linnet/rkyv,linnet/serde,linnet/symbolica,spenso-macros/shadowing,spenso/shadowing,symbolica/tracing_max_level_info,three-dimensional-reps/display,three-dimensional-reps/eval,three-dimensional-reps/serde --all-targets
8.29 s
[gammaloop-workspace-check] Checking cfg-if v1.0.4
8.30 s
[gammaloop-workspace-check] Checking memchr v2.8.0
8.30 s
[gammaloop-workspace-check] Checking once_cell v1.21.4
8.31 s
[gammaloop-workspace-check] Checking either v1.15.0
8.32 s
[gammaloop-workspace-check] Checking serde_core v1.0.228
8.32 s
[gammaloop-workspace-check] Checking libc v0.2.186
8.33 s
[gammaloop-workspace-check] Checking libm v0.2.16
8.34 s
[gammaloop-workspace-check] Checking itoa v1.0.18
8.34 s
[gammaloop-workspace-check] Checking log v0.4.29
8.34 s
[gammaloop-workspace-check] Checking regex-syntax v0.8.10
8.36 s
[gammaloop-workspace-check] Checking zerocopy v0.8.48
8.37 s
[gammaloop-workspace-check] Checking crossbeam-utils v0.8.21
8.39 s
[gammaloop-workspace-check] Checking equivalent v1.0.2
8.41 s
[gammaloop-workspace-check] Checking zmij v1.0.21
8.42 s
[gammaloop-workspace-check] Checking lazy_static v1.5.0
8.42 s
[gammaloop-workspace-check] Checking bytemuck v1.25.0
8.42 s
[gammaloop-workspace-check] Compiling target-lexicon v0.13.5
8.49 s
[gammaloop-workspace-check] Checking arrayvec v0.7.6
8.53 s
[gammaloop-workspace-check] Checking powerfmt v0.2.0
8.56 s
[gammaloop-workspace-check] Checking itertools v0.14.0
8.57 s
[gammaloop-workspace-check] Checking num-conv v0.2.1
8.59 s
[gammaloop-workspace-check] Checking pin-project-lite v0.2.17
8.59 s
[gammaloop-workspace-check] Checking num_threads v0.1.7
8.71 s
[gammaloop-workspace-check] Checking time-core v0.1.8
8.72 s
[gammaloop-workspace-check] Checking deranged v0.5.8
8.72 s
[gammaloop-workspace-check] Checking tracing-core v0.1.36
8.75 s
[gammaloop-workspace-check] Checking foldhash v0.2.0
8.77 s
[gammaloop-workspace-check] Checking allocator-api2 v0.2.21
8.79 s
[gammaloop-workspace-check] Checking const-random v0.1.18
8.84 s
[gammaloop-workspace-check] Checking safe_arch v0.7.4
8.97 s
[gammaloop-workspace-check] Checking nu-ansi-term v0.50.3
8.99 s
[gammaloop-workspace-check] Checking winnow v1.0.2
9.00 s
[gammaloop-workspace-check] Checking static_assertions v1.1.0
9.14 s
[gammaloop-workspace-check] Checking aho-corasick v1.1.4
9.16 s
[gammaloop-workspace-check] Checking unty v0.0.4
9.18 s
[gammaloop-workspace-check] Checking crossbeam-epoch v0.9.18
9.25 s
[gammaloop-workspace-check] Checking safe_arch v1.0.0
9.31 s
[gammaloop-workspace-check] Checking sharded-slab v0.1.7
9.41 s
[gammaloop-workspace-check] Checking hashbrown v0.16.1
9.48 s
[gammaloop-workspace-check] Checking tracing-log v0.2.0
9.73 s
[gammaloop-workspace-check] Checking crossbeam-deque v0.8.6
9.77 s
[gammaloop-workspace-check] Checking wide v0.7.33
10.02 s
[gammaloop-workspace-check] Checking tracing v0.1.44
10.32 s
[gammaloop-workspace-check] Checking rayon-core v1.13.0
10.42 s
[gammaloop-workspace-check] Checking thread_local v1.1.9
10.46 s
[gammaloop-workspace-check] Checking toml_writer v1.1.1+spec-1.1.0
10.66 s
[gammaloop-workspace-check] Checking indenter v0.3.4
10.84 s
[gammaloop-workspace-check] Checking az v1.3.0
10.86 s
[gammaloop-workspace-check] Checking wide v1.3.0
10.91 s
[gammaloop-workspace-check] Compiling phf_shared v0.11.3
10.92 s
[gammaloop-workspace-check] Checking anyhow v1.0.102
10.92 s
[gammaloop-workspace-check] Checking dyn-clone v1.0.20
11.08 s
[gammaloop-workspace-check] Checking utf8parse v0.2.2
11.09 s
[gammaloop-workspace-check] Checking num-traits v0.2.19
11.21 s
[gammaloop-workspace-check] Checking alloc-no-stdlib v2.0.4
11.21 s
[gammaloop-workspace-check] Checking rayon v1.12.0
11.28 s
[gammaloop-workspace-check] Checking rawpointer v0.2.1
11.42 s
[gammaloop-workspace-check] Checking toml_parser v1.1.2+spec-1.1.0
11.51 s
[gammaloop-workspace-check] Checking matrixmultiply v0.3.10
11.59 s
[gammaloop-workspace-check] Checking alloc-stdlib v0.2.2
11.74 s
[gammaloop-workspace-check] Checking anstyle-parse v1.0.0
11.85 s
[gammaloop-workspace-check] Checking anstyle v1.0.14
12.18 s
[gammaloop-workspace-check] Checking is_terminal_polyfill v1.70.2
12.25 s
[gammaloop-workspace-check] Checking anstyle-query v1.1.5
12.28 s
[gammaloop-workspace-check] Checking colorchoice v1.0.5
12.37 s
[gammaloop-workspace-check] Checking colored v3.1.1
12.39 s
[gammaloop-workspace-check] Compiling phf_generator v0.11.3
12.41 s
[gammaloop-workspace-check] Checking eyre v0.6.12
12.48 s
[gammaloop-workspace-check] Checking bitflags v1.3.2
12.50 s
[gammaloop-workspace-check] Checking regex-automata v0.4.14
12.51 s
[gammaloop-workspace-check] Checking anstream v1.0.0
12.56 s
[gammaloop-workspace-check] Checking unicode-width v0.2.2
12.67 s
[gammaloop-workspace-check] Checking brotli-decompressor v5.0.0
12.68 s
[gammaloop-workspace-check] Checking getrandom v0.3.4
12.75 s
[gammaloop-workspace-check] Checking time v0.3.47
12.77 s
[gammaloop-workspace-check] Compiling pyo3-build-config v0.28.3
12.85 s
[gammaloop-workspace-check] Checking gmp-mpfr-sys v1.7.1
12.87 s
[gammaloop-workspace-check] Checking region v3.0.2
13.03 s
[gammaloop-workspace-check] Checking approx v0.5.1
13.14 s
[gammaloop-workspace-check] Checking serde v1.0.228
13.22 s
[gammaloop-workspace-check] Checking serde_json v1.0.149
13.23 s
[gammaloop-workspace-check] Checking bitflags v2.11.1
13.25 s
[gammaloop-workspace-check] Checking rand_core v0.9.5
13.27 s
[gammaloop-workspace-check] Checking num-integer v0.1.46
13.41 s
[gammaloop-workspace-check] Checking serde_spanned v1.1.1
13.43 s
[gammaloop-workspace-check] Checking toml_datetime v1.1.1+spec-1.1.0
13.55 s
[gammaloop-workspace-check] Compiling phf_codegen v0.11.3
13.56 s
[gammaloop-workspace-check] Checking wasmtime-jit-icache-coherence v34.0.2
13.58 s
[gammaloop-workspace-check] Checking hugepage-rs v0.1.1
13.62 s
[gammaloop-workspace-check] Checking inventory v0.3.24
13.69 s
[gammaloop-workspace-check] Checking spec_math v0.1.6
13.71 s
[gammaloop-workspace-check] Checking thiserror v2.0.18
13.73 s
[gammaloop-workspace-check] Compiling getopts v0.2.24
13.73 s
[gammaloop-workspace-check] Checking libloading v0.9.0
13.77 s
[gammaloop-workspace-check] Checking append-only-vec v0.1.8
13.80 s
[gammaloop-workspace-check] Checking tinyjson v2.5.1
13.81 s
[gammaloop-workspace-check] Checking toml v1.1.2+spec-1.1.0
13.84 s
[gammaloop-workspace-check] Checking self_cell v1.2.2
13.94 s
[gammaloop-workspace-check] Checking byteorder v1.5.0
14.04 s
[gammaloop-workspace-check] Checking smallvec v1.15.1
14.14 s
[gammaloop-workspace-check] Checking num-complex v0.4.6
14.18 s
[gammaloop-workspace-check] Checking tracing-serde v0.2.0
14.28 s
[gammaloop-workspace-check] Checking bincode v2.0.1
14.31 s
[gammaloop-workspace-check] Checking smartstring v1.0.1
14.34 s
[gammaloop-workspace-check] Checking bytes v1.11.1
14.36 s
[gammaloop-workspace-check] Compiling unicode_names2_generator v1.3.0
14.44 s
[gammaloop-workspace-check] Compiling unic-common v0.9.0
14.67 s
[gammaloop-workspace-check] Checking brotli v8.0.2
14.70 s
[gammaloop-workspace-check] Checking linux-raw-sys v0.12.1
14.90 s
[gammaloop-workspace-check] Checking simba v0.9.1
14.91 s
[gammaloop-workspace-check] Compiling unic-char-range v0.9.0
14.96 s
[gammaloop-workspace-check] Compiling unic-ucd-version v0.9.0
15.09 s
[gammaloop-workspace-check] Compiling unic-char-property v0.9.0
15.09 s
[gammaloop-workspace-check] Compiling is-macro v0.3.7
15.27 s
[gammaloop-workspace-check] Compiling rustpython-parser-vendored v0.4.0
15.39 s
[gammaloop-workspace-check] Checking iana-time-zone v0.1.65
15.46 s
[gammaloop-workspace-check] Compiling rustpython-parser v0.4.0
15.67 s
[gammaloop-workspace-check] Checking rustix v1.1.4
15.80 s
[gammaloop-workspace-check] Checking chrono v0.4.44
16.31 s
[gammaloop-workspace-check] Compiling phf v0.11.3
16.31 s
[gammaloop-workspace-check] Checking rustc-hash v2.1.2
16.34 s
[gammaloop-workspace-check] Compiling unic-emoji-char v0.9.0
16.64 s
[gammaloop-workspace-check] Compiling unic-ucd-ident v0.9.0
16.67 s
[gammaloop-workspace-check] Checking ndarray v0.17.2
16.80 s
[gammaloop-workspace-check] Compiling lalrpop-util v0.20.2
16.86 s
[gammaloop-workspace-check] Compiling rustc-hash v1.1.0
17.01 s
[gammaloop-workspace-check] Checking rug v1.30.0
17.19 s
[gammaloop-workspace-check] Compiling symbolica v2.2.0 (https://github.com/alphal00p/symbolica?rev=a277a8dadbaae5a8d6605f2f381991a601e1f345#a277a8da)
17.20 s
[gammaloop-workspace-check] Checking unicode-segmentation v1.13.2
17.29 s
[gammaloop-workspace-check] Checking typenum v1.20.0
17.29 s
[gammaloop-workspace-check] Checking getrandom v0.2.17
17.76 s
[gammaloop-workspace-check] Checking scopeguard v1.2.0
17.91 s
[gammaloop-workspace-check] Checking ppv-lite86 v0.2.21
17.93 s
[gammaloop-workspace-check] Checking ahash v0.8.12
18.17 s
[gammaloop-workspace-check] Checking lock_api v0.4.14
18.54 s
[gammaloop-workspace-check] Checking parking_lot_core v0.9.12
18.70 s
[gammaloop-workspace-check] Checking unicode-ident v1.0.24
18.78 s
[gammaloop-workspace-check] Checking hashbrown v0.17.0
18.91 s
[gammaloop-workspace-check] Checking errno v0.3.14
19.03 s
[gammaloop-workspace-check] Checking parking_lot v0.12.5
19.17 s
[gammaloop-workspace-check] Checking clap_lex v1.1.0
19.29 s
[gammaloop-workspace-check] Checking strsim v0.11.1
19.35 s
[gammaloop-workspace-check] Checking matchers v0.2.0
19.38 s
[gammaloop-workspace-check] Checking rand_chacha v0.9.0
19.57 s
[gammaloop-workspace-check] Checking tracing-subscriber v0.3.23
19.77 s
[gammaloop-workspace-check] Checking regex v1.12.3
19.88 s
[gammaloop-workspace-check] Checking generic-array v0.14.7
20.02 s
[gammaloop-workspace-check] Checking rand v0.9.4
20.05 s
[gammaloop-workspace-check] Checking unicase v2.9.0
20.47 s
[gammaloop-workspace-check] Checking signal-hook-registry v1.4.8
20.52 s
[gammaloop-workspace-check] Checking vte v0.14.1
20.89 s
[gammaloop-workspace-check] Checking same-file v1.0.6
21.09 s
[gammaloop-workspace-check] Checking walkdir v2.5.0
21.09 s
[gammaloop-workspace-check] Checking signal-hook v0.3.18
21.29 s
[gammaloop-workspace-check] Checking indexmap v2.14.0
21.38 s
[gammaloop-workspace-check] Checking half v2.7.1
21.59 s
[gammaloop-workspace-check] Checking block-buffer v0.10.4
21.59 s
[gammaloop-workspace-check] Checking crypto-common v0.1.7
21.66 s
[gammaloop-workspace-check] Checking mio v1.2.0
21.73 s
[gammaloop-workspace-check] Checking terminal_size v0.4.4
21.82 s
[gammaloop-workspace-check] Checking symjit v2.21.0
21.88 s
[gammaloop-workspace-check] Checking minimal-lexical v0.2.1
22.04 s
[gammaloop-workspace-check] Checking clap_builder v4.6.0
22.08 s
[gammaloop-workspace-check] Checking ciborium-io v0.2.2
22.17 s
[gammaloop-workspace-check] Checking digest v0.10.7
22.44 s
[gammaloop-workspace-check] Checking nom v7.1.3
22.55 s
[gammaloop-workspace-check] Checking ciborium-ll v0.2.2
22.74 s
[gammaloop-workspace-check] Checking derive_more v2.1.1
22.83 s
[gammaloop-workspace-check] Checking signal-hook-mio v0.2.5
23.02 s
[gammaloop-workspace-check] Checking num-bigint v0.4.6
23.05 s
[gammaloop-workspace-check] Checking console v0.16.3
23.06 s
[gammaloop-workspace-check] Checking bstr v1.12.1
24.13 s
[gammaloop-workspace-check] Checking cpufeatures v0.2.17
24.17 s
[gammaloop-workspace-check] Checking winnow v0.7.15
24.24 s
[gammaloop-workspace-check] Checking linux-raw-sys v0.4.15
24.66 s
[gammaloop-workspace-check] Checking sha2 v0.10.9
24.75 s
[gammaloop-workspace-check] Checking globset v0.4.18
25.40 s
[gammaloop-workspace-check] Checking rustix v0.38.44
25.57 s
[gammaloop-workspace-check] Checking ciborium v0.2.2
25.92 s
[gammaloop-workspace-check] Checking getrandom v0.4.2
26.16 s
[gammaloop-workspace-check] Checking rand_core v0.6.4
26.45 s
[gammaloop-workspace-check] Checking plotters-backend v0.3.7
26.63 s
[gammaloop-workspace-check] Checking fnv v1.0.7
26.76 s
[gammaloop-workspace-check] Compiling unicode_names2 v1.3.0
26.85 s
[gammaloop-workspace-check] Checking fastrand v2.4.1
26.87 s
[gammaloop-workspace-check] Checking rust-embed-utils v8.11.0
27.06 s
[gammaloop-workspace-check] Checking ansitok v0.3.0
27.09 s
[gammaloop-workspace-check] Checking serde_spanned v0.6.9
27.17 s
[gammaloop-workspace-check] Checking clap v4.6.1
27.18 s
[gammaloop-workspace-check] Checking toml_datetime v0.6.11
27.26 s
[gammaloop-workspace-check] Checking itertools v0.10.5
27.45 s
[gammaloop-workspace-check] Checking tempfile v3.27.0
27.45 s
[gammaloop-workspace-check] Checking plotters-svg v0.3.7
27.45 s
[gammaloop-workspace-check] Checking tap v1.0.1
27.68 s
[gammaloop-workspace-check] Checking cast v0.3.0
27.72 s
[gammaloop-workspace-check] Checking toml_write v0.1.2
27.81 s
[gammaloop-workspace-check] Checking plotters v0.3.7
27.83 s
[gammaloop-workspace-check] Checking wyz v0.5.1
27.97 s
[gammaloop-workspace-check] Checking crossterm v0.28.1
27.98 s
[gammaloop-workspace-check] Checking rand_chacha v0.3.1
28.14 s
[gammaloop-workspace-check] Checking radium v0.7.0
28.22 s
[gammaloop-workspace-check] Checking typeid v1.0.3
28.28 s
[gammaloop-workspace-check] Checking similar v2.7.0
28.32 s
[gammaloop-workspace-check] Checking ansi-str v0.9.0
28.45 s
[gammaloop-workspace-check] Checking tinytemplate v1.2.1
28.56 s
[gammaloop-workspace-check] Checking is-terminal v0.4.17
28.71 s
[gammaloop-workspace-check] Checking oorandom v11.1.5
28.73 s
[gammaloop-workspace-check] Checking funty v2.0.0
28.92 s
[gammaloop-workspace-check] Checking bytecount v0.6.9
29.07 s
[gammaloop-workspace-check] Checking anes v0.1.6
29.38 s
[gammaloop-workspace-check] Checking rand v0.8.6
29.60 s
[gammaloop-workspace-check] Checking toml_edit v0.22.27
29.77 s
[gammaloop-workspace-check] Checking ron v0.12.1
30.03 s
[gammaloop-workspace-check] Checking testing_table v0.3.0
30.14 s
[gammaloop-workspace-check] Checking papergrid v0.17.0
30.25 s
[gammaloop-workspace-check] Checking toml_edit v0.25.11+spec-1.1.0
30.33 s
[gammaloop-workspace-check] Checking bitvec v1.0.1
31.04 s
[gammaloop-workspace-check] Checking criterion-plot v0.5.0
31.06 s
[gammaloop-workspace-check] Checking uncased v0.9.10
31.21 s
[gammaloop-workspace-check] Checking env_filter v1.0.1
31.40 s
[gammaloop-workspace-check] Checking jiff v0.2.24
31.42 s
[gammaloop-workspace-check] Checking ptr_meta v0.1.4
31.50 s
[gammaloop-workspace-check] Checking xprec v0.2.2
31.61 s
[gammaloop-workspace-check] Checking ucd-trie v0.1.7
31.71 s
[gammaloop-workspace-check] Checking simdutf8 v0.1.5
32.05 s
[gammaloop-workspace-check] Checking criterion v0.5.1
32.05 s
[gammaloop-workspace-check] Checking pest v2.8.6
32.13 s
[gammaloop-workspace-check] Checking bytecheck v0.6.12
32.41 s
[gammaloop-workspace-check] Checking ahash v0.7.8
32.95 s
[gammaloop-workspace-check] Checking hashbrown v0.12.3
33.04 s
[gammaloop-workspace-check] Checking approx v0.4.0
33.16 s
[gammaloop-workspace-check] Compiling pyo3-ffi v0.28.3
33.20 s
[gammaloop-workspace-check] Compiling pyo3-macros-backend v0.28.3
33.43 s
[gammaloop-workspace-check] Compiling pyo3 v0.28.3
33.65 s
[gammaloop-workspace-check] Compiling numpy v0.28.0
33.75 s
[gammaloop-workspace-check] Checking tabled v0.20.0
34.21 s
[gammaloop-workspace-check] Checking rend v0.4.2
34.30 s
[gammaloop-workspace-check] Checking seahash v4.1.0
34.33 s
[gammaloop-workspace-check] Checking insta v1.47.2
34.41 s
[gammaloop-workspace-check] Checking cgmath v0.18.0
34.60 s
[gammaloop-workspace-check] Checking num-rational v0.4.2
34.74 s
[gammaloop-workspace-check] Checking num-iter v0.1.45
34.94 s
[gammaloop-workspace-check] Checking ref-ops v0.2.5
35.06 s
[gammaloop-workspace-check] Checking toml v0.8.23
35.18 s
[gammaloop-workspace-check] Checking rand_xoshiro v0.6.0
35.92 s
[gammaloop-workspace-check] Checking num v0.4.3
35.99 s
[gammaloop-workspace-check] Checking figment v0.10.19
36.06 s
[gammaloop-workspace-check] Checking features v0.10.0
36.08 s
[gammaloop-workspace-check] Checking gat-lending-iterator v0.1.8
36.39 s
[gammaloop-workspace-check] Checking constcat v0.5.1
36.47 s
[gammaloop-workspace-check] Checking colored v2.2.0
36.52 s
[gammaloop-workspace-check] Checking arrayref v0.3.9
36.59 s
[gammaloop-workspace-check] Checking constant_time_eq v0.4.2
36.68 s
[gammaloop-workspace-check] Checking dot-parser v0.5.1
36.84 s
[gammaloop-workspace-check] Checking cpufeatures v0.3.0
36.97 s
[gammaloop-workspace-check] Checking base64 v0.22.1
37.07 s
[gammaloop-workspace-check] Checking joinery v2.1.0
37.07 s
[gammaloop-workspace-check] Checking siphasher v1.0.2
37.61 s
[gammaloop-workspace-check] Checking titlecase v2.2.1
37.62 s
[gammaloop-workspace-check] Checking phf_shared v0.13.1
37.63 s
[gammaloop-workspace-check] Checking blake3 v1.8.5
37.73 s
[gammaloop-workspace-check] Checking subprocess v0.2.15
37.85 s
[gammaloop-workspace-check] Checking rust_lisp v0.18.0
38.02 s
[gammaloop-workspace-check] Compiling vakint v0.1.2 (/build/source/crates/vakint)
38.02 s
[gammaloop-workspace-check] Checking version-compare v0.2.1
38.09 s
[gammaloop-workspace-check] Checking phf v0.13.1
38.13 s
[gammaloop-workspace-check] Checking xpct v0.5.1
38.35 s
[gammaloop-workspace-check] Checking ryu v1.0.23
38.55 s
[gammaloop-workspace-check] Checking castaway v0.2.4
38.58 s
[gammaloop-workspace-check] Checking toml_datetime v0.7.5+spec-1.1.0
38.67 s
[gammaloop-workspace-check] Checking strum v0.27.2
38.77 s
[gammaloop-workspace-check] Checking compact_str v0.9.0
38.77 s
[gammaloop-workspace-check] Checking unicode-truncate v2.0.1
38.79 s
[gammaloop-workspace-check] Checking kasuari v0.4.12
38.88 s
[gammaloop-workspace-check] Checking lru v0.16.4
39.03 s
[gammaloop-workspace-check] Checking vte v0.15.0
39.07 s
[gammaloop-workspace-check] Checking toml v0.9.12+spec-1.1.0
39.16 s
[gammaloop-workspace-check] Checking portable-atomic v1.13.1
39.21 s
[gammaloop-workspace-check] Checking unit-prefix v0.5.2
39.26 s
[gammaloop-workspace-check] Checking rand_distr v0.4.3
39.36 s
[gammaloop-workspace-check] Checking vt100 v0.16.2
39.43 s
[gammaloop-workspace-check] Checking simba v0.6.0
39.45 s
[gammaloop-workspace-check] Checking line-clipping v0.3.7
39.77 s
[gammaloop-workspace-check] Checking gimli v0.32.3
39.98 s
[gammaloop-workspace-check] Checking adler2 v2.0.1
40.02 s
[gammaloop-workspace-check] Checking ratatui-core v0.1.0
40.15 s
[gammaloop-workspace-check] Compiling three-dimensional-reps v0.1.0 (/build/source/crates/three-dimensional-reps)
40.35 s
[gammaloop-workspace-check] Checking miniz_oxide v0.8.9
40.38 s
[gammaloop-workspace-check] Checking string-template-plus v0.4.3
40.46 s
[gammaloop-workspace-check] Checking thiserror v1.0.69
40.75 s
[gammaloop-workspace-check] Checking env_logger v0.11.10
40.77 s
[gammaloop-workspace-check] Checking derive_builder v0.11.2
40.99 s
[gammaloop-workspace-check] Checking owo-colors v4.3.0
40.99 s
[gammaloop-workspace-check] Checking indicatif v0.18.4
41.05 s
[gammaloop-workspace-check] Checking object v0.37.3
41.44 s
[gammaloop-workspace-check] Checking crossterm v0.29.0
41.44 s
[gammaloop-workspace-check] Checking tracing-error v0.2.1
41.51 s
[gammaloop-workspace-check] Checking typed-index-collections v3.5.0
41.58 s
[gammaloop-workspace-check] Checking serde-big-array v0.5.1
41.88 s
[gammaloop-workspace-check] Checking amd v0.2.2
41.93 s
[gammaloop-workspace-check] Checking itertools v0.11.0
41.99 s
[gammaloop-workspace-check] Compiling gammaloop-tracing-filter-macros v0.1.0 (/build/source/crates/gammaloop-tracing-filter-macros)
42.28 s
[gammaloop-workspace-check] Checking rkyv v0.7.46
42.36 s
[gammaloop-workspace-check] Checking option-ext v0.2.0
42.44 s
[gammaloop-workspace-check] Checking rustc-demangle v0.1.27
42.46 s
[gammaloop-workspace-check] Checking dirs-sys v0.5.0
42.80 s
[gammaloop-workspace-check] Checking ref-cast v1.0.25
42.83 s
[gammaloop-workspace-check] Checking nix v0.31.2
42.85 s
[gammaloop-workspace-check] Checking integer-sqrt v0.1.5
42.93 s
[gammaloop-workspace-check] Checking brotli-decompressor v4.0.3
43.20 s
[gammaloop-workspace-check] Checking crossbeam-channel v0.5.15
43.37 s
[gammaloop-workspace-check] Compiling rustpython-parser-core v0.4.0
43.57 s
[gammaloop-workspace-check] Checking color-spantrace v0.3.0
43.62 s
[gammaloop-workspace-check] Checking itertools v0.12.1
43.93 s
[gammaloop-workspace-check] Compiling gammalooprs v0.3.4 (/build/source/crates/gammalooprs)
44.04 s
[gammaloop-workspace-check] Checking symlink v0.1.0
44.23 s
[gammaloop-workspace-check] Checking unsafe-libyaml v0.2.11
44.26 s
[gammaloop-workspace-check] Checking ratatui-widgets v0.3.0
44.55 s
[gammaloop-workspace-check] Compiling rustpython-ast v0.4.0
44.60 s
[gammaloop-workspace-check] Checking ratatui-crossterm v0.1.0
45.02 s
[gammaloop-workspace-check] Checking pathfinding v4.15.0
45.04 s
[gammaloop-workspace-check] Checking include_dir v0.7.4
45.19 s
[gammaloop-workspace-check] Checking tracing-appender v0.2.5
45.25 s
[gammaloop-workspace-check] Checking tracing-indicatif v0.3.14
45.27 s
[gammaloop-workspace-check] Checking clarabel v0.11.1
45.79 s
[gammaloop-workspace-check] Checking schemars v1.2.1
46.00 s
[gammaloop-workspace-check] Checking dirs v6.0.0
46.02 s
[gammaloop-workspace-check] Checking ctrlc v3.5.2
46.15 s
[gammaloop-workspace-check] Checking slotmap v1.1.1
46.42 s
[gammaloop-workspace-check] Checking json5 v0.4.1
46.54 s
[gammaloop-workspace-check] Checking brotli v7.0.0
46.84 s
[gammaloop-workspace-check] Checking serde_yaml v0.9.34+deprecated
46.86 s
[gammaloop-workspace-check] Checking vectorize v0.2.0
47.04 s
[gammaloop-workspace-check] Checking base62 v2.2.4
47.42 s
[gammaloop-workspace-check] Checking ringbuffer v0.16.0
47.45 s
[gammaloop-workspace-check] Checking rust-embed v8.11.0
47.45 s
[gammaloop-workspace-check] Checking clap_complete v4.6.3
47.56 s
[gammaloop-workspace-check] Checking fd-lock v4.0.4
47.73 s
[gammaloop-workspace-check] Checking strip-ansi-escapes v0.2.1
47.77 s
[gammaloop-workspace-check] Checking addr2line v0.25.1
47.78 s
[gammaloop-workspace-check] Compiling gammaloop-api v0.1.0 (/build/source/crates/gammaloop-api)
47.89 s
[gammaloop-workspace-check] Checking ratatui-macros v0.7.0
47.91 s
[gammaloop-workspace-check] Checking itertools v0.13.0
48.02 s
[gammaloop-workspace-check] Checking strum v0.26.3
48.04 s
[gammaloop-workspace-check] Checking ratatui v0.30.0
48.04 s
[gammaloop-workspace-check] Checking sysinfo v0.33.1
48.14 s
[gammaloop-workspace-check] Checking shlex v1.3.0
48.22 s
[gammaloop-workspace-check] Checking futures-core v0.3.32
48.32 s
[gammaloop-workspace-check] Checking futures-task v0.3.32
48.43 s
[gammaloop-workspace-check] Checking slab v0.4.12
48.46 s
[gammaloop-workspace-check] Checking sdd v3.0.10
48.49 s
[gammaloop-workspace-check] Compiling gammaloop-integration-tests v0.1.0 (/build/source/tests)
48.60 s
[gammaloop-workspace-check] Compiling test-log-core v0.2.20
48.65 s
[gammaloop-workspace-check] Checking clap_complete_nushell v4.6.0
48.81 s
[gammaloop-workspace-check] Checking futures-util v0.3.32
48.91 s
[gammaloop-workspace-check] Compiling rustc_version v0.4.1
49.14 s
[gammaloop-workspace-check] Checking scc v2.4.0
49.50 s
[gammaloop-workspace-check] Checking which v8.0.2
49.75 s
[gammaloop-workspace-check] Checking bincode v1.3.3
49.76 s
[gammaloop-workspace-check] Compiling gungraun-runner v0.18.2
50.65 s
[gammaloop-workspace-check] Checking proc-macro2 v1.0.106
51.05 s
[gammaloop-workspace-check] Checking maplit v1.0.2
51.28 s
[gammaloop-workspace-check] Compiling gungraun-macros v0.8.0
52.28 s
[gammaloop-workspace-check] Checking quote v1.0.45
52.42 s
[gammaloop-workspace-check] Checking nalgebra v0.29.0
52.58 s
[gammaloop-workspace-check] Checking base64 v0.21.7
52.92 s
[gammaloop-workspace-check] Checking reedline v0.42.0
52.95 s
[gammaloop-workspace-check] Checking backtrace v0.3.76
53.61 s
[gammaloop-workspace-check] Checking ron v0.8.1
53.73 s
[gammaloop-workspace-check] Compiling numerica v2.2.0 (https://github.com/alphal00p/symbolica?rev=a277a8dadbaae5a8d6605f2f381991a601e1f345#a277a8da)
54.58 s
[gammaloop-workspace-check] Checking futures-executor v0.3.32
54.68 s
[gammaloop-workspace-check] Checking color-eyre v0.6.5
54.91 s
[gammaloop-workspace-check] Checking serial_test v3.4.0
55.10 s
[gammaloop-workspace-check] Compiling iai-callgrind-runner v0.14.2
55.15 s
[gammaloop-workspace-check] Checking kurbo v0.13.0
55.47 s
[gammaloop-workspace-check] Checking wait-timeout v0.2.1
55.79 s
[gammaloop-workspace-check] Compiling iai-callgrind v0.14.2
55.87 s
[gammaloop-workspace-check] Checking quick-error v1.2.3
56.09 s
[gammaloop-workspace-check] Checking bit-vec v0.8.0
56.30 s
[gammaloop-workspace-check] Checking rusty-fork v0.3.1
56.72 s
[gammaloop-workspace-check] Checking syn v2.0.117
56.72 s
[gammaloop-workspace-check] Compiling test-log-macros v0.2.20
56.96 s
[gammaloop-workspace-check] Checking bit-set v0.8.0
57.35 s
[gammaloop-workspace-check] Compiling iai-callgrind-macros v0.5.1
57.57 s
[gammaloop-workspace-check] Checking rand_xorshift v0.4.0
58.05 s
[gammaloop-workspace-check] Checking console v0.15.11
58.07 s
[gammaloop-workspace-check] Checking pathdiff v0.2.3
58.24 s
[gammaloop-workspace-check] Checking unarray v0.1.4
58.38 s
[gammaloop-workspace-check] Checking proptest v1.11.0
59.40 s
[gammaloop-workspace-check] Checking similar-asserts v1.7.0
59.91 s
[gammaloop-workspace-check] Checking clinnet v0.1.8 (/build/source/crates/clinnet)
61.15 s
[gammaloop-workspace-check] Checking kurvst v0.1.0 (/build/source/crates/kurvst)
65.83 s
[gammaloop-workspace-check] Checking test-log v0.2.20
67.52 s
[gammaloop-workspace-check] Compiling graphica v2.1.0 (https://github.com/alphal00p/symbolica?rev=a277a8dadbaae5a8d6605f2f381991a601e1f345#a277a8da)
76.00 s
[gammaloop-workspace-check] Checking statrs v0.16.1
78.01 s
[gammaloop-workspace-check] Checking gungraun v0.18.2
78.67 s
[gammaloop-workspace-check] Checking momtrop v0.3.0
85.69 s
[gammaloop-workspace-check] Compiling pyo3-macros v0.28.3
85.78 s
[gammaloop-workspace-check] Compiling pyo3-stub-gen-derive v0.17.2
99.96 s
[gammaloop-workspace-check] Checking pyo3-stub-gen v0.17.2
111.22 s
[gammaloop-workspace-check] Checking symbolica-utils v0.1.0 (/build/source/crates/symbolica-utils)
111.22 s
[gammaloop-workspace-check] Checking spenso-macros v0.3.2 (/build/source/crates/spenso-macros)
363.66 s
[gammaloop-workspace-check] Compiling gammaloop-workspace-hack v0.1.0 (/build/source/crates/gammaloop-workspace-hack)
364.08 s
[gammaloop-workspace-check] Checking linnet v0.17.0 (/build/source/crates/linnet)
367.85 s
[gammaloop-workspace-check] Checking spenso v0.6.0 (/build/source/crates/spenso)
368.17 s
[gammaloop-workspace-check] Checking linnet-py v0.1.0 (/build/source/crates/linnet-py)
368.17 s
[gammaloop-workspace-check] Checking linnest v0.1.0 (/build/source/crates/linnest)
373.84 s
[gammaloop-workspace-check] Checking idenso v0.3.0 (/build/source/crates/idenso)
373.84 s
[gammaloop-workspace-check] Checking gammaloop-tracing-filter v0.1.0 (/build/source/crates/gammaloop-tracing-filter)
376.75 s
[gammaloop-workspace-check] Checking spenso-hep-lib v0.1.7 (/build/source/crates/spenso-hep-lib)
377.28 s
[gammaloop-workspace-check] Checking spynso3 v0.1.2 (/build/source/crates/spynso3)
412.57 s
[gammaloop-workspace-check] error[E0609] : no field `lmb_channel_id` on type `CutInfo`
412.57 s
[gammaloop-workspace-check] --> tests/tests/test_runs/utils.rs:568:36
412.57 s
[gammaloop-workspace-check] |
412.57 s
[gammaloop-workspace-check] 568 | event.cut_info.lmb_channel_id,
412.57 s
[gammaloop-workspace-check] | ^^^^^^^^^^^^^^ unknown field
412.57 s
[gammaloop-workspace-check] |
412.57 s
[gammaloop-workspace-check] = note : available fields are: `particle_pdgs`, `cut_id`, `graph_id`, `graph_group_id`, `orientation_id` ... and 2 others
412.57 s
[gammaloop-workspace-check]
412.57 s
[gammaloop-workspace-check] error[E0609] : no field `lmb_channel_id` on type `CutInfo`
412.57 s
[gammaloop-workspace-check] --> tests/tests/test_runs/utils.rs:580:36
412.57 s
[gammaloop-workspace-check] |
412.57 s
[gammaloop-workspace-check] 580 | event.cut_info.lmb_channel_id,
412.57 s
[gammaloop-workspace-check] | ^^^^^^^^^^^^^^ unknown field
412.57 s
[gammaloop-workspace-check] |
412.57 s
[gammaloop-workspace-check] = note : available fields are: `particle_pdgs`, `cut_id`, `graph_id`, `graph_group_id`, `orientation_id` ... and 2 others
412.57 s
[gammaloop-workspace-check]
413.10 s
[gammaloop-workspace-check] For more information about this error, try `rustc --explain E0609`.
413.12 s
[gammaloop-workspace-check] error : could not compile `gammaloop-integration-tests` (test "test_runs") due to 2 previous errors
413.76 s
Progress: 0 of 1 built (1 failed)
413.76 s
Failed to build gammaloop-workspace-check after 6m49s
413.77 s
Cannot build ' /nix/store/hf02q68sy1ndsdmim1xajah34f6rdf0z-gammaloop-workspace-check-0.1.0.drv '.
413.77 s
Reason: builder failed with exit code 101 .
413.77 s
Output paths:
413.77 s
/nix/store/a046g8g2g4l0nk90h7mpbjk09nss2las-gammaloop-workspace-check-0.1.0
413.77 s
Last 443 log lines:
413.77 s
> Running phase: unpackPhase
413.77 s
> unpacking source archive /nix/store/l80k18lnsv2ddgrh2zxvwqqdfi489njz-source
413.77 s
> source root is source
413.77 s
> Running phase: patchPhase
413.77 s
> Executing configureCargoCommonVars
413.77 s
> decompressing cargo artifacts from /nix/store/50vpxlcgfxf2d57i27v3d10zjwxxbm2r-gammaloop-workspace-deps-deps-0.1.0/target.tar.zst to target
413.77 s
> Running phase: updateAutotoolsGnuConfigScriptsPhase
413.77 s
> Running phase: configurePhase
413.77 s
> will append /build/source/.cargo-home/config.toml with contents of /nix/store/5drf77x6km4ky7gwlrzdx9bbd6fz09g3-vendor-cargo-deps/config.toml
413.77 s
> default configurePhase, nothing to do
413.77 s
> Running phase: buildPhase
413.77 s
> +++ command cargo --version
413.77 s
> cargo 1.97.0 (c980f4866 2026-06-30)
413.77 s
> +++ command cargo check --profile ci-optim --locked --workspace --features gammaloop-tracing-filter/clap,gammaloop-tracing-filter/symbolica,idenso/bincode,idenso/reference-cases,linnet/bincode,linnet/drawing,linnet/rkyv,linnet/serde,linnet/symbolica,spenso-macros/shadowing,spenso/shadowing,symbolica/tracing_max_level_info,three-dimensional-reps/display,three-dimensional-reps/eval,three-dimensional-reps/serde --all-targets
413.77 s
> Checking cfg-if v1.0.4
413.77 s
> Checking memchr v2.8.0
413.77 s
> Checking once_cell v1.21.4
413.77 s
> Checking either v1.15.0
413.77 s
> Checking serde_core v1.0.228
413.77 s
> Checking libc v0.2.186
413.77 s
> Checking libm v0.2.16
413.77 s
> Checking itoa v1.0.18
413.77 s
> Checking log v0.4.29
413.77 s
> Checking regex-syntax v0.8.10
413.77 s
> Checking zerocopy v0.8.48
413.77 s
> Checking crossbeam-utils v0.8.21
413.77 s
> Checking equivalent v1.0.2
413.77 s
> Checking zmij v1.0.21
413.77 s
> Checking lazy_static v1.5.0
413.77 s
> Checking bytemuck v1.25.0
413.77 s
> Compiling target-lexicon v0.13.5
413.77 s
> Checking arrayvec v0.7.6
413.77 s
> Checking powerfmt v0.2.0
413.77 s
> Checking itertools v0.14.0
413.77 s
> Checking num-conv v0.2.1
413.77 s
> Checking pin-project-lite v0.2.17
413.77 s
> Checking num_threads v0.1.7
413.77 s
> Checking time-core v0.1.8
413.77 s
> Checking deranged v0.5.8
413.77 s
> Checking tracing-core v0.1.36
413.77 s
> Checking foldhash v0.2.0
413.77 s
> Checking allocator-api2 v0.2.21
413.77 s
> Checking const-random v0.1.18
413.77 s
> Checking safe_arch v0.7.4
413.77 s
> Checking nu-ansi-term v0.50.3
413.77 s
> Checking winnow v1.0.2
413.77 s
> Checking static_assertions v1.1.0
413.77 s
> Checking aho-corasick v1.1.4
413.77 s
> Checking unty v0.0.4
413.77 s
> Checking crossbeam-epoch v0.9.18
413.77 s
> Checking safe_arch v1.0.0
413.77 s
> Checking sharded-slab v0.1.7
413.77 s
> Checking hashbrown v0.16.1
413.77 s
> Checking tracing-log v0.2.0
413.77 s
> Checking crossbeam-deque v0.8.6
413.77 s
> Checking wide v0.7.33
413.77 s
> Checking tracing v0.1.44
413.77 s
> Checking rayon-core v1.13.0
413.77 s
> Checking thread_local v1.1.9
413.77 s
> Checking toml_writer v1.1.1+spec-1.1.0
413.77 s
> Checking indenter v0.3.4
413.77 s
> Checking az v1.3.0
413.77 s
> Checking wide v1.3.0
413.77 s
> Compiling phf_shared v0.11.3
413.77 s
> Checking anyhow v1.0.102
413.77 s
> Checking dyn-clone v1.0.20
413.77 s
> Checking utf8parse v0.2.2
413.77 s
> Checking num-traits v0.2.19
413.77 s
> Checking alloc-no-stdlib v2.0.4
413.77 s
> Checking rayon v1.12.0
413.77 s
> Checking rawpointer v0.2.1
413.77 s
> Checking toml_parser v1.1.2+spec-1.1.0
413.77 s
> Checking matrixmultiply v0.3.10
413.77 s
> Checking alloc-stdlib v0.2.2
413.77 s
> Checking anstyle-parse v1.0.0
413.77 s
> Checking anstyle v1.0.14
413.77 s
> Checking is_terminal_polyfill v1.70.2
413.77 s
> Checking anstyle-query v1.1.5
413.77 s
> Checking colorchoice v1.0.5
413.77 s
> Checking colored v3.1.1
413.77 s
> Compiling phf_generator v0.11.3
413.77 s
> Checking eyre v0.6.12
413.77 s
> Checking bitflags v1.3.2
413.77 s
> Checking regex-automata v0.4.14
413.77 s
> Checking anstream v1.0.0
413.77 s
> Checking unicode-width v0.2.2
413.77 s
> Checking brotli-decompressor v5.0.0
413.77 s
> Checking getrandom v0.3.4
413.77 s
> Checking time v0.3.47
413.77 s
> Compiling pyo3-build-config v0.28.3
413.77 s
> Checking gmp-mpfr-sys v1.7.1
413.77 s
> Checking region v3.0.2
413.77 s
> Checking approx v0.5.1
413.77 s
> Checking serde v1.0.228
413.77 s
> Checking serde_json v1.0.149
413.77 s
> Checking bitflags v2.11.1
413.77 s
> Checking rand_core v0.9.5
413.77 s
> Checking num-integer v0.1.46
413.77 s
> Checking serde_spanned v1.1.1
413.77 s
> Checking toml_datetime v1.1.1+spec-1.1.0
413.77 s
> Compiling phf_codegen v0.11.3
413.77 s
> Checking wasmtime-jit-icache-coherence v34.0.2
413.77 s
> Checking hugepage-rs v0.1.1
413.77 s
> Checking inventory v0.3.24
413.77 s
> Checking spec_math v0.1.6
413.77 s
> Checking thiserror v2.0.18
413.77 s
> Compiling getopts v0.2.24
413.77 s
> Checking libloading v0.9.0
413.77 s
> Checking append-only-vec v0.1.8
413.77 s
> Checking tinyjson v2.5.1
413.77 s
> Checking toml v1.1.2+spec-1.1.0
413.77 s
> Checking self_cell v1.2.2
413.77 s
> Checking byteorder v1.5.0
413.77 s
> Checking smallvec v1.15.1
413.77 s
> Checking num-complex v0.4.6
413.77 s
> Checking tracing-serde v0.2.0
413.77 s
> Checking bincode v2.0.1
413.77 s
> Checking smartstring v1.0.1
413.77 s
> Checking bytes v1.11.1
413.77 s
> Compiling unicode_names2_generator v1.3.0
413.77 s
> Compiling unic-common v0.9.0
413.77 s
> Checking brotli v8.0.2
413.77 s
> Checking linux-raw-sys v0.12.1
413.77 s
> Checking simba v0.9.1
413.77 s
> Compiling unic-char-range v0.9.0
413.77 s
> Compiling unic-ucd-version v0.9.0
413.77 s
> Compiling unic-char-property v0.9.0
413.77 s
> Compiling is-macro v0.3.7
413.77 s
> Compiling rustpython-parser-vendored v0.4.0
413.77 s
> Checking iana-time-zone v0.1.65
413.77 s
> Compiling rustpython-parser v0.4.0
413.77 s
> Checking rustix v1.1.4
413.77 s
> Checking chrono v0.4.44
413.77 s
> Compiling phf v0.11.3
413.77 s
> Checking rustc-hash v2.1.2
413.77 s
> Compiling unic-emoji-char v0.9.0
413.77 s
> Compiling unic-ucd-ident v0.9.0
413.77 s
> Checking ndarray v0.17.2
413.77 s
> Compiling lalrpop-util v0.20.2
413.77 s
> Compiling rustc-hash v1.1.0
413.77 s
> Checking rug v1.30.0
413.77 s
> Compiling symbolica v2.2.0 (https://github.com/alphal00p/symbolica?rev=a277a8dadbaae5a8d6605f2f381991a601e1f345#a277a8da)
413.77 s
> Checking unicode-segmentation v1.13.2
413.77 s
> Checking typenum v1.20.0
413.77 s
> Checking getrandom v0.2.17
413.77 s
> Checking scopeguard v1.2.0
413.77 s
> Checking ppv-lite86 v0.2.21
413.77 s
> Checking ahash v0.8.12
413.77 s
> Checking lock_api v0.4.14
413.77 s
> Checking parking_lot_core v0.9.12
413.77 s
> Checking unicode-ident v1.0.24
413.77 s
> Checking hashbrown v0.17.0
413.77 s
> Checking errno v0.3.14
413.77 s
> Checking parking_lot v0.12.5
413.77 s
> Checking clap_lex v1.1.0
413.77 s
> Checking strsim v0.11.1
413.77 s
> Checking matchers v0.2.0
413.77 s
> Checking rand_chacha v0.9.0
413.77 s
> Checking tracing-subscriber v0.3.23
413.77 s
> Checking regex v1.12.3
413.77 s
> Checking generic-array v0.14.7
413.77 s
> Checking rand v0.9.4
413.77 s
> Checking unicase v2.9.0
413.77 s
> Checking signal-hook-registry v1.4.8
413.77 s
> Checking vte v0.14.1
413.77 s
> Checking same-file v1.0.6
413.77 s
> Checking walkdir v2.5.0
413.77 s
> Checking signal-hook v0.3.18
413.77 s
> Checking indexmap v2.14.0
413.77 s
> Checking half v2.7.1
413.77 s
> Checking block-buffer v0.10.4
413.77 s
> Checking crypto-common v0.1.7
413.77 s
> Checking mio v1.2.0
413.77 s
> Checking terminal_size v0.4.4
413.77 s
> Checking symjit v2.21.0
413.77 s
> Checking minimal-lexical v0.2.1
413.77 s
> Checking clap_builder v4.6.0
413.77 s
> Checking ciborium-io v0.2.2
413.77 s
> Checking digest v0.10.7
413.77 s
> Checking nom v7.1.3
413.77 s
> Checking ciborium-ll v0.2.2
413.77 s
> Checking derive_more v2.1.1
413.77 s
> Checking signal-hook-mio v0.2.5
413.77 s
> Checking num-bigint v0.4.6
413.77 s
> Checking console v0.16.3
413.77 s
> Checking bstr v1.12.1
413.77 s
> Checking cpufeatures v0.2.17
413.77 s
> Checking winnow v0.7.15
413.77 s
> Checking linux-raw-sys v0.4.15
413.77 s
> Checking sha2 v0.10.9
413.77 s
> Checking globset v0.4.18
413.77 s
> Checking rustix v0.38.44
413.77 s
> Checking ciborium v0.2.2
413.77 s
> Checking getrandom v0.4.2
413.77 s
> Checking rand_core v0.6.4
413.77 s
> Checking plotters-backend v0.3.7
413.77 s
> Checking fnv v1.0.7
413.77 s
> Compiling unicode_names2 v1.3.0
413.77 s
> Checking fastrand v2.4.1
413.77 s
> Checking rust-embed-utils v8.11.0
413.77 s
> Checking ansitok v0.3.0
413.77 s
> Checking serde_spanned v0.6.9
413.77 s
> Checking clap v4.6.1
413.77 s
> Checking toml_datetime v0.6.11
413.77 s
> Checking itertools v0.10.5
413.77 s
> Checking tempfile v3.27.0
413.77 s
> Checking plotters-svg v0.3.7
413.77 s
> Checking tap v1.0.1
413.77 s
> Checking cast v0.3.0
413.77 s
> Checking toml_write v0.1.2
413.77 s
> Checking plotters v0.3.7
413.77 s
> Checking wyz v0.5.1
413.77 s
> Checking crossterm v0.28.1
413.77 s
> Checking rand_chacha v0.3.1
413.77 s
> Checking radium v0.7.0
413.77 s
> Checking typeid v1.0.3
413.77 s
> Checking similar v2.7.0
413.77 s
> Checking ansi-str v0.9.0
413.77 s
> Checking tinytemplate v1.2.1
413.77 s
> Checking is-terminal v0.4.17
413.77 s
> Checking oorandom v11.1.5
413.77 s
> Checking funty v2.0.0
413.77 s
> Checking bytecount v0.6.9
413.77 s
> Checking anes v0.1.6
413.77 s
> Checking rand v0.8.6
413.77 s
> Checking toml_edit v0.22.27
413.77 s
> Checking ron v0.12.1
413.77 s
> Checking testing_table v0.3.0
413.77 s
> Checking papergrid v0.17.0
413.77 s
> Checking toml_edit v0.25.11+spec-1.1.0
413.77 s
> Checking bitvec v1.0.1
413.77 s
> Checking criterion-plot v0.5.0
413.77 s
> Checking uncased v0.9.10
413.77 s
> Checking env_filter v1.0.1
413.77 s
> Checking jiff v0.2.24
413.77 s
> Checking ptr_meta v0.1.4
413.77 s
> Checking xprec v0.2.2
413.77 s
> Checking ucd-trie v0.1.7
413.77 s
> Checking simdutf8 v0.1.5
413.77 s
> Checking criterion v0.5.1
413.77 s
> Checking pest v2.8.6
413.77 s
> Checking bytecheck v0.6.12
413.77 s
> Checking ahash v0.7.8
413.77 s
> Checking hashbrown v0.12.3
413.77 s
> Checking approx v0.4.0
413.77 s
> Compiling pyo3-ffi v0.28.3
413.77 s
> Compiling pyo3-macros-backend v0.28.3
413.77 s
> Compiling pyo3 v0.28.3
413.77 s
> Compiling numpy v0.28.0
413.77 s
> Checking tabled v0.20.0
413.77 s
> Checking rend v0.4.2
413.77 s
> Checking seahash v4.1.0
413.77 s
> Checking insta v1.47.2
413.77 s
> Checking cgmath v0.18.0
413.77 s
> Checking num-rational v0.4.2
413.77 s
> Checking num-iter v0.1.45
413.77 s
> Checking ref-ops v0.2.5
413.77 s
> Checking toml v0.8.23
413.77 s
> Checking rand_xoshiro v0.6.0
413.77 s
> Checking num v0.4.3
413.77 s
> Checking figment v0.10.19
413.77 s
> Checking features v0.10.0
413.77 s
> Checking gat-lending-iterator v0.1.8
413.77 s
> Checking constcat v0.5.1
413.77 s
> Checking colored v2.2.0
413.77 s
> Checking arrayref v0.3.9
413.77 s
> Checking constant_time_eq v0.4.2
413.77 s
> Checking dot-parser v0.5.1
413.77 s
> Checking cpufeatures v0.3.0
413.77 s
> Checking base64 v0.22.1
413.77 s
> Checking joinery v2.1.0
413.77 s
> Checking siphasher v1.0.2
413.77 s
> Checking titlecase v2.2.1
413.77 s
> Checking phf_shared v0.13.1
413.77 s
> Checking blake3 v1.8.5
413.77 s
> Checking subprocess v0.2.15
413.77 s
> Checking rust_lisp v0.18.0
413.77 s
> Compiling vakint v0.1.2 (/build/source/crates/vakint)
413.77 s
> Checking version-compare v0.2.1
413.77 s
> Checking phf v0.13.1
413.77 s
> Checking xpct v0.5.1
413.77 s
> Checking ryu v1.0.23
413.77 s
> Checking castaway v0.2.4
413.77 s
> Checking toml_datetime v0.7.5+spec-1.1.0
413.77 s
> Checking strum v0.27.2
413.77 s
> Checking compact_str v0.9.0
413.77 s
> Checking unicode-truncate v2.0.1
413.77 s
> Checking kasuari v0.4.12
413.77 s
> Checking lru v0.16.4
413.77 s
> Checking vte v0.15.0
413.77 s
> Checking toml v0.9.12+spec-1.1.0
413.77 s
> Checking portable-atomic v1.13.1
413.77 s
> Checking unit-prefix v0.5.2
413.77 s
> Checking rand_distr v0.4.3
413.77 s
> Checking vt100 v0.16.2
413.77 s
> Checking simba v0.6.0
413.77 s
> Checking line-clipping v0.3.7
413.77 s
> Checking gimli v0.32.3
413.77 s
> Checking adler2 v2.0.1
413.77 s
> Checking ratatui-core v0.1.0
413.77 s
> Compiling three-dimensional-reps v0.1.0 (/build/source/crates/three-dimensional-reps)
413.77 s
> Checking miniz_oxide v0.8.9
413.77 s
> Checking string-template-plus v0.4.3
413.77 s
> Checking thiserror v1.0.69
413.77 s
> Checking env_logger v0.11.10
413.77 s
> Checking derive_builder v0.11.2
413.77 s
> Checking owo-colors v4.3.0
413.77 s
> Checking indicatif v0.18.4
413.77 s
> Checking object v0.37.3
413.77 s
> Checking crossterm v0.29.0
413.77 s
> Checking tracing-error v0.2.1
413.77 s
> Checking typed-index-collections v3.5.0
413.77 s
> Checking serde-big-array v0.5.1
413.77 s
> Checking amd v0.2.2
413.77 s
> Checking itertools v0.11.0
413.77 s
> Compiling gammaloop-tracing-filter-macros v0.1.0 (/build/source/crates/gammaloop-tracing-filter-macros)
413.77 s
> Checking rkyv v0.7.46
413.77 s
> Checking option-ext v0.2.0
413.77 s
> Checking rustc-demangle v0.1.27
413.77 s
> Checking dirs-sys v0.5.0
413.77 s
> Checking ref-cast v1.0.25
413.77 s
> Checking nix v0.31.2
413.77 s
> Checking integer-sqrt v0.1.5
413.77 s
> Checking brotli-decompressor v4.0.3
413.77 s
> Checking crossbeam-channel v0.5.15
413.77 s
> Compiling rustpython-parser-core v0.4.0
413.77 s
> Checking color-spantrace v0.3.0
413.77 s
> Checking itertools v0.12.1
413.77 s
> Compiling gammalooprs v0.3.4 (/build/source/crates/gammalooprs)
413.77 s
> Checking symlink v0.1.0
413.77 s
> Checking unsafe-libyaml v0.2.11
413.77 s
> Checking ratatui-widgets v0.3.0
413.77 s
> Compiling rustpython-ast v0.4.0
413.77 s
> Checking ratatui-crossterm v0.1.0
413.77 s
> Checking pathfinding v4.15.0
413.77 s
> Checking include_dir v0.7.4
413.77 s
> Checking tracing-appender v0.2.5
413.77 s
> Checking tracing-indicatif v0.3.14
413.77 s
> Checking clarabel v0.11.1
413.77 s
> Checking schemars v1.2.1
413.77 s
> Checking dirs v6.0.0
413.77 s
> Checking ctrlc v3.5.2
413.77 s
> Checking slotmap v1.1.1
413.77 s
> Checking json5 v0.4.1
413.77 s
> Checking brotli v7.0.0
413.77 s
> Checking serde_yaml v0.9.34+deprecated
413.77 s
> Checking vectorize v0.2.0
413.77 s
> Checking base62 v2.2.4
413.77 s
> Checking ringbuffer v0.16.0
413.77 s
> Checking rust-embed v8.11.0
413.77 s
> Checking clap_complete v4.6.3
413.77 s
> Checking fd-lock v4.0.4
413.77 s
> Checking strip-ansi-escapes v0.2.1
413.77 s
> Checking addr2line v0.25.1
413.77 s
> Compiling gammaloop-api v0.1.0 (/build/source/crates/gammaloop-api)
413.77 s
> Checking ratatui-macros v0.7.0
413.77 s
> Checking itertools v0.13.0
413.77 s
> Checking strum v0.26.3
413.77 s
> Checking ratatui v0.30.0
413.77 s
> Checking sysinfo v0.33.1
413.77 s
> Checking shlex v1.3.0
413.77 s
> Checking futures-core v0.3.32
413.77 s
> Checking futures-task v0.3.32
413.77 s
> Checking slab v0.4.12
413.77 s
> Checking sdd v3.0.10
413.77 s
> Compiling gammaloop-integration-tests v0.1.0 (/build/source/tests)
413.77 s
> Compiling test-log-core v0.2.20
413.77 s
> Checking clap_complete_nushell v4.6.0
413.77 s
> Checking futures-util v0.3.32
413.77 s
> Compiling rustc_version v0.4.1
413.77 s
> Checking scc v2.4.0
413.77 s
> Checking which v8.0.2
413.77 s
> Checking bincode v1.3.3
413.77 s
> Compiling gungraun-runner v0.18.2
413.77 s
> Checking proc-macro2 v1.0.106
413.77 s
> Checking maplit v1.0.2
413.77 s
> Compiling gungraun-macros v0.8.0
413.77 s
> Checking quote v1.0.45
413.77 s
> Checking nalgebra v0.29.0
413.77 s
> Checking base64 v0.21.7
413.77 s
> Checking reedline v0.42.0
413.77 s
> Checking backtrace v0.3.76
413.77 s
> Checking ron v0.8.1
413.77 s
> Compiling numerica v2.2.0 (https://github.com/alphal00p/symbolica?rev=a277a8dadbaae5a8d6605f2f381991a601e1f345#a277a8da)
413.77 s
> Checking futures-executor v0.3.32
413.77 s
> Checking color-eyre v0.6.5
413.77 s
> Checking serial_test v3.4.0
413.77 s
> Compiling iai-callgrind-runner v0.14.2
413.77 s
> Checking kurbo v0.13.0
413.77 s
> Checking wait-timeout v0.2.1
413.77 s
> Compiling iai-callgrind v0.14.2
413.77 s
> Checking quick-error v1.2.3
413.77 s
> Checking bit-vec v0.8.0
413.77 s
> Checking rusty-fork v0.3.1
413.77 s
> Checking syn v2.0.117
413.77 s
> Compiling test-log-macros v0.2.20
413.77 s
> Checking bit-set v0.8.0
413.77 s
> Compiling iai-callgrind-macros v0.5.1
413.77 s
> Checking rand_xorshift v0.4.0
413.77 s
> Checking console v0.15.11
413.77 s
> Checking pathdiff v0.2.3
413.77 s
> Checking unarray v0.1.4
413.77 s
> Checking proptest v1.11.0
413.77 s
> Checking similar-asserts v1.7.0
413.77 s
> Checking clinnet v0.1.8 (/build/source/crates/clinnet)
413.77 s
> Checking kurvst v0.1.0 (/build/source/crates/kurvst)
413.77 s
> Checking test-log v0.2.20
413.77 s
> Compiling graphica v2.1.0 (https://github.com/alphal00p/symbolica?rev=a277a8dadbaae5a8d6605f2f381991a601e1f345#a277a8da)
413.77 s
> Checking statrs v0.16.1
413.77 s
> Checking gungraun v0.18.2
413.77 s
> Checking momtrop v0.3.0
413.77 s
> Compiling pyo3-macros v0.28.3
413.77 s
> Compiling pyo3-stub-gen-derive v0.17.2
413.77 s
> Checking pyo3-stub-gen v0.17.2
413.77 s
> Checking symbolica-utils v0.1.0 (/build/source/crates/symbolica-utils)
413.77 s
> Checking spenso-macros v0.3.2 (/build/source/crates/spenso-macros)
413.77 s
> Compiling gammaloop-workspace-hack v0.1.0 (/build/source/crates/gammaloop-workspace-hack)
413.77 s
> Checking linnet v0.17.0 (/build/source/crates/linnet)
413.77 s
> Checking spenso v0.6.0 (/build/source/crates/spenso)
413.77 s
> Checking linnet-py v0.1.0 (/build/source/crates/linnet-py)
413.77 s
> Checking linnest v0.1.0 (/build/source/crates/linnest)
413.77 s
> Checking idenso v0.3.0 (/build/source/crates/idenso)
413.77 s
> Checking gammaloop-tracing-filter v0.1.0 (/build/source/crates/gammaloop-tracing-filter)
413.77 s
> Checking spenso-hep-lib v0.1.7 (/build/source/crates/spenso-hep-lib)
413.77 s
> Checking spynso3 v0.1.2 (/build/source/crates/spynso3)
413.77 s
> error[E0609] : no field `lmb_channel_id` on type `CutInfo`
413.77 s
> --> tests/tests/test_runs/utils.rs:568:36
413.77 s
> |
413.77 s
> 568 | event.cut_info.lmb_channel_id,
413.77 s
> | ^^^^^^^^^^^^^^ unknown field
413.77 s
> |
413.77 s
> = note : available fields are: `particle_pdgs`, `cut_id`, `graph_id`, `graph_group_id`, `orientation_id` ... and 2 others
413.77 s
>
413.77 s
> error[E0609] : no field `lmb_channel_id` on type `CutInfo`
413.77 s
> --> tests/tests/test_runs/utils.rs:580:36
413.77 s
> |
413.77 s
> 580 | event.cut_info.lmb_channel_id,
413.77 s
> | ^^^^^^^^^^^^^^ unknown field
413.77 s
> |
413.77 s
> = note : available fields are: `particle_pdgs`, `cut_id`, `graph_id`, `graph_group_id`, `orientation_id` ... and 2 others
413.77 s
>
413.77 s
> For more information about this error, try `rustc --explain E0609`.
413.77 s
> error : could not compile `gammaloop-integration-tests` (test "test_runs") due to 2 previous errors
413.77 s
For full logs, run:
413.77 s
nix log /nix/store/hf02q68sy1ndsdmim1xajah34f6rdf0z-gammaloop-workspace-check-0.1.0.drv
413.81 s
Build failed.