build checks.x86_64-linux.gammaloop-check

Reproduce this run
Original Run
  1. 0.00 s $ /nix/store/9ypz3flqsrl5xl495mm8h645gadjsxi1-coreutils-9.11/bin/timeout --kill-after=15s 7200s /nix/store/23zk8sgzamrbmj1fday15szf7f2279s8-nix-2.34.7/bin/nix --extra-experimental-features nix-command --extra-experimental-features flakes --log-format internal-json build --no-link --print-out-paths git+https://github.com/alphal00p/gammaloop?ref=advanced_sampling&rev=f89addb17aa58fe7067932d90976b4f2b7c7d41d&shallow=1#checks.x86_64-linux.gammaloop-check --print-build-logs
  2. 3.13 s
  3. 3.65 s Building /nix/store/hf02q68sy1ndsdmim1xajah34f6rdf0z-gammaloop-workspace-check-0.1.0.drv
  4. 3.76 s [gammaloop-workspace-check] Phase: unpackPhase
  5. 3.77 s [gammaloop-workspace-check] unpacking source archive /nix/store/l80k18lnsv2ddgrh2zxvwqqdfi489njz-source
  6. 3.97 s [gammaloop-workspace-check] source root is source
  7. 4.01 s [gammaloop-workspace-check] Phase: patchPhase
  8. 4.01 s [gammaloop-workspace-check] Executing configureCargoCommonVars
  9. 4.02 s [gammaloop-workspace-check] decompressing cargo artifacts from /nix/store/50vpxlcgfxf2d57i27v3d10zjwxxbm2r-gammaloop-workspace-deps-deps-0.1.0/target.tar.zst to target
  10. 5.36 s [gammaloop-workspace-check] Phase: updateAutotoolsGnuConfigScriptsPhase
  11. 5.42 s [gammaloop-workspace-check] Phase: configurePhase
  12. 5.42 s [gammaloop-workspace-check] will append /build/source/.cargo-home/config.toml with contents of /nix/store/5drf77x6km4ky7gwlrzdx9bbd6fz09g3-vendor-cargo-deps/config.toml
  13. 5.42 s [gammaloop-workspace-check] default configurePhase, nothing to do
  14. 5.43 s [gammaloop-workspace-check] Phase: buildPhase
  15. 5.43 s [gammaloop-workspace-check] +++ command cargo --version
  16. 5.44 s [gammaloop-workspace-check] cargo 1.97.0 (c980f4866 2026-06-30)
  17. 5.49 s [gammaloop-workspace-check] +++ command cargo check --profile ci-optim --locked --workspace --features gammaloop-tracing-filter/clap,gammaloop-tracing-filter/symbolica,idenso/bincode,idenso/reference-cases,linnet/bincode,linnet/drawing,linnet/rkyv,linnet/serde,linnet/symbolica,spenso-macros/shadowing,spenso/shadowing,symbolica/tracing_max_level_info,three-dimensional-reps/display,three-dimensional-reps/eval,three-dimensional-reps/serde --all-targets
  18. 6.11 s [gammaloop-workspace-check] Checking cfg-if v1.0.4
  19. 6.12 s [gammaloop-workspace-check] Checking memchr v2.8.0
  20. 6.12 s [gammaloop-workspace-check] Checking once_cell v1.21.4
  21. 6.14 s [gammaloop-workspace-check] Checking either v1.15.0
  22. 6.15 s [gammaloop-workspace-check] Checking serde_core v1.0.228
  23. 6.15 s [gammaloop-workspace-check] Checking libc v0.2.186
  24. 6.15 s [gammaloop-workspace-check] Checking libm v0.2.16
  25. 6.16 s [gammaloop-workspace-check] Checking itoa v1.0.18
  26. 6.18 s [gammaloop-workspace-check] Checking log v0.4.29
  27. 6.18 s [gammaloop-workspace-check] Checking regex-syntax v0.8.10
  28. 6.19 s [gammaloop-workspace-check] Checking zerocopy v0.8.48
  29. 6.20 s [gammaloop-workspace-check] Checking crossbeam-utils v0.8.21
  30. 6.21 s [gammaloop-workspace-check] Checking equivalent v1.0.2
  31. 6.23 s [gammaloop-workspace-check] Checking zmij v1.0.21
  32. 6.23 s [gammaloop-workspace-check] Checking lazy_static v1.5.0
  33. 6.23 s [gammaloop-workspace-check] Checking bytemuck v1.25.0
  34. 6.23 s [gammaloop-workspace-check] Compiling target-lexicon v0.13.5
  35. 6.27 s [gammaloop-workspace-check] Checking arrayvec v0.7.6
  36. 6.29 s [gammaloop-workspace-check] Checking powerfmt v0.2.0
  37. 6.31 s [gammaloop-workspace-check] Checking itertools v0.14.0
  38. 6.32 s [gammaloop-workspace-check] Checking num-conv v0.2.1
  39. 6.32 s [gammaloop-workspace-check] Checking num_threads v0.1.7
  40. 6.34 s [gammaloop-workspace-check] Checking pin-project-lite v0.2.17
  41. 6.39 s [gammaloop-workspace-check] Checking time-core v0.1.8
  42. 6.40 s [gammaloop-workspace-check] Checking tracing-core v0.1.36
  43. 6.42 s [gammaloop-workspace-check] Checking safe_arch v0.7.4
  44. 6.43 s [gammaloop-workspace-check] Checking foldhash v0.2.0
  45. 6.43 s [gammaloop-workspace-check] Checking deranged v0.5.8
  46. 6.47 s [gammaloop-workspace-check] Checking allocator-api2 v0.2.21
  47. 6.48 s [gammaloop-workspace-check] Checking const-random v0.1.18
  48. 6.50 s [gammaloop-workspace-check] Checking nu-ansi-term v0.50.3
  49. 6.53 s [gammaloop-workspace-check] Checking unty v0.0.4
  50. 6.53 s [gammaloop-workspace-check] Checking static_assertions v1.1.0
  51. 6.58 s [gammaloop-workspace-check] Checking winnow v1.0.2
  52. 6.59 s [gammaloop-workspace-check] Checking safe_arch v1.0.0
  53. 6.59 s [gammaloop-workspace-check] Checking aho-corasick v1.1.4
  54. 6.65 s [gammaloop-workspace-check] Checking crossbeam-epoch v0.9.18
  55. 6.76 s [gammaloop-workspace-check] Checking wide v0.7.33
  56. 6.77 s [gammaloop-workspace-check] Checking sharded-slab v0.1.7
  57. 6.82 s [gammaloop-workspace-check] Checking hashbrown v0.16.1
  58. 6.84 s [gammaloop-workspace-check] Checking tracing v0.1.44
  59. 7.06 s [gammaloop-workspace-check] Checking crossbeam-deque v0.8.6
  60. 7.09 s [gammaloop-workspace-check] Checking tracing-log v0.2.0
  61. 7.12 s [gammaloop-workspace-check] Checking thread_local v1.1.9
  62. 7.28 s [gammaloop-workspace-check] Checking rayon-core v1.13.0
  63. 7.30 s [gammaloop-workspace-check] Checking indenter v0.3.4
  64. 7.32 s [gammaloop-workspace-check] Checking az v1.3.0
  65. 7.38 s [gammaloop-workspace-check] Checking toml_writer v1.1.1+spec-1.1.0
  66. 7.42 s [gammaloop-workspace-check] Checking wide v1.3.0
  67. 7.58 s [gammaloop-workspace-check] Checking num-traits v0.2.19
  68. 7.59 s [gammaloop-workspace-check] Compiling phf_shared v0.11.3
  69. 7.64 s [gammaloop-workspace-check] Checking anyhow v1.0.102
  70. 7.74 s [gammaloop-workspace-check] Checking utf8parse v0.2.2
  71. 7.77 s [gammaloop-workspace-check] Checking toml_parser v1.1.2+spec-1.1.0
  72. 7.84 s [gammaloop-workspace-check] Checking alloc-no-stdlib v2.0.4
  73. 7.85 s [gammaloop-workspace-check] Checking rawpointer v0.2.1
  74. 7.88 s [gammaloop-workspace-check] Checking dyn-clone v1.0.20
  75. 7.88 s [gammaloop-workspace-check] Checking getrandom v0.3.4
  76. 7.91 s [gammaloop-workspace-check] Checking time v0.3.47
  77. 7.92 s [gammaloop-workspace-check] Checking rayon v1.12.0
  78. 7.93 s [gammaloop-workspace-check] Checking gmp-mpfr-sys v1.7.1
  79. 7.93 s [gammaloop-workspace-check] Checking matrixmultiply v0.3.10
  80. 7.95 s [gammaloop-workspace-check] Checking alloc-stdlib v0.2.2
  81. 7.97 s [gammaloop-workspace-check] Checking anstyle-parse v1.0.0
  82. 8.06 s [gammaloop-workspace-check] Checking rand_core v0.9.5
  83. 8.08 s [gammaloop-workspace-check] Checking colorchoice v1.0.5
  84. 8.14 s [gammaloop-workspace-check] Checking colored v3.1.1
  85. 8.15 s [gammaloop-workspace-check] Checking anstyle v1.0.14
  86. 8.17 s [gammaloop-workspace-check] Checking is_terminal_polyfill v1.70.2
  87. 8.24 s [gammaloop-workspace-check] Checking anstyle-query v1.1.5
  88. 8.24 s [gammaloop-workspace-check] Compiling phf_generator v0.11.3
  89. 8.29 s [gammaloop-workspace-check] Compiling pyo3-build-config v0.28.3
  90. 8.30 s [gammaloop-workspace-check] Checking regex-automata v0.4.14
  91. 8.31 s [gammaloop-workspace-check] Checking eyre v0.6.12
  92. 8.34 s [gammaloop-workspace-check] Checking unicode-width v0.2.2
  93. 8.34 s [gammaloop-workspace-check] Checking anstream v1.0.0
  94. 8.37 s [gammaloop-workspace-check] Checking bitflags v1.3.2
  95. 8.38 s [gammaloop-workspace-check] Compiling phf_codegen v0.11.3
  96. 8.40 s [gammaloop-workspace-check] Checking approx v0.5.1
  97. 8.44 s [gammaloop-workspace-check] Checking num-integer v0.1.46
  98. 8.48 s [gammaloop-workspace-check] Checking region v3.0.2
  99. 8.50 s [gammaloop-workspace-check] Checking brotli-decompressor v5.0.0
  100. 8.52 s [gammaloop-workspace-check] Checking wasmtime-jit-icache-coherence v34.0.2
  101. 8.56 s [gammaloop-workspace-check] Checking hugepage-rs v0.1.1
  102. 8.57 s [gammaloop-workspace-check] Checking inventory v0.3.24
  103. 8.59 s [gammaloop-workspace-check] Checking spec_math v0.1.6
  104. 8.59 s [gammaloop-workspace-check] Checking thiserror v2.0.18
  105. 8.62 s [gammaloop-workspace-check] Compiling getopts v0.2.24
  106. 8.64 s [gammaloop-workspace-check] Checking serde v1.0.228
  107. 8.65 s [gammaloop-workspace-check] Checking serde_json v1.0.149
  108. 8.66 s [gammaloop-workspace-check] Checking bitflags v2.11.1
  109. 8.68 s [gammaloop-workspace-check] Checking serde_spanned v1.1.1
  110. 8.69 s [gammaloop-workspace-check] Checking toml_datetime v1.1.1+spec-1.1.0
  111. 8.70 s [gammaloop-workspace-check] Checking libloading v0.9.0
  112. 8.73 s [gammaloop-workspace-check] Checking byteorder v1.5.0
  113. 8.77 s [gammaloop-workspace-check] Checking self_cell v1.2.2
  114. 8.82 s [gammaloop-workspace-check] Checking tinyjson v2.5.1
  115. 8.85 s [gammaloop-workspace-check] Checking append-only-vec v0.1.8
  116. 8.86 s [gammaloop-workspace-check] Checking bytes v1.11.1
  117. 8.94 s [gammaloop-workspace-check] Compiling unicode_names2_generator v1.3.0
  118. 8.97 s [gammaloop-workspace-check] Checking toml v1.1.2+spec-1.1.0
  119. 8.98 s [gammaloop-workspace-check] Compiling unic-common v0.9.0
  120. 8.99 s [gammaloop-workspace-check] Checking linux-raw-sys v0.12.1
  121. 9.02 s [gammaloop-workspace-check] Compiling unic-char-range v0.9.0
  122. 9.05 s [gammaloop-workspace-check] Compiling unic-ucd-version v0.9.0
  123. 9.12 s [gammaloop-workspace-check] Compiling unic-char-property v0.9.0
  124. 9.14 s [gammaloop-workspace-check] Compiling is-macro v0.3.7
  125. 9.19 s [gammaloop-workspace-check] Checking smallvec v1.15.1
  126. 9.26 s [gammaloop-workspace-check] Checking num-complex v0.4.6
  127. 9.32 s [gammaloop-workspace-check] Checking bincode v2.0.1
  128. 9.39 s [gammaloop-workspace-check] Checking tracing-serde v0.2.0
  129. 9.39 s [gammaloop-workspace-check] Checking brotli v8.0.2
  130. 9.41 s [gammaloop-workspace-check] Checking smartstring v1.0.1
  131. 9.53 s [gammaloop-workspace-check] Checking rustix v1.1.4
  132. 9.62 s [gammaloop-workspace-check] Compiling rustpython-parser-vendored v0.4.0
  133. 9.70 s [gammaloop-workspace-check] Checking iana-time-zone v0.1.65
  134. 9.73 s [gammaloop-workspace-check] Checking simba v0.9.1
  135. 9.82 s [gammaloop-workspace-check] Compiling rustpython-parser v0.4.0
  136. 9.85 s [gammaloop-workspace-check] Checking chrono v0.4.44
  137. 9.91 s [gammaloop-workspace-check] Compiling phf v0.11.3
  138. 10.01 s [gammaloop-workspace-check] Checking rustc-hash v2.1.2
  139. 10.05 s [gammaloop-workspace-check] Checking ndarray v0.17.2
  140. 10.10 s [gammaloop-workspace-check] Compiling unic-ucd-ident v0.9.0
  141. 10.12 s [gammaloop-workspace-check] Compiling unic-emoji-char v0.9.0
  142. 10.15 s [gammaloop-workspace-check] Compiling lalrpop-util v0.20.2
  143. 10.15 s [gammaloop-workspace-check] Compiling rustc-hash v1.1.0
  144. 10.17 s [gammaloop-workspace-check] Checking rug v1.30.0
  145. 10.26 s [gammaloop-workspace-check] Checking unicode-segmentation v1.13.2
  146. 10.31 s [gammaloop-workspace-check] Compiling symbolica v2.2.0 (https://github.com/alphal00p/symbolica?rev=a277a8dadbaae5a8d6605f2f381991a601e1f345#a277a8da)
  147. 10.36 s [gammaloop-workspace-check] Checking typenum v1.20.0
  148. 10.38 s [gammaloop-workspace-check] Checking getrandom v0.2.17
  149. 10.51 s [gammaloop-workspace-check] Checking scopeguard v1.2.0
  150. 10.56 s [gammaloop-workspace-check] Checking lock_api v0.4.14
  151. 10.76 s [gammaloop-workspace-check] Checking parking_lot_core v0.9.12
  152. 10.81 s [gammaloop-workspace-check] Checking unicode-ident v1.0.24
  153. 10.87 s [gammaloop-workspace-check] Checking hashbrown v0.17.0
  154. 10.90 s [gammaloop-workspace-check] Checking errno v0.3.14
  155. 10.96 s [gammaloop-workspace-check] Checking parking_lot v0.12.5
  156. 11.03 s [gammaloop-workspace-check] Checking clap_lex v1.1.0
  157. 11.15 s [gammaloop-workspace-check] Checking generic-array v0.14.7
  158. 11.16 s [gammaloop-workspace-check] Checking strsim v0.11.1
  159. 11.19 s [gammaloop-workspace-check] Checking ppv-lite86 v0.2.21
  160. 11.20 s [gammaloop-workspace-check] Checking matchers v0.2.0
  161. 11.22 s [gammaloop-workspace-check] Checking ahash v0.8.12
  162. 11.26 s [gammaloop-workspace-check] Checking regex v1.12.3
  163. 11.31 s [gammaloop-workspace-check] Checking tracing-subscriber v0.3.23
  164. 11.35 s [gammaloop-workspace-check] Checking unicase v2.9.0
  165. 11.39 s [gammaloop-workspace-check] Checking signal-hook-registry v1.4.8
  166. 11.43 s [gammaloop-workspace-check] Checking indexmap v2.14.0
  167. 11.50 s [gammaloop-workspace-check] Checking vte v0.14.1
  168. 11.51 s [gammaloop-workspace-check] Checking same-file v1.0.6
  169. 11.56 s [gammaloop-workspace-check] Checking rand_chacha v0.9.0
  170. 11.60 s [gammaloop-workspace-check] Checking walkdir v2.5.0
  171. 11.69 s [gammaloop-workspace-check] Checking terminal_size v0.4.4
  172. 11.73 s [gammaloop-workspace-check] Checking signal-hook v0.3.18
  173. 11.76 s [gammaloop-workspace-check] Checking rand v0.9.4
  174. 11.78 s [gammaloop-workspace-check] Checking crypto-common v0.1.7
  175. 11.82 s [gammaloop-workspace-check] Checking block-buffer v0.10.4
  176. 11.84 s [gammaloop-workspace-check] Checking clap_builder v4.6.0
  177. 11.84 s [gammaloop-workspace-check] Checking half v2.7.1
  178. 11.91 s [gammaloop-workspace-check] Checking mio v1.2.0
  179. 11.96 s [gammaloop-workspace-check] Checking ciborium-io v0.2.2
  180. 11.98 s [gammaloop-workspace-check] Checking minimal-lexical v0.2.1
  181. 12.01 s [gammaloop-workspace-check] Checking digest v0.10.7
  182. 12.08 s [gammaloop-workspace-check] Checking derive_more v2.1.1
  183. 12.18 s [gammaloop-workspace-check] Checking ciborium-ll v0.2.2
  184. 12.18 s [gammaloop-workspace-check] Checking nom v7.1.3
  185. 12.18 s [gammaloop-workspace-check] Checking num-bigint v0.4.6
  186. 12.25 s [gammaloop-workspace-check] Checking console v0.16.3
  187. 12.38 s [gammaloop-workspace-check] Checking signal-hook-mio v0.2.5
  188. 12.43 s [gammaloop-workspace-check] Checking symjit v2.21.0
  189. 12.45 s [gammaloop-workspace-check] Checking bstr v1.12.1
  190. 12.48 s [gammaloop-workspace-check] Checking linux-raw-sys v0.4.15
  191. 12.72 s [gammaloop-workspace-check] Checking cpufeatures v0.2.17
  192. 12.79 s [gammaloop-workspace-check] Checking winnow v0.7.15
  193. 12.84 s [gammaloop-workspace-check] Checking rustix v0.38.44
  194. 12.87 s [gammaloop-workspace-check] Checking sha2 v0.10.9
  195. 12.91 s [gammaloop-workspace-check] Checking ciborium v0.2.2
  196. 13.14 s [gammaloop-workspace-check] Checking globset v0.4.18
  197. 13.32 s [gammaloop-workspace-check] Checking getrandom v0.4.2
  198. 13.51 s [gammaloop-workspace-check] Checking rand_core v0.6.4
  199. 13.57 s [gammaloop-workspace-check] Checking fnv v1.0.7
  200. 13.63 s [gammaloop-workspace-check] Checking fastrand v2.4.1
  201. 13.68 s [gammaloop-workspace-check] Checking plotters-backend v0.3.7
  202. 13.73 s [gammaloop-workspace-check] Checking crossterm v0.28.1
  203. 13.76 s [gammaloop-workspace-check] Checking rust-embed-utils v8.11.0
  204. 13.84 s [gammaloop-workspace-check] Checking toml_datetime v0.6.11
  205. 13.98 s [gammaloop-workspace-check] Compiling unicode_names2 v1.3.0
  206. 14.01 s [gammaloop-workspace-check] Checking serde_spanned v0.6.9
  207. 14.05 s [gammaloop-workspace-check] Checking tempfile v3.27.0
  208. 14.08 s [gammaloop-workspace-check] Checking itertools v0.10.5
  209. 14.14 s [gammaloop-workspace-check] Checking plotters-svg v0.3.7
  210. 14.17 s [gammaloop-workspace-check] Checking toml_write v0.1.2
  211. 14.27 s [gammaloop-workspace-check] Checking cast v0.3.0
  212. 14.39 s [gammaloop-workspace-check] Checking tap v1.0.1
  213. 14.42 s [gammaloop-workspace-check] Checking rand_chacha v0.3.1
  214. 14.44 s [gammaloop-workspace-check] Checking plotters v0.3.7
  215. 14.47 s [gammaloop-workspace-check] Checking ansitok v0.3.0
  216. 14.54 s [gammaloop-workspace-check] Checking radium v0.7.0
  217. 14.56 s [gammaloop-workspace-check] Checking wyz v0.5.1
  218. 14.72 s [gammaloop-workspace-check] Checking typeid v1.0.3
  219. 14.77 s [gammaloop-workspace-check] Checking similar v2.7.0
  220. 14.84 s [gammaloop-workspace-check] Checking tinytemplate v1.2.1
  221. 14.88 s [gammaloop-workspace-check] Checking clap v4.6.1
  222. 14.89 s [gammaloop-workspace-check] Checking is-terminal v0.4.17
  223. 14.95 s [gammaloop-workspace-check] Checking funty v2.0.0
  224. 14.97 s [gammaloop-workspace-check] Checking anes v0.1.6
  225. 15.02 s [gammaloop-workspace-check] Checking ansi-str v0.9.0
  226. 15.04 s [gammaloop-workspace-check] Checking xprec v0.2.2
  227. 15.06 s [gammaloop-workspace-check] Checking toml_edit v0.22.27
  228. 15.18 s [gammaloop-workspace-check] Checking bytecount v0.6.9
  229. 15.18 s [gammaloop-workspace-check] Checking oorandom v11.1.5
  230. 15.31 s [gammaloop-workspace-check] Checking testing_table v0.3.0
  231. 15.33 s [gammaloop-workspace-check] Checking ron v0.12.1
  232. 15.33 s [gammaloop-workspace-check] Checking rand v0.8.6
  233. 15.34 s [gammaloop-workspace-check] Checking toml_edit v0.25.11+spec-1.1.0
  234. 15.38 s [gammaloop-workspace-check] Checking uncased v0.9.10
  235. 15.39 s [gammaloop-workspace-check] Checking env_filter v1.0.1
  236. 15.43 s [gammaloop-workspace-check] Checking papergrid v0.17.0
  237. 15.55 s [gammaloop-workspace-check] Checking jiff v0.2.24
  238. 15.62 s [gammaloop-workspace-check] Checking ptr_meta v0.1.4
  239. 15.66 s [gammaloop-workspace-check] Checking criterion-plot v0.5.0
  240. 15.71 s [gammaloop-workspace-check] Checking simdutf8 v0.1.5
  241. 15.72 s [gammaloop-workspace-check] Checking bitvec v1.0.1
  242. 15.95 s [gammaloop-workspace-check] Checking ucd-trie v0.1.7
  243. 16.03 s [gammaloop-workspace-check] Checking bytecheck v0.6.12
  244. 16.05 s [gammaloop-workspace-check] Checking criterion v0.5.1
  245. 16.13 s [gammaloop-workspace-check] Checking pest v2.8.6
  246. 16.16 s [gammaloop-workspace-check] Checking ahash v0.7.8
  247. 16.52 s [gammaloop-workspace-check] Checking hashbrown v0.12.3
  248. 16.55 s [gammaloop-workspace-check] Checking approx v0.4.0
  249. 16.56 s [gammaloop-workspace-check] Checking rend v0.4.2
  250. 16.59 s [gammaloop-workspace-check] Checking seahash v4.1.0
  251. 16.66 s [gammaloop-workspace-check] Checking cgmath v0.18.0
  252. 16.76 s [gammaloop-workspace-check] Checking insta v1.47.2
  253. 16.78 s [gammaloop-workspace-check] Checking num-rational v0.4.2
  254. 16.94 s [gammaloop-workspace-check] Checking tabled v0.20.0
  255. 17.01 s [gammaloop-workspace-check] Compiling pyo3-ffi v0.28.3
  256. 17.09 s [gammaloop-workspace-check] Compiling pyo3-macros-backend v0.28.3
  257. 17.16 s [gammaloop-workspace-check] Compiling pyo3 v0.28.3
  258. 17.31 s [gammaloop-workspace-check] Compiling numpy v0.28.0
  259. 17.37 s [gammaloop-workspace-check] Checking toml v0.8.23
  260. 17.60 s [gammaloop-workspace-check] Checking num-iter v0.1.45
  261. 17.60 s [gammaloop-workspace-check] Checking dot-parser v0.5.1
  262. 17.66 s [gammaloop-workspace-check] Checking ref-ops v0.2.5
  263. 17.68 s [gammaloop-workspace-check] Checking num v0.4.3
  264. 17.72 s [gammaloop-workspace-check] Checking figment v0.10.19
  265. 17.76 s [gammaloop-workspace-check] Checking rand_xoshiro v0.6.0
  266. 17.78 s [gammaloop-workspace-check] Checking features v0.10.0
  267. 17.85 s [gammaloop-workspace-check] Checking constcat v0.5.1
  268. 17.89 s [gammaloop-workspace-check] Checking gat-lending-iterator v0.1.8
  269. 17.91 s [gammaloop-workspace-check] Checking colored v2.2.0
  270. 17.99 s [gammaloop-workspace-check] Checking constant_time_eq v0.4.2
  271. 18.02 s [gammaloop-workspace-check] Checking cpufeatures v0.3.0
  272. 18.09 s [gammaloop-workspace-check] Checking arrayref v0.3.9
  273. 18.11 s [gammaloop-workspace-check] Checking base64 v0.22.1
  274. 18.12 s [gammaloop-workspace-check] Checking joinery v2.1.0
  275. 18.14 s [gammaloop-workspace-check] Checking siphasher v1.0.2
  276. 18.14 s [gammaloop-workspace-check] Checking subprocess v0.2.15
  277. 18.17 s [gammaloop-workspace-check] Checking blake3 v1.8.5
  278. 18.28 s [gammaloop-workspace-check] Checking rust_lisp v0.18.0
  279. 18.33 s [gammaloop-workspace-check] Checking titlecase v2.2.1
  280. 18.36 s [gammaloop-workspace-check] Checking phf_shared v0.13.1
  281. 18.43 s [gammaloop-workspace-check] Compiling vakint v0.1.2 (/build/source/crates/vakint)
  282. 18.45 s [gammaloop-workspace-check] Checking version-compare v0.2.1
  283. 18.48 s [gammaloop-workspace-check] Checking xpct v0.5.1
  284. 18.50 s [gammaloop-workspace-check] Checking ryu v1.0.23
  285. 18.61 s [gammaloop-workspace-check] Checking phf v0.13.1
  286. 18.64 s [gammaloop-workspace-check] Checking castaway v0.2.4
  287. 18.64 s [gammaloop-workspace-check] Checking toml_datetime v0.7.5+spec-1.1.0
  288. 18.67 s [gammaloop-workspace-check] Checking strum v0.27.2
  289. 18.69 s [gammaloop-workspace-check] Checking unicode-truncate v2.0.1
  290. 18.71 s [gammaloop-workspace-check] Checking kasuari v0.4.12
  291. 18.75 s [gammaloop-workspace-check] Checking compact_str v0.9.0
  292. 18.78 s [gammaloop-workspace-check] Checking lru v0.16.4
  293. 18.83 s [gammaloop-workspace-check] Checking vte v0.15.0
  294. 18.83 s [gammaloop-workspace-check] Checking string-template-plus v0.4.3
  295. 18.84 s [gammaloop-workspace-check] Checking portable-atomic v1.13.1
  296. 18.89 s [gammaloop-workspace-check] Checking unit-prefix v0.5.2
  297. 18.91 s [gammaloop-workspace-check] Checking toml v0.9.12+spec-1.1.0
  298. 18.98 s [gammaloop-workspace-check] Compiling rustpython-parser-core v0.4.0
  299. 19.00 s [gammaloop-workspace-check] Checking rand_distr v0.4.3
  300. 19.03 s [gammaloop-workspace-check] Checking vt100 v0.16.2
  301. 19.04 s [gammaloop-workspace-check] Checking simba v0.6.0
  302. 19.06 s [gammaloop-workspace-check] Checking line-clipping v0.3.7
  303. 19.14 s [gammaloop-workspace-check] Checking adler2 v2.0.1
  304. 19.19 s [gammaloop-workspace-check] Compiling rustpython-ast v0.4.0
  305. 19.26 s [gammaloop-workspace-check] Checking gimli v0.32.3
  306. 19.30 s [gammaloop-workspace-check] Compiling three-dimensional-reps v0.1.0 (/build/source/crates/three-dimensional-reps)
  307. 19.32 s [gammaloop-workspace-check] Checking miniz_oxide v0.8.9
  308. 19.35 s [gammaloop-workspace-check] Checking thiserror v1.0.69
  309. 19.36 s [gammaloop-workspace-check] Checking ratatui-core v0.1.0
  310. 19.40 s [gammaloop-workspace-check] Checking derive_builder v0.11.2
  311. 19.44 s [gammaloop-workspace-check] Checking object v0.37.3
  312. 19.46 s [gammaloop-workspace-check] Checking crossterm v0.29.0
  313. 19.51 s [gammaloop-workspace-check] Checking owo-colors v4.3.0
  314. 19.53 s [gammaloop-workspace-check] Checking tracing-error v0.2.1
  315. 19.59 s [gammaloop-workspace-check] Checking env_logger v0.11.10
  316. 19.62 s [gammaloop-workspace-check] Checking indicatif v0.18.4
  317. 19.66 s [gammaloop-workspace-check] Checking typed-index-collections v3.5.0
  318. 19.70 s [gammaloop-workspace-check] Checking serde-big-array v0.5.1
  319. 19.75 s [gammaloop-workspace-check] Checking amd v0.2.2
  320. 19.90 s [gammaloop-workspace-check] Checking itertools v0.11.0
  321. 19.92 s [gammaloop-workspace-check] Compiling gammaloop-tracing-filter-macros v0.1.0 (/build/source/crates/gammaloop-tracing-filter-macros)
  322. 19.99 s [gammaloop-workspace-check] Checking option-ext v0.2.0
  323. 20.01 s [gammaloop-workspace-check] Checking rustc-demangle v0.1.27
  324. 20.06 s [gammaloop-workspace-check] Checking dirs-sys v0.5.0
  325. 20.08 s [gammaloop-workspace-check] Checking ref-cast v1.0.25
  326. 20.16 s [gammaloop-workspace-check] Checking nix v0.31.2
  327. 20.25 s [gammaloop-workspace-check] Checking rkyv v0.7.46
  328. 20.25 s [gammaloop-workspace-check] Checking integer-sqrt v0.1.5
  329. 20.34 s [gammaloop-workspace-check] Checking brotli-decompressor v4.0.3
  330. 20.37 s [gammaloop-workspace-check] Checking crossbeam-channel v0.5.15
  331. 20.39 s [gammaloop-workspace-check] Checking itertools v0.12.1
  332. 20.42 s [gammaloop-workspace-check] Checking symlink v0.1.0
  333. 20.44 s [gammaloop-workspace-check] Checking color-spantrace v0.3.0
  334. 20.48 s [gammaloop-workspace-check] Checking unsafe-libyaml v0.2.11
  335. 20.52 s [gammaloop-workspace-check] Compiling gammalooprs v0.3.4 (/build/source/crates/gammalooprs)
  336. 20.74 s [gammaloop-workspace-check] Checking tracing-indicatif v0.3.14
  337. 20.86 s [gammaloop-workspace-check] Checking ratatui-widgets v0.3.0
  338. 20.94 s [gammaloop-workspace-check] Checking ratatui-crossterm v0.1.0
  339. 21.01 s [gammaloop-workspace-check] Checking include_dir v0.7.4
  340. 21.04 s [gammaloop-workspace-check] Checking tracing-appender v0.2.5
  341. 21.06 s [gammaloop-workspace-check] Checking ctrlc v3.5.2
  342. 21.18 s [gammaloop-workspace-check] Checking pathfinding v4.15.0
  343. 21.19 s [gammaloop-workspace-check] Checking dirs v6.0.0
  344. 21.22 s [gammaloop-workspace-check] Checking schemars v1.2.1
  345. 21.26 s [gammaloop-workspace-check] Checking slotmap v1.1.1
  346. 21.37 s [gammaloop-workspace-check] Checking brotli v7.0.0
  347. 21.50 s [gammaloop-workspace-check] Checking clarabel v0.11.1
  348. 21.75 s [gammaloop-workspace-check] Checking serde_yaml v0.9.34+deprecated
  349. 21.85 s [gammaloop-workspace-check] Checking json5 v0.4.1
  350. 21.89 s [gammaloop-workspace-check] Checking vectorize v0.2.0
  351. 21.97 s [gammaloop-workspace-check] Checking ringbuffer v0.16.0
  352. 22.23 s [gammaloop-workspace-check] Checking base62 v2.2.4
  353. 22.26 s [gammaloop-workspace-check] Checking rust-embed v8.11.0
  354. 22.28 s [gammaloop-workspace-check] Checking clap_complete v4.6.3
  355. 22.28 s [gammaloop-workspace-check] Checking fd-lock v4.0.4
  356. 22.30 s [gammaloop-workspace-check] Checking addr2line v0.25.1
  357. 22.36 s [gammaloop-workspace-check] Checking strip-ansi-escapes v0.2.1
  358. 22.40 s [gammaloop-workspace-check] Compiling gammaloop-api v0.1.0 (/build/source/crates/gammaloop-api)
  359. 22.42 s [gammaloop-workspace-check] Checking ratatui-macros v0.7.0
  360. 22.45 s [gammaloop-workspace-check] Checking itertools v0.13.0
  361. 22.47 s [gammaloop-workspace-check] Checking strum v0.26.3
  362. 22.55 s [gammaloop-workspace-check] Checking ratatui v0.30.0
  363. 22.60 s [gammaloop-workspace-check] Checking sysinfo v0.33.1
  364. 22.66 s [gammaloop-workspace-check] Checking shlex v1.3.0
  365. 22.67 s [gammaloop-workspace-check] Checking futures-task v0.3.32
  366. 22.77 s [gammaloop-workspace-check] Checking clap_complete_nushell v4.6.0
  367. 22.83 s [gammaloop-workspace-check] Checking slab v0.4.12
  368. 22.85 s [gammaloop-workspace-check] Checking futures-core v0.3.32
  369. 22.90 s [gammaloop-workspace-check] Checking sdd v3.0.10
  370. 22.97 s [gammaloop-workspace-check] Compiling gammaloop-integration-tests v0.1.0 (/build/source/tests)
  371. 23.00 s [gammaloop-workspace-check] Compiling test-log-core v0.2.20
  372. 23.02 s [gammaloop-workspace-check] Checking futures-util v0.3.32
  373. 23.05 s [gammaloop-workspace-check] Compiling rustc_version v0.4.1
  374. 23.08 s [gammaloop-workspace-check] Checking which v8.0.2
  375. 23.11 s [gammaloop-workspace-check] Checking scc v2.4.0
  376. 23.34 s [gammaloop-workspace-check] Checking bincode v1.3.3
  377. 23.52 s [gammaloop-workspace-check] Compiling numerica v2.2.0 (https://github.com/alphal00p/symbolica?rev=a277a8dadbaae5a8d6605f2f381991a601e1f345#a277a8da)
  378. 23.58 s [gammaloop-workspace-check] Compiling gungraun-runner v0.18.2
  379. 23.90 s [gammaloop-workspace-check] Checking backtrace v0.3.76
  380. 24.31 s [gammaloop-workspace-check] Checking reedline v0.42.0
  381. 24.37 s [gammaloop-workspace-check] Compiling gungraun-macros v0.8.0
  382. 24.61 s [gammaloop-workspace-check] Checking color-eyre v0.6.5
  383. 24.81 s [gammaloop-workspace-check] Checking nalgebra v0.29.0
  384. 25.00 s [gammaloop-workspace-check] Checking proc-macro2 v1.0.106
  385. 25.17 s [gammaloop-workspace-check] Checking base64 v0.21.7
  386. 25.34 s [gammaloop-workspace-check] Checking futures-executor v0.3.32
  387. 25.42 s [gammaloop-workspace-check] Checking maplit v1.0.2
  388. 25.57 s [gammaloop-workspace-check] Compiling iai-callgrind-runner v0.14.2
  389. 25.66 s [gammaloop-workspace-check] Checking serial_test v3.4.0
  390. 25.69 s [gammaloop-workspace-check] Checking ron v0.8.1
  391. 25.80 s [gammaloop-workspace-check] Checking kurbo v0.13.0
  392. 25.82 s [gammaloop-workspace-check] Checking quote v1.0.45
  393. 25.89 s [gammaloop-workspace-check] Checking wait-timeout v0.2.1
  394. 26.08 s [gammaloop-workspace-check] Checking bit-vec v0.8.0
  395. 26.09 s [gammaloop-workspace-check] Checking quick-error v1.2.3
  396. 26.11 s [gammaloop-workspace-check] Compiling test-log-macros v0.2.20
  397. 26.13 s [gammaloop-workspace-check] Compiling iai-callgrind v0.14.2
  398. 26.21 s [gammaloop-workspace-check] Checking rusty-fork v0.3.1
  399. 26.28 s [gammaloop-workspace-check] Checking bit-set v0.8.0
  400. 26.46 s [gammaloop-workspace-check] Checking syn v2.0.117
  401. 26.47 s [gammaloop-workspace-check] Compiling iai-callgrind-macros v0.5.1
  402. 26.50 s [gammaloop-workspace-check] Checking rand_xorshift v0.4.0
  403. 26.59 s [gammaloop-workspace-check] Checking console v0.15.11
  404. 26.66 s [gammaloop-workspace-check] Checking pathdiff v0.2.3
  405. 26.74 s [gammaloop-workspace-check] Checking unarray v0.1.4
  406. 26.82 s [gammaloop-workspace-check] Checking proptest v1.11.0
  407. 26.97 s [gammaloop-workspace-check] Checking similar-asserts v1.7.0
  408. 26.98 s [gammaloop-workspace-check] Checking kurvst v0.1.0 (/build/source/crates/kurvst)
  409. 27.11 s [gammaloop-workspace-check] Checking clinnet v0.1.8 (/build/source/crates/clinnet)
  410. 28.07 s [gammaloop-workspace-check] Compiling graphica v2.1.0 (https://github.com/alphal00p/symbolica?rev=a277a8dadbaae5a8d6605f2f381991a601e1f345#a277a8da)
  411. 29.05 s [gammaloop-workspace-check] Checking test-log v0.2.20
  412. 31.19 s [gammaloop-workspace-check] Checking statrs v0.16.1
  413. 31.99 s [gammaloop-workspace-check] Checking momtrop v0.3.0
  414. 33.87 s [gammaloop-workspace-check] Checking gungraun v0.18.2
  415. 34.87 s [gammaloop-workspace-check] Compiling pyo3-stub-gen-derive v0.17.2
  416. 36.61 s [gammaloop-workspace-check] Compiling pyo3-macros v0.28.3
  417. 44.05 s [gammaloop-workspace-check] Checking pyo3-stub-gen v0.17.2
  418. 52.25 s [gammaloop-workspace-check] Checking symbolica-utils v0.1.0 (/build/source/crates/symbolica-utils)
  419. 52.26 s [gammaloop-workspace-check] Checking spenso-macros v0.3.2 (/build/source/crates/spenso-macros)
  420. 262.26 s [gammaloop-workspace-check] Compiling gammaloop-workspace-hack v0.1.0 (/build/source/crates/gammaloop-workspace-hack)
  421. 262.53 s [gammaloop-workspace-check] Checking linnet v0.17.0 (/build/source/crates/linnet)
  422. 266.41 s [gammaloop-workspace-check] Checking spenso v0.6.0 (/build/source/crates/spenso)
  423. 266.42 s [gammaloop-workspace-check] Checking linnet-py v0.1.0 (/build/source/crates/linnet-py)
  424. 266.42 s [gammaloop-workspace-check] Checking linnest v0.1.0 (/build/source/crates/linnest)
  425. 272.71 s [gammaloop-workspace-check] Checking idenso v0.3.0 (/build/source/crates/idenso)
  426. 272.71 s [gammaloop-workspace-check] Checking gammaloop-tracing-filter v0.1.0 (/build/source/crates/gammaloop-tracing-filter)
  427. 275.09 s [gammaloop-workspace-check] Checking spenso-hep-lib v0.1.7 (/build/source/crates/spenso-hep-lib)
  428. 275.29 s [gammaloop-workspace-check] Checking spynso3 v0.1.2 (/build/source/crates/spynso3)
  429. 322.13 s [gammaloop-workspace-check] error[E0609]: no field `lmb_channel_id` on type `CutInfo`
  430. 322.13 s [gammaloop-workspace-check] --> tests/tests/test_runs/utils.rs:568:36
  431. 322.13 s [gammaloop-workspace-check] |
  432. 322.13 s [gammaloop-workspace-check] 568 | event.cut_info.lmb_channel_id,
  433. 322.13 s [gammaloop-workspace-check] | ^^^^^^^^^^^^^^ unknown field
  434. 322.13 s [gammaloop-workspace-check] |
  435. 322.13 s [gammaloop-workspace-check] = note: available fields are: `particle_pdgs`, `cut_id`, `graph_id`, `graph_group_id`, `orientation_id` ... and 2 others
  436. 322.13 s [gammaloop-workspace-check]
  437. 322.13 s [gammaloop-workspace-check] error[E0609]: no field `lmb_channel_id` on type `CutInfo`
  438. 322.13 s [gammaloop-workspace-check] --> tests/tests/test_runs/utils.rs:580:36
  439. 322.13 s [gammaloop-workspace-check] |
  440. 322.13 s [gammaloop-workspace-check] 580 | event.cut_info.lmb_channel_id,
  441. 322.13 s [gammaloop-workspace-check] | ^^^^^^^^^^^^^^ unknown field
  442. 322.13 s [gammaloop-workspace-check] |
  443. 322.13 s [gammaloop-workspace-check] = note: available fields are: `particle_pdgs`, `cut_id`, `graph_id`, `graph_group_id`, `orientation_id` ... and 2 others
  444. 322.13 s [gammaloop-workspace-check]
  445. 322.78 s [gammaloop-workspace-check] For more information about this error, try `rustc --explain E0609`.
  446. 322.81 s [gammaloop-workspace-check] error: could not compile `gammaloop-integration-tests` (test "test_runs") due to 2 previous errors
  447. 323.67 s Progress: 0 of 1 built (1 failed)
  448. 323.67 s Failed to build gammaloop-workspace-check after 5m20s
  449. 323.68 s Cannot build '/nix/store/hf02q68sy1ndsdmim1xajah34f6rdf0z-gammaloop-workspace-check-0.1.0.drv'.
  450. 323.68 s Reason: builder failed with exit code 101.
  451. 323.68 s Output paths:
  452. 323.68 s /nix/store/a046g8g2g4l0nk90h7mpbjk09nss2las-gammaloop-workspace-check-0.1.0
  453. 323.68 s Last 443 log lines:
  454. 323.68 s > Running phase: unpackPhase
  455. 323.68 s > unpacking source archive /nix/store/l80k18lnsv2ddgrh2zxvwqqdfi489njz-source
  456. 323.68 s > source root is source
  457. 323.68 s > Running phase: patchPhase
  458. 323.68 s > Executing configureCargoCommonVars
  459. 323.68 s > decompressing cargo artifacts from /nix/store/50vpxlcgfxf2d57i27v3d10zjwxxbm2r-gammaloop-workspace-deps-deps-0.1.0/target.tar.zst to target
  460. 323.68 s > Running phase: updateAutotoolsGnuConfigScriptsPhase
  461. 323.68 s > Running phase: configurePhase
  462. 323.68 s > will append /build/source/.cargo-home/config.toml with contents of /nix/store/5drf77x6km4ky7gwlrzdx9bbd6fz09g3-vendor-cargo-deps/config.toml
  463. 323.68 s > default configurePhase, nothing to do
  464. 323.68 s > Running phase: buildPhase
  465. 323.68 s > +++ command cargo --version
  466. 323.68 s > cargo 1.97.0 (c980f4866 2026-06-30)
  467. 323.68 s > +++ command cargo check --profile ci-optim --locked --workspace --features gammaloop-tracing-filter/clap,gammaloop-tracing-filter/symbolica,idenso/bincode,idenso/reference-cases,linnet/bincode,linnet/drawing,linnet/rkyv,linnet/serde,linnet/symbolica,spenso-macros/shadowing,spenso/shadowing,symbolica/tracing_max_level_info,three-dimensional-reps/display,three-dimensional-reps/eval,three-dimensional-reps/serde --all-targets
  468. 323.68 s > Checking cfg-if v1.0.4
  469. 323.68 s > Checking memchr v2.8.0
  470. 323.68 s > Checking once_cell v1.21.4
  471. 323.68 s > Checking either v1.15.0
  472. 323.68 s > Checking serde_core v1.0.228
  473. 323.68 s > Checking libc v0.2.186
  474. 323.68 s > Checking libm v0.2.16
  475. 323.68 s > Checking itoa v1.0.18
  476. 323.68 s > Checking log v0.4.29
  477. 323.68 s > Checking regex-syntax v0.8.10
  478. 323.68 s > Checking zerocopy v0.8.48
  479. 323.68 s > Checking crossbeam-utils v0.8.21
  480. 323.68 s > Checking equivalent v1.0.2
  481. 323.68 s > Checking zmij v1.0.21
  482. 323.68 s > Checking lazy_static v1.5.0
  483. 323.68 s > Checking bytemuck v1.25.0
  484. 323.68 s > Compiling target-lexicon v0.13.5
  485. 323.68 s > Checking arrayvec v0.7.6
  486. 323.68 s > Checking powerfmt v0.2.0
  487. 323.68 s > Checking itertools v0.14.0
  488. 323.68 s > Checking num-conv v0.2.1
  489. 323.68 s > Checking num_threads v0.1.7
  490. 323.68 s > Checking pin-project-lite v0.2.17
  491. 323.68 s > Checking time-core v0.1.8
  492. 323.68 s > Checking tracing-core v0.1.36
  493. 323.68 s > Checking safe_arch v0.7.4
  494. 323.68 s > Checking foldhash v0.2.0
  495. 323.68 s > Checking deranged v0.5.8
  496. 323.68 s > Checking allocator-api2 v0.2.21
  497. 323.68 s > Checking const-random v0.1.18
  498. 323.68 s > Checking nu-ansi-term v0.50.3
  499. 323.68 s > Checking unty v0.0.4
  500. 323.68 s > Checking static_assertions v1.1.0
  501. 323.68 s > Checking winnow v1.0.2
  502. 323.68 s > Checking safe_arch v1.0.0
  503. 323.68 s > Checking aho-corasick v1.1.4
  504. 323.68 s > Checking crossbeam-epoch v0.9.18
  505. 323.68 s > Checking wide v0.7.33
  506. 323.68 s > Checking sharded-slab v0.1.7
  507. 323.68 s > Checking hashbrown v0.16.1
  508. 323.68 s > Checking tracing v0.1.44
  509. 323.68 s > Checking crossbeam-deque v0.8.6
  510. 323.68 s > Checking tracing-log v0.2.0
  511. 323.68 s > Checking thread_local v1.1.9
  512. 323.68 s > Checking rayon-core v1.13.0
  513. 323.68 s > Checking indenter v0.3.4
  514. 323.68 s > Checking az v1.3.0
  515. 323.68 s > Checking toml_writer v1.1.1+spec-1.1.0
  516. 323.68 s > Checking wide v1.3.0
  517. 323.68 s > Checking num-traits v0.2.19
  518. 323.68 s > Compiling phf_shared v0.11.3
  519. 323.68 s > Checking anyhow v1.0.102
  520. 323.68 s > Checking utf8parse v0.2.2
  521. 323.68 s > Checking toml_parser v1.1.2+spec-1.1.0
  522. 323.68 s > Checking alloc-no-stdlib v2.0.4
  523. 323.68 s > Checking rawpointer v0.2.1
  524. 323.68 s > Checking dyn-clone v1.0.20
  525. 323.68 s > Checking getrandom v0.3.4
  526. 323.68 s > Checking time v0.3.47
  527. 323.68 s > Checking rayon v1.12.0
  528. 323.68 s > Checking gmp-mpfr-sys v1.7.1
  529. 323.68 s > Checking matrixmultiply v0.3.10
  530. 323.68 s > Checking alloc-stdlib v0.2.2
  531. 323.68 s > Checking anstyle-parse v1.0.0
  532. 323.68 s > Checking rand_core v0.9.5
  533. 323.68 s > Checking colorchoice v1.0.5
  534. 323.68 s > Checking colored v3.1.1
  535. 323.68 s > Checking anstyle v1.0.14
  536. 323.68 s > Checking is_terminal_polyfill v1.70.2
  537. 323.68 s > Checking anstyle-query v1.1.5
  538. 323.68 s > Compiling phf_generator v0.11.3
  539. 323.68 s > Compiling pyo3-build-config v0.28.3
  540. 323.68 s > Checking regex-automata v0.4.14
  541. 323.68 s > Checking eyre v0.6.12
  542. 323.68 s > Checking unicode-width v0.2.2
  543. 323.68 s > Checking anstream v1.0.0
  544. 323.68 s > Checking bitflags v1.3.2
  545. 323.68 s > Compiling phf_codegen v0.11.3
  546. 323.68 s > Checking approx v0.5.1
  547. 323.68 s > Checking num-integer v0.1.46
  548. 323.68 s > Checking region v3.0.2
  549. 323.68 s > Checking brotli-decompressor v5.0.0
  550. 323.68 s > Checking wasmtime-jit-icache-coherence v34.0.2
  551. 323.68 s > Checking hugepage-rs v0.1.1
  552. 323.68 s > Checking inventory v0.3.24
  553. 323.68 s > Checking spec_math v0.1.6
  554. 323.68 s > Checking thiserror v2.0.18
  555. 323.68 s > Compiling getopts v0.2.24
  556. 323.68 s > Checking serde v1.0.228
  557. 323.68 s > Checking serde_json v1.0.149
  558. 323.68 s > Checking bitflags v2.11.1
  559. 323.68 s > Checking serde_spanned v1.1.1
  560. 323.68 s > Checking toml_datetime v1.1.1+spec-1.1.0
  561. 323.68 s > Checking libloading v0.9.0
  562. 323.68 s > Checking byteorder v1.5.0
  563. 323.68 s > Checking self_cell v1.2.2
  564. 323.68 s > Checking tinyjson v2.5.1
  565. 323.68 s > Checking append-only-vec v0.1.8
  566. 323.68 s > Checking bytes v1.11.1
  567. 323.68 s > Compiling unicode_names2_generator v1.3.0
  568. 323.68 s > Checking toml v1.1.2+spec-1.1.0
  569. 323.68 s > Compiling unic-common v0.9.0
  570. 323.68 s > Checking linux-raw-sys v0.12.1
  571. 323.68 s > Compiling unic-char-range v0.9.0
  572. 323.68 s > Compiling unic-ucd-version v0.9.0
  573. 323.68 s > Compiling unic-char-property v0.9.0
  574. 323.68 s > Compiling is-macro v0.3.7
  575. 323.68 s > Checking smallvec v1.15.1
  576. 323.68 s > Checking num-complex v0.4.6
  577. 323.68 s > Checking bincode v2.0.1
  578. 323.68 s > Checking tracing-serde v0.2.0
  579. 323.68 s > Checking brotli v8.0.2
  580. 323.68 s > Checking smartstring v1.0.1
  581. 323.68 s > Checking rustix v1.1.4
  582. 323.68 s > Compiling rustpython-parser-vendored v0.4.0
  583. 323.68 s > Checking iana-time-zone v0.1.65
  584. 323.68 s > Checking simba v0.9.1
  585. 323.68 s > Compiling rustpython-parser v0.4.0
  586. 323.68 s > Checking chrono v0.4.44
  587. 323.68 s > Compiling phf v0.11.3
  588. 323.68 s > Checking rustc-hash v2.1.2
  589. 323.68 s > Checking ndarray v0.17.2
  590. 323.68 s > Compiling unic-ucd-ident v0.9.0
  591. 323.68 s > Compiling unic-emoji-char v0.9.0
  592. 323.68 s > Compiling lalrpop-util v0.20.2
  593. 323.68 s > Compiling rustc-hash v1.1.0
  594. 323.68 s > Checking rug v1.30.0
  595. 323.68 s > Checking unicode-segmentation v1.13.2
  596. 323.68 s > Compiling symbolica v2.2.0 (https://github.com/alphal00p/symbolica?rev=a277a8dadbaae5a8d6605f2f381991a601e1f345#a277a8da)
  597. 323.68 s > Checking typenum v1.20.0
  598. 323.68 s > Checking getrandom v0.2.17
  599. 323.68 s > Checking scopeguard v1.2.0
  600. 323.68 s > Checking lock_api v0.4.14
  601. 323.68 s > Checking parking_lot_core v0.9.12
  602. 323.68 s > Checking unicode-ident v1.0.24
  603. 323.68 s > Checking hashbrown v0.17.0
  604. 323.68 s > Checking errno v0.3.14
  605. 323.68 s > Checking parking_lot v0.12.5
  606. 323.68 s > Checking clap_lex v1.1.0
  607. 323.68 s > Checking generic-array v0.14.7
  608. 323.68 s > Checking strsim v0.11.1
  609. 323.68 s > Checking ppv-lite86 v0.2.21
  610. 323.68 s > Checking matchers v0.2.0
  611. 323.68 s > Checking ahash v0.8.12
  612. 323.68 s > Checking regex v1.12.3
  613. 323.68 s > Checking tracing-subscriber v0.3.23
  614. 323.68 s > Checking unicase v2.9.0
  615. 323.68 s > Checking signal-hook-registry v1.4.8
  616. 323.68 s > Checking indexmap v2.14.0
  617. 323.68 s > Checking vte v0.14.1
  618. 323.68 s > Checking same-file v1.0.6
  619. 323.68 s > Checking rand_chacha v0.9.0
  620. 323.68 s > Checking walkdir v2.5.0
  621. 323.68 s > Checking terminal_size v0.4.4
  622. 323.68 s > Checking signal-hook v0.3.18
  623. 323.68 s > Checking rand v0.9.4
  624. 323.68 s > Checking crypto-common v0.1.7
  625. 323.68 s > Checking block-buffer v0.10.4
  626. 323.68 s > Checking clap_builder v4.6.0
  627. 323.68 s > Checking half v2.7.1
  628. 323.68 s > Checking mio v1.2.0
  629. 323.68 s > Checking ciborium-io v0.2.2
  630. 323.68 s > Checking minimal-lexical v0.2.1
  631. 323.68 s > Checking digest v0.10.7
  632. 323.68 s > Checking derive_more v2.1.1
  633. 323.68 s > Checking ciborium-ll v0.2.2
  634. 323.68 s > Checking nom v7.1.3
  635. 323.68 s > Checking num-bigint v0.4.6
  636. 323.68 s > Checking console v0.16.3
  637. 323.68 s > Checking signal-hook-mio v0.2.5
  638. 323.68 s > Checking symjit v2.21.0
  639. 323.68 s > Checking bstr v1.12.1
  640. 323.68 s > Checking linux-raw-sys v0.4.15
  641. 323.68 s > Checking cpufeatures v0.2.17
  642. 323.68 s > Checking winnow v0.7.15
  643. 323.68 s > Checking rustix v0.38.44
  644. 323.68 s > Checking sha2 v0.10.9
  645. 323.68 s > Checking ciborium v0.2.2
  646. 323.68 s > Checking globset v0.4.18
  647. 323.68 s > Checking getrandom v0.4.2
  648. 323.68 s > Checking rand_core v0.6.4
  649. 323.68 s > Checking fnv v1.0.7
  650. 323.68 s > Checking fastrand v2.4.1
  651. 323.68 s > Checking plotters-backend v0.3.7
  652. 323.68 s > Checking crossterm v0.28.1
  653. 323.68 s > Checking rust-embed-utils v8.11.0
  654. 323.68 s > Checking toml_datetime v0.6.11
  655. 323.68 s > Compiling unicode_names2 v1.3.0
  656. 323.68 s > Checking serde_spanned v0.6.9
  657. 323.68 s > Checking tempfile v3.27.0
  658. 323.68 s > Checking itertools v0.10.5
  659. 323.68 s > Checking plotters-svg v0.3.7
  660. 323.68 s > Checking toml_write v0.1.2
  661. 323.68 s > Checking cast v0.3.0
  662. 323.68 s > Checking tap v1.0.1
  663. 323.68 s > Checking rand_chacha v0.3.1
  664. 323.68 s > Checking plotters v0.3.7
  665. 323.68 s > Checking ansitok v0.3.0
  666. 323.68 s > Checking radium v0.7.0
  667. 323.68 s > Checking wyz v0.5.1
  668. 323.68 s > Checking typeid v1.0.3
  669. 323.68 s > Checking similar v2.7.0
  670. 323.68 s > Checking tinytemplate v1.2.1
  671. 323.68 s > Checking clap v4.6.1
  672. 323.68 s > Checking is-terminal v0.4.17
  673. 323.68 s > Checking funty v2.0.0
  674. 323.68 s > Checking anes v0.1.6
  675. 323.68 s > Checking ansi-str v0.9.0
  676. 323.68 s > Checking xprec v0.2.2
  677. 323.68 s > Checking toml_edit v0.22.27
  678. 323.68 s > Checking bytecount v0.6.9
  679. 323.68 s > Checking oorandom v11.1.5
  680. 323.68 s > Checking testing_table v0.3.0
  681. 323.68 s > Checking ron v0.12.1
  682. 323.68 s > Checking rand v0.8.6
  683. 323.68 s > Checking toml_edit v0.25.11+spec-1.1.0
  684. 323.68 s > Checking uncased v0.9.10
  685. 323.68 s > Checking env_filter v1.0.1
  686. 323.68 s > Checking papergrid v0.17.0
  687. 323.68 s > Checking jiff v0.2.24
  688. 323.68 s > Checking ptr_meta v0.1.4
  689. 323.68 s > Checking criterion-plot v0.5.0
  690. 323.68 s > Checking simdutf8 v0.1.5
  691. 323.68 s > Checking bitvec v1.0.1
  692. 323.68 s > Checking ucd-trie v0.1.7
  693. 323.68 s > Checking bytecheck v0.6.12
  694. 323.68 s > Checking criterion v0.5.1
  695. 323.68 s > Checking pest v2.8.6
  696. 323.68 s > Checking ahash v0.7.8
  697. 323.68 s > Checking hashbrown v0.12.3
  698. 323.68 s > Checking approx v0.4.0
  699. 323.68 s > Checking rend v0.4.2
  700. 323.68 s > Checking seahash v4.1.0
  701. 323.68 s > Checking cgmath v0.18.0
  702. 323.68 s > Checking insta v1.47.2
  703. 323.68 s > Checking num-rational v0.4.2
  704. 323.68 s > Checking tabled v0.20.0
  705. 323.68 s > Compiling pyo3-ffi v0.28.3
  706. 323.68 s > Compiling pyo3-macros-backend v0.28.3
  707. 323.68 s > Compiling pyo3 v0.28.3
  708. 323.68 s > Compiling numpy v0.28.0
  709. 323.68 s > Checking toml v0.8.23
  710. 323.68 s > Checking num-iter v0.1.45
  711. 323.68 s > Checking dot-parser v0.5.1
  712. 323.68 s > Checking ref-ops v0.2.5
  713. 323.68 s > Checking num v0.4.3
  714. 323.68 s > Checking figment v0.10.19
  715. 323.68 s > Checking rand_xoshiro v0.6.0
  716. 323.68 s > Checking features v0.10.0
  717. 323.68 s > Checking constcat v0.5.1
  718. 323.68 s > Checking gat-lending-iterator v0.1.8
  719. 323.68 s > Checking colored v2.2.0
  720. 323.68 s > Checking constant_time_eq v0.4.2
  721. 323.68 s > Checking cpufeatures v0.3.0
  722. 323.68 s > Checking arrayref v0.3.9
  723. 323.68 s > Checking base64 v0.22.1
  724. 323.68 s > Checking joinery v2.1.0
  725. 323.68 s > Checking siphasher v1.0.2
  726. 323.68 s > Checking subprocess v0.2.15
  727. 323.68 s > Checking blake3 v1.8.5
  728. 323.68 s > Checking rust_lisp v0.18.0
  729. 323.68 s > Checking titlecase v2.2.1
  730. 323.68 s > Checking phf_shared v0.13.1
  731. 323.68 s > Compiling vakint v0.1.2 (/build/source/crates/vakint)
  732. 323.68 s > Checking version-compare v0.2.1
  733. 323.68 s > Checking xpct v0.5.1
  734. 323.68 s > Checking ryu v1.0.23
  735. 323.68 s > Checking phf v0.13.1
  736. 323.68 s > Checking castaway v0.2.4
  737. 323.68 s > Checking toml_datetime v0.7.5+spec-1.1.0
  738. 323.68 s > Checking strum v0.27.2
  739. 323.68 s > Checking unicode-truncate v2.0.1
  740. 323.68 s > Checking kasuari v0.4.12
  741. 323.68 s > Checking compact_str v0.9.0
  742. 323.68 s > Checking lru v0.16.4
  743. 323.68 s > Checking vte v0.15.0
  744. 323.68 s > Checking string-template-plus v0.4.3
  745. 323.68 s > Checking portable-atomic v1.13.1
  746. 323.68 s > Checking unit-prefix v0.5.2
  747. 323.68 s > Checking toml v0.9.12+spec-1.1.0
  748. 323.68 s > Compiling rustpython-parser-core v0.4.0
  749. 323.68 s > Checking rand_distr v0.4.3
  750. 323.68 s > Checking vt100 v0.16.2
  751. 323.68 s > Checking simba v0.6.0
  752. 323.68 s > Checking line-clipping v0.3.7
  753. 323.68 s > Checking adler2 v2.0.1
  754. 323.68 s > Compiling rustpython-ast v0.4.0
  755. 323.68 s > Checking gimli v0.32.3
  756. 323.68 s > Compiling three-dimensional-reps v0.1.0 (/build/source/crates/three-dimensional-reps)
  757. 323.68 s > Checking miniz_oxide v0.8.9
  758. 323.68 s > Checking thiserror v1.0.69
  759. 323.68 s > Checking ratatui-core v0.1.0
  760. 323.68 s > Checking derive_builder v0.11.2
  761. 323.68 s > Checking object v0.37.3
  762. 323.68 s > Checking crossterm v0.29.0
  763. 323.68 s > Checking owo-colors v4.3.0
  764. 323.68 s > Checking tracing-error v0.2.1
  765. 323.68 s > Checking env_logger v0.11.10
  766. 323.68 s > Checking indicatif v0.18.4
  767. 323.68 s > Checking typed-index-collections v3.5.0
  768. 323.68 s > Checking serde-big-array v0.5.1
  769. 323.68 s > Checking amd v0.2.2
  770. 323.68 s > Checking itertools v0.11.0
  771. 323.68 s > Compiling gammaloop-tracing-filter-macros v0.1.0 (/build/source/crates/gammaloop-tracing-filter-macros)
  772. 323.68 s > Checking option-ext v0.2.0
  773. 323.68 s > Checking rustc-demangle v0.1.27
  774. 323.68 s > Checking dirs-sys v0.5.0
  775. 323.68 s > Checking ref-cast v1.0.25
  776. 323.68 s > Checking nix v0.31.2
  777. 323.68 s > Checking rkyv v0.7.46
  778. 323.68 s > Checking integer-sqrt v0.1.5
  779. 323.68 s > Checking brotli-decompressor v4.0.3
  780. 323.68 s > Checking crossbeam-channel v0.5.15
  781. 323.68 s > Checking itertools v0.12.1
  782. 323.68 s > Checking symlink v0.1.0
  783. 323.68 s > Checking color-spantrace v0.3.0
  784. 323.68 s > Checking unsafe-libyaml v0.2.11
  785. 323.68 s > Compiling gammalooprs v0.3.4 (/build/source/crates/gammalooprs)
  786. 323.68 s > Checking tracing-indicatif v0.3.14
  787. 323.68 s > Checking ratatui-widgets v0.3.0
  788. 323.68 s > Checking ratatui-crossterm v0.1.0
  789. 323.68 s > Checking include_dir v0.7.4
  790. 323.68 s > Checking tracing-appender v0.2.5
  791. 323.68 s > Checking ctrlc v3.5.2
  792. 323.68 s > Checking pathfinding v4.15.0
  793. 323.68 s > Checking dirs v6.0.0
  794. 323.68 s > Checking schemars v1.2.1
  795. 323.68 s > Checking slotmap v1.1.1
  796. 323.68 s > Checking brotli v7.0.0
  797. 323.68 s > Checking clarabel v0.11.1
  798. 323.68 s > Checking serde_yaml v0.9.34+deprecated
  799. 323.68 s > Checking json5 v0.4.1
  800. 323.68 s > Checking vectorize v0.2.0
  801. 323.68 s > Checking ringbuffer v0.16.0
  802. 323.68 s > Checking base62 v2.2.4
  803. 323.68 s > Checking rust-embed v8.11.0
  804. 323.68 s > Checking clap_complete v4.6.3
  805. 323.68 s > Checking fd-lock v4.0.4
  806. 323.68 s > Checking addr2line v0.25.1
  807. 323.68 s > Checking strip-ansi-escapes v0.2.1
  808. 323.68 s > Compiling gammaloop-api v0.1.0 (/build/source/crates/gammaloop-api)
  809. 323.68 s > Checking ratatui-macros v0.7.0
  810. 323.68 s > Checking itertools v0.13.0
  811. 323.68 s > Checking strum v0.26.3
  812. 323.68 s > Checking ratatui v0.30.0
  813. 323.68 s > Checking sysinfo v0.33.1
  814. 323.68 s > Checking shlex v1.3.0
  815. 323.68 s > Checking futures-task v0.3.32
  816. 323.68 s > Checking clap_complete_nushell v4.6.0
  817. 323.68 s > Checking slab v0.4.12
  818. 323.68 s > Checking futures-core v0.3.32
  819. 323.68 s > Checking sdd v3.0.10
  820. 323.68 s > Compiling gammaloop-integration-tests v0.1.0 (/build/source/tests)
  821. 323.68 s > Compiling test-log-core v0.2.20
  822. 323.68 s > Checking futures-util v0.3.32
  823. 323.68 s > Compiling rustc_version v0.4.1
  824. 323.68 s > Checking which v8.0.2
  825. 323.68 s > Checking scc v2.4.0
  826. 323.68 s > Checking bincode v1.3.3
  827. 323.68 s > Compiling numerica v2.2.0 (https://github.com/alphal00p/symbolica?rev=a277a8dadbaae5a8d6605f2f381991a601e1f345#a277a8da)
  828. 323.68 s > Compiling gungraun-runner v0.18.2
  829. 323.68 s > Checking backtrace v0.3.76
  830. 323.68 s > Checking reedline v0.42.0
  831. 323.68 s > Compiling gungraun-macros v0.8.0
  832. 323.68 s > Checking color-eyre v0.6.5
  833. 323.68 s > Checking nalgebra v0.29.0
  834. 323.68 s > Checking proc-macro2 v1.0.106
  835. 323.68 s > Checking base64 v0.21.7
  836. 323.68 s > Checking futures-executor v0.3.32
  837. 323.68 s > Checking maplit v1.0.2
  838. 323.68 s > Compiling iai-callgrind-runner v0.14.2
  839. 323.68 s > Checking serial_test v3.4.0
  840. 323.68 s > Checking ron v0.8.1
  841. 323.68 s > Checking kurbo v0.13.0
  842. 323.68 s > Checking quote v1.0.45
  843. 323.68 s > Checking wait-timeout v0.2.1
  844. 323.68 s > Checking bit-vec v0.8.0
  845. 323.68 s > Checking quick-error v1.2.3
  846. 323.68 s > Compiling test-log-macros v0.2.20
  847. 323.68 s > Compiling iai-callgrind v0.14.2
  848. 323.68 s > Checking rusty-fork v0.3.1
  849. 323.68 s > Checking bit-set v0.8.0
  850. 323.68 s > Checking syn v2.0.117
  851. 323.68 s > Compiling iai-callgrind-macros v0.5.1
  852. 323.68 s > Checking rand_xorshift v0.4.0
  853. 323.68 s > Checking console v0.15.11
  854. 323.68 s > Checking pathdiff v0.2.3
  855. 323.68 s > Checking unarray v0.1.4
  856. 323.68 s > Checking proptest v1.11.0
  857. 323.68 s > Checking similar-asserts v1.7.0
  858. 323.68 s > Checking kurvst v0.1.0 (/build/source/crates/kurvst)
  859. 323.68 s > Checking clinnet v0.1.8 (/build/source/crates/clinnet)
  860. 323.68 s > Compiling graphica v2.1.0 (https://github.com/alphal00p/symbolica?rev=a277a8dadbaae5a8d6605f2f381991a601e1f345#a277a8da)
  861. 323.68 s > Checking test-log v0.2.20
  862. 323.68 s > Checking statrs v0.16.1
  863. 323.68 s > Checking momtrop v0.3.0
  864. 323.68 s > Checking gungraun v0.18.2
  865. 323.68 s > Compiling pyo3-stub-gen-derive v0.17.2
  866. 323.68 s > Compiling pyo3-macros v0.28.3
  867. 323.68 s > Checking pyo3-stub-gen v0.17.2
  868. 323.68 s > Checking symbolica-utils v0.1.0 (/build/source/crates/symbolica-utils)
  869. 323.68 s > Checking spenso-macros v0.3.2 (/build/source/crates/spenso-macros)
  870. 323.68 s > Compiling gammaloop-workspace-hack v0.1.0 (/build/source/crates/gammaloop-workspace-hack)
  871. 323.68 s > Checking linnet v0.17.0 (/build/source/crates/linnet)
  872. 323.68 s > Checking spenso v0.6.0 (/build/source/crates/spenso)
  873. 323.68 s > Checking linnet-py v0.1.0 (/build/source/crates/linnet-py)
  874. 323.68 s > Checking linnest v0.1.0 (/build/source/crates/linnest)
  875. 323.68 s > Checking idenso v0.3.0 (/build/source/crates/idenso)
  876. 323.68 s > Checking gammaloop-tracing-filter v0.1.0 (/build/source/crates/gammaloop-tracing-filter)
  877. 323.68 s > Checking spenso-hep-lib v0.1.7 (/build/source/crates/spenso-hep-lib)
  878. 323.68 s > Checking spynso3 v0.1.2 (/build/source/crates/spynso3)
  879. 323.68 s > error[E0609]: no field `lmb_channel_id` on type `CutInfo`
  880. 323.68 s > --> tests/tests/test_runs/utils.rs:568:36
  881. 323.68 s > |
  882. 323.68 s > 568 | event.cut_info.lmb_channel_id,
  883. 323.68 s > | ^^^^^^^^^^^^^^ unknown field
  884. 323.68 s > |
  885. 323.68 s > = note: available fields are: `particle_pdgs`, `cut_id`, `graph_id`, `graph_group_id`, `orientation_id` ... and 2 others
  886. 323.68 s >
  887. 323.68 s > error[E0609]: no field `lmb_channel_id` on type `CutInfo`
  888. 323.68 s > --> tests/tests/test_runs/utils.rs:580:36
  889. 323.68 s > |
  890. 323.68 s > 580 | event.cut_info.lmb_channel_id,
  891. 323.68 s > | ^^^^^^^^^^^^^^ unknown field
  892. 323.68 s > |
  893. 323.68 s > = note: available fields are: `particle_pdgs`, `cut_id`, `graph_id`, `graph_group_id`, `orientation_id` ... and 2 others
  894. 323.68 s >
  895. 323.68 s > For more information about this error, try `rustc --explain E0609`.
  896. 323.68 s > error: could not compile `gammaloop-integration-tests` (test "test_runs") due to 2 previous errors
  897. 323.68 s For full logs, run:
  898. 323.68 s nix log /nix/store/hf02q68sy1ndsdmim1xajah34f6rdf0z-gammaloop-workspace-check-0.1.0.drv
  899. 323.74 s Build failed.