test packages.x86_64-linux.nix-ci-check-gammaloop-doctest
0.18 s
$ /nix/store/9ypz3flqsrl5xl495mm8h645gadjsxi1-coreutils-9.11/bin/timeout --kill-after=15s 7200s /nix/store/23zk8sgzamrbmj1fday15szf7f2279s8-nix-2.34.7/bin/nix --extra-experimental-features nix-command --extra-experimental-features flakes flake clone git+https://github.com/alphal00p/gammaloop --dest /tmp/nix-ci-worker/stable-pwd/repo/
0.23 s
Cloning into '/tmp/nix-ci-worker/stable-pwd/repo'...
1.49 s
remote: Enumerating objects: 62298, done.
1.61 s
remote: Counting objects: 0% (1/7652)
remote: Counting objects: 1% (77/7652)
remote: Counting objects: 2% (154/7652)
remote: Counting objects: 3% (230/7652)
remote: Counting objects: 4% (307/7652)
remote: Counting objects: 5% (383/7652)
remote: Counting objects: 6% (460/7652)
remote: Counting objects: 7% (536/7652)
remote: Counting objects: 8% (613/7652)
remote: Counting objects: 9% (689/7652)
remote: Counting objects: 10% (766/7652)
remote: Counting objects: 11% (842/7652)
remote: Counting objects: 12% (919/7652)
remote: Counting objects: 13% (995/7652)
remote: Counting objects: 14% (1072/7652)
remote: Counting objects: 15% (1148/7652)
remote: Counting objects: 16% (1225/7652)
remote: Counting objects: 17% (1301/7652)
remote: Counting objects: 18% (1378/7652)
remote: Counting objects: 19% (1454/7652)
remote: Counting objects: 20% (1531/7652)
remote: Counting objects: 21% (1607/7652)
remote: Counting objects: 22% (1684/7652)
remote: Counting objects: 23% (1760/7652)
remote: Counting objects: 24% (1837/7652)
remote: Counting objects: 25% (1913/7652)
remote: Counting objects: 26% (1990/7652)
remote: Counting objects: 27% (2067/7652)
remote: Counting objects: 28% (2143/7652)
remote: Counting objects: 29% (2220/7652)
remote: Counting objects: 30% (2296/7652)
remote: Counting objects: 31% (2373/7652)
remote: Counting objects: 32% (2449/7652)
remote: Counting objects: 33% (2526/7652)
remote: Counting objects: 34% (2602/7652)
remote: Counting objects: 35% (2679/7652)
remote: Counting objects: 36% (2755/7652)
remote: Counting objects: 37% (2832/7652)
remote: Counting objects: 38% (2908/7652)
remote: Counting objects: 39% (2985/7652)
remote: Counting objects: 40% (3061/7652)
remote: Counting objects: 41% (3138/7652)
remote: Counting objects: 42% (3214/7652)
remote: Counting objects: 43% (3291/7652)
remote: Counting objects: 44% (3367/7652)
remote: Counting objects: 45% (3444/7652)
remote: Counting objects: 46% (3520/7652)
remote: Counting objects: 47% (3597/7652)
remote: Counting objects: 48% (3673/7652)
remote: Counting objects: 49% (3750/7652)
remote: Counting objects: 50% (3826/7652)
remote: Counting objects: 51% (3903/7652)
remote: Counting objects: 52% (3980/7652)
remote: Counting objects: 53% (4056/7652)
remote: Counting objects: 54% (4133/7652)
remote: Counting objects: 55% (4209/7652)
remote: Counting objects: 56% (4286/7652)
remote: Counting objects: 57% (4362/7652)
remote: Counting objects: 58% (4439/7652)
remote: Counting objects: 59% (4515/7652)
remote: Counting objects: 60% (4592/7652)
remote: Counting objects: 61% (4668/7652)
remote: Counting objects: 62% (4745/7652)
remote: Counting objects: 63% (4821/7652)
remote: Counting objects: 64% (4898/7652)
remote: Counting objects: 65% (4974/7652)
remote: Counting objects: 66% (5051/7652)
remote: Counting objects: 67% (5127/7652)
remote: Counting objects: 68% (5204/7652)
remote: Counting objects: 69% (5280/7652)
remote: Counting objects: 70% (5357/7652)
remote: Counting objects: 71% (5433/7652)
remote: Counting objects: 72% (5510/7652)
remote: Counting objects: 73% (5586/7652)
remote: Counting objects: 74% (5663/7652)
remote: Counting objects: 75% (5739/7652)
remote: Counting objects: 76% (5816/7652)
remote: Counting objects: 77% (5893/7652)
remote: Counting objects: 78% (5969/7652)
remote: Counting objects: 79% (6046/7652)
remote: Counting objects: 80% (6122/7652)
remote: Counting objects: 81% (6199/7652)
remote: Counting objects: 82% (6275/7652)
remote: Counting objects: 83% (6352/7652)
remote: Counting objects: 84% (6428/7652)
remote: Counting objects: 85% (6505/7652)
remote: Counting objects: 86% (6581/7652)
remote: Counting objects: 87% (6658/7652)
remote: Counting objects: 88% (6734/7652)
remote: Counting objects: 89% (6811/7652)
remote: Counting objects: 90% (6887/7652)
remote: Counting objects: 91% (6964/7652)
remote: Counting objects: 92% (7040/7652)
remote: Counting objects: 93% (7117/7652)
remote: Counting objects: 94% (7193/7652)
remote: Counting objects: 95% (7270/7652)
remote: Counting objects: 96% (7346/7652)
remote: Counting objects: 97% (7423/7652)
remote: Counting objects: 98% (7499/7652)
remote: Counting objects: 99% (7576/7652)
remote: Counting objects: 100% (7652/7652)
remote: Counting objects: 100% (7652/7652), done.
3.23 s
remote: Compressing objects: 0% (1/1667)
remote: Compressing objects: 1% (17/1667)
remote: Compressing objects: 2% (34/1667)
remote: Compressing objects: 3% (51/1667)
remote: Compressing objects: 4% (67/1667)
remote: Compressing objects: 5% (84/1667)
remote: Compressing objects: 6% (101/1667)
remote: Compressing objects: 7% (117/1667)
remote: Compressing objects: 8% (134/1667)
remote: Compressing objects: 9% (151/1667)
remote: Compressing objects: 10% (167/1667)
remote: Compressing objects: 11% (184/1667)
remote: Compressing objects: 12% (201/1667)
remote: Compressing objects: 13% (217/1667)
remote: Compressing objects: 14% (234/1667)
remote: Compressing objects: 15% (251/1667)
remote: Compressing objects: 16% (267/1667)
remote: Compressing objects: 17% (284/1667)
remote: Compressing objects: 18% (301/1667)
remote: Compressing objects: 18% (302/1667)
remote: Compressing objects: 19% (317/1667)
remote: Compressing objects: 20% (334/1667)
remote: Compressing objects: 21% (351/1667)
remote: Compressing objects: 22% (367/1667)
remote: Compressing objects: 23% (384/1667)
remote: Compressing objects: 24% (401/1667)
remote: Compressing objects: 25% (417/1667)
remote: Compressing objects: 26% (434/1667)
remote: Compressing objects: 27% (451/1667)
remote: Compressing objects: 28% (467/1667)
remote: Compressing objects: 29% (484/1667)
remote: Compressing objects: 30% (501/1667)
remote: Compressing objects: 31% (517/1667)
remote: Compressing objects: 32% (534/1667)
remote: Compressing objects: 33% (551/1667)
remote: Compressing objects: 34% (567/1667)
remote: Compressing objects: 35% (584/1667)
remote: Compressing objects: 36% (601/1667)
remote: Compressing objects: 37% (617/1667)
remote: Compressing objects: 38% (634/1667)
remote: Compressing objects: 39% (651/1667)
remote: Compressing objects: 40% (667/1667)
remote: Compressing objects: 41% (684/1667)
remote: Compressing objects: 42% (701/1667)
remote: Compressing objects: 43% (717/1667)
remote: Compressing objects: 44% (734/1667)
remote: Compressing objects: 45% (751/1667)
remote: Compressing objects: 46% (767/1667)
remote: Compressing objects: 47% (784/1667)
remote: Compressing objects: 48% (801/1667)
remote: Compressing objects: 49% (817/1667)
remote: Compressing objects: 50% (834/1667)
remote: Compressing objects: 51% (851/1667)
remote: Compressing objects: 52% (867/1667)
remote: Compressing objects: 53% (884/1667)
remote: Compressing objects: 54% (901/1667)
remote: Compressing objects: 55% (917/1667)
remote: Compressing objects: 56% (934/1667)
remote: Compressing objects: 57% (951/1667)
remote: Compressing objects: 58% (967/1667)
remote: Compressing objects: 59% (984/1667)
remote: Compressing objects: 60% (1001/1667)
remote: Compressing objects: 61% (1017/1667)
remote: Compressing objects: 62% (1034/1667)
remote: Compressing objects: 63% (1051/1667)
remote: Compressing objects: 64% (1067/1667)
remote: Compressing objects: 65% (1084/1667)
remote: Compressing objects: 66% (1101/1667)
remote: Compressing objects: 67% (1117/1667)
remote: Compressing objects: 68% (1134/1667)
remote: Compressing objects: 69% (1151/1667)
remote: Compressing objects: 70% (1167/1667)
remote: Compressing objects: 71% (1184/1667)
remote: Compressing objects: 72% (1201/1667)
remote: Compressing objects: 73% (1217/1667)
remote: Compressing objects: 74% (1234/1667)
remote: Compressing objects: 75% (1251/1667)
remote: Compressing objects: 76% (1267/1667)
remote: Compressing objects: 77% (1284/1667)
remote: Compressing objects: 78% (1301/1667)
remote: Compressing objects: 79% (1317/1667)
remote: Compressing objects: 80% (1334/1667)
remote: Compressing objects: 81% (1351/1667)
remote: Compressing objects: 82% (1367/1667)
remote: Compressing objects: 83% (1384/1667)
remote: Compressing objects: 84% (1401/1667)
remote: Compressing objects: 85% (1417/1667)
remote: Compressing objects: 86% (1434/1667)
remote: Compressing objects: 87% (1451/1667)
remote: Compressing objects: 88% (1467/1667)
remote: Compressing objects: 89% (1484/1667)
remote: Compressing objects: 90% (1501/1667)
remote: Compressing objects: 91% (1517/1667)
remote: Compressing objects: 92% (1534/1667)
remote: Compressing objects: 93% (1551/1667)
remote: Compressing objects: 94% (1567/1667)
remote: Compressing objects: 95% (1584/1667)
remote: Compressing objects: 96% (1601/1667)
remote: Compressing objects: 97% (1617/1667)
remote: Compressing objects: 98% (1634/1667)
remote: Compressing objects: 99% (1651/1667)
remote: Compressing objects: 100% (1667/1667)
remote: Compressing objects: 100% (1667/1667), done.
6.33 s
Receiving objects: 0% (1/62298)
Receiving objects: 1% (623/62298)
Receiving objects: 2% (1246/62298)
Receiving objects: 3% (1869/62298)
Receiving objects: 4% (2492/62298)
Receiving objects: 5% (3115/62298)
Receiving objects: 6% (3738/62298)
Receiving objects: 7% (4361/62298)
Receiving objects: 8% (4984/62298)
Receiving objects: 9% (5607/62298)
Receiving objects: 10% (6230/62298), 11.04 MiB | 22.06 MiB/s
Receiving objects: 11% (6853/62298), 11.04 MiB | 22.06 MiB/s
Receiving objects: 12% (7476/62298), 11.04 MiB | 22.06 MiB/s
Receiving objects: 13% (8099/62298), 11.04 MiB | 22.06 MiB/s
Receiving objects: 14% (8722/62298), 11.04 MiB | 22.06 MiB/s
Receiving objects: 15% (9345/62298), 11.04 MiB | 22.06 MiB/s
Receiving objects: 16% (9968/62298), 11.04 MiB | 22.06 MiB/s
Receiving objects: 17% (10591/62298), 11.04 MiB | 22.06 MiB/s
Receiving objects: 18% (11214/62298), 11.04 MiB | 22.06 MiB/s
Receiving objects: 19% (11837/62298), 11.04 MiB | 22.06 MiB/s
Receiving objects: 20% (12460/62298), 11.04 MiB | 22.06 MiB/s
Receiving objects: 21% (13083/62298), 11.04 MiB | 22.06 MiB/s
Receiving objects: 22% (13706/62298), 11.04 MiB | 22.06 MiB/s
Receiving objects: 23% (14329/62298), 11.04 MiB | 22.06 MiB/s
Receiving objects: 24% (14952/62298), 11.04 MiB | 22.06 MiB/s
Receiving objects: 25% (15575/62298), 11.04 MiB | 22.06 MiB/s
Receiving objects: 26% (16198/62298), 11.04 MiB | 22.06 MiB/s
Receiving objects: 27% (16821/62298), 11.04 MiB | 22.06 MiB/s
Receiving objects: 28% (17444/62298), 11.04 MiB | 22.06 MiB/s
Receiving objects: 29% (18067/62298), 11.04 MiB | 22.06 MiB/s
Receiving objects: 30% (18690/62298), 11.04 MiB | 22.06 MiB/s
Receiving objects: 31% (19313/62298), 11.04 MiB | 22.06 MiB/s
Receiving objects: 32% (19936/62298), 11.04 MiB | 22.06 MiB/s
Receiving objects: 33% (20559/62298), 11.04 MiB | 22.06 MiB/s
Receiving objects: 34% (21182/62298), 11.04 MiB | 22.06 MiB/s
Receiving objects: 35% (21805/62298), 11.04 MiB | 22.06 MiB/s
Receiving objects: 36% (22428/62298), 11.04 MiB | 22.06 MiB/s
Receiving objects: 37% (23051/62298), 11.04 MiB | 22.06 MiB/s
Receiving objects: 38% (23674/62298), 11.04 MiB | 22.06 MiB/s
Receiving objects: 39% (24297/62298), 11.04 MiB | 22.06 MiB/s
Receiving objects: 40% (24920/62298), 11.04 MiB | 22.06 MiB/s
Receiving objects: 41% (25543/62298), 11.04 MiB | 22.06 MiB/s
Receiving objects: 42% (26166/62298), 11.04 MiB | 22.06 MiB/s
Receiving objects: 43% (26789/62298), 11.04 MiB | 22.06 MiB/s
Receiving objects: 44% (27412/62298), 11.04 MiB | 22.06 MiB/s
Receiving objects: 45% (28035/62298), 11.04 MiB | 22.06 MiB/s
Receiving objects: 46% (28658/62298), 11.04 MiB | 22.06 MiB/s
Receiving objects: 47% (29281/62298), 11.04 MiB | 22.06 MiB/s
Receiving objects: 48% (29904/62298), 11.04 MiB | 22.06 MiB/s
Receiving objects: 49% (30527/62298), 11.04 MiB | 22.06 MiB/s
Receiving objects: 50% (31149/62298), 11.04 MiB | 22.06 MiB/s
Receiving objects: 51% (31772/62298), 11.04 MiB | 22.06 MiB/s
Receiving objects: 51% (31923/62298), 26.95 MiB | 26.94 MiB/s
Receiving objects: 52% (32395/62298), 26.95 MiB | 26.94 MiB/s
Receiving objects: 53% (33018/62298), 26.95 MiB | 26.94 MiB/s
Receiving objects: 54% (33641/62298), 26.95 MiB | 26.94 MiB/s
Receiving objects: 55% (34264/62298), 26.95 MiB | 26.94 MiB/s
Receiving objects: 56% (34887/62298), 26.95 MiB | 26.94 MiB/s
Receiving objects: 57% (35510/62298), 26.95 MiB | 26.94 MiB/s
Receiving objects: 58% (36133/62298), 26.95 MiB | 26.94 MiB/s
Receiving objects: 59% (36756/62298), 26.95 MiB | 26.94 MiB/s
Receiving objects: 60% (37379/62298), 42.81 MiB | 28.54 MiB/s
Receiving objects: 61% (38002/62298), 42.81 MiB | 28.54 MiB/s
Receiving objects: 62% (38625/62298), 42.81 MiB | 28.54 MiB/s
Receiving objects: 63% (39248/62298), 42.81 MiB | 28.54 MiB/s
Receiving objects: 64% (39871/62298), 42.81 MiB | 28.54 MiB/s
Receiving objects: 65% (40494/62298), 42.81 MiB | 28.54 MiB/s
Receiving objects: 66% (41117/62298), 42.81 MiB | 28.54 MiB/s
Receiving objects: 67% (41740/62298), 42.81 MiB | 28.54 MiB/s
Receiving objects: 68% (42363/62298), 42.81 MiB | 28.54 MiB/s
Receiving objects: 68% (42538/62298), 58.11 MiB | 29.03 MiB/s
Receiving objects: 69% (42986/62298), 58.11 MiB | 29.03 MiB/s
Receiving objects: 70% (43609/62298), 58.11 MiB | 29.03 MiB/s
Receiving objects: 71% (44232/62298), 58.11 MiB | 29.03 MiB/s
Receiving objects: 72% (44855/62298), 58.11 MiB | 29.03 MiB/s
Receiving objects: 73% (45478/62298), 58.11 MiB | 29.03 MiB/s
Receiving objects: 74% (46101/62298), 58.11 MiB | 29.03 MiB/s
Receiving objects: 75% (46724/62298), 58.11 MiB | 29.03 MiB/s
Receiving objects: 76% (47347/62298), 58.11 MiB | 29.03 MiB/s
Receiving objects: 77% (47970/62298), 58.11 MiB | 29.03 MiB/s
Receiving objects: 78% (48593/62298), 58.11 MiB | 29.03 MiB/s
Receiving objects: 79% (49216/62298), 58.11 MiB | 29.03 MiB/s
Receiving objects: 80% (49839/62298), 58.11 MiB | 29.03 MiB/s
Receiving objects: 81% (50462/62298), 58.11 MiB | 29.03 MiB/s
Receiving objects: 82% (51085/62298), 58.11 MiB | 29.03 MiB/s
Receiving objects: 83% (51708/62298), 73.93 MiB | 29.53 MiB/s
Receiving objects: 84% (52331/62298), 73.93 MiB | 29.53 MiB/s
Receiving objects: 85% (52954/62298), 73.93 MiB | 29.53 MiB/s
Receiving objects: 86% (53577/62298), 73.93 MiB | 29.53 MiB/s
Receiving objects: 87% (54200/62298), 73.93 MiB | 29.53 MiB/s
Receiving objects: 88% (54823/62298), 73.93 MiB | 29.53 MiB/s
Receiving objects: 89% (55446/62298), 73.93 MiB | 29.53 MiB/s
Receiving objects: 90% (56069/62298), 73.93 MiB | 29.53 MiB/s
Receiving objects: 91% (56692/62298), 73.93 MiB | 29.53 MiB/s
Receiving objects: 92% (57315/62298), 73.93 MiB | 29.53 MiB/s
Receiving objects: 93% (57938/62298), 73.93 MiB | 29.53 MiB/s
Receiving objects: 94% (58561/62298), 73.93 MiB | 29.53 MiB/s
Receiving objects: 95% (59184/62298), 73.93 MiB | 29.53 MiB/s
Receiving objects: 96% (59807/62298), 73.93 MiB | 29.53 MiB/s
Receiving objects: 97% (60430/62298), 73.93 MiB | 29.53 MiB/s
Receiving objects: 97% (60802/62298), 89.89 MiB | 29.85 MiB/s
Receiving objects: 98% (61053/62298), 89.89 MiB | 29.85 MiB/s
Receiving objects: 99% (61676/62298), 89.89 MiB | 29.85 MiB/s
remote: Total 62298 (delta 6505), reused 6170 (delta 5980), pack-reused 54646 (from 3)
6.43 s
Receiving objects: 100% (62298/62298), 89.89 MiB | 29.85 MiB/s
Receiving objects: 100% (62298/62298), 93.15 MiB | 30.03 MiB/s, done.
6.97 s
Resolving deltas: 0% (0/43435)
Resolving deltas: 1% (436/43435)
Resolving deltas: 2% (869/43435)
Resolving deltas: 3% (1304/43435)
Resolving deltas: 4% (1739/43435)
Resolving deltas: 5% (2172/43435)
Resolving deltas: 6% (2610/43435)
Resolving deltas: 7% (3041/43435)
Resolving deltas: 8% (3475/43435)
Resolving deltas: 9% (3913/43435)
Resolving deltas: 10% (4344/43435)
Resolving deltas: 11% (4778/43435)
Resolving deltas: 12% (5213/43435)
Resolving deltas: 13% (5647/43435)
Resolving deltas: 14% (6081/43435)
Resolving deltas: 15% (6516/43435)
Resolving deltas: 16% (6950/43435)
Resolving deltas: 17% (7385/43435)
Resolving deltas: 18% (7819/43435)
Resolving deltas: 19% (8253/43435)
Resolving deltas: 20% (8689/43435)
Resolving deltas: 21% (9122/43435)
Resolving deltas: 22% (9556/43435)
Resolving deltas: 23% (9991/43435)
Resolving deltas: 24% (10425/43435)
Resolving deltas: 25% (10861/43435)
Resolving deltas: 26% (11295/43435)
Resolving deltas: 27% (11728/43435)
Resolving deltas: 28% (12162/43435)
Resolving deltas: 29% (12597/43435)
Resolving deltas: 30% (13032/43435)
Resolving deltas: 31% (13465/43435)
Resolving deltas: 32% (13900/43435)
Resolving deltas: 33% (14334/43435)
Resolving deltas: 34% (14768/43435)
Resolving deltas: 35% (15203/43435)
Resolving deltas: 36% (15638/43435)
Resolving deltas: 37% (16071/43435)
Resolving deltas: 38% (16506/43435)
Resolving deltas: 39% (16940/43435)
Resolving deltas: 40% (17374/43435)
Resolving deltas: 41% (17809/43435)
Resolving deltas: 42% (18244/43435)
Resolving deltas: 43% (18678/43435)
Resolving deltas: 44% (19112/43435)
Resolving deltas: 45% (19546/43435)
Resolving deltas: 46% (19981/43435)
Resolving deltas: 47% (20417/43435)
Resolving deltas: 48% (20849/43435)
Resolving deltas: 49% (21285/43435)
Resolving deltas: 50% (21718/43435)
Resolving deltas: 51% (22152/43435)
Resolving deltas: 52% (22588/43435)
Resolving deltas: 53% (23021/43435)
Resolving deltas: 54% (23455/43435)
Resolving deltas: 55% (23890/43435)
Resolving deltas: 56% (24325/43435)
Resolving deltas: 57% (24758/43435)
Resolving deltas: 58% (25193/43435)
Resolving deltas: 59% (25627/43435)
Resolving deltas: 60% (26061/43435)
Resolving deltas: 61% (26496/43435)
Resolving deltas: 62% (26930/43435)
Resolving deltas: 63% (27365/43435)
Resolving deltas: 64% (27799/43435)
Resolving deltas: 65% (28233/43435)
Resolving deltas: 66% (28668/43435)
Resolving deltas: 67% (29102/43435)
Resolving deltas: 68% (29537/43435)
Resolving deltas: 69% (29971/43435)
Resolving deltas: 70% (30405/43435)
Resolving deltas: 71% (30841/43435)
Resolving deltas: 72% (31274/43435)
Resolving deltas: 73% (31709/43435)
Resolving deltas: 74% (32142/43435)
Resolving deltas: 75% (32577/43435)
Resolving deltas: 76% (33012/43435)
Resolving deltas: 77% (33445/43435)
Resolving deltas: 78% (33880/43435)
Resolving deltas: 79% (34314/43435)
Resolving deltas: 80% (34748/43435)
Resolving deltas: 81% (35184/43435)
Resolving deltas: 82% (35617/43435)
Resolving deltas: 83% (36052/43435)
Resolving deltas: 84% (36486/43435)
Resolving deltas: 85% (36920/43435)
Resolving deltas: 86% (37355/43435)
Resolving deltas: 87% (37789/43435)
Resolving deltas: 88% (38223/43435)
Resolving deltas: 89% (38659/43435)
Resolving deltas: 90% (39092/43435)
Resolving deltas: 91% (39527/43435)
Resolving deltas: 92% (39963/43435)
Resolving deltas: 93% (40395/43435)
Resolving deltas: 94% (40830/43435)
Resolving deltas: 95% (41264/43435)
Resolving deltas: 96% (41699/43435)
Resolving deltas: 97% (42132/43435)
Resolving deltas: 98% (42567/43435)
Resolving deltas: 99% (43001/43435)
Resolving deltas: 100% (43435/43435)
Resolving deltas: 100% (43435/43435), done.
7.25 s
Fetching commit 8b39ee1f2509ff24aad52dbd6ceb557987b212ec for docs ...
7.25 s
$ /nix/store/bcnisk3ydfgv26v2gw3zlky24g00yww2-git-2.54.0/bin/git fetch origin 8b39ee1f2509ff24aad52dbd6ceb557987b212ec
7.99 s
From https://github.com/alphal00p/gammaloop
7.99 s
* branch 8b39ee1f2509ff24aad52dbd6ceb557987b212ec -> FETCH_HEAD
8.00 s
$ /nix/store/9ypz3flqsrl5xl495mm8h645gadjsxi1-coreutils-9.11/bin/timeout --kill-after=15s 7200s /nix/store/bcnisk3ydfgv26v2gw3zlky24g00yww2-git-2.54.0/bin/git -c advice.detachedHead=false checkout 8b39ee1f2509ff24aad52dbd6ceb557987b212ec
8.20 s
HEAD is now at 8b39ee1f add current package quickstarts
8.21 s
$ /nix/store/9ypz3flqsrl5xl495mm8h645gadjsxi1-coreutils-9.11/bin/timeout --kill-after=15s 7200s /nix/store/23zk8sgzamrbmj1fday15szf7f2279s8-nix-2.34.7/bin/nix --extra-experimental-features nix-command --extra-experimental-features flakes --log-format internal-json run .#packages.x86_64-linux.nix-ci-check-gammaloop-doctest --print-build-logs
12.52 s
13.00 s
Downloading cached boehm-gc from https://cache.nix-ci.com
13.05 s
Downloading cached busybox from https://cache.nix-ci.com
13.05 s
Downloading cached aws-c-common from https://cache.nix-ci.com
13.05 s
Downloading cached brotli-1.2.0-lib from https://cache.nix-ci.com
13.05 s
Downloading cached editline-1.17.1-unstable-2025-05 from https://cache.nix-ci.com
13.05 s
Downloading cached libcpuid from https://cache.nix-ci.com
13.05 s
Downloading cached libseccomp-2.6.0-lib from https://cache.nix-ci.com
13.05 s
Downloading cached libsodium-1.0.22-unstable-2026-04 from https://cache.nix-ci.com
13.05 s
Downloading cached lowdown-3.0.1-lib from https://cache.nix-ci.com
13.06 s
Downloading cached publicsuffix-list-0-unstable-2026-05 from https://cache.nix-ci.com
13.06 s
Downloading cached icu4c from https://cache.nix-ci.com
13.06 s
Downloading cached libssh2 from https://cache.nix-ci.com
13.06 s
Downloading cached libxml2 from https://cache.nix-ci.com
13.06 s
Downloading cached llhttp from https://cache.nix-ci.com
13.06 s
Downloading cached nghttp2-1.69.0-lib from https://cache.nix-ci.com
13.06 s
Downloading cached nghttp3 from https://cache.nix-ci.com
13.09 s
Downloaded cached boehm-gc (312 KiB) in 87ms
13.09 s
Progress: 0 of 1 built, 1 of 50 downloaded from cache (15 downloading)
13.09 s
Downloading cached hwloc-2.14.0-lib from https://cache.nix-ci.com
13.10 s
Downloaded cached editline-1.17.1-unstable-2025-05 (58 KiB) in 47ms
13.10 s
Progress: 0 of 1 built, 2 of 50 downloaded from cache (15 downloading)
13.10 s
Downloaded cached llhttp (89 KiB) in 47ms
13.10 s
Downloading cached keyutils-1.6.3-lib from https://cache.nix-ci.com
13.10 s
Progress: 0 of 1 built, 3 of 50 downloaded from cache (15 downloading)
13.10 s
Downloading cached ngtcp2 from https://cache.nix-ci.com
13.11 s
Downloaded cached libcpuid (326 KiB) in 50ms
13.11 s
Progress: 0 of 1 built, 4 of 50 downloaded from cache (15 downloading)
13.11 s
Downloading cached s2n-tls from https://cache.nix-ci.com
13.11 s
Downloaded cached libseccomp-2.6.0-lib (193 KiB) in 51ms
13.11 s
Progress: 0 of 1 built, 5 of 50 downloaded from cache (15 downloading)
13.11 s
Downloaded cached publicsuffix-list-0-unstable-2026-05 (329 KiB) in 52ms
13.11 s
Progress: 0 of 1 built, 6 of 50 downloaded from cache (14 downloading)
13.11 s
Downloading cached libpsl from https://cache.nix-ci.com
13.11 s
Downloaded cached nghttp3 (228 KiB) in 56ms
13.11 s
Progress: 0 of 1 built, 7 of 50 downloaded from cache (14 downloading)
13.11 s
Downloaded cached libssh2 (330 KiB) in 58ms
13.11 s
Progress: 0 of 1 built, 8 of 50 downloaded from cache (13 downloading)
13.12 s
Downloading cached libgit2-1.9.4-lib from https://cache.nix-ci.com
13.12 s
Downloaded cached nghttp2-1.69.0-lib (225 KiB) in 59ms
13.12 s
Downloaded cached lowdown-3.0.1-lib (341 KiB) in 60ms
13.12 s
Progress: 0 of 1 built, 9 of 50 downloaded from cache (13 downloading)
13.12 s
Progress: 0 of 1 built, 10 of 50 downloaded from cache (12 downloading)
13.12 s
Downloaded cached busybox (230 KiB) in 62ms
13.12 s
Progress: 0 of 1 built, 11 of 50 downloaded from cache (11 downloading)
13.12 s
Downloaded cached libsodium-1.0.22-unstable-2026-04 (666 KiB) in 67ms
13.12 s
Progress: 0 of 1 built, 12 of 50 downloaded from cache (10 downloading)
13.13 s
Downloaded cached aws-c-common (1.1 MiB) in 70ms
13.13 s
Progress: 0 of 1 built, 13 of 50 downloaded from cache (9 downloading)
13.13 s
Downloaded cached brotli-1.2.0-lib (961 KiB) in 71ms
13.13 s
Downloading cached aws-c-cal from https://cache.nix-ci.com
13.13 s
Downloading cached aws-c-compression from https://cache.nix-ci.com
13.13 s
Downloading cached aws-c-sdkutils from https://cache.nix-ci.com
13.13 s
Progress: 0 of 1 built, 14 of 50 downloaded from cache (12 downloading)
13.13 s
Downloading cached aws-checksums from https://cache.nix-ci.com
13.14 s
Downloaded cached libxml2 (1.4 MiB) in 85ms
13.14 s
Progress: 0 of 1 built, 15 of 50 downloaded from cache (11 downloading)
13.14 s
Downloading cached libarchive-3.8.8-lib from https://cache.nix-ci.com
13.17 s
Downloaded cached hwloc-2.14.0-lib (459 KiB) in 80ms
13.17 s
Progress: 0 of 1 built, 16 of 50 downloaded from cache (11 downloading)
13.17 s
Downloading cached onetbb from https://cache.nix-ci.com
13.19 s
Downloaded cached keyutils-1.6.3-lib (41 KiB) in 84ms
13.19 s
Progress: 0 of 1 built, 17 of 50 downloaded from cache (11 downloading)
13.19 s
Downloading cached krb5-1.22.2-lib from https://cache.nix-ci.com
13.20 s
Downloaded cached ngtcp2 (515 KiB) in 92ms
13.20 s
Progress: 0 of 1 built, 18 of 50 downloaded from cache (11 downloading)
13.20 s
Downloaded cached libpsl (114 KiB) in 89ms
13.20 s
Progress: 0 of 1 built, 19 of 50 downloaded from cache (10 downloading)
13.20 s
Downloaded cached s2n-tls (1.3 MiB) in 97ms
13.20 s
Progress: 0 of 1 built, 20 of 50 downloaded from cache (9 downloading)
13.21 s
Downloaded cached aws-c-compression (31 KiB) in 83ms
13.21 s
Progress: 0 of 1 built, 21 of 50 downloaded from cache (8 downloading)
13.21 s
Downloaded cached aws-c-sdkutils (155 KiB) in 85ms
13.21 s
Progress: 0 of 1 built, 22 of 50 downloaded from cache (7 downloading)
13.21 s
Downloaded cached aws-checksums (86 KiB) in 87ms
13.21 s
Progress: 0 of 1 built, 23 of 50 downloaded from cache (6 downloading)
13.21 s
Downloaded cached aws-c-cal (158 KiB) in 88ms
13.21 s
Progress: 0 of 1 built, 24 of 50 downloaded from cache (5 downloading)
13.21 s
Downloading cached aws-c-io from https://cache.nix-ci.com
13.22 s
Downloaded cached libgit2-1.9.4-lib (1.6 MiB) in 100ms
13.22 s
Progress: 0 of 1 built, 25 of 50 downloaded from cache (5 downloading)
13.23 s
Downloaded cached libarchive-3.8.8-lib (953 KiB) in 92ms
13.23 s
Progress: 0 of 1 built, 26 of 50 downloaded from cache (4 downloading)
13.26 s
Downloaded cached onetbb (626 KiB) in 84ms
13.26 s
Progress: 0 of 1 built, 27 of 50 downloaded from cache (3 downloading)
13.26 s
Downloading cached libblake3 from https://cache.nix-ci.com
13.28 s
Downloaded cached icu4c (38.2 MiB) in 222ms
13.28 s
Progress: 0 of 1 built, 28 of 50 downloaded from cache (3 downloading)
13.28 s
Downloading cached boost from https://cache.nix-ci.com
13.28 s
Downloaded cached krb5-1.22.2-lib (2.7 MiB) in 95ms
13.28 s
Progress: 0 of 1 built, 29 of 50 downloaded from cache (3 downloading)
13.28 s
Downloading cached curl from https://cache.nix-ci.com
13.29 s
Downloaded cached aws-c-io (648 KiB) in 70ms
13.29 s
Progress: 0 of 1 built, 30 of 50 downloaded from cache (3 downloading)
13.29 s
Downloading cached aws-c-event-stream from https://cache.nix-ci.com
13.29 s
Downloading cached aws-c-http from https://cache.nix-ci.com
13.31 s
Downloaded cached libblake3 (117 KiB) in 54ms
13.31 s
Progress: 0 of 1 built, 31 of 50 downloaded from cache (4 downloading)
13.35 s
Downloaded cached aws-c-event-stream (176 KiB) in 61ms
13.35 s
Progress: 0 of 1 built, 32 of 50 downloaded from cache (3 downloading)
13.35 s
Downloaded cached aws-c-http (641 KiB) in 67ms
13.35 s
Progress: 0 of 1 built, 33 of 50 downloaded from cache (2 downloading)
13.35 s
Downloading cached aws-c-auth from https://cache.nix-ci.com
13.35 s
Downloading cached aws-c-mqtt from https://cache.nix-ci.com
13.36 s
Downloaded cached curl (1.2 MiB) in 76ms
13.36 s
Progress: 0 of 1 built, 34 of 50 downloaded from cache (3 downloading)
13.38 s
Downloaded cached boost (14.5 MiB) in 102ms
13.38 s
Progress: 0 of 1 built, 35 of 50 downloaded from cache (2 downloading)
13.38 s
Downloading cached nix-util from https://cache.nix-ci.com
13.41 s
Downloaded cached aws-c-auth (387 KiB) in 55ms
13.41 s
Progress: 0 of 1 built, 36 of 50 downloaded from cache (2 downloading)
13.41 s
Downloading cached aws-c-s3 from https://cache.nix-ci.com
13.41 s
Downloaded cached aws-c-mqtt (557 KiB) in 58ms
13.41 s
Progress: 0 of 1 built, 37 of 50 downloaded from cache (2 downloading)
13.44 s
Downloaded cached nix-util (2.4 MiB) in 62ms
13.44 s
Progress: 0 of 1 built, 38 of 50 downloaded from cache (1 downloading)
13.44 s
Downloading cached nix-nswrapper from https://cache.nix-ci.com
13.47 s
Downloaded cached aws-c-s3 (384 KiB) in 57ms
13.47 s
Progress: 0 of 1 built, 39 of 50 downloaded from cache (1 downloading)
13.47 s
Downloading cached aws-crt-cpp from https://cache.nix-ci.com
13.50 s
Downloaded cached nix-nswrapper (131 KiB) in 52ms
13.50 s
Progress: 0 of 1 built, 40 of 50 downloaded from cache (1 downloading)
13.53 s
Downloaded cached aws-crt-cpp (979 KiB) in 58ms
13.53 s
Progress: 0 of 1 built, 41 of 50 downloaded from cache
13.53 s
Downloading cached nix-store from https://cache.nix-ci.com
13.60 s
Downloaded cached nix-store (5.8 MiB) in 73ms
13.60 s
Progress: 0 of 1 built, 42 of 50 downloaded from cache
13.60 s
Downloading cached nix-fetchers from https://cache.nix-ci.com
13.60 s
Downloading cached nix-main from https://cache.nix-ci.com
13.66 s
Downloaded cached nix-main (393 KiB) in 55ms
13.66 s
Progress: 0 of 1 built, 43 of 50 downloaded from cache (1 downloading)
13.66 s
Downloaded cached nix-fetchers (1.5 MiB) in 59ms
13.66 s
Progress: 0 of 1 built, 44 of 50 downloaded from cache
13.66 s
Downloading cached nix-expr from https://cache.nix-ci.com
13.73 s
Downloaded cached nix-expr (3.3 MiB) in 70ms
13.73 s
Progress: 0 of 1 built, 45 of 50 downloaded from cache
13.73 s
Downloading cached nix-flake from https://cache.nix-ci.com
13.79 s
Downloaded cached nix-flake (956 KiB) in 56ms
13.79 s
Progress: 0 of 1 built, 46 of 50 downloaded from cache
13.79 s
Downloading cached nix-cmd from https://cache.nix-ci.com
13.84 s
Downloaded cached nix-cmd (1 MiB) in 56ms
13.84 s
Progress: 0 of 1 built, 47 of 50 downloaded from cache
13.85 s
Downloading cached nix from https://cache.nix-ci.com
13.91 s
Downloaded cached nix (3.9 MiB) in 66ms
13.91 s
Progress: 0 of 1 built, 48 of 50 downloaded from cache
13.91 s
Downloading cached nix from https://cache.nix-ci.com
13.96 s
Downloaded cached nix (8848 B) in 52ms
13.96 s
Progress: 0 of 1 built, 49 of 50 downloaded from cache
13.96 s
Downloading cached nix-ci-check-gammaloop-doctest from https://cache.nix-ci.com
14.01 s
Downloaded cached nix-ci-check-gammaloop-doctest (1000 B) in 44ms
14.01 s
Progress: 0 of 1 built, 50 of 50 downloaded from cache
16.45 s
evaluating derivation 'g
copying '/nix/store/xi5g
evaluating derivation 'g
querying gammaloop-works
[0 /1 built, 0.0 KiB DL]
[1 /0 /1 built, 0.0 KiB DLgammaloop-workspace-doctest> Running phase: unpackPhase
16.46 s
gammaloop-workspace-doctest> unpacking source archive /nix/store/j2ncg4pj99fhx17lqnr4ncczqgxk2q5z-source
16.57 s
gammaloop-workspace-doctest> source root is source
16.60 s
gammaloop-workspace-doctest> Running phase: patchPhase
16.60 s
gammaloop-workspace-doctest> Executing configureCargoCommonVars
16.61 s
gammaloop-workspace-doctest> decompressing cargo artifacts from /nix/store/8rkh7d3hq722l839568nhnwihnsx041a-gammaloop-workspace-deps-deps-0.1.0/target.tar.zst to target
18.50 s
gammaloop-workspace-doctest> Running phase: updateAutotoolsGnuConfigScriptsPhase
18.63 s
gammaloop-workspace-doctest> Running phase: configurePhase
18.63 s
gammaloop-workspace-doctest> will append /build/source/.cargo-home/config.toml with contents of /nix/store/xdy1vvhll2bijdplvl9fcc2b9plkxhaa-vendor-cargo-deps/config.toml
18.63 s
gammaloop-workspace-doctest> default configurePhase, nothing to do
18.63 s
gammaloop-workspace-doctest> Running phase: buildPhase
18.63 s
gammaloop-workspace-doctest> +++ command cargo --version
18.63 s
gammaloop-workspace-doctest> cargo 1.97.0 (c980f4866 2026-06-30)
18.63 s
gammaloop-workspace-doctest> +++ command cargo test --profile ci-optim --doc --locked --workspace --features gammaloop-api/cli,gammaloop-tracing-filter/clap,gammaloop-tracing-filter/symbolica,idenso/bincode,idenso/reference-cases,linnet/bincode,linnet/drawing,linnet/nodestore-vec,linnet/rkyv,linnet/serde,linnet/symbolica,spenso-macros/shadowing,spenso/shadowing,symbolica/tracing_max_level_info
19.20 s
gammaloop-workspace-doctest> Compiling target-lexicon v0.13.5
19.21 s
gammaloop-workspace-doctest> Compiling symbolica v2.2.0 (https://github.com/symbolica-dev/symbolica?branch=dev#0441bd7a)
19.21 s
gammaloop-workspace-doctest> Compiling maplit v1.0.2
19.23 s
gammaloop-workspace-doctest> Compiling gammaloop-tracing-filter-macros v0.1.0 (/build/source/crates/gammaloop-tracing-filter-macros)
19.23 s
gammaloop-workspace-doctest> Compiling vakint v0.1.2 (/build/source/crates/vakint)
19.24 s
gammaloop-workspace-doctest> Compiling gammalooprs v0.3.4 (/build/source/crates/gammalooprs)
19.24 s
gammaloop-workspace-doctest> Compiling alphal00p-docs-macros v0.1.0 (/build/source/crates/alphal00p-docs-macros)
19.24 s
gammaloop-workspace-doctest> Compiling alphal00p-docs-schema v0.1.0 (/build/source/crates/alphal00p-docs-schema)
19.24 s
gammaloop-workspace-doctest> Compiling rustc_version v0.4.1
19.24 s
gammaloop-workspace-doctest> Compiling bincode v1.3.3
19.24 s
gammaloop-workspace-doctest> Compiling target-triple v1.0.1
19.24 s
gammaloop-workspace-doctest> Compiling iai-callgrind-runner v0.14.2
19.24 s
gammaloop-workspace-doctest> Compiling gungraun-runner v0.18.2
19.25 s
gammaloop-workspace-doctest> Compiling gammaloop-integration-tests v0.1.0 (/build/source/tests)
19.30 s
gammaloop-workspace-doctest> Compiling test-log-core v0.2.20
19.54 s
gammaloop-workspace-doctest> Compiling wait-timeout v0.2.1
19.60 s
gammaloop-workspace-doctest> Compiling quick-error v1.2.3
19.67 s
gammaloop-workspace-doctest> Compiling iai-callgrind v0.14.2
19.67 s
gammaloop-workspace-doctest> Compiling bit-vec v0.8.0
19.80 s
gammaloop-workspace-doctest> Compiling rusty-fork v0.3.1
19.95 s
gammaloop-workspace-doctest> Compiling iai-callgrind-macros v0.5.1
20.05 s
gammaloop-workspace-doctest> Compiling bit-set v0.8.0
20.08 s
gammaloop-workspace-doctest> Compiling rand_xorshift v0.4.0
20.17 s
gammaloop-workspace-doctest> Compiling console v0.15.11
20.18 s
gammaloop-workspace-doctest> Compiling unarray v0.1.4
20.19 s
gammaloop-workspace-doctest> Compiling glob v0.3.4
20.22 s
gammaloop-workspace-doctest> Compiling base64 v0.21.7
20.27 s
gammaloop-workspace-doctest> Compiling termcolor v1.4.1
20.31 s
gammaloop-workspace-doctest> Compiling gungraun-macros v0.8.0
20.77 s
gammaloop-workspace-doctest> Compiling similar-asserts v1.7.0
21.14 s
gammaloop-workspace-doctest> Compiling ron v0.8.1
21.17 s
gammaloop-workspace-doctest> Compiling pyo3-build-config v0.28.3
21.20 s
gammaloop-workspace-doctest> Compiling trybuild v1.0.120
21.26 s
gammaloop-workspace-doctest> Compiling alphal00p-docs-catalogs v0.1.0 (/build/source/crates/alphal00p-docs-catalogs)
21.27 s
gammaloop-workspace-doctest> Compiling proptest v1.11.0
21.27 s
gammaloop-workspace-doctest> Compiling alphal00p-docs-builder v0.1.0 (/build/source/crates/alphal00p-docs-builder)
21.29 s
gammaloop-workspace-doctest> Compiling kurvst v0.1.0 (/build/source/crates/kurvst)
22.49 s
gammaloop-workspace-doctest> Compiling test-log-macros v0.2.20
25.55 s
gammaloop-workspace-doctest> Compiling test-log v0.2.20
26.61 s
gammaloop-workspace-doctest> Compiling alphal00p-docs-examples v0.1.0 (/build/source/crates/alphal00p-docs-examples)
28.39 s
gammaloop-workspace-doctest> Compiling pyo3-ffi v0.28.3
28.43 s
gammaloop-workspace-doctest> Compiling pyo3-macros-backend v0.28.3
28.88 s
gammaloop-workspace-doctest> Compiling pyo3 v0.28.3
29.03 s
gammaloop-workspace-doctest> Compiling numpy v0.28.0
29.26 s
gammaloop-workspace-doctest> Compiling gammaloop-api v0.1.0 (/build/source/crates/gammaloop-api)
29.92 s
gammaloop-workspace-doctest> Compiling gungraun v0.18.2
36.08 s
gammaloop-workspace-doctest> Compiling pyo3-macros v0.28.3
41.24 s
gammaloop-workspace-doctest> Compiling pyo3-stub-gen v0.17.2
41.91 s
gammaloop-workspace-doctest> Compiling numerica v2.2.0 (https://github.com/symbolica-dev/symbolica?branch=dev#0441bd7a)
44.41 s
gammaloop-workspace-doctest> Compiling graphica v2.1.0 (https://github.com/symbolica-dev/symbolica?branch=dev#0441bd7a)
47.63 s
gammaloop-workspace-doctest> Compiling symbolica-utils v0.1.0 (/build/source/crates/symbolica-utils)
233.09 s
gammaloop-workspace-doctest> Compiling gammaloop-workspace-hack v0.1.0 (/build/source/crates/gammaloop-workspace-hack)
233.14 s
gammaloop-workspace-doctest> Compiling spenso-macros v0.3.2 (/build/source/crates/spenso-macros)
233.43 s
gammaloop-workspace-doctest> Compiling linnet v0.17.0 (/build/source/crates/linnet)
240.17 s
gammaloop-workspace-doctest> Compiling spenso v0.6.0 (/build/source/crates/spenso)
252.42 s
gammaloop-workspace-doctest> Compiling idenso v0.3.0 (/build/source/crates/idenso)
252.48 s
gammaloop-workspace-doctest> Compiling gammaloop-tracing-filter v0.1.0 (/build/source/crates/gammaloop-tracing-filter)
258.53 s
gammaloop-workspace-doctest> Compiling spenso-hep-lib v0.1.7 (/build/source/crates/spenso-hep-lib)
259.05 s
gammaloop-workspace-doctest> Compiling spynso3 v0.1.2 (/build/source/crates/spynso3)
321.26 s
gammaloop-workspace-doctest> Compiling linnest v0.1.0 (/build/source/crates/linnest)
321.32 s
gammaloop-workspace-doctest> Compiling linnet-py v0.1.0 (/build/source/crates/linnet-py)
565.36 s
gammaloop-workspace-doctest> Finished `ci-optim` profile [optimized] target(s) in 9m 06s
565.58 s
gammaloop-workspace-doctest> warning : the following packages contain code that will be rejected by a future version of Rust: proc-macro-error2 v2.0.1
565.58 s
gammaloop-workspace-doctest> note : to see what the problems were, use the option `--future-incompat-report`, or run `cargo report future-incompatibilities --id 1`
565.64 s
gammaloop-workspace-doctest> Doc-tests alphal00p_docs_builder
565.97 s
gammaloop-workspace-doctest>
565.97 s
gammaloop-workspace-doctest> running 0 tests
565.97 s
gammaloop-workspace-doctest>
565.97 s
gammaloop-workspace-doctest> test result: ok. 0 passed; 0 failed; 0 ignored; 0 measured; 0 filtered out; finished in 0.00s
565.97 s
gammaloop-workspace-doctest>
565.98 s
gammaloop-workspace-doctest> Doc-tests alphal00p_docs_catalogs
568.44 s
gammaloop-workspace-doctest>
568.44 s
gammaloop-workspace-doctest> running 0 tests
568.44 s
gammaloop-workspace-doctest>
568.44 s
gammaloop-workspace-doctest> test result: ok. 0 passed; 0 failed; 0 ignored; 0 measured; 0 filtered out; finished in 0.00s
568.44 s
gammaloop-workspace-doctest>
568.44 s
gammaloop-workspace-doctest> Doc-tests alphal00p_docs_examples
568.47 s
gammaloop-workspace-doctest>
568.47 s
gammaloop-workspace-doctest> running 0 tests
568.47 s
gammaloop-workspace-doctest>
568.47 s
gammaloop-workspace-doctest> test result: ok. 0 passed; 0 failed; 0 ignored; 0 measured; 0 filtered out; finished in 0.00s
568.47 s
gammaloop-workspace-doctest>
568.48 s
gammaloop-workspace-doctest> Doc-tests alphal00p_docs
568.59 s
gammaloop-workspace-doctest>
568.59 s
gammaloop-workspace-doctest> running 0 tests
568.59 s
gammaloop-workspace-doctest>
568.59 s
gammaloop-workspace-doctest> test result: ok. 0 passed; 0 failed; 0 ignored; 0 measured; 0 filtered out; finished in 0.00s
568.59 s
gammaloop-workspace-doctest>
568.59 s
gammaloop-workspace-doctest> Doc-tests alphal00p_docs_schema
568.74 s
gammaloop-workspace-doctest>
568.74 s
gammaloop-workspace-doctest> running 0 tests
568.74 s
gammaloop-workspace-doctest>
568.74 s
gammaloop-workspace-doctest> test result: ok. 0 passed; 0 failed; 0 ignored; 0 measured; 0 filtered out; finished in 0.00s
568.74 s
gammaloop-workspace-doctest>
568.74 s
gammaloop-workspace-doctest> Doc-tests gammaloop_api
570.76 s
gammaloop-workspace-doctest>
570.76 s
gammaloop-workspace-doctest> running 16 tests
570.81 s
gammaloop-workspace-doctest> test crates/gammaloop-api/src/python.rs - python::GammaLoopAPI::get_integrand_settings (line 3647) ... FAILED
570.81 s
gammaloop-workspace-doctest> test crates/gammaloop-api/src/python.rs - python::GammaLoopAPI::get_active_command_blocks (line 3760) ... FAILED
570.81 s
gammaloop-workspace-doctest> test crates/gammaloop-api/src/python.rs - python::GammaLoopAPI::get_default_runtime_settings (line 3796) ... FAILED
570.81 s
gammaloop-workspace-doctest> test crates/gammaloop-api/src/python.rs - python::PyHistogramAccumulator (line 871) ... FAILED
570.82 s
gammaloop-workspace-doctest> test crates/gammaloop-api/src/python.rs - python::GammaLoopAPI::evaluate_samples (line 3108) ... FAILED
570.85 s
gammaloop-workspace-doctest> test crates/gammaloop-api/src/python.rs - python::GammaLoopAPI::get_integrand_info (line 3585) ... FAILED
570.87 s
gammaloop-workspace-doctest> test crates/gammaloop-api/src/python.rs - python::GammaLoopAPI::evaluate_sample (line 2967) ... FAILED
570.97 s
gammaloop-workspace-doctest> test crates/gammaloop-api/src/python.rs - python::GammaLoopAPI::get_run_history (line 3711) ... FAILED
570.97 s
gammaloop-workspace-doctest> test crates/gammaloop-api/src/python.rs - python::GammaLoopAPI::new_python (line 2834) ... FAILED
571.07 s
gammaloop-workspace-doctest> test crates/gammaloop-api/src/lib.rs - (line 18) - compile ... ok
571.23 s
gammaloop-workspace-doctest> test crates/gammaloop-api/src/python.rs - python::GammaLoopAPI::get_global_settings (line 3739) ... FAILED
571.25 s
gammaloop-workspace-doctest> test crates/gammaloop-api/src/python.rs - python::atom_to_dots (line 157) ... FAILED
571.26 s
gammaloop-workspace-doctest> test crates/gammaloop-api/src/python.rs - python::evaluate_graph_overall_factor (line 95) ... FAILED
571.27 s
gammaloop-workspace-doctest> test crates/gammaloop-api/src/python.rs - python::GammaLoopAPI::run_command (line 3901) ... FAILED
571.30 s
gammaloop-workspace-doctest> test crates/gammaloop-api/src/python.rs - python::atom_to_canonical_string (line 128) ... FAILED
576.60 s
gammaloop-workspace-doctest> test crates/gammaloop-api/src/commands/evaluate_samples.rs - commands::evaluate_samples::EvaluateSamples (line 50) ... ok
576.65 s
gammaloop-workspace-doctest>
576.65 s
gammaloop-workspace-doctest> failures:
576.65 s
gammaloop-workspace-doctest>
576.65 s
gammaloop-workspace-doctest> ---- crates/gammaloop-api/src/python.rs - python::GammaLoopAPI::get_integrand_settings (line 3647) stdout ----
576.65 s
gammaloop-workspace-doctest> error: expected one of `!` or `::`, found `=`
576.65 s
gammaloop-workspace-doctest> --> crates/gammaloop-api/src/python.rs:3648:10
576.65 s
gammaloop-workspace-doctest> |
576.65 s
gammaloop-workspace-doctest> 3648 | settings = api.get_integrand_settings(process_id=0)
576.65 s
gammaloop-workspace-doctest> | ^ expected one of `!` or `::`
576.65 s
gammaloop-workspace-doctest>
576.65 s
gammaloop-workspace-doctest> error: aborting due to 1 previous error
576.65 s
gammaloop-workspace-doctest>
576.65 s
gammaloop-workspace-doctest> Couldn't compile the test.
576.65 s
gammaloop-workspace-doctest> ---- crates/gammaloop-api/src/python.rs - python::GammaLoopAPI::get_active_command_blocks (line 3760) stdout ----
576.65 s
gammaloop-workspace-doctest> error: expected item, found keyword `for`
576.65 s
gammaloop-workspace-doctest> --> crates/gammaloop-api/src/python.rs:3761:1
576.65 s
gammaloop-workspace-doctest> |
576.65 s
gammaloop-workspace-doctest> 3761 | for name, commands in api.get_active_command_blocks().items():
576.65 s
gammaloop-workspace-doctest> | ^^^ expected item
576.65 s
gammaloop-workspace-doctest> |
576.65 s
gammaloop-workspace-doctest> = note: for a full list of items that can appear in modules, see <https://doc.rust-lang.org/reference/items.html>
576.65 s
gammaloop-workspace-doctest>
576.65 s
gammaloop-workspace-doctest> error: aborting due to 1 previous error
576.65 s
gammaloop-workspace-doctest>
576.65 s
gammaloop-workspace-doctest> Couldn't compile the test.
576.65 s
gammaloop-workspace-doctest> ---- crates/gammaloop-api/src/python.rs - python::GammaLoopAPI::get_default_runtime_settings (line 3796) stdout ----
576.65 s
gammaloop-workspace-doctest> error: expected one of `!` or `::`, found `=`
576.65 s
gammaloop-workspace-doctest> --> crates/gammaloop-api/src/python.rs:3797:9
576.65 s
gammaloop-workspace-doctest> |
576.65 s
gammaloop-workspace-doctest> 3797 | runtime = api.get_default_runtime_settings()
576.65 s
gammaloop-workspace-doctest> | ^ expected one of `!` or `::`
576.65 s
gammaloop-workspace-doctest>
576.65 s
gammaloop-workspace-doctest> error: aborting due to 1 previous error
576.65 s
gammaloop-workspace-doctest>
576.65 s
gammaloop-workspace-doctest> Couldn't compile the test.
576.65 s
gammaloop-workspace-doctest> ---- crates/gammaloop-api/src/python.rs - python::PyHistogramAccumulator (line 871) stdout ----
576.65 s
gammaloop-workspace-doctest> error: expected one of `!` or `::`, found `gammaloop`
576.65 s
gammaloop-workspace-doctest> --> crates/gammaloop-api/src/python.rs:872:6
576.65 s
gammaloop-workspace-doctest> |
576.65 s
gammaloop-workspace-doctest> 872 | from gammaloop import HistogramAccumulator
576.65 s
gammaloop-workspace-doctest> | ^^^^^^^^^ expected one of `!` or `::`
576.65 s
gammaloop-workspace-doctest>
576.65 s
gammaloop-workspace-doctest> error: aborting due to 1 previous error
576.65 s
gammaloop-workspace-doctest>
576.65 s
gammaloop-workspace-doctest> Couldn't compile the test.
576.65 s
gammaloop-workspace-doctest> ---- crates/gammaloop-api/src/python.rs - python::GammaLoopAPI::evaluate_samples (line 3108) stdout ----
576.65 s
gammaloop-workspace-doctest> error: expected one of `!` or `::`, found `pathlib`
576.65 s
gammaloop-workspace-doctest> --> crates/gammaloop-api/src/python.rs:3109:6
576.65 s
gammaloop-workspace-doctest> |
576.65 s
gammaloop-workspace-doctest> 3109 | from pathlib import Path
576.65 s
gammaloop-workspace-doctest> | ^^^^^^^ expected one of `!` or `::`
576.65 s
gammaloop-workspace-doctest>
576.65 s
gammaloop-workspace-doctest> error: aborting due to 1 previous error
576.65 s
gammaloop-workspace-doctest>
576.65 s
gammaloop-workspace-doctest> Couldn't compile the test.
576.65 s
gammaloop-workspace-doctest> ---- crates/gammaloop-api/src/python.rs - python::GammaLoopAPI::get_integrand_info (line 3585) stdout ----
576.65 s
gammaloop-workspace-doctest> error: expected one of `!` or `::`, found `pathlib`
576.65 s
gammaloop-workspace-doctest> --> crates/gammaloop-api/src/python.rs:3586:6
576.65 s
gammaloop-workspace-doctest> |
576.65 s
gammaloop-workspace-doctest> 3586 | from pathlib import Path
576.65 s
gammaloop-workspace-doctest> | ^^^^^^^ expected one of `!` or `::`
576.65 s
gammaloop-workspace-doctest>
576.65 s
gammaloop-workspace-doctest> error: aborting due to 1 previous error
576.65 s
gammaloop-workspace-doctest>
576.65 s
gammaloop-workspace-doctest> Couldn't compile the test.
576.65 s
gammaloop-workspace-doctest> ---- crates/gammaloop-api/src/python.rs - python::GammaLoopAPI::evaluate_sample (line 2967) stdout ----
576.65 s
gammaloop-workspace-doctest> error: expected one of `!` or `::`, found `pathlib`
576.65 s
gammaloop-workspace-doctest> --> crates/gammaloop-api/src/python.rs:2968:6
576.65 s
gammaloop-workspace-doctest> |
576.65 s
gammaloop-workspace-doctest> 2968 | from pathlib import Path
576.65 s
gammaloop-workspace-doctest> | ^^^^^^^ expected one of `!` or `::`
576.65 s
gammaloop-workspace-doctest>
576.65 s
gammaloop-workspace-doctest> error: aborting due to 1 previous error
576.65 s
gammaloop-workspace-doctest>
576.65 s
gammaloop-workspace-doctest> Couldn't compile the test.
576.65 s
gammaloop-workspace-doctest> ---- crates/gammaloop-api/src/python.rs - python::GammaLoopAPI::get_run_history (line 3711) stdout ----
576.65 s
gammaloop-workspace-doctest> error[E0425] : cannot find value `run_card_toml` in this scope
576.65 s
gammaloop-workspace-doctest> --> crates/gammaloop-api/src/python.rs:3712:1
576.65 s
gammaloop-workspace-doctest> |
576.65 s
gammaloop-workspace-doctest> 3712 | run_card_toml = api.get_run_history()
576.65 s
gammaloop-workspace-doctest> | ^^^^^^^^^^^^^
576.65 s
gammaloop-workspace-doctest> |
576.65 s
gammaloop-workspace-doctest> help : you might have meant to introduce a new binding
576.65 s
gammaloop-workspace-doctest> |
576.65 s
gammaloop-workspace-doctest> 3712 | let run_card_toml = api.get_run_history()
576.65 s
gammaloop-workspace-doctest> | +++
576.65 s
gammaloop-workspace-doctest>
576.65 s
gammaloop-workspace-doctest> error[E0425] : cannot find value `api` in this scope
576.65 s
gammaloop-workspace-doctest> --> crates/gammaloop-api/src/python.rs:3712:17
576.65 s
gammaloop-workspace-doctest> |
576.65 s
gammaloop-workspace-doctest> 3712 | run_card_toml = api.get_run_history()
576.65 s
gammaloop-workspace-doctest> | ^^^ not found in this scope
576.65 s
gammaloop-workspace-doctest>
576.65 s
gammaloop-workspace-doctest> error : aborting due to 2 previous errors
576.65 s
gammaloop-workspace-doctest>
576.65 s
gammaloop-workspace-doctest> For more information about this error, try `rustc --explain E0425`.
576.65 s
gammaloop-workspace-doctest> Couldn't compile the test.
576.65 s
gammaloop-workspace-doctest> ---- crates/gammaloop-api/src/python.rs - python::GammaLoopAPI::new_python (line 2834) stdout ----
576.65 s
gammaloop-workspace-doctest> error[E0425] : cannot find value `api` in this scope
576.65 s
gammaloop-workspace-doctest> --> crates/gammaloop-api/src/python.rs:2835:1
576.65 s
gammaloop-workspace-doctest> |
576.65 s
gammaloop-workspace-doctest> 2835 | api = GammaLoopAPI(state_folder="./state", read_only_state=True)
576.65 s
gammaloop-workspace-doctest> | ^^^
576.65 s
gammaloop-workspace-doctest> |
576.65 s
gammaloop-workspace-doctest> help : you might have meant to introduce a new binding
576.65 s
gammaloop-workspace-doctest> |
576.65 s
gammaloop-workspace-doctest> 2835 | let api = GammaLoopAPI(state_folder="./state", read_only_state=True)
576.65 s
gammaloop-workspace-doctest> | +++
576.65 s
gammaloop-workspace-doctest>
576.65 s
gammaloop-workspace-doctest> error[E0425] : cannot find value `state_folder` in this scope
576.65 s
gammaloop-workspace-doctest> --> crates/gammaloop-api/src/python.rs:2835:20
576.65 s
gammaloop-workspace-doctest> |
576.65 s
gammaloop-workspace-doctest> 2835 | api = GammaLoopAPI(state_folder="./state", read_only_state=True)
576.65 s
gammaloop-workspace-doctest> | ^^^^^^^^^^^^ not found in this scope
576.65 s
gammaloop-workspace-doctest>
576.65 s
gammaloop-workspace-doctest> error[E0425] : cannot find value `read_only_state` in this scope
576.65 s
gammaloop-workspace-doctest> --> crates/gammaloop-api/src/python.rs:2835:44
576.65 s
gammaloop-workspace-doctest> |
576.65 s
gammaloop-workspace-doctest> 2835 | api = GammaLoopAPI(state_folder="./state", read_only_state=True)
576.65 s
gammaloop-workspace-doctest> | ^^^^^^^^^^^^^^^ not found in this scope
576.65 s
gammaloop-workspace-doctest>
576.65 s
gammaloop-workspace-doctest> error[E0425] : cannot find value `True` in this scope
576.65 s
gammaloop-workspace-doctest> --> crates/gammaloop-api/src/python.rs:2835:60
576.65 s
gammaloop-workspace-doctest> |
576.65 s
gammaloop-workspace-doctest> 2835 | api = GammaLoopAPI(state_folder="./state", read_only_state=True)
576.65 s
gammaloop-workspace-doctest> | ^^^^ not found in this scope
576.65 s
gammaloop-workspace-doctest> |
576.65 s
gammaloop-workspace-doctest> help : you may want to use a bool value instead
576.65 s
gammaloop-workspace-doctest> |
576.65 s
gammaloop-workspace-doctest> 2835 - api = GammaLoopAPI(state_folder="./state", read_only_state=True )
576.65 s
gammaloop-workspace-doctest> 2835 + api = GammaLoopAPI(state_folder="./state", read_only_state=true )
576.65 s
gammaloop-workspace-doctest> |
576.65 s
gammaloop-workspace-doctest>
576.65 s
gammaloop-workspace-doctest> error[E0425] : cannot find function, tuple struct or tuple variant `GammaLoopAPI` in this scope
576.65 s
gammaloop-workspace-doctest> --> crates/gammaloop-api/src/python.rs:2835:7
576.65 s
gammaloop-workspace-doctest> |
576.65 s
gammaloop-workspace-doctest> 2835 | api = GammaLoopAPI(state_folder="./state", read_only_state=True)
576.65 s
gammaloop-workspace-doctest> | ^^^^^^^^^^^^ not found in this scope
576.65 s
gammaloop-workspace-doctest>
576.65 s
gammaloop-workspace-doctest> error : aborting due to 5 previous errors
576.65 s
gammaloop-workspace-doctest>
576.65 s
gammaloop-workspace-doctest> For more information about this error, try `rustc --explain E0425`.
576.65 s
gammaloop-workspace-doctest> Couldn't compile the test.
576.65 s
gammaloop-workspace-doctest> ---- crates/gammaloop-api/src/python.rs - python::GammaLoopAPI::get_global_settings (line 3739) stdout ----
576.65 s
gammaloop-workspace-doctest> error[E0425] : cannot find value `settings_toml` in this scope
576.65 s
gammaloop-workspace-doctest> --> crates/gammaloop-api/src/python.rs:3740:1
576.65 s
gammaloop-workspace-doctest> |
576.65 s
gammaloop-workspace-doctest> 3740 | settings_toml = api.get_global_settings()
576.65 s
gammaloop-workspace-doctest> | ^^^^^^^^^^^^^
576.65 s
gammaloop-workspace-doctest> |
576.65 s
gammaloop-workspace-doctest> help : you might have meant to introduce a new binding
576.65 s
gammaloop-workspace-doctest> |
576.65 s
gammaloop-workspace-doctest> 3740 | let settings_toml = api.get_global_settings()
576.65 s
gammaloop-workspace-doctest> | +++
576.65 s
gammaloop-workspace-doctest>
576.65 s
gammaloop-workspace-doctest> error[E0425] : cannot find value `api` in this scope
576.65 s
gammaloop-workspace-doctest> --> crates/gammaloop-api/src/python.rs:3740:17
576.65 s
gammaloop-workspace-doctest> |
576.65 s
gammaloop-workspace-doctest> 3740 | settings_toml = api.get_global_settings()
576.65 s
gammaloop-workspace-doctest> | ^^^ not found in this scope
576.65 s
gammaloop-workspace-doctest>
576.65 s
gammaloop-workspace-doctest> error : aborting due to 2 previous errors
576.65 s
gammaloop-workspace-doctest>
576.65 s
gammaloop-workspace-doctest> For more information about this error, try `rustc --explain E0425`.
576.65 s
gammaloop-workspace-doctest> Couldn't compile the test.
576.65 s
gammaloop-workspace-doctest> ---- crates/gammaloop-api/src/python.rs - python::atom_to_dots (line 157) stdout ----
576.65 s
gammaloop-workspace-doctest> error[E0425] : cannot find function `to_dots` in this scope
576.65 s
gammaloop-workspace-doctest> --> crates/gammaloop-api/src/python.rs:158:1
576.65 s
gammaloop-workspace-doctest> |
576.65 s
gammaloop-workspace-doctest> 158 | to_dots("p(mu) * q(mu)")
576.65 s
gammaloop-workspace-doctest> | ^^^^^^^ not found in this scope
576.65 s
gammaloop-workspace-doctest>
576.65 s
gammaloop-workspace-doctest> error : aborting due to 1 previous error
576.65 s
gammaloop-workspace-doctest>
576.65 s
gammaloop-workspace-doctest> For more information about this error, try `rustc --explain E0425`.
576.65 s
gammaloop-workspace-doctest> Couldn't compile the test.
576.65 s
gammaloop-workspace-doctest> ---- crates/gammaloop-api/src/python.rs - python::evaluate_graph_overall_factor (line 95) stdout ----
576.65 s
gammaloop-workspace-doctest> error[E0425] : cannot find function `evaluate_graph_overall_factor` in this scope
576.65 s
gammaloop-workspace-doctest> --> crates/gammaloop-api/src/python.rs:96:1
576.65 s
gammaloop-workspace-doctest> |
576.65 s
gammaloop-workspace-doctest> 96 | evaluate_graph_overall_factor(
576.65 s
gammaloop-workspace-doctest> | ^^^^^^^^^^^^^^^^^^^^^^^^^^^^^ not found in this scope
576.65 s
gammaloop-workspace-doctest>
576.65 s
gammaloop-workspace-doctest> error : aborting due to 1 previous error
576.65 s
gammaloop-workspace-doctest>
576.65 s
gammaloop-workspace-doctest> For more information about this error, try `rustc --explain E0425`.
576.65 s
gammaloop-workspace-doctest> Couldn't compile the test.
576.65 s
gammaloop-workspace-doctest> ---- crates/gammaloop-api/src/python.rs - python::GammaLoopAPI::run_command (line 3901) stdout ----
576.65 s
gammaloop-workspace-doctest> error[E0425] : cannot find value `api` in this scope
576.65 s
gammaloop-workspace-doctest> --> crates/gammaloop-api/src/python.rs:3902:1
576.65 s
gammaloop-workspace-doctest> |
576.65 s
gammaloop-workspace-doctest> 3902 | api.run("display processes")
576.65 s
gammaloop-workspace-doctest> | ^^^ not found in this scope
576.65 s
gammaloop-workspace-doctest>
576.65 s
gammaloop-workspace-doctest> error : aborting due to 1 previous error
576.65 s
gammaloop-workspace-doctest>
576.65 s
gammaloop-workspace-doctest> For more information about this error, try `rustc --explain E0425`.
576.65 s
gammaloop-workspace-doctest> Couldn't compile the test.
576.65 s
gammaloop-workspace-doctest> ---- crates/gammaloop-api/src/python.rs - python::atom_to_canonical_string (line 128) stdout ----
576.65 s
gammaloop-workspace-doctest> error[E0425] : cannot find function `atom_to_canonical_string` in this scope
576.65 s
gammaloop-workspace-doctest> --> crates/gammaloop-api/src/python.rs:129:1
576.65 s
gammaloop-workspace-doctest> |
576.65 s
gammaloop-workspace-doctest> 129 | atom_to_canonical_string("x + x")
576.65 s
gammaloop-workspace-doctest> | ^^^^^^^^^^^^^^^^^^^^^^^^ not found in this scope
576.65 s
gammaloop-workspace-doctest>
576.65 s
gammaloop-workspace-doctest> error : aborting due to 1 previous error
576.65 s
gammaloop-workspace-doctest>
576.65 s
gammaloop-workspace-doctest> For more information about this error, try `rustc --explain E0425`.
576.65 s
gammaloop-workspace-doctest> Couldn't compile the test.
576.65 s
gammaloop-workspace-doctest>
576.65 s
gammaloop-workspace-doctest> failures:
576.65 s
gammaloop-workspace-doctest> crates/gammaloop-api/src/python.rs - python::GammaLoopAPI::evaluate_sample (line 2967)
576.65 s
gammaloop-workspace-doctest> crates/gammaloop-api/src/python.rs - python::GammaLoopAPI::evaluate_samples (line 3108)
576.65 s
gammaloop-workspace-doctest> crates/gammaloop-api/src/python.rs - python::GammaLoopAPI::get_active_command_blocks (line 3760)
576.65 s
gammaloop-workspace-doctest> crates/gammaloop-api/src/python.rs - python::GammaLoopAPI::get_default_runtime_settings (line 3796)
576.65 s
gammaloop-workspace-doctest> crates/gammaloop-api/src/python.rs - python::GammaLoopAPI::get_global_settings (line 3739)
576.65 s
gammaloop-workspace-doctest> crates/gammaloop-api/src/python.rs - python::GammaLoopAPI::get_integrand_info (line 3585)
576.65 s
gammaloop-workspace-doctest> crates/gammaloop-api/src/python.rs - python::GammaLoopAPI::get_integrand_settings (line 3647)
576.65 s
gammaloop-workspace-doctest> crates/gammaloop-api/src/python.rs - python::GammaLoopAPI::get_run_history (line 3711)
576.65 s
gammaloop-workspace-doctest> crates/gammaloop-api/src/python.rs - python::GammaLoopAPI::new_python (line 2834)
576.65 s
gammaloop-workspace-doctest> crates/gammaloop-api/src/python.rs - python::GammaLoopAPI::run_command (line 3901)
576.65 s
gammaloop-workspace-doctest> crates/gammaloop-api/src/python.rs - python::PyHistogramAccumulator (line 871)
576.65 s
gammaloop-workspace-doctest> crates/gammaloop-api/src/python.rs - python::atom_to_canonical_string (line 128)
576.65 s
gammaloop-workspace-doctest> crates/gammaloop-api/src/python.rs - python::atom_to_dots (line 157)
576.65 s
gammaloop-workspace-doctest> crates/gammaloop-api/src/python.rs - python::evaluate_graph_overall_factor (line 95)
576.65 s
gammaloop-workspace-doctest>
576.65 s
gammaloop-workspace-doctest> test result: FAILED. 2 passed; 14 failed; 0 ignored; 0 measured; 0 filtered out; finished in 5.84s
576.65 s
gammaloop-workspace-doctest>
576.65 s
gammaloop-workspace-doctest> error : doctest failed, to rerun pass `-p gammaloop-api --doc`
577.46 s
[0 built (1 failed ), 0.0 error: Cannot build '/nix/store/q3rgbccmd61xgar5zy984yip45msxdh7-gammaloop-workspace-doctest-0.1.0.drv '.
577.46 s
Reason: builder failed with exit code 101 .
577.46 s
Output paths:
577.46 s
/nix/store/kgprf5k2zpbrmlyzcfkch5hhbjn62g3v-gammaloop-workspace-doctest-0.1.0
577.46 s
Last 356 log lines:
577.46 s
> Running phase: unpackPhase
577.46 s
> unpacking source archive /nix/store/j2ncg4pj99fhx17lqnr4ncczqgxk2q5z-source
577.46 s
> source root is source
577.46 s
> Running phase: patchPhase
577.46 s
> Executing configureCargoCommonVars
577.46 s
> decompressing cargo artifacts from /nix/store/8rkh7d3hq722l839568nhnwihnsx041a-gammaloop-workspace-deps-deps-0.1.0/target.tar.zst to target
577.46 s
> Running phase: updateAutotoolsGnuConfigScriptsPhase
577.46 s
> Running phase: configurePhase
577.46 s
> will append /build/source/.cargo-home/config.toml with contents of /nix/store/xdy1vvhll2bijdplvl9fcc2b9plkxhaa-vendor-cargo-deps/config.toml
577.46 s
> default configurePhase, nothing to do
577.46 s
> Running phase: buildPhase
577.46 s
> +++ command cargo --version
577.46 s
> cargo 1.97.0 (c980f4866 2026-06-30)
577.46 s
> +++ command cargo test --profile ci-optim --doc --locked --workspace --features gammaloop-api/cli,gammaloop-tracing-filter/clap,gammaloop-tracing-filter/symbolica,idenso/bincode,idenso/reference-cases,linnet/bincode,linnet/drawing,linnet/nodestore-vec,linnet/rkyv,linnet/serde,linnet/symbolica,spenso-macros/shadowing,spenso/shadowing,symbolica/tracing_max_level_info
577.46 s
> Compiling target-lexicon v0.13.5
577.46 s
> Compiling symbolica v2.2.0 (https://github.com/symbolica-dev/symbolica?branch=dev#0441bd7a)
577.46 s
> Compiling maplit v1.0.2
577.46 s
> Compiling gammaloop-tracing-filter-macros v0.1.0 (/build/source/crates/gammaloop-tracing-filter-macros)
577.46 s
> Compiling vakint v0.1.2 (/build/source/crates/vakint)
577.46 s
> Compiling gammalooprs v0.3.4 (/build/source/crates/gammalooprs)
577.46 s
> Compiling alphal00p-docs-macros v0.1.0 (/build/source/crates/alphal00p-docs-macros)
577.46 s
> Compiling alphal00p-docs-schema v0.1.0 (/build/source/crates/alphal00p-docs-schema)
577.46 s
> Compiling rustc_version v0.4.1
577.46 s
> Compiling bincode v1.3.3
577.46 s
> Compiling target-triple v1.0.1
577.46 s
> Compiling iai-callgrind-runner v0.14.2
577.46 s
> Compiling gungraun-runner v0.18.2
577.46 s
> Compiling gammaloop-integration-tests v0.1.0 (/build/source/tests)
577.46 s
> Compiling test-log-core v0.2.20
577.46 s
> Compiling wait-timeout v0.2.1
577.46 s
> Compiling quick-error v1.2.3
577.46 s
> Compiling iai-callgrind v0.14.2
577.46 s
> Compiling bit-vec v0.8.0
577.46 s
> Compiling rusty-fork v0.3.1
577.46 s
> Compiling iai-callgrind-macros v0.5.1
577.46 s
> Compiling bit-set v0.8.0
577.46 s
> Compiling rand_xorshift v0.4.0
577.46 s
> Compiling console v0.15.11
577.46 s
> Compiling unarray v0.1.4
577.46 s
> Compiling glob v0.3.4
577.46 s
> Compiling base64 v0.21.7
577.46 s
> Compiling termcolor v1.4.1
577.46 s
> Compiling gungraun-macros v0.8.0
577.46 s
> Compiling similar-asserts v1.7.0
577.46 s
> Compiling ron v0.8.1
577.46 s
> Compiling pyo3-build-config v0.28.3
577.46 s
> Compiling trybuild v1.0.120
577.46 s
> Compiling alphal00p-docs-catalogs v0.1.0 (/build/source/crates/alphal00p-docs-catalogs)
577.46 s
> Compiling proptest v1.11.0
577.46 s
> Compiling alphal00p-docs-builder v0.1.0 (/build/source/crates/alphal00p-docs-builder)
577.46 s
> Compiling kurvst v0.1.0 (/build/source/crates/kurvst)
577.46 s
> Compiling test-log-macros v0.2.20
577.46 s
> Compiling test-log v0.2.20
577.46 s
> Compiling alphal00p-docs-examples v0.1.0 (/build/source/crates/alphal00p-docs-examples)
577.46 s
> Compiling pyo3-ffi v0.28.3
577.46 s
> Compiling pyo3-macros-backend v0.28.3
577.46 s
> Compiling pyo3 v0.28.3
577.46 s
> Compiling numpy v0.28.0
577.46 s
> Compiling gammaloop-api v0.1.0 (/build/source/crates/gammaloop-api)
577.46 s
> Compiling gungraun v0.18.2
577.46 s
> Compiling pyo3-macros v0.28.3
577.46 s
> Compiling pyo3-stub-gen v0.17.2
577.46 s
> Compiling numerica v2.2.0 (https://github.com/symbolica-dev/symbolica?branch=dev#0441bd7a)
577.46 s
> Compiling graphica v2.1.0 (https://github.com/symbolica-dev/symbolica?branch=dev#0441bd7a)
577.46 s
> Compiling symbolica-utils v0.1.0 (/build/source/crates/symbolica-utils)
577.46 s
> Compiling gammaloop-workspace-hack v0.1.0 (/build/source/crates/gammaloop-workspace-hack)
577.46 s
> Compiling spenso-macros v0.3.2 (/build/source/crates/spenso-macros)
577.46 s
> Compiling linnet v0.17.0 (/build/source/crates/linnet)
577.46 s
> Compiling spenso v0.6.0 (/build/source/crates/spenso)
577.46 s
> Compiling idenso v0.3.0 (/build/source/crates/idenso)
577.46 s
> Compiling gammaloop-tracing-filter v0.1.0 (/build/source/crates/gammaloop-tracing-filter)
577.46 s
> Compiling spenso-hep-lib v0.1.7 (/build/source/crates/spenso-hep-lib)
577.46 s
> Compiling spynso3 v0.1.2 (/build/source/crates/spynso3)
577.46 s
> Compiling linnest v0.1.0 (/build/source/crates/linnest)
577.46 s
> Compiling linnet-py v0.1.0 (/build/source/crates/linnet-py)
577.46 s
> Finished `ci-optim` profile [optimized] target(s) in 9m 06s
577.46 s
> warning : the following packages contain code that will be rejected by a future version of Rust: proc-macro-error2 v2.0.1
577.46 s
> note : to see what the problems were, use the option `--future-incompat-report`, or run `cargo report future-incompatibilities --id 1`
577.46 s
> Doc-tests alphal00p_docs_builder
577.46 s
>
577.46 s
> running 0 tests
577.46 s
>
577.46 s
> test result: ok. 0 passed; 0 failed; 0 ignored; 0 measured; 0 filtered out; finished in 0.00s
577.46 s
>
577.46 s
> Doc-tests alphal00p_docs_catalogs
577.46 s
>
577.46 s
> running 0 tests
577.46 s
>
577.46 s
> test result: ok. 0 passed; 0 failed; 0 ignored; 0 measured; 0 filtered out; finished in 0.00s
577.46 s
>
577.46 s
> Doc-tests alphal00p_docs_examples
577.46 s
>
577.46 s
> running 0 tests
577.46 s
>
577.46 s
> test result: ok. 0 passed; 0 failed; 0 ignored; 0 measured; 0 filtered out; finished in 0.00s
577.46 s
>
577.46 s
> Doc-tests alphal00p_docs
577.46 s
>
577.46 s
> running 0 tests
577.46 s
>
577.46 s
> test result: ok. 0 passed; 0 failed; 0 ignored; 0 measured; 0 filtered out; finished in 0.00s
577.46 s
>
577.46 s
> Doc-tests alphal00p_docs_schema
577.46 s
>
577.46 s
> running 0 tests
577.46 s
>
577.46 s
> test result: ok. 0 passed; 0 failed; 0 ignored; 0 measured; 0 filtered out; finished in 0.00s
577.46 s
>
577.46 s
> Doc-tests gammaloop_api
577.46 s
>
577.46 s
> running 16 tests
577.46 s
> test crates/gammaloop-api/src/python.rs - python::GammaLoopAPI::get_integrand_settings (line 3647) ... FAILED
577.46 s
> test crates/gammaloop-api/src/python.rs - python::GammaLoopAPI::get_active_command_blocks (line 3760) ... FAILED
577.46 s
> test crates/gammaloop-api/src/python.rs - python::GammaLoopAPI::get_default_runtime_settings (line 3796) ... FAILED
577.46 s
> test crates/gammaloop-api/src/python.rs - python::PyHistogramAccumulator (line 871) ... FAILED
577.46 s
> test crates/gammaloop-api/src/python.rs - python::GammaLoopAPI::evaluate_samples (line 3108) ... FAILED
577.46 s
> test crates/gammaloop-api/src/python.rs - python::GammaLoopAPI::get_integrand_info (line 3585) ... FAILED
577.46 s
> test crates/gammaloop-api/src/python.rs - python::GammaLoopAPI::evaluate_sample (line 2967) ... FAILED
577.46 s
> test crates/gammaloop-api/src/python.rs - python::GammaLoopAPI::get_run_history (line 3711) ... FAILED
577.46 s
> test crates/gammaloop-api/src/python.rs - python::GammaLoopAPI::new_python (line 2834) ... FAILED
577.46 s
> test crates/gammaloop-api/src/lib.rs - (line 18) - compile ... ok
577.46 s
> test crates/gammaloop-api/src/python.rs - python::GammaLoopAPI::get_global_settings (line 3739) ... FAILED
577.46 s
> test crates/gammaloop-api/src/python.rs - python::atom_to_dots (line 157) ... FAILED
577.46 s
> test crates/gammaloop-api/src/python.rs - python::evaluate_graph_overall_factor (line 95) ... FAILED
577.46 s
> test crates/gammaloop-api/src/python.rs - python::GammaLoopAPI::run_command (line 3901) ... FAILED
577.46 s
> test crates/gammaloop-api/src/python.rs - python::atom_to_canonical_string (line 128) ... FAILED
577.46 s
> test crates/gammaloop-api/src/commands/evaluate_samples.rs - commands::evaluate_samples::EvaluateSamples (line 50) ... ok
577.46 s
>
577.46 s
> failures:
577.46 s
>
577.46 s
> ---- crates/gammaloop-api/src/python.rs - python::GammaLoopAPI::get_integrand_settings (line 3647) stdout ----
577.46 s
> error: expected one of `!` or `::`, found `=`
577.46 s
> --> crates/gammaloop-api/src/python.rs:3648:10
577.46 s
> |
577.46 s
> 3648 | settings = api.get_integrand_settings(process_id=0)
577.46 s
> | ^ expected one of `!` or `::`
577.46 s
>
577.46 s
> error: aborting due to 1 previous error
577.46 s
>
577.46 s
> Couldn't compile the test.
577.46 s
> ---- crates/gammaloop-api/src/python.rs - python::GammaLoopAPI::get_active_command_blocks (line 3760) stdout ----
577.46 s
> error: expected item, found keyword `for`
577.46 s
> --> crates/gammaloop-api/src/python.rs:3761:1
577.46 s
> |
577.46 s
> 3761 | for name, commands in api.get_active_command_blocks().items():
577.46 s
> | ^^^ expected item
577.46 s
> |
577.46 s
> = note: for a full list of items that can appear in modules, see <https://doc.rust-lang.org/reference/items.html>
577.46 s
>
577.46 s
> error: aborting due to 1 previous error
577.46 s
>
577.46 s
> Couldn't compile the test.
577.46 s
> ---- crates/gammaloop-api/src/python.rs - python::GammaLoopAPI::get_default_runtime_settings (line 3796) stdout ----
577.46 s
> error: expected one of `!` or `::`, found `=`
577.46 s
> --> crates/gammaloop-api/src/python.rs:3797:9
577.46 s
> |
577.46 s
> 3797 | runtime = api.get_default_runtime_settings()
577.46 s
> | ^ expected one of `!` or `::`
577.46 s
>
577.46 s
> error: aborting due to 1 previous error
577.46 s
>
577.46 s
> Couldn't compile the test.
577.46 s
> ---- crates/gammaloop-api/src/python.rs - python::PyHistogramAccumulator (line 871) stdout ----
577.46 s
> error: expected one of `!` or `::`, found `gammaloop`
577.46 s
> --> crates/gammaloop-api/src/python.rs:872:6
577.46 s
> |
577.46 s
> 872 | from gammaloop import HistogramAccumulator
577.46 s
> | ^^^^^^^^^ expected one of `!` or `::`
577.46 s
>
577.46 s
> error: aborting due to 1 previous error
577.46 s
>
577.46 s
> Couldn't compile the test.
577.46 s
> ---- crates/gammaloop-api/src/python.rs - python::GammaLoopAPI::evaluate_samples (line 3108) stdout ----
577.46 s
> error: expected one of `!` or `::`, found `pathlib`
577.46 s
> --> crates/gammaloop-api/src/python.rs:3109:6
577.46 s
> |
577.46 s
> 3109 | from pathlib import Path
577.46 s
> | ^^^^^^^ expected one of `!` or `::`
577.46 s
>
577.46 s
> error: aborting due to 1 previous error
577.46 s
>
577.46 s
> Couldn't compile the test.
577.46 s
> ---- crates/gammaloop-api/src/python.rs - python::GammaLoopAPI::get_integrand_info (line 3585) stdout ----
577.46 s
> error: expected one of `!` or `::`, found `pathlib`
577.46 s
> --> crates/gammaloop-api/src/python.rs:3586:6
577.46 s
> |
577.46 s
> 3586 | from pathlib import Path
577.46 s
> | ^^^^^^^ expected one of `!` or `::`
577.46 s
>
577.46 s
> error: aborting due to 1 previous error
577.46 s
>
577.46 s
> Couldn't compile the test.
577.46 s
> ---- crates/gammaloop-api/src/python.rs - python::GammaLoopAPI::evaluate_sample (line 2967) stdout ----
577.46 s
> error: expected one of `!` or `::`, found `pathlib`
577.46 s
> --> crates/gammaloop-api/src/python.rs:2968:6
577.46 s
> |
577.46 s
> 2968 | from pathlib import Path
577.46 s
> | ^^^^^^^ expected one of `!` or `::`
577.46 s
>
577.46 s
> error: aborting due to 1 previous error
577.46 s
>
577.46 s
> Couldn't compile the test.
577.46 s
> ---- crates/gammaloop-api/src/python.rs - python::GammaLoopAPI::get_run_history (line 3711) stdout ----
577.46 s
> error[E0425] : cannot find value `run_card_toml` in this scope
577.46 s
> --> crates/gammaloop-api/src/python.rs:3712:1
577.46 s
> |
577.46 s
> 3712 | run_card_toml = api.get_run_history()
577.46 s
> | ^^^^^^^^^^^^^
577.46 s
> |
577.46 s
> help : you might have meant to introduce a new binding
577.46 s
> |
577.46 s
> 3712 | let run_card_toml = api.get_run_history()
577.46 s
> | +++
577.46 s
>
577.46 s
> error[E0425] : cannot find value `api` in this scope
577.46 s
> --> crates/gammaloop-api/src/python.rs:3712:17
577.46 s
> |
577.46 s
> 3712 | run_card_toml = api.get_run_history()
577.46 s
> | ^^^ not found in this scope
577.46 s
>
577.46 s
> error : aborting due to 2 previous errors
577.46 s
>
577.46 s
> For more information about this error, try `rustc --explain E0425`.
577.46 s
> Couldn't compile the test.
577.46 s
> ---- crates/gammaloop-api/src/python.rs - python::GammaLoopAPI::new_python (line 2834) stdout ----
577.46 s
> error[E0425] : cannot find value `api` in this scope
577.46 s
> --> crates/gammaloop-api/src/python.rs:2835:1
577.46 s
> |
577.46 s
> 2835 | api = GammaLoopAPI(state_folder="./state", read_only_state=True)
577.46 s
> | ^^^
577.46 s
> |
577.46 s
> help : you might have meant to introduce a new binding
577.46 s
> |
577.46 s
> 2835 | let api = GammaLoopAPI(state_folder="./state", read_only_state=True)
577.46 s
> | +++
577.46 s
>
577.46 s
> error[E0425] : cannot find value `state_folder` in this scope
577.47 s
> --> crates/gammaloop-api/src/python.rs:2835:20
577.47 s
> |
577.47 s
> 2835 | api = GammaLoopAPI(state_folder="./state", read_only_state=True)
577.47 s
> | ^^^^^^^^^^^^ not found in this scope
577.47 s
>
577.47 s
> error[E0425] : cannot find value `read_only_state` in this scope
577.47 s
> --> crates/gammaloop-api/src/python.rs:2835:44
577.47 s
> |
577.47 s
> 2835 | api = GammaLoopAPI(state_folder="./state", read_only_state=True)
577.47 s
> | ^^^^^^^^^^^^^^^ not found in this scope
577.47 s
>
577.47 s
> error[E0425] : cannot find value `True` in this scope
577.47 s
> --> crates/gammaloop-api/src/python.rs:2835:60
577.47 s
> |
577.47 s
> 2835 | api = GammaLoopAPI(state_folder="./state", read_only_state=True)
577.47 s
> | ^^^^ not found in this scope
577.47 s
> |
577.47 s
> help : you may want to use a bool value instead
577.47 s
> |
577.47 s
> 2835 - api = GammaLoopAPI(state_folder="./state", read_only_state=True )
577.47 s
> 2835 + api = GammaLoopAPI(state_folder="./state", read_only_state=true )
577.47 s
> |
577.47 s
>
577.47 s
> error[E0425] : cannot find function, tuple struct or tuple variant `GammaLoopAPI` in this scope
577.47 s
> --> crates/gammaloop-api/src/python.rs:2835:7
577.47 s
> |
577.47 s
> 2835 | api = GammaLoopAPI(state_folder="./state", read_only_state=True)
577.47 s
> | ^^^^^^^^^^^^ not found in this scope
577.47 s
>
577.47 s
> error : aborting due to 5 previous errors
577.47 s
>
577.47 s
> For more information about this error, try `rustc --explain E0425`.
577.47 s
> Couldn't compile the test.
577.47 s
> ---- crates/gammaloop-api/src/python.rs - python::GammaLoopAPI::get_global_settings (line 3739) stdout ----
577.47 s
> error[E0425] : cannot find value `settings_toml` in this scope
577.47 s
> --> crates/gammaloop-api/src/python.rs:3740:1
577.47 s
> |
577.47 s
> 3740 | settings_toml = api.get_global_settings()
577.47 s
> | ^^^^^^^^^^^^^
577.47 s
> |
577.47 s
> help : you might have meant to introduce a new binding
577.47 s
> |
577.47 s
> 3740 | let settings_toml = api.get_global_settings()
577.47 s
> | +++
577.47 s
>
577.47 s
> error[E0425] : cannot find value `api` in this scope
577.47 s
> --> crates/gammaloop-api/src/python.rs:3740:17
577.47 s
> |
577.47 s
> 3740 | settings_toml = api.get_global_settings()
577.47 s
> | ^^^ not found in this scope
577.47 s
>
577.47 s
> error : aborting due to 2 previous errors
577.47 s
>
577.47 s
> For more information about this error, try `rustc --explain E0425`.
577.47 s
> Couldn't compile the test.
577.47 s
> ---- crates/gammaloop-api/src/python.rs - python::atom_to_dots (line 157) stdout ----
577.47 s
> error[E0425] : cannot find function `to_dots` in this scope
577.47 s
> --> crates/gammaloop-api/src/python.rs:158:1
577.47 s
> |
577.47 s
> 158 | to_dots("p(mu) * q(mu)")
577.47 s
> | ^^^^^^^ not found in this scope
577.47 s
>
577.47 s
> error : aborting due to 1 previous error
577.47 s
>
577.47 s
> For more information about this error, try `rustc --explain E0425`.
577.47 s
> Couldn't compile the test.
577.47 s
> ---- crates/gammaloop-api/src/python.rs - python::evaluate_graph_overall_factor (line 95) stdout ----
577.47 s
> error[E0425] : cannot find function `evaluate_graph_overall_factor` in this scope
577.47 s
> --> crates/gammaloop-api/src/python.rs:96:1
577.47 s
> |
577.47 s
> 96 | evaluate_graph_overall_factor(
577.47 s
> | ^^^^^^^^^^^^^^^^^^^^^^^^^^^^^ not found in this scope
577.47 s
>
577.47 s
> error : aborting due to 1 previous error
577.47 s
>
577.47 s
> For more information about this error, try `rustc --explain E0425`.
577.47 s
> Couldn't compile the test.
577.47 s
> ---- crates/gammaloop-api/src/python.rs - python::GammaLoopAPI::run_command (line 3901) stdout ----
577.47 s
> error[E0425] : cannot find value `api` in this scope
577.47 s
> --> crates/gammaloop-api/src/python.rs:3902:1
577.47 s
> |
577.47 s
> 3902 | api.run("display processes")
577.47 s
> | ^^^ not found in this scope
577.47 s
>
577.47 s
> error : aborting due to 1 previous error
577.47 s
>
577.47 s
> For more information about this error, try `rustc --explain E0425`.
577.47 s
> Couldn't compile the test.
577.47 s
> ---- crates/gammaloop-api/src/python.rs - python::atom_to_canonical_string (line 128) stdout ----
577.47 s
> error[E0425] : cannot find function `atom_to_canonical_string` in this scope
577.47 s
> --> crates/gammaloop-api/src/python.rs:129:1
577.47 s
> |
577.47 s
> 129 | atom_to_canonical_string("x + x")
577.47 s
> | ^^^^^^^^^^^^^^^^^^^^^^^^ not found in this scope
577.47 s
>
577.47 s
> error : aborting due to 1 previous error
577.47 s
>
577.47 s
> For more information about this error, try `rustc --explain E0425`.
577.47 s
> Couldn't compile the test.
577.47 s
>
577.47 s
> failures:
577.47 s
> crates/gammaloop-api/src/python.rs - python::GammaLoopAPI::evaluate_sample (line 2967)
577.47 s
> crates/gammaloop-api/src/python.rs - python::GammaLoopAPI::evaluate_samples (line 3108)
577.47 s
> crates/gammaloop-api/src/python.rs - python::GammaLoopAPI::get_active_command_blocks (line 3760)
577.47 s
> crates/gammaloop-api/src/python.rs - python::GammaLoopAPI::get_default_runtime_settings (line 3796)
577.47 s
> crates/gammaloop-api/src/python.rs - python::GammaLoopAPI::get_global_settings (line 3739)
577.47 s
> crates/gammaloop-api/src/python.rs - python::GammaLoopAPI::get_integrand_info (line 3585)
577.47 s
> crates/gammaloop-api/src/python.rs - python::GammaLoopAPI::get_integrand_settings (line 3647)
577.47 s
> crates/gammaloop-api/src/python.rs - python::GammaLoopAPI::get_run_history (line 3711)
577.47 s
> crates/gammaloop-api/src/python.rs - python::GammaLoopAPI::new_python (line 2834)
577.47 s
> crates/gammaloop-api/src/python.rs - python::GammaLoopAPI::run_command (line 3901)
577.47 s
> crates/gammaloop-api/src/python.rs - python::PyHistogramAccumulator (line 871)
577.47 s
> crates/gammaloop-api/src/python.rs - python::atom_to_canonical_string (line 128)
577.47 s
> crates/gammaloop-api/src/python.rs - python::atom_to_dots (line 157)
577.47 s
> crates/gammaloop-api/src/python.rs - python::evaluate_graph_overall_factor (line 95)
577.47 s
>
577.47 s
> test result: FAILED. 2 passed; 14 failed; 0 ignored; 0 measured; 0 filtered out; finished in 5.84s
577.47 s
>
577.47 s
> error : doctest failed, to rerun pass `-p gammaloop-api --doc`
577.47 s
For full logs, run:
577.47 s
nix log /nix/store/q3rgbccmd61xgar5zy984yip45msxdh7-gammaloop-workspace-doctest-0.1.0.drv
577.64 s
Run failed.