test packages.x86_64-linux.nix-ci-check-gammaloop-doctest

Reproduce this run
Original Run
  1. 24.13 s Downloading cached cargo-package-cpufeatures from https://cache.nix-ci.com
  2. 24.13 s Progress: 0 of 1 built, 85 of 675 downloaded from cache (15 downloading)
  3. 24.13 s Downloading cached cargo-package-cpufeatures from https://cache.nix-ci.com
  4. 24.13 s Downloaded cached cargo-package-colorchoice (23 KiB) in 37ms
  5. 24.13 s Progress: 0 of 1 built, 86 of 675 downloaded from cache (15 downloading)
  6. 24.13 s Downloading cached cargo-package-criterion from https://cache.nix-ci.com
  7. 24.13 s Downloaded cached cargo-package-color-eyre (836 KiB) in 48ms
  8. 24.13 s Progress: 0 of 1 built, 87 of 675 downloaded from cache (15 downloading)
  9. 24.13 s Downloaded cached cargo-package-compact_str (335 KiB) in 37ms
  10. 24.13 s Downloaded cached cargo-package-colored (149 KiB) in 40ms
  11. 24.14 s Downloaded cached cargo-package-constcat (33 KiB) in 25ms
  12. 24.14 s Downloading cached cargo-package-criterion-plot from https://cache.nix-ci.com
  13. 24.14 s Progress: 0 of 1 built, 88 of 675 downloaded from cache (15 downloading)
  14. 24.14 s Progress: 0 of 1 built, 89 of 675 downloaded from cache (14 downloading)
  15. 24.14 s Downloaded cached cargo-package-constant_time_eq (118 KiB) in 28ms
  16. 24.14 s Progress: 0 of 1 built, 90 of 675 downloaded from cache (13 downloading)
  17. 24.14 s Downloaded cached cargo-package-convert_case (100 KiB) in 25ms
  18. 24.14 s Downloaded cached cargo-package-colored (151 KiB) in 40ms
  19. 24.14 s Downloading cached cargo-package-crossbeam-channel from https://cache.nix-ci.com
  20. 24.14 s Downloading cached cargo-package-crossbeam-deque from https://cache.nix-ci.com
  21. 24.14 s Downloading cached cargo-package-crossbeam-epoch from https://cache.nix-ci.com
  22. 24.14 s Progress: 0 of 1 built, 91 of 675 downloaded from cache (15 downloading)
  23. 24.14 s Progress: 0 of 1 built, 92 of 675 downloaded from cache (14 downloading)
  24. 24.14 s Progress: 0 of 1 built, 93 of 675 downloaded from cache (13 downloading)
  25. 24.14 s Downloaded cached cargo-package-console (142 KiB) in 35ms
  26. 24.14 s Downloading cached cargo-package-crossbeam-utils from https://cache.nix-ci.com
  27. 24.14 s Downloading cached cargo-package-crossterm from https://cache.nix-ci.com
  28. 24.14 s Downloading cached cargo-package-crossterm from https://cache.nix-ci.com
  29. 24.14 s Progress: 0 of 1 built, 94 of 675 downloaded from cache (15 downloading)
  30. 24.14 s Downloaded cached cargo-package-const-random-macro (19 KiB) in 34ms
  31. 24.14 s Downloading cached cargo-package-crossterm_winapi from https://cache.nix-ci.com
  32. 24.14 s Downloaded cached cargo-package-const-random (20 KiB) in 36ms
  33. 24.14 s Progress: 0 of 1 built, 95 of 675 downloaded from cache (15 downloading)
  34. 24.14 s Progress: 0 of 1 built, 96 of 675 downloaded from cache (14 downloading)
  35. 24.14 s Downloaded cached cargo-package-console (159 KiB) in 41ms
  36. 24.14 s Downloading cached cargo-package-crypto-common from https://cache.nix-ci.com
  37. 24.14 s Downloading cached cargo-package-csscolorparser from https://cache.nix-ci.com
  38. 24.14 s Progress: 0 of 1 built, 97 of 675 downloaded from cache (15 downloading)
  39. 24.14 s Downloading cached cargo-package-ctrlc from https://cache.nix-ci.com
  40. 24.14 s Downloaded cached cargo-package-convert_case (34 KiB) in 23ms
  41. 24.14 s Progress: 0 of 1 built, 98 of 675 downloaded from cache (15 downloading)
  42. 24.15 s Downloading cached cargo-package-darling from https://cache.nix-ci.com
  43. 24.16 s Downloaded cached cargo-package-core-foundation-sys (237 KiB) in 28ms
  44. 24.16 s Progress: 0 of 1 built, 99 of 675 downloaded from cache (15 downloading)
  45. 24.16 s Downloaded cached cargo-package-cpufeatures (47 KiB) in 26ms
  46. 24.16 s Downloading cached cargo-package-darling from https://cache.nix-ci.com
  47. 24.16 s Progress: 0 of 1 built, 100 of 675 downloaded from cache (15 downloading)
  48. 24.16 s Downloaded cached cargo-package-cpufeatures (49 KiB) in 27ms
  49. 24.16 s Downloading cached cargo-package-darling_core from https://cache.nix-ci.com
  50. 24.16 s Progress: 0 of 1 built, 101 of 675 downloaded from cache (15 downloading)
  51. 24.16 s Downloading cached cargo-package-darling_core from https://cache.nix-ci.com
  52. 24.16 s Downloaded cached cargo-package-crossbeam-utils (192 KiB) in 25ms
  53. 24.16 s Progress: 0 of 1 built, 102 of 675 downloaded from cache (15 downloading)
  54. 24.17 s Downloaded cached cargo-package-crossbeam-epoch (204 KiB) in 29ms
  55. 24.17 s Downloaded cached cargo-package-crossbeam-channel (597 KiB) in 29ms
  56. 24.17 s Downloading cached cargo-package-darling_macro from https://cache.nix-ci.com
  57. 24.17 s Downloaded cached cargo-package-crossterm_winapi (65 KiB) in 25ms
  58. 24.17 s Progress: 0 of 1 built, 103 of 675 downloaded from cache (15 downloading)
  59. 24.17 s Progress: 0 of 1 built, 104 of 675 downloaded from cache (14 downloading)
  60. 24.17 s Progress: 0 of 1 built, 105 of 675 downloaded from cache (13 downloading)
  61. 24.17 s Downloading cached cargo-package-darling_macro from https://cache.nix-ci.com
  62. 24.17 s Downloading cached cargo-package-delegate from https://cache.nix-ci.com
  63. 24.17 s Downloading cached cargo-package-delegate from https://cache.nix-ci.com
  64. 24.17 s Downloaded cached cargo-package-criterion-plot (98 KiB) in 33ms
  65. 24.17 s Progress: 0 of 1 built, 106 of 675 downloaded from cache (15 downloading)
  66. 24.17 s Downloaded cached cargo-package-csscolorparser (70 KiB) in 26ms
  67. 24.17 s Downloaded cached cargo-package-crossbeam-deque (129 KiB) in 33ms
  68. 24.17 s Downloading cached cargo-package-deltae from https://cache.nix-ci.com
  69. 24.17 s Progress: 0 of 1 built, 107 of 675 downloaded from cache (15 downloading)
  70. 24.17 s Progress: 0 of 1 built, 108 of 675 downloaded from cache (14 downloading)
  71. 24.17 s Downloading cached cargo-package-deprecate-until from https://cache.nix-ci.com
  72. 24.17 s Downloading cached cargo-package-deranged from https://cache.nix-ci.com
  73. 24.17 s Downloaded cached cargo-package-criterion (521 KiB) in 39ms
  74. 24.17 s Progress: 0 of 1 built, 109 of 675 downloaded from cache (15 downloading)
  75. 24.17 s Downloaded cached cargo-package-ctrlc (52 KiB) in 29ms
  76. 24.17 s Downloading cached cargo-package-derive_builder from https://cache.nix-ci.com
  77. 24.17 s Progress: 0 of 1 built, 110 of 675 downloaded from cache (15 downloading)
  78. 24.18 s Downloading cached cargo-package-derive_builder_core from https://cache.nix-ci.com
  79. 24.18 s Downloaded cached cargo-package-darling (96 KiB) in 32ms
  80. 24.18 s Downloaded cached cargo-package-crypto-common (30 KiB) in 35ms
  81. 24.18 s Progress: 0 of 1 built, 111 of 675 downloaded from cache (15 downloading)
  82. 24.18 s Downloaded cached cargo-package-crossterm (542 KiB) in 40ms
  83. 24.18 s Downloading cached cargo-package-derive_builder_macro from https://cache.nix-ci.com
  84. 24.18 s Progress: 0 of 1 built, 112 of 675 downloaded from cache (15 downloading)
  85. 24.18 s Progress: 0 of 1 built, 113 of 675 downloaded from cache (14 downloading)
  86. 24.18 s Downloading cached cargo-package-derive_more from https://cache.nix-ci.com
  87. 24.18 s Downloading cached cargo-package-derive_more from https://cache.nix-ci.com
  88. 24.18 s Downloaded cached cargo-package-crossterm (516 KiB) in 43ms
  89. 24.18 s Progress: 0 of 1 built, 114 of 675 downloaded from cache (15 downloading)
  90. 24.18 s Downloading cached cargo-package-derive_more-impl from https://cache.nix-ci.com
  91. 24.19 s Downloaded cached cargo-package-darling_core (274 KiB) in 33ms
  92. 24.19 s Progress: 0 of 1 built, 115 of 675 downloaded from cache (15 downloading)
  93. 24.19 s Downloaded cached cargo-package-darling_macro (7608 B) in 25ms
  94. 24.19 s Downloading cached cargo-package-digest from https://cache.nix-ci.com
  95. 24.19 s Progress: 0 of 1 built, 116 of 675 downloaded from cache (15 downloading)
  96. 24.19 s Downloaded cached cargo-package-darling (179 KiB) in 37ms
  97. 24.20 s Downloading cached cargo-package-dirs from https://cache.nix-ci.com
  98. 24.20 s Progress: 0 of 1 built, 117 of 675 downloaded from cache (15 downloading)
  99. 24.20 s Downloaded cached cargo-package-darling_macro (5696 B) in 30ms
  100. 24.20 s Downloaded cached cargo-package-delegate (55 KiB) in 28ms
  101. 24.20 s Downloading cached cargo-package-dirs-sys from https://cache.nix-ci.com
  102. 24.20 s Progress: 0 of 1 built, 118 of 675 downloaded from cache (15 downloading)
  103. 24.20 s Progress: 0 of 1 built, 119 of 675 downloaded from cache (14 downloading)
  104. 24.20 s Downloaded cached cargo-package-delegate (84 KiB) in 30ms
  105. 24.20 s Downloading cached cargo-package-dispatch2 from https://cache.nix-ci.com
  106. 24.20 s Downloading cached cargo-package-document-features from https://cache.nix-ci.com
  107. 24.20 s Progress: 0 of 1 built, 120 of 675 downloaded from cache (15 downloading)
  108. 24.20 s Downloaded cached cargo-package-darling_core (349 KiB) in 39ms
  109. 24.20 s Downloading cached cargo-package-dot-parser from https://cache.nix-ci.com
  110. 24.20 s Progress: 0 of 1 built, 121 of 675 downloaded from cache (15 downloading)
  111. 24.20 s Downloaded cached cargo-package-deranged (148 KiB) in 29ms
  112. 24.20 s Downloading cached cargo-package-duplicate from https://cache.nix-ci.com
  113. 24.20 s Progress: 0 of 1 built, 122 of 675 downloaded from cache (15 downloading)
  114. 24.20 s Downloading cached cargo-package-duplicate from https://cache.nix-ci.com
  115. 24.20 s Downloaded cached cargo-package-derive_builder_macro (18 KiB) in 24ms
  116. 24.20 s Progress: 0 of 1 built, 123 of 675 downloaded from cache (15 downloading)
  117. 24.21 s Downloading cached cargo-package-dyn-clone from https://cache.nix-ci.com
  118. 24.21 s Downloaded cached cargo-package-deprecate-until (37 KiB) in 33ms
  119. 24.21 s Progress: 0 of 1 built, 124 of 675 downloaded from cache (15 downloading)
  120. 24.21 s Downloading cached cargo-package-either from https://cache.nix-ci.com
  121. 24.21 s Downloaded cached cargo-package-derive_builder (140 KiB) in 35ms
  122. 24.21 s Progress: 0 of 1 built, 125 of 675 downloaded from cache (15 downloading)
  123. 24.21 s Downloaded cached cargo-package-derive_builder_core (137 KiB) in 33ms
  124. 24.21 s Downloading cached cargo-package-encode_unicode from https://cache.nix-ci.com
  125. 24.21 s Progress: 0 of 1 built, 126 of 675 downloaded from cache (15 downloading)
  126. 24.21 s Downloaded cached cargo-package-derive_more (313 KiB) in 30ms
  127. 24.21 s Downloading cached cargo-package-enum-try-as-inner from https://cache.nix-ci.com
  128. 24.21 s Progress: 0 of 1 built, 127 of 675 downloaded from cache (15 downloading)
  129. 24.22 s Downloading cached cargo-package-enum_dispatch from https://cache.nix-ci.com
  130. 24.22 s Downloaded cached cargo-package-derive_more-impl (543 KiB) in 32ms
  131. 24.22 s Progress: 0 of 1 built, 128 of 675 downloaded from cache (15 downloading)
  132. 24.22 s Downloading cached cargo-package-env_filter from https://cache.nix-ci.com
  133. 24.22 s Downloaded cached cargo-package-derive_more (818 KiB) in 37ms
  134. 24.22 s Progress: 0 of 1 built, 129 of 675 downloaded from cache (15 downloading)
  135. 24.22 s Downloading cached cargo-package-env_logger from https://cache.nix-ci.com
  136. 24.23 s Downloaded cached cargo-package-dot-parser (100 KiB) in 30ms
  137. 24.23 s Progress: 0 of 1 built, 130 of 675 downloaded from cache (15 downloading)
  138. 24.23 s Downloaded cached cargo-package-digest (90 KiB) in 37ms
  139. 24.23 s Downloading cached cargo-package-equivalent from https://cache.nix-ci.com
  140. 24.23 s Progress: 0 of 1 built, 131 of 675 downloaded from cache (15 downloading)
  141. 24.24 s Downloading cached cargo-package-errno from https://cache.nix-ci.com
  142. 24.24 s Downloaded cached cargo-package-dirs (58 KiB) in 41ms
  143. 24.24 s Progress: 0 of 1 built, 132 of 675 downloaded from cache (15 downloading)
  144. 24.24 s Downloaded cached cargo-package-dispatch2 (290 KiB) in 38ms
  145. 24.24 s Downloaded cached cargo-package-document-features (52 KiB) in 39ms
  146. 24.24 s Downloading cached cargo-package-euclid from https://cache.nix-ci.com
  147. 24.24 s Progress: 0 of 1 built, 133 of 675 downloaded from cache (15 downloading)
  148. 24.24 s Progress: 0 of 1 built, 134 of 675 downloaded from cache (14 downloading)
  149. 24.24 s Downloaded cached cargo-package-dirs-sys (33 KiB) in 41ms
  150. 24.24 s Downloading cached cargo-package-eyre from https://cache.nix-ci.com
  151. 24.24 s Downloading cached cargo-package-fancy-regex from https://cache.nix-ci.com
  152. 24.24 s Progress: 0 of 1 built, 135 of 675 downloaded from cache (15 downloading)
  153. 24.24 s Downloading cached cargo-package-fastrand from https://cache.nix-ci.com
  154. 24.25 s Downloaded cached cargo-package-enum_dispatch (121 KiB) in 29ms
  155. 24.25 s Progress: 0 of 1 built, 136 of 675 downloaded from cache (15 downloading)
  156. 24.25 s Downloaded cached cargo-package-dyn-clone (48 KiB) in 40ms
  157. 24.25 s Downloaded cached cargo-package-env_filter (66 KiB) in 29ms
  158. 24.25 s Downloading cached cargo-package-fd-lock from https://cache.nix-ci.com
  159. 24.25 s Downloaded cached cargo-package-deltae (2.6 MiB) in 78ms
  160. 24.25 s Downloaded cached cargo-package-duplicate (178 KiB) in 47ms
  161. 24.25 s Progress: 0 of 1 built, 137 of 675 downloaded from cache (15 downloading)
  162. 24.25 s Progress: 0 of 1 built, 138 of 675 downloaded from cache (14 downloading)
  163. 24.25 s Progress: 0 of 1 built, 139 of 675 downloaded from cache (13 downloading)
  164. 24.25 s Downloaded cached cargo-package-either (84 KiB) in 42ms
  165. 24.25 s Progress: 0 of 1 built, 140 of 675 downloaded from cache (12 downloading)
  166. 24.25 s Downloaded cached cargo-package-enum-try-as-inner (68 KiB) in 36ms
  167. 24.25 s Downloading cached cargo-package-features from https://cache.nix-ci.com
  168. 24.25 s Downloading cached cargo-package-figment from https://cache.nix-ci.com
  169. 24.25 s Downloading cached cargo-package-filedescriptor from https://cache.nix-ci.com
  170. 24.25 s Downloading cached cargo-package-find-msvc-tools from https://cache.nix-ci.com
  171. 24.25 s Downloaded cached cargo-package-duplicate (205 KiB) in 47ms
  172. 24.25 s Progress: 0 of 1 built, 141 of 675 downloaded from cache (15 downloading)
  173. 24.25 s Progress: 0 of 1 built, 142 of 675 downloaded from cache (14 downloading)
  174. 24.25 s Progress: 0 of 1 built, 143 of 675 downloaded from cache (13 downloading)
  175. 24.25 s Downloading cached cargo-package-finl_unicode from https://cache.nix-ci.com
  176. 24.25 s Downloading cached cargo-package-fixedbitset from https://cache.nix-ci.com
  177. 24.25 s Downloading cached cargo-package-fnv from https://cache.nix-ci.com
  178. 24.25 s Downloaded cached cargo-package-encode_unicode (233 KiB) in 41ms
  179. 24.25 s Progress: 0 of 1 built, 144 of 675 downloaded from cache (15 downloading)
  180. 24.25 s Downloaded cached cargo-package-env_logger (133 KiB) in 33ms
  181. 24.25 s Downloading cached cargo-package-foldhash from https://cache.nix-ci.com
  182. 24.25 s Progress: 0 of 1 built, 145 of 675 downloaded from cache (15 downloading)
  183. 24.26 s Downloading cached cargo-package-foldhash from https://cache.nix-ci.com
  184. 24.27 s Downloaded cached cargo-package-equivalent (21 KiB) in 35ms
  185. 24.27 s Progress: 0 of 1 built, 146 of 675 downloaded from cache (15 downloading)
  186. 24.27 s Downloading cached cargo-package-fsevent-sys from https://cache.nix-ci.com
  187. 24.27 s Downloaded cached cargo-package-errno (41 KiB) in 35ms
  188. 24.27 s Progress: 0 of 1 built, 147 of 675 downloaded from cache (15 downloading)
  189. 24.27 s Downloading cached cargo-package-funty from https://cache.nix-ci.com
  190. 24.28 s Downloaded cached cargo-package-fastrand (75 KiB) in 33ms
  191. 24.28 s Progress: 0 of 1 built, 148 of 675 downloaded from cache (15 downloading)
  192. 24.28 s Downloaded cached cargo-package-euclid (553 KiB) in 37ms
  193. 24.28 s Downloaded cached cargo-package-fnv (36 KiB) in 23ms
  194. 24.28 s Downloading cached cargo-package-futures-core from https://cache.nix-ci.com
  195. 24.28 s Downloaded cached cargo-package-filedescriptor (58 KiB) in 25ms
  196. 24.28 s Downloaded cached cargo-package-fixedbitset (69 KiB) in 24ms
  197. 24.28 s Downloaded cached cargo-package-eyre (178 KiB) in 37ms
  198. 24.28 s Downloaded cached cargo-package-fancy-regex (361 KiB) in 38ms
  199. 24.28 s Progress: 0 of 1 built, 149 of 675 downloaded from cache (15 downloading)
  200. 24.28 s Progress: 0 of 1 built, 150 of 675 downloaded from cache (14 downloading)
  201. 24.28 s Progress: 0 of 1 built, 151 of 675 downloaded from cache (13 downloading)
  202. 24.28 s Progress: 0 of 1 built, 152 of 675 downloaded from cache (12 downloading)
  203. 24.28 s Progress: 0 of 1 built, 153 of 675 downloaded from cache (11 downloading)
  204. 24.28 s Downloaded cached cargo-package-features (29 KiB) in 27ms
  205. 24.28 s Downloaded cached cargo-package-foldhash (81 KiB) in 24ms
  206. 24.28 s Downloading cached cargo-package-futures-executor from https://cache.nix-ci.com
  207. 24.28 s Downloading cached cargo-package-futures-task from https://cache.nix-ci.com
  208. 24.28 s Downloading cached cargo-package-futures-util from https://cache.nix-ci.com
  209. 24.28 s Downloading cached cargo-package-gat-lending-iterator from https://cache.nix-ci.com
  210. 24.28 s Downloading cached cargo-package-generic-array from https://cache.nix-ci.com
  211. 24.28 s Progress: 0 of 1 built, 154 of 675 downloaded from cache (15 downloading)
  212. 24.28 s Progress: 0 of 1 built, 155 of 675 downloaded from cache (14 downloading)
  213. 24.28 s Progress: 0 of 1 built, 156 of 675 downloaded from cache (13 downloading)
  214. 24.28 s Downloaded cached cargo-package-foldhash (85 KiB) in 25ms
  215. 24.28 s Downloading cached cargo-package-getopts from https://cache.nix-ci.com
  216. 24.28 s Downloading cached cargo-package-getrandom from https://cache.nix-ci.com
  217. 24.28 s Downloading cached cargo-package-getrandom from https://cache.nix-ci.com
  218. 24.28 s Downloaded cached cargo-package-finl_unicode (1.3 MiB) in 29ms
  219. 24.28 s Progress: 0 of 1 built, 157 of 675 downloaded from cache (15 downloading)
  220. 24.28 s Progress: 0 of 1 built, 158 of 675 downloaded from cache (14 downloading)
  221. 24.28 s Downloaded cached cargo-package-figment (324 KiB) in 31ms
  222. 24.28 s Downloaded cached cargo-package-find-msvc-tools (117 KiB) in 31ms
  223. 24.28 s Downloading cached cargo-package-getrandom from https://cache.nix-ci.com
  224. 24.28 s Downloading cached cargo-package-gimli from https://cache.nix-ci.com
  225. 24.28 s Downloaded cached cargo-package-fd-lock (58 KiB) in 36ms
  226. 24.28 s Progress: 0 of 1 built, 159 of 675 downloaded from cache (15 downloading)
  227. 24.28 s Progress: 0 of 1 built, 160 of 675 downloaded from cache (14 downloading)
  228. 24.28 s Progress: 0 of 1 built, 161 of 675 downloaded from cache (13 downloading)
  229. 24.29 s Downloading cached cargo-package-glob from https://cache.nix-ci.com
  230. 24.29 s Downloading cached cargo-package-globset from https://cache.nix-ci.com
  231. 24.29 s Downloading cached cargo-package-gmp-mpfr-sys from https://cache.nix-ci.com
  232. 24.30 s Downloaded cached cargo-package-fsevent-sys (18 KiB) in 30ms
  233. 24.30 s Progress: 0 of 1 built, 162 of 675 downloaded from cache (15 downloading)
  234. 24.30 s Downloaded cached cargo-package-funty (57 KiB) in 29ms
  235. 24.30 s Downloading cached cargo-package-gungraun from https://cache.nix-ci.com
  236. 24.30 s Progress: 0 of 1 built, 163 of 675 downloaded from cache (15 downloading)
  237. 24.30 s Downloading cached cargo-package-gungraun-macros from https://cache.nix-ci.com
  238. 24.31 s Downloaded cached cargo-package-getopts (100 KiB) in 23ms
  239. 24.31 s Downloaded cached cargo-package-getrandom (181 KiB) in 23ms
  240. 24.31 s Downloaded cached cargo-package-getrandom (134 KiB) in 23ms
  241. 24.31 s Progress: 0 of 1 built, 164 of 675 downloaded from cache (15 downloading)
  242. 24.31 s Progress: 0 of 1 built, 165 of 675 downloaded from cache (14 downloading)
  243. 24.31 s Progress: 0 of 1 built, 166 of 675 downloaded from cache (13 downloading)
  244. 24.31 s Downloading cached cargo-package-gungraun-runner from https://cache.nix-ci.com
  245. 24.31 s Downloading cached cargo-package-hashbrown from https://cache.nix-ci.com
  246. 24.31 s Downloading cached cargo-package-half from https://cache.nix-ci.com
  247. 24.31 s Downloaded cached cargo-package-generic-array (69 KiB) in 29ms
  248. 24.31 s Progress: 0 of 1 built, 167 of 675 downloaded from cache (15 downloading)
  249. 24.31 s Downloading cached cargo-package-hashbrown from https://cache.nix-ci.com
  250. 24.31 s Downloaded cached cargo-package-futures-core (49 KiB) in 35ms
  251. 24.31 s Downloaded cached cargo-package-futures-task (42 KiB) in 33ms
  252. 24.31 s Progress: 0 of 1 built, 168 of 675 downloaded from cache (15 downloading)
  253. 24.31 s Downloaded cached cargo-package-gat-lending-iterator (113 KiB) in 33ms
  254. 24.31 s Downloaded cached cargo-package-getrandom (196 KiB) in 30ms
  255. 24.31 s Downloaded cached cargo-package-futures-executor (69 KiB) in 34ms
  256. 24.31 s Downloading cached cargo-package-hashbrown from https://cache.nix-ci.com
  257. 24.31 s Downloaded cached cargo-package-globset (122 KiB) in 28ms
  258. 24.32 s Progress: 0 of 1 built, 169 of 675 downloaded from cache (15 downloading)
  259. 24.32 s Progress: 0 of 1 built, 170 of 675 downloaded from cache (14 downloading)
  260. 24.32 s Progress: 0 of 1 built, 171 of 675 downloaded from cache (13 downloading)
  261. 24.32 s Progress: 0 of 1 built, 172 of 675 downloaded from cache (12 downloading)
  262. 24.32 s Progress: 0 of 1 built, 173 of 675 downloaded from cache (11 downloading)
  263. 24.32 s Downloaded cached cargo-package-glob (95 KiB) in 29ms
  264. 24.32 s Downloading cached cargo-package-hashbrown from https://cache.nix-ci.com
  265. 24.32 s Downloading cached cargo-package-heck from https://cache.nix-ci.com
  266. 24.32 s Downloading cached cargo-package-heck from https://cache.nix-ci.com
  267. 24.32 s Downloading cached cargo-package-hermit-abi from https://cache.nix-ci.com
  268. 24.32 s Downloading cached cargo-package-hex from https://cache.nix-ci.com
  269. 24.32 s Progress: 0 of 1 built, 174 of 675 downloaded from cache (15 downloading)
  270. 24.32 s Downloading cached cargo-package-httpdate from https://cache.nix-ci.com
  271. 24.32 s Downloaded cached cargo-package-futures-util (895 KiB) in 41ms
  272. 24.32 s Progress: 0 of 1 built, 175 of 675 downloaded from cache (15 downloading)
  273. 24.32 s Downloaded cached cargo-package-gimli (1.8 MiB) in 38ms
  274. 24.33 s Downloading cached cargo-package-hugepage-rs from https://cache.nix-ci.com
  275. 24.33 s Progress: 0 of 1 built, 176 of 675 downloaded from cache (15 downloading)
  276. 24.33 s Downloading cached cargo-package-iai-callgrind from https://cache.nix-ci.com
  277. 24.34 s Downloaded cached cargo-package-hermit-abi (57 KiB) in 27ms
  278. 24.34 s Progress: 0 of 1 built, 177 of 675 downloaded from cache (15 downloading)
  279. 24.34 s Downloaded cached cargo-package-httpdate (35 KiB) in 24ms
  280. 24.35 s Downloading cached cargo-package-iai-callgrind-macros from https://cache.nix-ci.com
  281. 24.35 s Progress: 0 of 1 built, 178 of 675 downloaded from cache (15 downloading)
  282. 24.35 s Downloaded cached cargo-package-gungraun-macros (147 KiB) in 44ms
  283. 24.35 s Downloading cached cargo-package-iai-callgrind-runner from https://cache.nix-ci.com
  284. 24.35 s Progress: 0 of 1 built, 179 of 675 downloaded from cache (15 downloading)
  285. 24.35 s Downloading cached cargo-package-iana-time-zone from https://cache.nix-ci.com
  286. 24.35 s Downloaded cached cargo-package-half (340 KiB) in 44ms
  287. 24.35 s Progress: 0 of 1 built, 180 of 675 downloaded from cache (15 downloading)
  288. 24.35 s Downloading cached cargo-package-iana-time-zone-haiku from https://cache.nix-ci.com
  289. 24.35 s Downloaded cached cargo-package-heck (45 KiB) in 37ms
  290. 24.35 s Downloaded cached cargo-package-gungraun (570 KiB) in 52ms
  291. 24.36 s Downloaded cached cargo-package-heck (46 KiB) in 39ms
  292. 24.36 s Downloaded cached cargo-package-hex (45 KiB) in 39ms
  293. 24.36 s Downloaded cached cargo-package-hashbrown (584 KiB) in 48ms
  294. 24.36 s Progress: 0 of 1 built, 181 of 675 downloaded from cache (15 downloading)
  295. 24.36 s Progress: 0 of 1 built, 182 of 675 downloaded from cache (14 downloading)
  296. 24.36 s Progress: 0 of 1 built, 183 of 675 downloaded from cache (13 downloading)
  297. 24.36 s Progress: 0 of 1 built, 184 of 675 downloaded from cache (12 downloading)
  298. 24.36 s Progress: 0 of 1 built, 185 of 675 downloaded from cache (11 downloading)
  299. 24.36 s Downloaded cached cargo-package-hashbrown (876 KiB) in 41ms
  300. 24.36 s Downloaded cached cargo-package-hugepage-rs (13 KiB) in 32ms
  301. 24.36 s Downloading cached cargo-package-id-arena from https://cache.nix-ci.com
  302. 24.36 s Downloading cached cargo-package-ident_case from https://cache.nix-ci.com
  303. 24.36 s Downloading cached cargo-package-include_dir_macros from https://cache.nix-ci.com
  304. 24.36 s Downloading cached cargo-package-include_dir from https://cache.nix-ci.com
  305. 24.36 s Downloading cached cargo-package-indenter from https://cache.nix-ci.com
  306. 24.36 s Progress: 0 of 1 built, 186 of 675 downloaded from cache (15 downloading)
  307. 24.36 s Progress: 0 of 1 built, 187 of 675 downloaded from cache (14 downloading)
  308. 24.36 s Downloading cached cargo-package-indexmap from https://cache.nix-ci.com
  309. 24.36 s Downloading cached cargo-package-indicatif from https://cache.nix-ci.com
  310. 24.36 s Downloaded cached cargo-package-gungraun-runner (1.1 MiB) in 55ms
  311. 24.36 s Progress: 0 of 1 built, 188 of 675 downloaded from cache (15 downloading)
  312. 24.36 s Downloading cached cargo-package-indoc from https://cache.nix-ci.com
  313. 24.37 s Downloaded cached cargo-package-hashbrown (810 KiB) in 53ms
  314. 24.37 s Progress: 0 of 1 built, 189 of 675 downloaded from cache (15 downloading)
  315. 24.37 s Downloaded cached cargo-package-hashbrown (853 KiB) in 50ms
  316. 24.37 s Downloading cached cargo-package-inotify from https://cache.nix-ci.com
  317. 24.37 s Progress: 0 of 1 built, 190 of 675 downloaded from cache (15 downloading)
  318. 24.37 s Downloaded cached cargo-package-iai-callgrind (536 KiB) in 40ms
  319. 24.37 s Downloading cached cargo-package-inotify-sys from https://cache.nix-ci.com
  320. 24.37 s Progress: 0 of 1 built, 191 of 675 downloaded from cache (15 downloading)
  321. 24.37 s Downloading cached cargo-package-insta from https://cache.nix-ci.com
  322. 24.39 s Downloaded cached cargo-package-iai-callgrind-macros (120 KiB) in 42ms
  323. 24.39 s Progress: 0 of 1 built, 192 of 675 downloaded from cache (15 downloading)
  324. 24.39 s Downloading cached cargo-package-instability from https://cache.nix-ci.com
  325. 24.39 s Downloaded cached cargo-package-id-arena (48 KiB) in 34ms
  326. 24.39 s Progress: 0 of 1 built, 193 of 675 downloaded from cache (15 downloading)
  327. 24.39 s Downloading cached cargo-package-integer-sqrt from https://cache.nix-ci.com
  328. 24.40 s Downloaded cached cargo-package-indenter (38 KiB) in 36ms
  329. 24.40 s Downloaded cached cargo-package-indicatif (341 KiB) in 34ms
  330. 24.40 s Progress: 0 of 1 built, 194 of 675 downloaded from cache (15 downloading)
  331. 24.40 s Downloaded cached cargo-package-iana-time-zone-haiku (20 KiB) in 42ms
  332. 24.40 s Downloaded cached cargo-package-iana-time-zone (184 KiB) in 45ms
  333. 24.40 s Downloaded cached cargo-package-ident_case (11 KiB) in 38ms
  334. 24.40 s Downloaded cached cargo-package-include_dir_macros (13 KiB) in 39ms
  335. 24.40 s Downloading cached cargo-package-inventory from https://cache.nix-ci.com
  336. 24.40 s Downloaded cached cargo-package-include_dir (21 KiB) in 40ms
  337. 24.40 s Progress: 0 of 1 built, 195 of 675 downloaded from cache (15 downloading)
  338. 24.40 s Downloaded cached cargo-package-indoc (67 KiB) in 33ms
  339. 24.40 s Progress: 0 of 1 built, 196 of 675 downloaded from cache (14 downloading)
  340. 24.40 s Progress: 0 of 1 built, 197 of 675 downloaded from cache (13 downloading)
  341. 24.40 s Progress: 0 of 1 built, 198 of 675 downloaded from cache (12 downloading)
  342. 24.40 s Progress: 0 of 1 built, 199 of 675 downloaded from cache (11 downloading)
  343. 24.40 s Progress: 0 of 1 built, 200 of 675 downloaded from cache (10 downloading)
  344. 24.40 s Downloaded cached cargo-package-inotify-sys (39 KiB) in 32ms
  345. 24.40 s Downloaded cached cargo-package-inotify (119 KiB) in 33ms
  346. 24.40 s Downloaded cached cargo-package-indexmap (530 KiB) in 38ms
  347. 24.40 s Downloading cached cargo-package-is-macro from https://cache.nix-ci.com
  348. 24.40 s Downloading cached cargo-package-is-terminal from https://cache.nix-ci.com
  349. 24.40 s Downloading cached cargo-package-is_terminal_polyfill from https://cache.nix-ci.com
  350. 24.40 s Downloading cached cargo-package-itertools from https://cache.nix-ci.com
  351. 24.40 s Downloading cached cargo-package-itertools from https://cache.nix-ci.com
  352. 24.40 s Downloading cached cargo-package-itertools from https://cache.nix-ci.com
  353. 24.40 s Progress: 0 of 1 built, 201 of 675 downloaded from cache (15 downloading)
  354. 24.40 s Progress: 0 of 1 built, 202 of 675 downloaded from cache (14 downloading)
  355. 24.40 s Progress: 0 of 1 built, 203 of 675 downloaded from cache (13 downloading)
  356. 24.40 s Progress: 0 of 1 built, 204 of 675 downloaded from cache (12 downloading)
  357. 24.40 s Downloading cached cargo-package-itertools from https://cache.nix-ci.com
  358. 24.40 s Downloading cached cargo-package-itertools from https://cache.nix-ci.com
  359. 24.40 s Downloading cached cargo-package-itoa from https://cache.nix-ci.com
  360. 24.40 s Downloading cached cargo-package-jiff from https://cache.nix-ci.com
  361. 24.41 s Downloaded cached cargo-package-iai-callgrind-runner (5.3 MiB) in 58ms
  362. 24.41 s Progress: 0 of 1 built, 205 of 675 downloaded from cache (15 downloading)
  363. 24.41 s Downloading cached cargo-package-jiff-static from https://cache.nix-ci.com
  364. 24.41 s Downloaded cached cargo-package-insta (554 KiB) in 42ms
  365. 24.41 s Progress: 0 of 1 built, 206 of 675 downloaded from cache (15 downloading)
  366. 24.41 s Downloading cached cargo-package-joinery from https://cache.nix-ci.com
  367. 24.42 s Downloaded cached cargo-package-instability (68 KiB) in 31ms
  368. 24.42 s Progress: 0 of 1 built, 207 of 675 downloaded from cache (15 downloading)
  369. 24.42 s Downloading cached cargo-package-js-sys from https://cache.nix-ci.com
  370. 24.43 s Downloaded cached cargo-package-itertools (559 KiB) in 29ms
  371. 24.43 s Progress: 0 of 1 built, 208 of 675 downloaded from cache (15 downloading)
  372. 24.43 s Downloading cached cargo-package-json5 from https://cache.nix-ci.com
  373. 24.43 s Downloaded cached cargo-package-integer-sqrt (8088 B) in 39ms
  374. 24.43 s Downloaded cached cargo-package-is-terminal (25 KiB) in 34ms
  375. 24.43 s Downloaded cached cargo-package-itoa (53 KiB) in 30ms
  376. 24.43 s Progress: 0 of 1 built, 209 of 675 downloaded from cache (15 downloading)
  377. 24.43 s Progress: 0 of 1 built, 210 of 675 downloaded from cache (14 downloading)
  378. 24.43 s Progress: 0 of 1 built, 211 of 675 downloaded from cache (13 downloading)
  379. 24.44 s Downloading cached cargo-package-kasuari from https://cache.nix-ci.com
  380. 24.44 s Downloaded cached cargo-package-itertools (745 KiB) in 32ms
  381. 24.44 s Downloading cached cargo-package-kqueue from https://cache.nix-ci.com
  382. 24.44 s Downloading cached cargo-package-kqueue-sys from https://cache.nix-ci.com
  383. 24.44 s Downloaded cached cargo-package-is_terminal_polyfill (23 KiB) in 36ms
  384. 24.44 s Progress: 0 of 1 built, 212 of 675 downloaded from cache (15 downloading)
  385. 24.44 s Progress: 0 of 1 built, 213 of 675 downloaded from cache (14 downloading)
  386. 24.44 s Downloading cached cargo-package-kurbo from https://cache.nix-ci.com
  387. 24.44 s Downloading cached cargo-package-lab from https://cache.nix-ci.com
  388. 24.44 s Downloaded cached cargo-package-is-macro (31 KiB) in 38ms
  389. 24.44 s Progress: 0 of 1 built, 214 of 675 downloaded from cache (15 downloading)
  390. 24.44 s Downloaded cached cargo-package-inventory (55 KiB) in 41ms
  391. 24.44 s Downloaded cached cargo-package-itertools (675 KiB) in 38ms
  392. 24.44 s Downloading cached cargo-package-lalrpop-util from https://cache.nix-ci.com
  393. 24.44 s Progress: 0 of 1 built, 215 of 675 downloaded from cache (15 downloading)
  394. 24.44 s Progress: 0 of 1 built, 216 of 675 downloaded from cache (14 downloading)
  395. 24.44 s Downloaded cached cargo-package-itertools (710 KiB) in 38ms
  396. 24.44 s Downloading cached cargo-package-lazy_static from https://cache.nix-ci.com
  397. 24.44 s Downloading cached cargo-package-leb128fmt from https://cache.nix-ci.com
  398. 24.44 s Downloaded cached cargo-package-joinery (52 KiB) in 30ms
  399. 24.44 s Progress: 0 of 1 built, 217 of 675 downloaded from cache (15 downloading)
  400. 24.44 s Progress: 0 of 1 built, 218 of 675 downloaded from cache (14 downloading)
  401. 24.44 s Downloaded cached cargo-package-itertools (602 KiB) in 44ms
  402. 24.45 s Downloaded cached cargo-package-jiff-static (328 KiB) in 36ms
  403. 24.45 s Downloading cached cargo-package-libc from https://cache.nix-ci.com
  404. 24.45 s Downloading cached cargo-package-libloading from https://cache.nix-ci.com
  405. 24.45 s Progress: 0 of 1 built, 219 of 675 downloaded from cache (15 downloading)
  406. 24.45 s Progress: 0 of 1 built, 220 of 675 downloaded from cache (14 downloading)
  407. 24.45 s Downloading cached cargo-package-libm from https://cache.nix-ci.com
  408. 24.45 s Downloading cached cargo-package-libredox from https://cache.nix-ci.com
  409. 24.46 s Downloaded cached cargo-package-jiff (3.7 MiB) in 54ms
  410. 24.46 s Progress: 0 of 1 built, 221 of 675 downloaded from cache (15 downloading)
  411. 24.46 s Downloaded cached cargo-package-lalrpop-util (51 KiB) in 18ms
  412. 24.46 s Downloaded cached cargo-package-js-sys (824 KiB) in 34ms
  413. 24.46 s Downloading cached cargo-package-line-clipping from https://cache.nix-ci.com
  414. 24.46 s Progress: 0 of 1 built, 222 of 675 downloaded from cache (15 downloading)
  415. 24.46 s Progress: 0 of 1 built, 223 of 675 downloaded from cache (14 downloading)
  416. 24.46 s Downloading cached cargo-package-linux-raw-sys from https://cache.nix-ci.com
  417. 24.46 s Downloading cached cargo-package-linux-raw-sys from https://cache.nix-ci.com
  418. 24.46 s Downloaded cached cargo-package-json5 (82 KiB) in 32ms
  419. 24.46 s Downloaded cached cargo-package-leb128fmt (74 KiB) in 22ms
  420. 24.46 s Progress: 0 of 1 built, 224 of 675 downloaded from cache (15 downloading)
  421. 24.47 s Downloading cached cargo-package-litrs from https://cache.nix-ci.com
  422. 24.47 s Downloaded cached cargo-package-kqueue-sys (40 KiB) in 29ms
  423. 24.47 s Progress: 0 of 1 built, 225 of 675 downloaded from cache (15 downloading)
  424. 24.47 s Downloaded cached cargo-package-kqueue (133 KiB) in 30ms
  425. 24.47 s Progress: 0 of 1 built, 226 of 675 downloaded from cache (14 downloading)
  426. 24.47 s Downloaded cached cargo-package-lab (67 KiB) in 28ms
  427. 24.47 s Downloading cached cargo-package-lock_api from https://cache.nix-ci.com
  428. 24.47 s Downloading cached cargo-package-log from https://cache.nix-ci.com
  429. 24.47 s Downloaded cached cargo-package-kurbo (635 KiB) in 29ms
  430. 24.47 s Progress: 0 of 1 built, 227 of 675 downloaded from cache (15 downloading)
  431. 24.47 s Progress: 0 of 1 built, 228 of 675 downloaded from cache (14 downloading)
  432. 24.47 s Downloaded cached cargo-package-kasuari (143 KiB) in 31ms
  433. 24.47 s Downloading cached cargo-package-lru from https://cache.nix-ci.com
  434. 24.47 s Downloading cached cargo-package-mac_address from https://cache.nix-ci.com
  435. 24.47 s Progress: 0 of 1 built, 229 of 675 downloaded from cache (15 downloading)
  436. 24.47 s Progress: 0 of 1 built, 230 of 675 downloaded from cache (14 downloading)
  437. 24.47 s Downloaded cached cargo-package-libloading (146 KiB) in 24ms
  438. 24.47 s Downloading cached cargo-package-mach2 from https://cache.nix-ci.com
  439. 24.47 s Downloading cached cargo-package-malachite-base from https://cache.nix-ci.com
  440. 24.47 s Progress: 0 of 1 built, 231 of 675 downloaded from cache (15 downloading)
  441. 24.47 s Downloading cached cargo-package-malachite-nz from https://cache.nix-ci.com
  442. 24.47 s Downloaded cached cargo-package-lazy_static (47 KiB) in 29ms
  443. 24.47 s Progress: 0 of 1 built, 232 of 675 downloaded from cache (15 downloading)
  444. 24.47 s Downloading cached cargo-package-malachite-q from https://cache.nix-ci.com
  445. 24.48 s Downloaded cached cargo-package-libredox (39 KiB) in 27ms
  446. 24.48 s Progress: 0 of 1 built, 233 of 675 downloaded from cache (15 downloading)
  447. 24.48 s Downloading cached cargo-package-maplit from https://cache.nix-ci.com
  448. 24.49 s Downloaded cached cargo-package-libm (683 KiB) in 37ms
  449. 24.49 s Progress: 0 of 1 built, 234 of 675 downloaded from cache (15 downloading)
  450. 24.49 s Downloading cached cargo-package-matchers from https://cache.nix-ci.com
  451. 24.49 s Downloaded cached cargo-package-line-clipping (55 KiB) in 27ms
  452. 24.49 s Progress: 0 of 1 built, 235 of 675 downloaded from cache (15 downloading)
  453. 24.49 s Downloading cached cargo-package-matrixmultiply from https://cache.nix-ci.com
  454. 24.50 s Downloaded cached cargo-package-mac_address (45 KiB) in 29ms
  455. 24.50 s Downloaded cached cargo-package-lru (115 KiB) in 29ms
  456. 24.50 s Progress: 0 of 1 built, 236 of 675 downloaded from cache (15 downloading)
  457. 24.50 s Downloaded cached cargo-package-mach2 (108 KiB) in 28ms
  458. 24.50 s Downloading cached cargo-package-memchr from https://cache.nix-ci.com
  459. 24.50 s Progress: 0 of 1 built, 237 of 675 downloaded from cache (15 downloading)
  460. 24.50 s Progress: 0 of 1 built, 238 of 675 downloaded from cache (14 downloading)
  461. 24.50 s Downloaded cached cargo-package-lock_api (205 KiB) in 32ms
  462. 24.50 s Downloading cached cargo-package-memmem from https://cache.nix-ci.com
  463. 24.50 s Downloading cached cargo-package-memoffset from https://cache.nix-ci.com
  464. 24.50 s Progress: 0 of 1 built, 239 of 675 downloaded from cache (15 downloading)
  465. 24.50 s Downloaded cached cargo-package-litrs (210 KiB) in 35ms
  466. 24.50 s Downloading cached cargo-package-minimal-lexical from https://cache.nix-ci.com
  467. 24.50 s Downloaded cached cargo-package-log (241 KiB) in 35ms
  468. 24.50 s Progress: 0 of 1 built, 240 of 675 downloaded from cache (15 downloading)
  469. 24.50 s Progress: 0 of 1 built, 241 of 675 downloaded from cache (14 downloading)
  470. 24.50 s Downloading cached cargo-package-miniz_oxide from https://cache.nix-ci.com
  471. 24.50 s Downloading cached cargo-package-mio from https://cache.nix-ci.com
  472. 24.51 s Downloaded cached cargo-package-maplit (28 KiB) in 31ms
  473. 24.51 s Progress: 0 of 1 built, 242 of 675 downloaded from cache (15 downloading)
  474. 24.51 s Downloading cached cargo-package-momtrop from https://cache.nix-ci.com
  475. 24.52 s Downloaded cached cargo-package-libc (4.3 MiB) in 71ms
  476. 24.52 s Progress: 0 of 1 built, 243 of 675 downloaded from cache (15 downloading)
  477. 24.52 s Downloading cached cargo-package-nalgebra from https://cache.nix-ci.com
  478. 24.52 s Downloaded cached cargo-package-malachite-q (2 MiB) in 49ms
  479. 24.52 s Progress: 0 of 1 built, 244 of 675 downloaded from cache (15 downloading)
  480. 24.53 s Downloading cached cargo-package-nalgebra-macros from https://cache.nix-ci.com
  481. 24.53 s Downloaded cached cargo-package-matrixmultiply (252 KiB) in 41ms
  482. 24.53 s Progress: 0 of 1 built, 245 of 675 downloaded from cache (15 downloading)
  483. 24.53 s Downloading cached cargo-package-ndarray from https://cache.nix-ci.com
  484. 24.53 s Downloaded cached cargo-package-matchers (29 KiB) in 47ms
  485. 24.53 s Progress: 0 of 1 built, 246 of 675 downloaded from cache (15 downloading)
  486. 24.54 s Downloading cached cargo-package-nix from https://cache.nix-ci.com
  487. 24.54 s Downloaded cached cargo-package-momtrop (160 KiB) in 33ms
  488. 24.54 s Progress: 0 of 1 built, 247 of 675 downloaded from cache (15 downloading)
  489. 24.55 s Downloading cached cargo-package-nix from https://cache.nix-ci.com
  490. 24.55 s Downloaded cached cargo-package-memmem (31 KiB) in 45ms
  491. 24.55 s Downloaded cached cargo-package-memoffset (41 KiB) in 45ms
  492. 24.55 s Progress: 0 of 1 built, 248 of 675 downloaded from cache (15 downloading)
  493. 24.55 s Progress: 0 of 1 built, 249 of 675 downloaded from cache (14 downloading)
  494. 24.55 s Downloaded cached cargo-package-miniz_oxide (282 KiB) in 43ms
  495. 24.55 s Downloading cached cargo-package-nom from https://cache.nix-ci.com
  496. 24.55 s Downloading cached cargo-package-notify from https://cache.nix-ci.com
  497. 24.55 s Progress: 0 of 1 built, 250 of 675 downloaded from cache (15 downloading)
  498. 24.55 s Downloaded cached cargo-package-minimal-lexical (335 KiB) in 45ms
  499. 24.55 s Downloading cached cargo-package-notify-types from https://cache.nix-ci.com
  500. 24.55 s Progress: 0 of 1 built, 251 of 675 downloaded from cache (15 downloading)
  501. 24.55 s Downloading cached cargo-package-ntapi from https://cache.nix-ci.com
  502. 24.55 s Downloaded cached cargo-package-memchr (585 KiB) in 52ms
  503. 24.55 s Progress: 0 of 1 built, 252 of 675 downloaded from cache (15 downloading)
  504. 24.55 s Downloading cached cargo-package-nu-ansi-term from https://cache.nix-ci.com
  505. 24.56 s Downloaded cached cargo-package-linux-raw-sys (11.4 MiB) in 95ms
  506. 24.56 s Downloaded cached cargo-package-mio (484 KiB) in 54ms
  507. 24.56 s Progress: 0 of 1 built, 253 of 675 downloaded from cache (15 downloading)
  508. 24.56 s Downloading cached cargo-package-num from https://cache.nix-ci.com
  509. 24.56 s Progress: 0 of 1 built, 254 of 675 downloaded from cache (15 downloading)
  510. 24.56 s Downloading cached cargo-package-num-bigint from https://cache.nix-ci.com
  511. 24.57 s Downloaded cached cargo-package-nalgebra-macros (27 KiB) in 46ms
  512. 24.57 s Progress: 0 of 1 built, 255 of 675 downloaded from cache (15 downloading)
  513. 24.57 s Downloading cached cargo-package-num-complex from https://cache.nix-ci.com
  514. 24.58 s Downloaded cached cargo-package-linux-raw-sys (16.2 MiB) in 117ms
  515. 24.58 s Progress: 0 of 1 built, 256 of 675 downloaded from cache (15 downloading)
  516. 24.58 s Downloading cached cargo-package-num-conv from https://cache.nix-ci.com
  517. 24.59 s Downloaded cached cargo-package-nix (1.5 MiB) in 52ms
  518. 24.59 s Progress: 0 of 1 built, 257 of 675 downloaded from cache (15 downloading)
  519. 24.59 s Downloaded cached cargo-package-nu-ansi-term (129 KiB) in 34ms
  520. 24.59 s Downloading cached cargo-package-num-derive from https://cache.nix-ci.com
  521. 24.59 s Progress: 0 of 1 built, 258 of 675 downloaded from cache (15 downloading)
  522. 24.59 s Downloading cached cargo-package-num-integer from https://cache.nix-ci.com
  523. 24.59 s Downloaded cached cargo-package-notify-types (97 KiB) in 41ms
  524. 24.59 s Progress: 0 of 1 built, 259 of 675 downloaded from cache (15 downloading)
  525. 24.59 s Downloaded cached cargo-package-nalgebra (2.1 MiB) in 72ms
  526. 24.59 s Downloaded cached cargo-package-notify (161 KiB) in 43ms
  527. 24.59 s Downloading cached cargo-package-num-iter from https://cache.nix-ci.com
  528. 24.59 s Progress: 0 of 1 built, 260 of 675 downloaded from cache (15 downloading)
  529. 24.59 s Progress: 0 of 1 built, 261 of 675 downloaded from cache (14 downloading)
  530. 24.59 s Downloading cached cargo-package-num-rational from https://cache.nix-ci.com
  531. 24.59 s Downloading cached cargo-package-num-traits from https://cache.nix-ci.com
  532. 24.59 s Downloaded cached cargo-package-ntapi (703 KiB) in 43ms
  533. 24.59 s Downloaded cached cargo-package-ndarray (1.1 MiB) in 62ms
  534. 24.59 s Progress: 0 of 1 built, 262 of 675 downloaded from cache (15 downloading)
  535. 24.60 s Downloading cached cargo-package-num_threads from https://cache.nix-ci.com
  536. 24.60 s Progress: 0 of 1 built, 263 of 675 downloaded from cache (15 downloading)
  537. 24.60 s Downloading cached cargo-package-numpy from https://cache.nix-ci.com
  538. 24.60 s Downloaded cached cargo-package-num (30 KiB) in 40ms
  539. 24.60 s Progress: 0 of 1 built, 264 of 675 downloaded from cache (15 downloading)
  540. 24.60 s Downloaded cached cargo-package-nom (655 KiB) in 53ms
  541. 24.60 s Downloaded cached cargo-package-num-bigint (494 KiB) in 41ms
  542. 24.60 s Downloading cached cargo-package-objc2 from https://cache.nix-ci.com
  543. 24.60 s Downloaded cached cargo-package-num-complex (142 KiB) in 28ms
  544. 24.60 s Progress: 0 of 1 built, 265 of 675 downloaded from cache (15 downloading)
  545. 24.60 s Progress: 0 of 1 built, 266 of 675 downloaded from cache (14 downloading)
  546. 24.60 s Progress: 0 of 1 built, 267 of 675 downloaded from cache (13 downloading)
  547. 24.60 s Downloading cached cargo-package-objc2-encode from https://cache.nix-ci.com
  548. 24.60 s Downloading cached cargo-package-object from https://cache.nix-ci.com
  549. 24.60 s Downloading cached cargo-package-once_cell from https://cache.nix-ci.com
  550. 24.61 s Downloaded cached cargo-package-num-conv (24 KiB) in 23ms
  551. 24.61 s Progress: 0 of 1 built, 268 of 675 downloaded from cache (15 downloading)
  552. 24.61 s Downloading cached cargo-package-once_cell_polyfill from https://cache.nix-ci.com
  553. 24.61 s Downloaded cached cargo-package-nix (1.7 MiB) in 62ms
  554. 24.61 s Progress: 0 of 1 built, 269 of 675 downloaded from cache (15 downloading)
  555. 24.61 s Downloading cached cargo-package-oorandom from https://cache.nix-ci.com
  556. 24.61 s Downloaded cached cargo-package-malachite-base (7.5 MiB) in 139ms
  557. 24.61 s Progress: 0 of 1 built, 270 of 675 downloaded from cache (15 downloading)
  558. 24.61 s Downloading cached cargo-package-option-ext from https://cache.nix-ci.com
  559. 24.61 s Downloaded cached cargo-package-num_threads (21 KiB) in 15ms
  560. 24.61 s Progress: 0 of 1 built, 271 of 675 downloaded from cache (15 downloading)
  561. 24.61 s Downloaded cached cargo-package-num-traits (273 KiB) in 18ms
  562. 24.61 s Downloaded cached cargo-package-num-derive (66 KiB) in 23ms
  563. 24.61 s Downloaded cached cargo-package-num-integer (111 KiB) in 21ms
  564. 24.61 s Downloading cached cargo-package-ordered-float from https://cache.nix-ci.com
  565. 24.61 s Progress: 0 of 1 built, 272 of 675 downloaded from cache (15 downloading)
  566. 24.61 s Progress: 0 of 1 built, 273 of 675 downloaded from cache (14 downloading)
  567. 24.61 s Progress: 0 of 1 built, 274 of 675 downloaded from cache (13 downloading)
  568. 24.61 s Downloading cached cargo-package-owo-colors from https://cache.nix-ci.com
  569. 24.61 s Downloading cached cargo-package-papergrid from https://cache.nix-ci.com
  570. 24.61 s Downloading cached cargo-package-parking_lot from https://cache.nix-ci.com
  571. 24.62 s Downloaded cached cargo-package-num-iter (40 KiB) in 24ms
  572. 24.62 s Progress: 0 of 1 built, 275 of 675 downloaded from cache (15 downloading)
  573. 24.62 s Downloaded cached cargo-package-numpy (385 KiB) in 20ms
  574. 24.62 s Downloaded cached cargo-package-num-rational (131 KiB) in 23ms
  575. 24.62 s Downloading cached cargo-package-parking_lot_core from https://cache.nix-ci.com
  576. 24.62 s Progress: 0 of 1 built, 276 of 675 downloaded from cache (15 downloading)
  577. 24.62 s Progress: 0 of 1 built, 277 of 675 downloaded from cache (14 downloading)
  578. 24.62 s Downloading cached cargo-package-paste from https://cache.nix-ci.com
  579. 24.62 s Downloading cached cargo-package-pathdiff from https://cache.nix-ci.com
  580. 24.62 s Downloaded cached cargo-package-objc2-encode (94 KiB) in 19ms
  581. 24.62 s Progress: 0 of 1 built, 278 of 675 downloaded from cache (15 downloading)
  582. 24.62 s Downloaded cached cargo-package-once_cell (154 KiB) in 19ms
  583. 24.62 s Downloading cached cargo-package-pathfinding from https://cache.nix-ci.com
  584. 24.62 s Progress: 0 of 1 built, 279 of 675 downloaded from cache (15 downloading)
  585. 24.63 s Downloaded cached cargo-package-once_cell_polyfill (23 KiB) in 18ms
  586. 24.63 s Downloading cached cargo-package-percent-encoding from https://cache.nix-ci.com
  587. 24.63 s Progress: 0 of 1 built, 280 of 675 downloaded from cache (15 downloading)
  588. 24.63 s Downloading cached cargo-package-pest from https://cache.nix-ci.com
  589. 24.64 s Downloaded cached cargo-package-objc2 (1.1 MiB) in 35ms
  590. 24.64 s Progress: 0 of 1 built, 281 of 675 downloaded from cache (15 downloading)
  591. 24.64 s Downloading cached cargo-package-pest_derive from https://cache.nix-ci.com
  592. 24.64 s Downloaded cached cargo-package-oorandom (122 KiB) in 30ms
  593. 24.64 s Progress: 0 of 1 built, 282 of 675 downloaded from cache (15 downloading)
  594. 24.64 s Downloaded cached cargo-package-ordered-float (131 KiB) in 27ms
  595. 24.64 s Downloading cached cargo-package-pest_generator from https://cache.nix-ci.com
  596. 24.64 s Downloaded cached cargo-package-parking_lot (216 KiB) in 27ms
  597. 24.64 s Progress: 0 of 1 built, 283 of 675 downloaded from cache (15 downloading)
  598. 24.64 s Progress: 0 of 1 built, 284 of 675 downloaded from cache (14 downloading)
  599. 24.64 s Downloaded cached cargo-package-option-ext (24 KiB) in 31ms
  600. 24.64 s Downloading cached cargo-package-pest_meta from https://cache.nix-ci.com
  601. 24.64 s Downloading cached cargo-package-phf from https://cache.nix-ci.com
  602. 24.64 s Downloaded cached cargo-package-pathdiff (25 KiB) in 23ms
  603. 24.64 s Progress: 0 of 1 built, 285 of 675 downloaded from cache (15 downloading)
  604. 24.64 s Downloading cached cargo-package-phf from https://cache.nix-ci.com
  605. 24.64 s Progress: 0 of 1 built, 286 of 675 downloaded from cache (15 downloading)
  606. 24.65 s Downloaded cached cargo-package-parking_lot_core (146 KiB) in 27ms
  607. 24.65 s Downloading cached cargo-package-phf_codegen from https://cache.nix-ci.com
  608. 24.65 s Downloaded cached cargo-package-owo-colors (162 KiB) in 32ms
  609. 24.65 s Progress: 0 of 1 built, 287 of 675 downloaded from cache (15 downloading)
  610. 24.65 s Progress: 0 of 1 built, 288 of 675 downloaded from cache (14 downloading)
  611. 24.65 s Downloading cached cargo-package-phf_generator from https://cache.nix-ci.com
  612. 24.65 s Downloading cached cargo-package-phf_generator from https://cache.nix-ci.com
  613. 24.65 s Downloaded cached cargo-package-papergrid (489 KiB) in 35ms
  614. 24.65 s Progress: 0 of 1 built, 289 of 675 downloaded from cache (15 downloading)
  615. 24.65 s Downloaded cached cargo-package-gmp-mpfr-sys (27.6 MiB) in 364ms
  616. 24.65 s Downloading cached cargo-package-phf_macros from https://cache.nix-ci.com
  617. 24.65 s Downloaded cached cargo-package-object (1.9 MiB) in 48ms
  618. 24.65 s Progress: 0 of 1 built, 290 of 675 downloaded from cache (15 downloading)
  619. 24.65 s Progress: 0 of 1 built, 291 of 675 downloaded from cache (14 downloading)
  620. 24.65 s Downloaded cached cargo-package-paste (78 KiB) in 34ms
  621. 24.65 s Downloading cached cargo-package-phf_shared from https://cache.nix-ci.com
  622. 24.65 s Downloading cached cargo-package-phf_macros from https://cache.nix-ci.com
  623. 24.65 s Progress: 0 of 1 built, 292 of 675 downloaded from cache (15 downloading)
  624. 24.65 s Downloaded cached cargo-package-percent-encoding (36 KiB) in 28ms
  625. 24.66 s Downloading cached cargo-package-phf_shared from https://cache.nix-ci.com
  626. 24.66 s Progress: 0 of 1 built, 293 of 675 downloaded from cache (15 downloading)
  627. 24.66 s Downloading cached cargo-package-pin-project-lite from https://cache.nix-ci.com
  628. 24.66 s Downloaded cached cargo-package-pest (1.4 MiB) in 32ms
  629. 24.66 s Progress: 0 of 1 built, 294 of 675 downloaded from cache (15 downloading)
  630. 24.66 s Downloading cached cargo-package-plotters from https://cache.nix-ci.com
  631. 24.66 s Downloaded cached cargo-package-pathfinding (730 KiB) in 40ms
  632. 24.66 s Progress: 0 of 1 built, 295 of 675 downloaded from cache (15 downloading)
  633. 24.67 s Downloaded cached cargo-package-phf_codegen (46 KiB) in 19ms
  634. 24.67 s Downloading cached cargo-package-plotters-backend from https://cache.nix-ci.com
  635. 24.67 s Progress: 0 of 1 built, 296 of 675 downloaded from cache (15 downloading)
  636. 24.67 s Downloading cached cargo-package-plotters-svg from https://cache.nix-ci.com
  637. 24.67 s Downloaded cached cargo-package-phf (92 KiB) in 22ms
  638. 24.67 s Progress: 0 of 1 built, 297 of 675 downloaded from cache (15 downloading)
  639. 24.67 s Downloading cached cargo-package-portable-atomic from https://cache.nix-ci.com
  640. 24.67 s Downloaded cached cargo-package-phf_generator (51 KiB) in 22ms
  641. 24.67 s Progress: 0 of 1 built, 298 of 675 downloaded from cache (15 downloading)
  642. 24.67 s Downloaded cached cargo-package-phf_generator (50 KiB) in 22ms
  643. 24.67 s Downloaded cached cargo-package-pest_derive (176 KiB) in 30ms
  644. 24.67 s Downloading cached cargo-package-portable-atomic-util from https://cache.nix-ci.com
  645. 24.67 s Progress: 0 of 1 built, 299 of 675 downloaded from cache (15 downloading)
  646. 24.67 s Progress: 0 of 1 built, 300 of 675 downloaded from cache (14 downloading)
  647. 24.67 s Downloading cached cargo-package-powerfmt from https://cache.nix-ci.com
  648. 24.67 s Downloading cached cargo-package-ppv-lite86 from https://cache.nix-ci.com
  649. 24.67 s Downloaded cached cargo-package-pest_generator (179 KiB) in 31ms
  650. 24.67 s Progress: 0 of 1 built, 301 of 675 downloaded from cache (15 downloading)
  651. 24.67 s Downloaded cached cargo-package-phf (87 KiB) in 29ms
  652. 24.67 s Downloading cached cargo-package-prettyplease from https://cache.nix-ci.com
  653. 24.67 s Progress: 0 of 1 built, 302 of 675 downloaded from cache (15 downloading)
  654. 24.67 s Downloading cached cargo-package-proc-macro-error from https://cache.nix-ci.com
  655. 24.68 s Downloaded cached cargo-package-pest_meta (375 KiB) in 33ms
  656. 24.68 s Progress: 0 of 1 built, 303 of 675 downloaded from cache (15 downloading)
  657. 24.68 s Downloading cached cargo-package-proc-macro-error-attr from https://cache.nix-ci.com
  658. 24.68 s Downloaded cached cargo-package-phf_shared (51 KiB) in 22ms
  659. 24.68 s Progress: 0 of 1 built, 304 of 675 downloaded from cache (15 downloading)
  660. 24.68 s Downloading cached cargo-package-proc-macro-error-attr2 from https://cache.nix-ci.com
  661. 24.68 s Downloaded cached cargo-package-phf_macros (74 KiB) in 25ms
  662. 24.68 s Progress: 0 of 1 built, 305 of 675 downloaded from cache (15 downloading)
  663. 24.68 s Downloading cached cargo-package-proc-macro-error2 from https://cache.nix-ci.com
  664. 24.68 s Downloaded cached cargo-package-pin-project-lite (251 KiB) in 24ms
  665. 24.68 s Progress: 0 of 1 built, 306 of 675 downloaded from cache (15 downloading)
  666. 24.68 s Downloading cached cargo-package-proc-macro2 from https://cache.nix-ci.com
  667. 24.68 s Downloaded cached cargo-package-phf_macros (59 KiB) in 32ms
  668. 24.68 s Progress: 0 of 1 built, 307 of 675 downloaded from cache (15 downloading)
  669. 24.68 s Downloaded cached cargo-package-phf_shared (47 KiB) in 29ms
  670. 24.68 s Downloading cached cargo-package-proc-macro2-diagnostics from https://cache.nix-ci.com
  671. 24.68 s Progress: 0 of 1 built, 308 of 675 downloaded from cache (15 downloading)
  672. 24.68 s Downloading cached cargo-package-proptest from https://cache.nix-ci.com
  673. 24.69 s Downloaded cached cargo-package-plotters (708 KiB) in 28ms
  674. 24.69 s Progress: 0 of 1 built, 309 of 675 downloaded from cache (15 downloading)
  675. 24.69 s Downloading cached cargo-package-ptr_meta from https://cache.nix-ci.com
  676. 24.69 s Downloaded cached cargo-package-powerfmt (58 KiB) in 22ms
  677. 24.69 s Progress: 0 of 1 built, 310 of 675 downloaded from cache (15 downloading)
  678. 24.69 s Downloaded cached cargo-package-plotters-svg (28 KiB) in 27ms
  679. 24.69 s Downloaded cached cargo-package-plotters-backend (55 KiB) in 28ms
  680. 24.69 s Downloaded cached cargo-package-proc-macro-error (95 KiB) in 21ms
  681. 24.69 s Downloading cached cargo-package-ptr_meta_derive from https://cache.nix-ci.com
  682. 24.70 s Progress: 0 of 1 built, 311 of 675 downloaded from cache (15 downloading)
  683. 24.70 s Progress: 0 of 1 built, 312 of 675 downloaded from cache (14 downloading)
  684. 24.70 s Progress: 0 of 1 built, 313 of 675 downloaded from cache (13 downloading)
  685. 24.70 s Downloading cached cargo-package-pyo3 from https://cache.nix-ci.com
  686. 24.70 s Downloading cached cargo-package-pyo3-build-config from https://cache.nix-ci.com
  687. 24.70 s Downloaded cached cargo-package-prettyplease (416 KiB) in 24ms
  688. 24.70 s Downloading cached cargo-package-pyo3-ffi from https://cache.nix-ci.com
  689. 24.70 s Progress: 0 of 1 built, 314 of 675 downloaded from cache (15 downloading)
  690. 24.70 s Downloading cached cargo-package-pyo3-macros from https://cache.nix-ci.com
  691. 24.70 s Downloaded cached cargo-package-portable-atomic-util (212 KiB) in 30ms
  692. 24.70 s Progress: 0 of 1 built, 315 of 675 downloaded from cache (15 downloading)
  693. 24.70 s Downloaded cached cargo-package-ppv-lite86 (132 KiB) in 30ms
  694. 24.70 s Downloading cached cargo-package-pyo3-macros-backend from https://cache.nix-ci.com
  695. 24.70 s Progress: 0 of 1 built, 316 of 675 downloaded from cache (15 downloading)
  696. 24.70 s Downloading cached cargo-package-pyo3-stub-gen from https://cache.nix-ci.com
  697. 24.71 s Downloaded cached cargo-package-portable-atomic (1.2 MiB) in 38ms
  698. 24.71 s Progress: 0 of 1 built, 317 of 675 downloaded from cache (15 downloading)
  699. 24.71 s Downloaded cached cargo-package-proc-macro-error-attr (23 KiB) in 29ms
  700. 24.71 s Downloaded cached cargo-package-proc-macro2-diagnostics (46 KiB) in 23ms
  701. 24.71 s Downloading cached cargo-package-pyo3-stub-gen-derive from https://cache.nix-ci.com
  702. 24.71 s Progress: 0 of 1 built, 318 of 675 downloaded from cache (15 downloading)
  703. 24.71 s Progress: 0 of 1 built, 319 of 675 downloaded from cache (14 downloading)
  704. 24.71 s Downloading cached cargo-package-quick-error from https://cache.nix-ci.com
  705. 24.71 s Downloading cached cargo-package-quote from https://cache.nix-ci.com
  706. 24.71 s Downloaded cached cargo-package-proc-macro-error-attr2 (23 KiB) in 30ms
  707. 24.71 s Progress: 0 of 1 built, 320 of 675 downloaded from cache (15 downloading)
  708. 24.71 s Downloading cached cargo-package-r-efi from https://cache.nix-ci.com
  709. 24.71 s Downloaded cached cargo-package-proc-macro2 (271 KiB) in 28ms
  710. 24.71 s Progress: 0 of 1 built, 321 of 675 downloaded from cache (15 downloading)
  711. 24.71 s Downloaded cached cargo-package-proc-macro-error2 (94 KiB) in 31ms
  712. 24.71 s Downloading cached cargo-package-r-efi from https://cache.nix-ci.com
  713. 24.71 s Progress: 0 of 1 built, 322 of 675 downloaded from cache (15 downloading)
  714. 24.71 s Downloading cached cargo-package-radium from https://cache.nix-ci.com
  715. 24.72 s Downloaded cached cargo-package-proptest (914 KiB) in 31ms
  716. 24.72 s Progress: 0 of 1 built, 323 of 675 downloaded from cache (15 downloading)
  717. 24.72 s Downloading cached cargo-package-rand from https://cache.nix-ci.com
  718. 24.72 s Downloaded cached cargo-package-malachite-nz (17.9 MiB) in 247ms
  719. 24.72 s Progress: 0 of 1 built, 324 of 675 downloaded from cache (15 downloading)
  720. 24.72 s Downloaded cached cargo-package-ptr_meta (19 KiB) in 28ms
  721. 24.72 s Downloading cached cargo-package-rand from https://cache.nix-ci.com
  722. 24.72 s Progress: 0 of 1 built, 325 of 675 downloaded from cache (15 downloading)
  723. 24.72 s Downloading cached cargo-package-rand_chacha from https://cache.nix-ci.com
  724. 24.73 s Downloaded cached cargo-package-ptr_meta_derive (6920 B) in 30ms
  725. 24.73 s Progress: 0 of 1 built, 326 of 675 downloaded from cache (15 downloading)
  726. 24.73 s Downloaded cached cargo-package-pyo3-ffi (423 KiB) in 29ms
  727. 24.73 s Downloaded cached cargo-package-pyo3-macros-backend (451 KiB) in 24ms
  728. 24.73 s Downloading cached cargo-package-rand_chacha from https://cache.nix-ci.com
  729. 24.73 s Progress: 0 of 1 built, 327 of 675 downloaded from cache (15 downloading)
  730. 24.73 s Progress: 0 of 1 built, 328 of 675 downloaded from cache (14 downloading)
  731. 24.73 s Downloaded cached cargo-package-pyo3-stub-gen (190 KiB) in 28ms
  732. 24.73 s Downloading cached cargo-package-rand_core from https://cache.nix-ci.com
  733. 24.73 s Downloading cached cargo-package-rand_core from https://cache.nix-ci.com
  734. 24.73 s Downloaded cached cargo-package-pyo3-build-config (160 KiB) in 34ms
  735. 24.73 s Progress: 0 of 1 built, 329 of 675 downloaded from cache (15 downloading)
  736. 24.73 s Progress: 0 of 1 built, 330 of 675 downloaded from cache (14 downloading)
  737. 24.73 s Downloaded cached cargo-package-pyo3-macros (28 KiB) in 33ms
  738. 24.73 s Downloading cached cargo-package-rand_distr from https://cache.nix-ci.com
  739. 24.73 s Downloading cached cargo-package-rand_xorshift from https://cache.nix-ci.com
  740. 24.73 s Progress: 0 of 1 built, 331 of 675 downloaded from cache (15 downloading)
  741. 24.73 s Downloading cached cargo-package-rand_xoshiro from https://cache.nix-ci.com
  742. 24.74 s Downloaded cached cargo-package-radium (51 KiB) in 25ms
  743. 24.74 s Progress: 0 of 1 built, 332 of 675 downloaded from cache (15 downloading)
  744. 24.74 s Downloaded cached cargo-package-quick-error (64 KiB) in 31ms
  745. 24.74 s Downloaded cached cargo-package-quote (142 KiB) in 32ms
  746. 24.74 s Downloading cached cargo-package-ratatui from https://cache.nix-ci.com
  747. 24.74 s Progress: 0 of 1 built, 333 of 675 downloaded from cache (15 downloading)
  748. 24.74 s Progress: 0 of 1 built, 334 of 675 downloaded from cache (14 downloading)
  749. 24.74 s Downloaded cached cargo-package-r-efi (301 KiB) in 29ms
  750. 24.74 s Downloading cached cargo-package-ratatui-core from https://cache.nix-ci.com
  751. 24.74 s Downloading cached cargo-package-ratatui-crossterm from https://cache.nix-ci.com
  752. 24.74 s Progress: 0 of 1 built, 335 of 675 downloaded from cache (15 downloading)
  753. 24.74 s Downloaded cached cargo-package-r-efi (296 KiB) in 33ms
  754. 24.74 s Downloaded cached cargo-package-pyo3-stub-gen-derive (275 KiB) in 36ms
  755. 24.74 s Downloading cached cargo-package-ratatui-macros from https://cache.nix-ci.com
  756. 24.74 s Progress: 0 of 1 built, 336 of 675 downloaded from cache (15 downloading)
  757. 24.74 s Progress: 0 of 1 built, 337 of 675 downloaded from cache (14 downloading)
  758. 24.74 s Downloading cached cargo-package-ratatui-termwiz from https://cache.nix-ci.com
  759. 24.74 s Downloading cached cargo-package-ratatui-widgets from https://cache.nix-ci.com
  760. 24.75 s Downloaded cached cargo-package-rand_xorshift (30 KiB) in 21ms
  761. 24.76 s Progress: 0 of 1 built, 338 of 675 downloaded from cache (15 downloading)
  762. 24.76 s Downloaded cached cargo-package-rand_chacha (53 KiB) in 35ms
  763. 24.76 s Downloaded cached cargo-package-rand_xoshiro (97 KiB) in 24ms
  764. 24.76 s Downloaded cached cargo-package-rand (331 KiB) in 40ms
  765. 24.76 s Downloading cached cargo-package-rawpointer from https://cache.nix-ci.com
  766. 24.76 s Progress: 0 of 1 built, 339 of 675 downloaded from cache (15 downloading)
  767. 24.76 s Progress: 0 of 1 built, 340 of 675 downloaded from cache (14 downloading)
  768. 24.76 s Progress: 0 of 1 built, 341 of 675 downloaded from cache (13 downloading)
  769. 24.76 s Downloaded cached cargo-package-rand (409 KiB) in 39ms
  770. 24.76 s Downloaded cached cargo-package-rand_chacha (63 KiB) in 32ms
  771. 24.76 s Downloading cached cargo-package-rayon from https://cache.nix-ci.com
  772. 24.76 s Downloaded cached cargo-package-rand_core (79 KiB) in 28ms
  773. 24.76 s Downloading cached cargo-package-rayon-core from https://cache.nix-ci.com
  774. 24.76 s Downloading cached cargo-package-redox_syscall from https://cache.nix-ci.com
  775. 24.76 s Progress: 0 of 1 built, 342 of 675 downloaded from cache (15 downloading)
  776. 24.76 s Progress: 0 of 1 built, 343 of 675 downloaded from cache (14 downloading)
  777. 24.76 s Progress: 0 of 1 built, 344 of 675 downloaded from cache (13 downloading)
  778. 24.76 s Downloading cached cargo-package-redox_users from https://cache.nix-ci.com
  779. 24.76 s Downloading cached cargo-package-reedline from https://cache.nix-ci.com
  780. 24.76 s Downloading cached cargo-package-ref-cast from https://cache.nix-ci.com
  781. 24.76 s Downloaded cached cargo-package-rand_core (84 KiB) in 29ms
  782. 24.76 s Downloaded cached cargo-package-rand_distr (226 KiB) in 29ms
  783. 24.76 s Progress: 0 of 1 built, 345 of 675 downloaded from cache (15 downloading)
  784. 24.76 s Downloading cached cargo-package-ref-cast-impl from https://cache.nix-ci.com
  785. 24.76 s Progress: 0 of 1 built, 346 of 675 downloaded from cache (15 downloading)
  786. 24.76 s Downloading cached cargo-package-ref-ops from https://cache.nix-ci.com
  787. 24.77 s Downloaded cached cargo-package-ratatui-termwiz (70 KiB) in 22ms
  788. 24.77 s Progress: 0 of 1 built, 347 of 675 downloaded from cache (15 downloading)
  789. 24.77 s Downloading cached cargo-package-regex from https://cache.nix-ci.com
  790. 24.77 s Downloaded cached cargo-package-ratatui-crossterm (70 KiB) in 26ms
  791. 24.77 s Progress: 0 of 1 built, 348 of 675 downloaded from cache (15 downloading)
  792. 24.77 s Downloaded cached cargo-package-ratatui-macros (71 KiB) in 25ms
  793. 24.77 s Downloading cached cargo-package-regex-automata from https://cache.nix-ci.com
  794. 24.77 s Progress: 0 of 1 built, 349 of 675 downloaded from cache (15 downloading)
  795. 24.77 s Downloaded cached cargo-package-pyo3 (3.8 MiB) in 74ms
  796. 24.77 s Downloading cached cargo-package-regex-syntax from https://cache.nix-ci.com
  797. 24.77 s Progress: 0 of 1 built, 350 of 675 downloaded from cache (15 downloading)
  798. 24.77 s Downloading cached cargo-package-region from https://cache.nix-ci.com
  799. 24.77 s Downloaded cached cargo-package-ratatui (347 KiB) in 33ms
  800. 24.77 s Progress: 0 of 1 built, 351 of 675 downloaded from cache (15 downloading)
  801. 24.78 s Downloading cached cargo-package-rend from https://cache.nix-ci.com
  802. 24.78 s Downloaded cached cargo-package-ratatui-widgets (1.1 MiB) in 33ms
  803. 24.78 s Progress: 0 of 1 built, 352 of 675 downloaded from cache (15 downloading)
  804. 24.78 s Downloading cached cargo-package-ringbuffer from https://cache.nix-ci.com
  805. 24.78 s Downloaded cached cargo-package-ratatui-core (863 KiB) in 36ms
  806. 24.78 s Progress: 0 of 1 built, 353 of 675 downloaded from cache (15 downloading)
  807. 24.78 s Downloading cached cargo-package-rkyv from https://cache.nix-ci.com
  808. 24.78 s Downloaded cached cargo-package-redox_users (65 KiB) in 21ms
  809. 24.78 s Progress: 0 of 1 built, 354 of 675 downloaded from cache (15 downloading)
  810. 24.78 s Downloaded cached cargo-package-ref-cast-impl (33 KiB) in 21ms
  811. 24.78 s Downloading cached cargo-package-rkyv_derive from https://cache.nix-ci.com
  812. 24.78 s Downloaded cached cargo-package-ref-cast (57 KiB) in 22ms
  813. 24.78 s Progress: 0 of 1 built, 355 of 675 downloaded from cache (15 downloading)
  814. 24.78 s Downloading cached cargo-package-ron from https://cache.nix-ci.com
  815. 24.78 s Progress: 0 of 1 built, 356 of 675 downloaded from cache (15 downloading)
  816. 24.79 s Downloading cached cargo-package-ron from https://cache.nix-ci.com
  817. 24.79 s Downloaded cached cargo-package-ref-ops (47 KiB) in 22ms
  818. 24.79 s Progress: 0 of 1 built, 357 of 675 downloaded from cache (15 downloading)
  819. 24.79 s Downloading cached cargo-package-rug from https://cache.nix-ci.com
  820. 24.79 s Downloaded cached cargo-package-redox_syscall (159 KiB) in 28ms
  821. 24.79 s Progress: 0 of 1 built, 358 of 675 downloaded from cache (15 downloading)
  822. 24.79 s Downloading cached cargo-package-rust-embed from https://cache.nix-ci.com
  823. 24.79 s Downloaded cached cargo-package-rawpointer (22 KiB) in 31ms
  824. 24.79 s Progress: 0 of 1 built, 359 of 675 downloaded from cache (15 downloading)
  825. 24.79 s Downloading cached cargo-package-rust-embed-impl from https://cache.nix-ci.com
  826. 24.79 s Downloaded cached cargo-package-rayon-core (289 KiB) in 31ms
  827. 24.79 s Progress: 0 of 1 built, 360 of 675 downloaded from cache (15 downloading)
  828. 24.79 s Downloading cached cargo-package-rust-embed-utils from https://cache.nix-ci.com
  829. 24.79 s Downloaded cached cargo-package-reedline (778 KiB) in 33ms
  830. 24.79 s Progress: 0 of 1 built, 361 of 675 downloaded from cache (15 downloading)
  831. 24.79 s Downloaded cached cargo-package-rend (51 KiB) in 19ms
  832. 24.80 s Downloaded cached cargo-package-rayon (920 KiB) in 35ms
  833. 24.80 s Downloading cached cargo-package-rust_lisp from https://cache.nix-ci.com
  834. 24.80 s Progress: 0 of 1 built, 362 of 675 downloaded from cache (15 downloading)
  835. 24.80 s Progress: 0 of 1 built, 363 of 675 downloaded from cache (14 downloading)
  836. 24.80 s Downloading cached cargo-package-rustc-demangle from https://cache.nix-ci.com
  837. 24.80 s Downloading cached cargo-package-rustc-hash from https://cache.nix-ci.com
  838. 24.80 s Downloaded cached cargo-package-region (92 KiB) in 23ms
  839. 24.80 s Progress: 0 of 1 built, 364 of 675 downloaded from cache (15 downloading)
  840. 24.80 s Downloading cached cargo-package-rustc-hash from https://cache.nix-ci.com
  841. 24.80 s Downloaded cached cargo-package-ringbuffer (184 KiB) in 25ms
  842. 24.80 s Progress: 0 of 1 built, 365 of 675 downloaded from cache (15 downloading)
  843. 24.80 s Downloaded cached cargo-package-regex (713 KiB) in 37ms
  844. 24.81 s Downloading cached cargo-package-rustc_version from https://cache.nix-ci.com
  845. 24.81 s Progress: 0 of 1 built, 366 of 675 downloaded from cache (15 downloading)
  846. 24.81 s Downloading cached cargo-package-rustix from https://cache.nix-ci.com
  847. 24.81 s Downloaded cached cargo-package-regex-syntax (1.6 MiB) in 35ms
  848. 24.81 s Progress: 0 of 1 built, 367 of 675 downloaded from cache (15 downloading)
  849. 24.81 s Downloading cached cargo-package-rustix from https://cache.nix-ci.com
  850. 24.81 s Downloaded cached cargo-package-rust-embed-impl (30 KiB) in 22ms
  851. 24.81 s Progress: 0 of 1 built, 368 of 675 downloaded from cache (15 downloading)
  852. 24.81 s Downloading cached cargo-package-rustpython-ast from https://cache.nix-ci.com
  853. 24.82 s Downloaded cached cargo-package-rkyv_derive (128 KiB) in 35ms
  854. 24.82 s Progress: 0 of 1 built, 369 of 675 downloaded from cache (15 downloading)
  855. 24.82 s Downloading cached cargo-package-rustpython-parser from https://cache.nix-ci.com
  856. 24.82 s Downloaded cached cargo-package-rkyv (667 KiB) in 41ms
  857. 24.82 s Progress: 0 of 1 built, 370 of 675 downloaded from cache (15 downloading)
  858. 24.82 s Downloaded cached cargo-package-regex-automata (2.6 MiB) in 51ms
  859. 24.82 s Downloading cached cargo-package-rustpython-parser-core from https://cache.nix-ci.com
  860. 24.82 s Progress: 0 of 1 built, 371 of 675 downloaded from cache (15 downloading)
  861. 24.82 s Downloading cached cargo-package-rustpython-parser-vendored from https://cache.nix-ci.com
  862. 24.83 s Downloaded cached cargo-package-ron (320 KiB) in 41ms
  863. 24.83 s Progress: 0 of 1 built, 372 of 675 downloaded from cache (15 downloading)
  864. 24.83 s Downloaded cached cargo-package-rustc-hash (46 KiB) in 29ms
  865. 24.83 s Downloading cached cargo-package-rustversion from https://cache.nix-ci.com
  866. 24.83 s Progress: 0 of 1 built, 373 of 675 downloaded from cache (15 downloading)
  867. 24.83 s Downloaded cached cargo-package-ron (719 KiB) in 43ms
  868. 24.83 s Downloading cached cargo-package-rusty-fork from https://cache.nix-ci.com
  869. 24.83 s Progress: 0 of 1 built, 374 of 675 downloaded from cache (15 downloading)
  870. 24.83 s Downloading cached cargo-package-ryu from https://cache.nix-ci.com
  871. 24.83 s Downloaded cached cargo-package-rust-embed-utils (17 KiB) in 41ms
  872. 24.83 s Progress: 0 of 1 built, 375 of 675 downloaded from cache (15 downloading)
  873. 24.83 s Downloading cached cargo-package-safe_arch from https://cache.nix-ci.com
  874. 24.83 s Downloaded cached cargo-package-rustc-hash (25 KiB) in 38ms
  875. 24.84 s Progress: 0 of 1 built, 376 of 675 downloaded from cache (15 downloading)
  876. 24.84 s Downloading cached cargo-package-safe_arch from https://cache.nix-ci.com
  877. 24.84 s Downloaded cached cargo-package-rust_lisp (101 KiB) in 41ms
  878. 24.84 s Progress: 0 of 1 built, 377 of 675 downloaded from cache (15 downloading)
  879. 24.84 s Downloading cached cargo-package-safe_arch from https://cache.nix-ci.com
  880. 24.84 s Downloaded cached cargo-package-rustc-demangle (156 KiB) in 43ms
  881. 24.84 s Progress: 0 of 1 built, 378 of 675 downloaded from cache (15 downloading)
  882. 24.84 s Downloaded cached cargo-package-rug (2.3 MiB) in 53ms
  883. 24.84 s Downloading cached cargo-package-same-file from https://cache.nix-ci.com
  884. 24.84 s Progress: 0 of 1 built, 379 of 675 downloaded from cache (15 downloading)
  885. 24.84 s Downloading cached cargo-package-scc from https://cache.nix-ci.com
  886. 24.84 s Downloaded cached cargo-package-rust-embed (1014 KiB) in 53ms
  887. 24.84 s Progress: 0 of 1 built, 380 of 675 downloaded from cache (15 downloading)
  888. 24.84 s Downloaded cached cargo-package-rustc_version (46 KiB) in 37ms
  889. 24.84 s Downloading cached cargo-package-schemars from https://cache.nix-ci.com
  890. 24.84 s Progress: 0 of 1 built, 381 of 675 downloaded from cache (15 downloading)
  891. 24.84 s Downloading cached cargo-package-schemars_derive from https://cache.nix-ci.com
  892. 24.86 s Downloaded cached cargo-package-rustpython-parser-core (17 KiB) in 33ms
  893. 24.86 s Progress: 0 of 1 built, 382 of 675 downloaded from cache (15 downloading)
  894. 24.86 s Downloading cached cargo-package-scopeguard from https://cache.nix-ci.com
  895. 24.86 s Downloaded cached cargo-package-rusty-fork (70 KiB) in 27ms
  896. 24.86 s Progress: 0 of 1 built, 383 of 675 downloaded from cache (15 downloading)
  897. 24.86 s Downloaded cached cargo-package-rustpython-ast (405 KiB) in 43ms
  898. 24.86 s Downloading cached cargo-package-sdd from https://cache.nix-ci.com
  899. 24.86 s Progress: 0 of 1 built, 384 of 675 downloaded from cache (15 downloading)
  900. 24.86 s Downloading cached cargo-package-seahash from https://cache.nix-ci.com
  901. 24.86 s Downloaded cached cargo-package-rustpython-parser-vendored (72 KiB) in 39ms
  902. 24.86 s Progress: 0 of 1 built, 385 of 675 downloaded from cache (15 downloading)
  903. 24.86 s Downloading cached cargo-package-self_cell from https://cache.nix-ci.com
  904. 24.87 s Downloaded cached cargo-package-rustversion (81 KiB) in 38ms
  905. 24.87 s Progress: 0 of 1 built, 386 of 675 downloaded from cache (15 downloading)
  906. 24.87 s Downloading cached cargo-package-semver from https://cache.nix-ci.com
  907. 24.87 s Downloaded cached cargo-package-rustix (2.3 MiB) in 60ms
  908. 24.87 s Progress: 0 of 1 built, 387 of 675 downloaded from cache (15 downloading)
  909. 24.87 s Downloading cached cargo-package-serde from https://cache.nix-ci.com
  910. 24.87 s Downloaded cached cargo-package-schemars_derive (140 KiB) in 25ms
  911. 24.87 s Progress: 0 of 1 built, 388 of 675 downloaded from cache (15 downloading)
  912. 24.87 s Downloaded cached cargo-package-ryu (187 KiB) in 40ms
  913. 24.87 s Downloading cached cargo-package-serde-big-array from https://cache.nix-ci.com
  914. 24.87 s Progress: 0 of 1 built, 389 of 675 downloaded from cache (15 downloading)
  915. 24.87 s Downloading cached cargo-package-serde_core from https://cache.nix-ci.com
  916. 24.88 s Downloaded cached cargo-package-rustpython-parser (3.1 MiB) in 56ms
  917. 24.88 s Progress: 0 of 1 built, 390 of 675 downloaded from cache (15 downloading)
  918. 24.88 s Downloaded cached cargo-package-same-file (37 KiB) in 36ms
  919. 24.88 s Downloading cached cargo-package-serde_derive from https://cache.nix-ci.com
  920. 24.88 s Progress: 0 of 1 built, 391 of 675 downloaded from cache (15 downloading)
  921. 24.88 s Downloaded cached cargo-package-safe_arch (555 KiB) in 43ms
  922. 24.88 s Downloading cached cargo-package-serde_derive_internals from https://cache.nix-ci.com
  923. 24.88 s Downloaded cached cargo-package-rustix (2.1 MiB) in 74ms
  924. 24.88 s Progress: 0 of 1 built, 392 of 675 downloaded from cache (15 downloading)
  925. 24.88 s Progress: 0 of 1 built, 393 of 675 downloaded from cache (14 downloading)
  926. 24.88 s Downloading cached cargo-package-serde_json from https://cache.nix-ci.com
  927. 24.88 s Downloading cached cargo-package-serde_repr from https://cache.nix-ci.com
  928. 24.88 s Downloaded cached cargo-package-scc (933 KiB) in 39ms
  929. 24.88 s Progress: 0 of 1 built, 394 of 675 downloaded from cache (15 downloading)
  930. 24.88 s Downloaded cached cargo-package-safe_arch (714 KiB) in 44ms
  931. 24.88 s Downloading cached cargo-package-serde_spanned from https://cache.nix-ci.com
  932. 24.88 s Progress: 0 of 1 built, 395 of 675 downloaded from cache (15 downloading)
  933. 24.88 s Downloaded cached cargo-package-safe_arch (713 KiB) in 46ms
  934. 24.88 s Downloading cached cargo-package-serde_spanned from https://cache.nix-ci.com
  935. 24.88 s Progress: 0 of 1 built, 396 of 675 downloaded from cache (15 downloading)
  936. 24.88 s Downloading cached cargo-package-serde_yaml from https://cache.nix-ci.com
  937. 24.89 s Downloaded cached cargo-package-seahash (69 KiB) in 29ms
  938. 24.89 s Progress: 0 of 1 built, 397 of 675 downloaded from cache (15 downloading)
  939. 24.89 s Downloaded cached cargo-package-schemars (586 KiB) in 44ms
  940. 24.89 s Downloading cached cargo-package-serial_test from https://cache.nix-ci.com
  941. 24.89 s Downloaded cached cargo-package-scopeguard (37 KiB) in 31ms
  942. 24.89 s Progress: 0 of 1 built, 398 of 675 downloaded from cache (15 downloading)
  943. 24.89 s Progress: 0 of 1 built, 399 of 675 downloaded from cache (14 downloading)
  944. 24.89 s Downloaded cached cargo-package-sdd (158 KiB) in 31ms
  945. 24.89 s Downloading cached cargo-package-serial_test_derive from https://cache.nix-ci.com
  946. 24.89 s Downloading cached cargo-package-sha2 from https://cache.nix-ci.com
  947. 24.89 s Progress: 0 of 1 built, 400 of 675 downloaded from cache (15 downloading)
  948. 24.89 s Downloading cached cargo-package-sharded-slab from https://cache.nix-ci.com
  949. 24.89 s Downloaded cached cargo-package-self_cell (81 KiB) in 27ms
  950. 24.89 s Progress: 0 of 1 built, 401 of 675 downloaded from cache (15 downloading)
  951. 24.89 s Downloading cached cargo-package-shellexpand from https://cache.nix-ci.com
  952. 24.90 s Downloaded cached cargo-package-serde-big-array (25 KiB) in 27ms
  953. 24.90 s Progress: 0 of 1 built, 402 of 675 downloaded from cache (15 downloading)
  954. 24.90 s Downloaded cached cargo-package-semver (134 KiB) in 31ms
  955. 24.90 s Downloading cached cargo-package-shlex from https://cache.nix-ci.com
  956. 24.90 s Progress: 0 of 1 built, 403 of 675 downloaded from cache (15 downloading)
  957. 24.90 s Downloading cached cargo-package-signal-hook from https://cache.nix-ci.com
  958. 24.90 s Downloaded cached cargo-package-serde_repr (45 KiB) in 18ms
  959. 24.90 s Progress: 0 of 1 built, 404 of 675 downloaded from cache (15 downloading)
  960. 24.90 s Downloading cached cargo-package-signal-hook-mio from https://cache.nix-ci.com
  961. 24.90 s Downloaded cached cargo-package-serde_core (389 KiB) in 30ms
  962. 24.90 s Progress: 0 of 1 built, 405 of 675 downloaded from cache (15 downloading)
  963. 24.90 s Downloaded cached cargo-package-serde (555 KiB) in 35ms
  964. 24.90 s Downloaded cached cargo-package-serde_derive_internals (130 KiB) in 25ms
  965. 24.90 s Downloading cached cargo-package-signal-hook-registry from https://cache.nix-ci.com
  966. 24.90 s Progress: 0 of 1 built, 406 of 675 downloaded from cache (15 downloading)
  967. 24.90 s Progress: 0 of 1 built, 407 of 675 downloaded from cache (14 downloading)
  968. 24.91 s Downloaded cached cargo-package-serde_spanned (35 KiB) in 22ms
  969. 24.91 s Downloaded cached cargo-package-serde_spanned (31 KiB) in 23ms
  970. 24.91 s Downloading cached cargo-package-simba from https://cache.nix-ci.com
  971. 24.91 s Downloading cached cargo-package-simba from https://cache.nix-ci.com
  972. 24.91 s Progress: 0 of 1 built, 408 of 675 downloaded from cache (15 downloading)
  973. 24.91 s Progress: 0 of 1 built, 409 of 675 downloaded from cache (14 downloading)
  974. 24.91 s Downloading cached cargo-package-simdutf8 from https://cache.nix-ci.com
  975. 24.91 s Downloading cached cargo-package-similar from https://cache.nix-ci.com
  976. 24.91 s Downloaded cached cargo-package-serde_derive (333 KiB) in 29ms
  977. 24.91 s Progress: 0 of 1 built, 410 of 675 downloaded from cache (15 downloading)
  978. 24.91 s Downloading cached cargo-package-similar-asserts from https://cache.nix-ci.com
  979. 24.91 s Downloaded cached cargo-package-serde_json (748 KiB) in 28ms
  980. 24.91 s Progress: 0 of 1 built, 411 of 675 downloaded from cache (15 downloading)
  981. 24.91 s Downloading cached cargo-package-siphasher from https://cache.nix-ci.com
  982. 24.91 s Downloaded cached cargo-package-shellexpand (98 KiB) in 21ms
  983. 24.91 s Progress: 0 of 1 built, 412 of 675 downloaded from cache (15 downloading)
  984. 24.91 s Downloaded cached cargo-package-sharded-slab (272 KiB) in 23ms
  985. 24.91 s Downloading cached cargo-package-slab from https://cache.nix-ci.com
  986. 24.91 s Progress: 0 of 1 built, 413 of 675 downloaded from cache (15 downloading)
  987. 24.91 s Downloaded cached cargo-package-serial_test_derive (52 KiB) in 25ms
  988. 24.91 s Downloading cached cargo-package-slotmap from https://cache.nix-ci.com
  989. 24.92 s Progress: 0 of 1 built, 414 of 675 downloaded from cache (15 downloading)
  990. 24.92 s Downloading cached cargo-package-smallvec from https://cache.nix-ci.com
  991. 24.92 s Downloaded cached cargo-package-sha2 (118 KiB) in 27ms
  992. 24.92 s Progress: 0 of 1 built, 415 of 675 downloaded from cache (15 downloading)
  993. 24.92 s Downloading cached cargo-package-smartstring from https://cache.nix-ci.com
  994. 24.92 s Downloaded cached cargo-package-serial_test (62 KiB) in 29ms
  995. 24.92 s Progress: 0 of 1 built, 416 of 675 downloaded from cache (15 downloading)
  996. 24.92 s Downloaded cached cargo-package-serde_yaml (400 KiB) in 33ms
  997. 24.92 s Downloading cached cargo-package-spec_math from https://cache.nix-ci.com
  998. 24.92 s Progress: 0 of 1 built, 417 of 675 downloaded from cache (15 downloading)
  999. 24.92 s Downloading cached cargo-package-static_assertions from https://cache.nix-ci.com
  1000. 24.93 s Downloaded cached cargo-package-simdutf8 (133 KiB) in 19ms
  1001. 24.93 s Progress: 0 of 1 built, 418 of 675 downloaded from cache (15 downloading)
  1002. 24.93 s Downloading cached cargo-package-statrs from https://cache.nix-ci.com
  1003. 24.93 s Downloaded cached cargo-package-signal-hook-mio (64 KiB) in 26ms
  1004. 24.93 s Progress: 0 of 1 built, 419 of 675 downloaded from cache (15 downloading)
  1005. 24.93 s Downloading cached cargo-package-string-template-plus from https://cache.nix-ci.com
  1006. 24.93 s Downloaded cached cargo-package-shlex (60 KiB) in 29ms
  1007. 24.93 s Progress: 0 of 1 built, 420 of 675 downloaded from cache (15 downloading)
  1008. 24.93 s Downloading cached cargo-package-strip-ansi-escapes from https://cache.nix-ci.com
  1009. 24.93 s Downloaded cached cargo-package-signal-hook (168 KiB) in 30ms
  1010. 24.93 s Progress: 0 of 1 built, 421 of 675 downloaded from cache (15 downloading)
  1011. 24.93 s Downloaded cached cargo-package-similar (256 KiB) in 24ms
  1012. 24.93 s Downloading cached cargo-package-strsim from https://cache.nix-ci.com
  1013. 24.93 s Progress: 0 of 1 built, 422 of 675 downloaded from cache (15 downloading)
  1014. 24.93 s Downloading cached cargo-package-strsim from https://cache.nix-ci.com
  1015. 24.93 s Downloaded cached cargo-package-signal-hook-registry (69 KiB) in 29ms
  1016. 24.93 s Progress: 0 of 1 built, 423 of 675 downloaded from cache (15 downloading)
  1017. 24.93 s Downloaded cached cargo-package-simba (334 KiB) in 28ms
  1018. 24.93 s Downloading cached cargo-package-strum from https://cache.nix-ci.com
  1019. 24.93 s Progress: 0 of 1 built, 424 of 675 downloaded from cache (15 downloading)
  1020. 24.93 s Downloading cached cargo-package-strum from https://cache.nix-ci.com
  1021. 24.94 s Downloaded cached cargo-package-simba (294 KiB) in 29ms
  1022. 24.94 s Progress: 0 of 1 built, 425 of 675 downloaded from cache (15 downloading)
  1023. 24.94 s Downloading cached cargo-package-strum_macros from https://cache.nix-ci.com
  1024. 24.94 s Downloaded cached cargo-package-similar-asserts (63 KiB) in 30ms
  1025. 24.94 s Progress: 0 of 1 built, 426 of 675 downloaded from cache (15 downloading)
  1026. 24.94 s Downloading cached cargo-package-strum_macros from https://cache.nix-ci.com
  1027. 24.94 s Downloaded cached cargo-package-smartstring (124 KiB) in 24ms
  1028. 24.94 s Progress: 0 of 1 built, 427 of 675 downloaded from cache (15 downloading)
  1029. 24.94 s Downloaded cached cargo-package-static_assertions (66 KiB) in 23ms
  1030. 24.94 s Downloading cached cargo-package-subprocess from https://cache.nix-ci.com
  1031. 24.94 s Progress: 0 of 1 built, 428 of 675 downloaded from cache (15 downloading)
  1032. 24.94 s Downloading cached cargo-package-symjit from https://cache.nix-ci.com
  1033. 24.94 s Downloaded cached cargo-package-siphasher (60 KiB) in 32ms
  1034. 24.94 s Progress: 0 of 1 built, 429 of 675 downloaded from cache (15 downloading)
  1035. 24.94 s Downloading cached cargo-package-symlink from https://cache.nix-ci.com
  1036. 24.94 s Downloaded cached cargo-package-slab (81 KiB) in 30ms
  1037. 24.94 s Progress: 0 of 1 built, 430 of 675 downloaded from cache (15 downloading)
  1038. 24.94 s Downloading cached cargo-package-syn from https://cache.nix-ci.com
  1039. 24.95 s Downloaded cached cargo-package-slotmap (298 KiB) in 30ms
  1040. 24.95 s Progress: 0 of 1 built, 431 of 675 downloaded from cache (15 downloading)
  1041. 24.95 s Downloading cached cargo-package-syn from https://cache.nix-ci.com
  1042. 24.95 s Downloaded cached cargo-package-smallvec (160 KiB) in 30ms
  1043. 24.95 s Progress: 0 of 1 built, 432 of 675 downloaded from cache (15 downloading)
  1044. 24.95 s Downloading cached cargo-package-sysinfo from https://cache.nix-ci.com
  1045. 24.95 s Downloaded cached cargo-package-spec_math (1.6 MiB) in 34ms
  1046. 24.95 s Progress: 0 of 1 built, 433 of 675 downloaded from cache (15 downloading)
  1047. 24.95 s Downloading cached cargo-package-tabled from https://cache.nix-ci.com
  1048. 24.95 s Downloaded cached cargo-package-strum (21 KiB) in 20ms
  1049. 24.96 s Progress: 0 of 1 built, 434 of 675 downloaded from cache (15 downloading)
  1050. 24.96 s Downloading cached cargo-package-tabled_derive from https://cache.nix-ci.com
  1051. 24.96 s Downloaded cached cargo-package-strum (25 KiB) in 20ms
  1052. 24.96 s Progress: 0 of 1 built, 435 of 675 downloaded from cache (15 downloading)
  1053. 24.96 s Downloading cached cargo-package-tap from https://cache.nix-ci.com
  1054. 24.96 s Downloaded cached cargo-package-strsim (56 KiB) in 25ms
  1055. 24.96 s Progress: 0 of 1 built, 436 of 675 downloaded from cache (15 downloading)
  1056. 24.96 s Downloading cached cargo-package-target-lexicon from https://cache.nix-ci.com
  1057. 24.96 s Downloaded cached cargo-package-strip-ansi-escapes (26 KiB) in 33ms
  1058. 24.96 s Progress: 0 of 1 built, 437 of 675 downloaded from cache (15 downloading)
  1059. 24.96 s Downloading cached cargo-package-target-triple from https://cache.nix-ci.com
  1060. 24.96 s Downloaded cached cargo-package-strsim (48 KiB) in 31ms
  1061. 24.96 s Progress: 0 of 1 built, 438 of 675 downloaded from cache (15 downloading)
  1062. 24.96 s Downloaded cached cargo-package-string-template-plus (125 KiB) in 35ms
  1063. 24.96 s Downloading cached cargo-package-tempfile from https://cache.nix-ci.com
  1064. 24.96 s Progress: 0 of 1 built, 439 of 675 downloaded from cache (15 downloading)
  1065. 24.96 s Downloading cached cargo-package-termcolor from https://cache.nix-ci.com
  1066. 24.97 s Downloaded cached cargo-package-statrs (699 KiB) in 38ms
  1067. 24.97 s Progress: 0 of 1 built, 440 of 675 downloaded from cache (15 downloading)
  1068. 24.97 s Downloading cached cargo-package-terminal_size from https://cache.nix-ci.com
  1069. 24.97 s Downloaded cached cargo-package-strum_macros (136 KiB) in 35ms
  1070. 24.97 s Progress: 0 of 1 built, 441 of 675 downloaded from cache (15 downloading)
  1071. 24.97 s Downloading cached cargo-package-terminfo from https://cache.nix-ci.com
  1072. 24.98 s Downloaded cached cargo-package-strum_macros (151 KiB) in 37ms
  1073. 24.98 s Progress: 0 of 1 built, 442 of 675 downloaded from cache (15 downloading)
  1074. 24.98 s Downloading cached cargo-package-termios from https://cache.nix-ci.com
  1075. 24.98 s Downloaded cached cargo-package-symlink (38 KiB) in 33ms
  1076. 24.98 s Progress: 0 of 1 built, 443 of 675 downloaded from cache (15 downloading)
  1077. 24.98 s Downloading cached cargo-package-termwiz from https://cache.nix-ci.com
  1078. 24.98 s Downloaded cached cargo-package-subprocess (253 KiB) in 39ms
  1079. 24.98 s Progress: 0 of 1 built, 444 of 675 downloaded from cache (15 downloading)
  1080. 24.98 s Downloaded cached cargo-package-sysinfo (905 KiB) in 34ms
  1081. 24.98 s Downloading cached cargo-package-test-log from https://cache.nix-ci.com
  1082. 24.98 s Progress: 0 of 1 built, 445 of 675 downloaded from cache (15 downloading)
  1083. 24.98 s Downloading cached cargo-package-test-log-core from https://cache.nix-ci.com
  1084. 24.99 s Downloaded cached cargo-package-symjit (831 KiB) in 42ms
  1085. 24.99 s Progress: 0 of 1 built, 446 of 675 downloaded from cache (15 downloading)
  1086. 24.99 s Downloading cached cargo-package-test-log-macros from https://cache.nix-ci.com
  1087. 24.99 s Downloaded cached cargo-package-syn (1.8 MiB) in 44ms
  1088. 24.99 s Progress: 0 of 1 built, 447 of 675 downloaded from cache (15 downloading)
  1089. 24.99 s Downloading cached cargo-package-testing_table from https://cache.nix-ci.com
  1090. 24.99 s Downloaded cached cargo-package-syn (2.2 MiB) in 44ms
  1091. 24.99 s Progress: 0 of 1 built, 448 of 675 downloaded from cache (15 downloading)
  1092. 24.99 s Downloading cached cargo-package-thiserror from https://cache.nix-ci.com
  1093. 24.99 s Downloaded cached cargo-package-terminal_size (32 KiB) in 28ms
  1094. 24.99 s Progress: 0 of 1 built, 449 of 675 downloaded from cache (15 downloading)
  1095. 24.99 s Downloaded cached cargo-package-target-lexicon (123 KiB) in 36ms
  1096. 24.99 s Downloaded cached cargo-package-tabled_derive (54 KiB) in 38ms
  1097. 24.99 s Downloading cached cargo-package-thiserror from https://cache.nix-ci.com
  1098. 24.99 s Downloaded cached cargo-package-tap (40 KiB) in 38ms
  1099. 24.99 s Progress: 0 of 1 built, 450 of 675 downloaded from cache (15 downloading)
  1100. 24.99 s Progress: 0 of 1 built, 451 of 675 downloaded from cache (14 downloading)
  1101. 25.00 s Downloading cached cargo-package-thiserror-impl from https://cache.nix-ci.com
  1102. 25.00 s Downloading cached cargo-package-thiserror-impl from https://cache.nix-ci.com
  1103. 25.00 s Progress: 0 of 1 built, 452 of 675 downloaded from cache (15 downloading)
  1104. 25.00 s Downloading cached cargo-package-thread_local from https://cache.nix-ci.com
  1105. 25.00 s Downloaded cached cargo-package-termcolor (92 KiB) in 33ms
  1106. 25.00 s Progress: 0 of 1 built, 453 of 675 downloaded from cache (15 downloading)
  1107. 25.00 s Downloading cached cargo-package-time from https://cache.nix-ci.com
  1108. 25.00 s Downloaded cached cargo-package-target-triple (22 KiB) in 34ms
  1109. 25.00 s Progress: 0 of 1 built, 454 of 675 downloaded from cache (15 downloading)
  1110. 25.00 s Downloading cached cargo-package-time-core from https://cache.nix-ci.com
  1111. 25.00 s Downloaded cached cargo-package-tempfile (189 KiB) in 36ms
  1112. 25.00 s Progress: 0 of 1 built, 455 of 675 downloaded from cache (15 downloading)
  1113. 25.00 s Downloading cached cargo-package-time-macros from https://cache.nix-ci.com
  1114. 25.00 s Downloaded cached cargo-package-tabled (1.6 MiB) in 51ms
  1115. 25.00 s Progress: 0 of 1 built, 456 of 675 downloaded from cache (15 downloading)
  1116. 25.00 s Downloading cached cargo-package-tiny-keccak from https://cache.nix-ci.com
  1117. 25.01 s Downloaded cached cargo-package-test-log-macros (18 KiB) in 20ms
  1118. 25.01 s Progress: 0 of 1 built, 457 of 675 downloaded from cache (15 downloading)
  1119. 25.01 s Downloaded cached cargo-package-test-log-core (36 KiB) in 23ms
  1120. 25.01 s Downloading cached cargo-package-tiny_http from https://cache.nix-ci.com
  1121. 25.01 s Progress: 0 of 1 built, 458 of 675 downloaded from cache (15 downloading)
  1122. 25.01 s Downloading cached cargo-package-tinyjson from https://cache.nix-ci.com
  1123. 25.01 s Downloaded cached cargo-package-terminfo (180 KiB) in 36ms
  1124. 25.01 s Progress: 0 of 1 built, 459 of 675 downloaded from cache (15 downloading)
  1125. 25.01 s Downloading cached cargo-package-tinytemplate from https://cache.nix-ci.com
  1126. 25.01 s Downloaded cached cargo-package-test-log (46 KiB) in 28ms
  1127. 25.01 s Progress: 0 of 1 built, 460 of 675 downloaded from cache (15 downloading)
  1128. 25.01 s Downloaded cached cargo-package-termios (94 KiB) in 34ms
  1129. 25.01 s Downloaded cached cargo-package-testing_table (11 KiB) in 21ms
  1130. 25.01 s Downloading cached cargo-package-tinyvec from https://cache.nix-ci.com
  1131. 25.01 s Progress: 0 of 1 built, 461 of 675 downloaded from cache (15 downloading)
  1132. 25.01 s Progress: 0 of 1 built, 462 of 675 downloaded from cache (14 downloading)
  1133. 25.01 s Downloading cached cargo-package-tinyvec_macros from https://cache.nix-ci.com
  1134. 25.01 s Downloading cached cargo-package-titlecase from https://cache.nix-ci.com
  1135. 25.02 s Downloaded cached cargo-package-time-core (31 KiB) in 23ms
  1136. 25.02 s Progress: 0 of 1 built, 463 of 675 downloaded from cache (15 downloading)
  1137. 25.02 s Downloaded cached cargo-package-time-macros (113 KiB) in 23ms
  1138. 25.02 s Downloading cached cargo-package-toml from https://cache.nix-ci.com
  1139. 25.02 s Progress: 0 of 1 built, 464 of 675 downloaded from cache (15 downloading)
  1140. 25.02 s Downloading cached cargo-package-toml-0.9.12+spec from https://cache.nix-ci.com
  1141. 25.03 s Downloaded cached cargo-package-thread_local (71 KiB) in 30ms
  1142. 25.03 s Progress: 0 of 1 built, 465 of 675 downloaded from cache (15 downloading)
  1143. 25.03 s Downloaded cached cargo-package-thiserror (109 KiB) in 35ms
  1144. 25.03 s Downloading cached cargo-package-toml-1.1.2+spec from https://cache.nix-ci.com
  1145. 25.03 s Progress: 0 of 1 built, 466 of 675 downloaded from cache (15 downloading)
  1146. 25.03 s Downloading cached cargo-package-toml_datetime from https://cache.nix-ci.com
  1147. 25.03 s Downloaded cached cargo-package-thiserror-impl (97 KiB) in 32ms
  1148. 25.03 s Progress: 0 of 1 built, 467 of 675 downloaded from cache (15 downloading)
  1149. 25.03 s Downloaded cached cargo-package-thiserror-impl (83 KiB) in 32ms
  1150. 25.03 s Downloading cached cargo-package-toml_datetime-0.7.5+spec from https://cache.nix-ci.com
  1151. 25.03 s Progress: 0 of 1 built, 468 of 675 downloaded from cache (15 downloading)
  1152. 25.03 s Downloading cached cargo-package-toml_datetime-1.1.1+spec from https://cache.nix-ci.com
  1153. 25.03 s Downloaded cached cargo-package-termwiz (3.5 MiB) in 50ms
  1154. 25.03 s Progress: 0 of 1 built, 469 of 675 downloaded from cache (15 downloading)
  1155. 25.03 s Downloading cached cargo-package-toml_edit from https://cache.nix-ci.com
  1156. 25.03 s Downloaded cached cargo-package-thiserror (136 KiB) in 38ms
  1157. 25.03 s Progress: 0 of 1 built, 470 of 675 downloaded from cache (15 downloading)
  1158. 25.03 s Downloading cached cargo-package-toml_edit-0.25.11+spec from https://cache.nix-ci.com
  1159. 25.04 s Downloaded cached cargo-package-tinyjson (61 KiB) in 27ms
  1160. 25.04 s Progress: 0 of 1 built, 471 of 675 downloaded from cache (15 downloading)
  1161. 25.04 s Downloading cached cargo-package-toml_parser-1.1.2+spec from https://cache.nix-ci.com
  1162. 25.04 s Downloaded cached cargo-package-tiny-keccak (97 KiB) in 33ms
  1163. 25.04 s Progress: 0 of 1 built, 472 of 675 downloaded from cache (15 downloading)
  1164. 25.04 s Downloaded cached cargo-package-titlecase (23 KiB) in 25ms
  1165. 25.04 s Downloaded cached cargo-package-tinyvec_macros (16 KiB) in 25ms
  1166. 25.04 s Downloading cached cargo-package-toml_write from https://cache.nix-ci.com
  1167. 25.04 s Progress: 0 of 1 built, 473 of 675 downloaded from cache (15 downloading)
  1168. 25.04 s Progress: 0 of 1 built, 474 of 675 downloaded from cache (14 downloading)
  1169. 25.04 s Downloading cached cargo-package-toml_writer-1.1.1+spec from https://cache.nix-ci.com
  1170. 25.04 s Downloading cached cargo-package-tracing from https://cache.nix-ci.com
  1171. 25.04 s Downloaded cached cargo-package-time (1.5 MiB) in 42ms
  1172. 25.04 s Progress: 0 of 1 built, 475 of 675 downloaded from cache (15 downloading)
  1173. 25.04 s Downloaded cached cargo-package-tiny_http (197 KiB) in 33ms
  1174. 25.04 s Downloading cached cargo-package-tracing-appender from https://cache.nix-ci.com
  1175. 25.04 s Progress: 0 of 1 built, 476 of 675 downloaded from cache (15 downloading)
  1176. 25.04 s Downloaded cached cargo-package-tinytemplate (114 KiB) in 32ms
  1177. 25.04 s Downloading cached cargo-package-tracing-attributes from https://cache.nix-ci.com
  1178. 25.04 s Progress: 0 of 1 built, 477 of 675 downloaded from cache (15 downloading)
  1179. 25.04 s Downloading cached cargo-package-tracing-core from https://cache.nix-ci.com
  1180. 25.04 s Downloaded cached cargo-package-tinyvec (237 KiB) in 31ms
  1181. 25.04 s Progress: 0 of 1 built, 478 of 675 downloaded from cache (15 downloading)
  1182. 25.04 s Downloading cached cargo-package-tracing-error from https://cache.nix-ci.com
  1183. 25.05 s Downloaded cached cargo-package-toml_datetime-1.1.1+spec (71 KiB) in 22ms
  1184. 25.05 s Progress: 0 of 1 built, 479 of 675 downloaded from cache (15 downloading)
  1185. 25.05 s Downloaded cached cargo-package-toml_datetime-0.7.5+spec (71 KiB) in 23ms
  1186. 25.05 s Downloading cached cargo-package-tracing-indicatif from https://cache.nix-ci.com
  1187. 25.05 s Progress: 0 of 1 built, 480 of 675 downloaded from cache (15 downloading)
  1188. 25.05 s Downloading cached cargo-package-tracing-log from https://cache.nix-ci.com
  1189. 25.05 s Downloaded cached cargo-package-toml_datetime (59 KiB) in 26ms
  1190. 25.05 s Progress: 0 of 1 built, 481 of 675 downloaded from cache (15 downloading)
  1191. 25.05 s Downloading cached cargo-package-tracing-serde from https://cache.nix-ci.com
  1192. 25.05 s Downloaded cached cargo-package-toml (185 KiB) in 30ms
  1193. 25.05 s Progress: 0 of 1 built, 482 of 675 downloaded from cache (15 downloading)
  1194. 25.05 s Downloaded cached cargo-package-toml_edit (396 KiB) in 25ms
  1195. 25.06 s Downloading cached cargo-package-tracing-subscriber from https://cache.nix-ci.com
  1196. 25.06 s Progress: 0 of 1 built, 483 of 675 downloaded from cache (15 downloading)
  1197. 25.06 s Downloading cached cargo-package-trybuild from https://cache.nix-ci.com
  1198. 25.06 s Downloaded cached cargo-package-toml-1.1.2+spec (325 KiB) in 32ms
  1199. 25.06 s Progress: 0 of 1 built, 484 of 675 downloaded from cache (15 downloading)
  1200. 25.06 s Downloading cached cargo-package-typed-index-collections from https://cache.nix-ci.com
  1201. 25.06 s Downloaded cached cargo-package-toml-0.9.12+spec (322 KiB) in 35ms
  1202. 25.06 s Progress: 0 of 1 built, 485 of 675 downloaded from cache (15 downloading)
  1203. 25.06 s Downloading cached cargo-package-typeid from https://cache.nix-ci.com
  1204. 25.06 s Downloaded cached cargo-package-tracing-error (47 KiB) in 21ms
  1205. 25.06 s Progress: 0 of 1 built, 486 of 675 downloaded from cache (15 downloading)
  1206. 25.06 s Downloaded cached cargo-package-tracing-core (255 KiB) in 23ms
  1207. 25.06 s Downloading cached cargo-package-typenum from https://cache.nix-ci.com
  1208. 25.06 s Progress: 0 of 1 built, 487 of 675 downloaded from cache (15 downloading)
  1209. 25.07 s Downloading cached cargo-package-ucd-trie from https://cache.nix-ci.com
  1210. 25.07 s Downloaded cached cargo-package-toml_edit-0.25.11+spec (359 KiB) in 33ms
  1211. 25.07 s Progress: 0 of 1 built, 488 of 675 downloaded from cache (15 downloading)
  1212. 25.07 s Downloading cached cargo-package-unarray from https://cache.nix-ci.com
  1213. 25.07 s Downloaded cached cargo-package-tracing-appender (131 KiB) in 26ms
  1214. 25.07 s Progress: 0 of 1 built, 489 of 675 downloaded from cache (15 downloading)
  1215. 25.07 s Downloaded cached cargo-package-tracing-attributes (184 KiB) in 26ms
  1216. 25.07 s Downloading cached cargo-package-uncased from https://cache.nix-ci.com
  1217. 25.07 s Progress: 0 of 1 built, 490 of 675 downloaded from cache (15 downloading)
  1218. 25.07 s Downloading cached cargo-package-unic-char-property from https://cache.nix-ci.com
  1219. 25.07 s Downloaded cached cargo-package-toml_parser-1.1.2+spec (239 KiB) in 32ms
  1220. 25.07 s Progress: 0 of 1 built, 491 of 675 downloaded from cache (15 downloading)
  1221. 25.07 s Downloading cached cargo-package-unic-char-range from https://cache.nix-ci.com
  1222. 25.07 s Downloaded cached cargo-package-toml_writer-1.1.1+spec (74 KiB) in 32ms
  1223. 25.07 s Progress: 0 of 1 built, 492 of 675 downloaded from cache (15 downloading)
  1224. 25.07 s Downloaded cached cargo-package-toml_write (59 KiB) in 32ms
  1225. 25.07 s Downloading cached cargo-package-unic-common from https://cache.nix-ci.com
  1226. 25.07 s Progress: 0 of 1 built, 493 of 675 downloaded from cache (15 downloading)
  1227. 25.07 s Downloading cached cargo-package-unic-emoji-char from https://cache.nix-ci.com
  1228. 25.08 s Downloaded cached cargo-package-typeid (29 KiB) in 21ms
  1229. 25.08 s Progress: 0 of 1 built, 494 of 675 downloaded from cache (15 downloading)
  1230. 25.08 s Downloaded cached cargo-package-tracing-log (68 KiB) in 29ms
  1231. 25.08 s Downloading cached cargo-package-unic-ucd-ident from https://cache.nix-ci.com
  1232. 25.08 s Progress: 0 of 1 built, 495 of 675 downloaded from cache (15 downloading)
  1233. 25.08 s Downloading cached cargo-package-unic-ucd-version from https://cache.nix-ci.com
  1234. 25.08 s Downloaded cached cargo-package-trybuild (191 KiB) in 27ms
  1235. 25.08 s Progress: 0 of 1 built, 496 of 675 downloaded from cache (15 downloading)
  1236. 25.08 s Downloading cached cargo-package-unicase from https://cache.nix-ci.com
  1237. 25.08 s Downloaded cached cargo-package-tracing-indicatif (138 KiB) in 31ms
  1238. 25.08 s Progress: 0 of 1 built, 497 of 675 downloaded from cache (15 downloading)
  1239. 25.08 s Downloading cached cargo-package-unicode-ident from https://cache.nix-ci.com
  1240. 25.09 s Downloaded cached cargo-package-tracing-serde (31 KiB) in 31ms
  1241. 25.09 s Progress: 0 of 1 built, 498 of 675 downloaded from cache (15 downloading)
  1242. 25.09 s Downloading cached cargo-package-unicode-segmentation from https://cache.nix-ci.com
  1243. 25.09 s Downloaded cached cargo-package-unic-common (8240 B) in 22ms
  1244. 25.10 s Progress: 0 of 1 built, 499 of 675 downloaded from cache (15 downloading)
  1245. 25.10 s Downloaded cached cargo-package-unic-emoji-char (44 KiB) in 22ms
  1246. 25.10 s Downloaded cached cargo-package-typed-index-collections (280 KiB) in 35ms
  1247. 25.10 s Downloaded cached cargo-package-tracing-subscriber (1.1 MiB) in 40ms
  1248. 25.10 s Downloading cached cargo-package-unicode-truncate from https://cache.nix-ci.com
  1249. 25.10 s Progress: 0 of 1 built, 500 of 675 downloaded from cache (15 downloading)
  1250. 25.10 s Progress: 0 of 1 built, 501 of 675 downloaded from cache (14 downloading)
  1251. 25.10 s Progress: 0 of 1 built, 502 of 675 downloaded from cache (13 downloading)
  1252. 25.10 s Downloading cached cargo-package-unicode-width from https://cache.nix-ci.com
  1253. 25.10 s Downloading cached cargo-package-unicode-xid from https://cache.nix-ci.com
  1254. 25.10 s Downloading cached cargo-package-unicode_names2 from https://cache.nix-ci.com
  1255. 25.10 s Downloaded cached cargo-package-tracing (9.4 MiB) in 57ms
  1256. 25.10 s Progress: 0 of 1 built, 503 of 675 downloaded from cache (15 downloading)
  1257. 25.10 s Downloaded cached cargo-package-unic-char-range (30 KiB) in 28ms
  1258. 25.10 s Downloading cached cargo-package-unicode_names2_generator from https://cache.nix-ci.com
  1259. 25.10 s Progress: 0 of 1 built, 504 of 675 downloaded from cache (15 downloading)
  1260. 25.10 s Downloading cached cargo-package-unit-prefix from https://cache.nix-ci.com
  1261. 25.10 s Downloaded cached cargo-package-ucd-trie (160 KiB) in 33ms
  1262. 25.10 s Progress: 0 of 1 built, 505 of 675 downloaded from cache (15 downloading)
  1263. 25.10 s Downloading cached cargo-package-unsafe-libyaml from https://cache.nix-ci.com
  1264. 25.10 s Downloaded cached cargo-package-unarray (45 KiB) in 32ms
  1265. 25.10 s Progress: 0 of 1 built, 506 of 675 downloaded from cache (15 downloading)
  1266. 25.10 s Downloaded cached cargo-package-unic-char-property (31 KiB) in 32ms
  1267. 25.10 s Downloading cached cargo-package-unty from https://cache.nix-ci.com
  1268. 25.10 s Progress: 0 of 1 built, 507 of 675 downloaded from cache (15 downloading)
  1269. 25.10 s Downloading cached cargo-package-utf8parse from https://cache.nix-ci.com
  1270. 25.10 s Downloaded cached cargo-package-uncased (42 KiB) in 32ms
  1271. 25.10 s Progress: 0 of 1 built, 508 of 675 downloaded from cache (15 downloading)
  1272. 25.10 s Downloading cached cargo-package-uuid from https://cache.nix-ci.com
  1273. 25.10 s Downloaded cached cargo-package-typenum (1.2 MiB) in 37ms
  1274. 25.10 s Progress: 0 of 1 built, 509 of 675 downloaded from cache (15 downloading)
  1275. 25.10 s Downloading cached cargo-package-valuable from https://cache.nix-ci.com
  1276. 25.11 s Downloaded cached cargo-package-unicase (113 KiB) in 25ms
  1277. 25.11 s Progress: 0 of 1 built, 510 of 675 downloaded from cache (15 downloading)
  1278. 25.11 s Downloaded cached cargo-package-unic-ucd-version (8360 B) in 26ms
  1279. 25.11 s Downloading cached cargo-package-vectorize from https://cache.nix-ci.com
  1280. 25.11 s Progress: 0 of 1 built, 511 of 675 downloaded from cache (15 downloading)
  1281. 25.11 s Downloading cached cargo-package-venial from https://cache.nix-ci.com
  1282. 25.11 s Downloaded cached cargo-package-unic-ucd-ident (151 KiB) in 28ms
  1283. 25.11 s Progress: 0 of 1 built, 512 of 675 downloaded from cache (15 downloading)
  1284. 25.11 s Downloading cached cargo-package-version-compare from https://cache.nix-ci.com
  1285. 25.12 s Downloaded cached cargo-package-unicode-segmentation (659 KiB) in 29ms
  1286. 25.12 s Progress: 0 of 1 built, 513 of 675 downloaded from cache (15 downloading)
  1287. 25.12 s Downloading cached cargo-package-version_check from https://cache.nix-ci.com
  1288. 25.12 s Downloaded cached cargo-package-unicode-ident (335 KiB) in 32ms
  1289. 25.12 s Progress: 0 of 1 built, 514 of 675 downloaded from cache (15 downloading)
  1290. 25.12 s Downloading cached cargo-package-virtue from https://cache.nix-ci.com
  1291. 25.12 s Downloaded cached cargo-package-utf8parse (36 KiB) in 18ms
  1292. 25.12 s Progress: 0 of 1 built, 515 of 675 downloaded from cache (15 downloading)
  1293. 25.12 s Downloading cached cargo-package-vt100 from https://cache.nix-ci.com
  1294. 25.12 s Downloaded cached cargo-package-unty (21 KiB) in 20ms
  1295. 25.12 s Progress: 0 of 1 built, 516 of 675 downloaded from cache (15 downloading)
  1296. 25.12 s Downloading cached cargo-package-vte from https://cache.nix-ci.com
  1297. 25.12 s Downloaded cached cargo-package-uuid (316 KiB) in 21ms
  1298. 25.12 s Progress: 0 of 1 built, 517 of 675 downloaded from cache (15 downloading)
  1299. 25.12 s Downloading cached cargo-package-vte from https://cache.nix-ci.com
  1300. 25.12 s Downloaded cached cargo-package-unit-prefix (30 KiB) in 25ms
  1301. 25.12 s Progress: 0 of 1 built, 518 of 675 downloaded from cache (15 downloading)
  1302. 25.12 s Downloaded cached cargo-package-unicode_names2_generator (42 KiB) in 25ms
  1303. 25.12 s Downloaded cached cargo-package-valuable (156 KiB) in 21ms
  1304. 25.12 s Downloading cached cargo-package-vtparse from https://cache.nix-ci.com
  1305. 25.12 s Progress: 0 of 1 built, 519 of 675 downloaded from cache (15 downloading)
  1306. 25.12 s Progress: 0 of 1 built, 520 of 675 downloaded from cache (14 downloading)
  1307. 25.12 s Downloading cached cargo-package-wait-timeout from https://cache.nix-ci.com
  1308. 25.12 s Downloading cached cargo-package-walkdir from https://cache.nix-ci.com
  1309. 25.13 s Downloaded cached cargo-package-unsafe-libyaml (457 KiB) in 25ms
  1310. 25.13 s Progress: 0 of 1 built, 521 of 675 downloaded from cache (15 downloading)
  1311. 25.13 s Downloaded cached cargo-package-unicode-xid (78 KiB) in 29ms
  1312. 25.13 s Downloading cached cargo-package-wasi-0.11.1+wasi-snapshot-preview1 from https://cache.nix-ci.com
  1313. 25.13 s Progress: 0 of 1 built, 522 of 675 downloaded from cache (15 downloading)
  1314. 25.13 s Downloading cached cargo-package-wasip2-1.0.3+wasi from https://cache.nix-ci.com
  1315. 25.13 s Downloaded cached cargo-package-unicode-truncate (67 KiB) in 30ms
  1316. 25.13 s Progress: 0 of 1 built, 523 of 675 downloaded from cache (15 downloading)
  1317. 25.13 s Downloading cached cargo-package-wasip3-0.4.0+wasi-0.3.0-rc-2026-01 from https://cache.nix-ci.com
  1318. 25.14 s Downloaded cached cargo-package-unicode-width (2.3 MiB) in 40ms
  1319. 25.14 s Progress: 0 of 1 built, 524 of 675 downloaded from cache (15 downloading)
  1320. 25.14 s Downloading cached cargo-package-wasm-bindgen from https://cache.nix-ci.com
  1321. 25.14 s Downloaded cached cargo-package-unicode_names2 (2.2 MiB) in 42ms
  1322. 25.14 s Progress: 0 of 1 built, 525 of 675 downloaded from cache (15 downloading)
  1323. 25.14 s Downloaded cached cargo-package-vectorize (6368 B) in 29ms
  1324. 25.14 s Downloading cached cargo-package-wasm-bindgen-macro from https://cache.nix-ci.com
  1325. 25.14 s Progress: 0 of 1 built, 526 of 675 downloaded from cache (15 downloading)
  1326. 25.14 s Downloading cached cargo-package-wasm-bindgen-macro-support from https://cache.nix-ci.com
  1327. 25.14 s Downloaded cached cargo-package-venial (170 KiB) in 31ms
  1328. 25.14 s Progress: 0 of 1 built, 527 of 675 downloaded from cache (15 downloading)
  1329. 25.14 s Downloading cached cargo-package-wasm-bindgen-shared from https://cache.nix-ci.com
  1330. 25.14 s Downloaded cached cargo-package-version_check (62 KiB) in 27ms
  1331. 25.14 s Progress: 0 of 1 built, 528 of 675 downloaded from cache (15 downloading)
  1332. 25.14 s Downloading cached cargo-package-wasm-encoder from https://cache.nix-ci.com
  1333. 25.14 s Downloaded cached cargo-package-version-compare (65 KiB) in 32ms
  1334. 25.14 s Progress: 0 of 1 built, 529 of 675 downloaded from cache (15 downloading)
  1335. 25.14 s Downloading cached cargo-package-wasm-metadata from https://cache.nix-ci.com
  1336. 25.15 s Downloaded cached cargo-package-virtue (199 KiB) in 34ms
  1337. 25.15 s Progress: 0 of 1 built, 530 of 675 downloaded from cache (15 downloading)
  1338. 25.15 s Downloading cached cargo-package-wasm-minimal-protocol from https://cache.nix-ci.com
  1339. 25.15 s Downloaded cached cargo-package-vt100 (160 KiB) in 32ms
  1340. 25.15 s Progress: 0 of 1 built, 531 of 675 downloaded from cache (15 downloading)
  1341. 25.15 s Downloading cached cargo-package-wasmparser from https://cache.nix-ci.com
  1342. 25.16 s Downloaded cached cargo-package-vte (319 KiB) in 34ms
  1343. 25.16 s Progress: 0 of 1 built, 532 of 675 downloaded from cache (15 downloading)
  1344. 25.16 s Downloaded cached cargo-package-wasip2-1.0.3+wasi (1.2 MiB) in 29ms
  1345. 25.16 s Downloaded cached cargo-package-vtparse (53 KiB) in 31ms
  1346. 25.16 s Downloading cached cargo-package-wasmtime-jit-icache-coherence from https://cache.nix-ci.com
  1347. 25.16 s Progress: 0 of 1 built, 533 of 675 downloaded from cache (15 downloading)
  1348. 25.16 s Progress: 0 of 1 built, 534 of 675 downloaded from cache (14 downloading)
  1349. 25.16 s Downloaded cached cargo-package-wait-timeout (35 KiB) in 31ms
  1350. 25.16 s Downloading cached cargo-package-web-sys from https://cache.nix-ci.com
  1351. 25.16 s Downloading cached cargo-package-web-time from https://cache.nix-ci.com
  1352. 25.16 s Downloaded cached cargo-package-wasi-0.11.1+wasi-snapshot-preview1 (132 KiB) in 30ms
  1353. 25.16 s Progress: 0 of 1 built, 535 of 675 downloaded from cache (15 downloading)
  1354. 25.16 s Downloading cached cargo-package-web-time from https://cache.nix-ci.com
  1355. 25.16 s Progress: 0 of 1 built, 536 of 675 downloaded from cache (15 downloading)
  1356. 25.16 s Downloading cached cargo-package-wezterm-bidi from https://cache.nix-ci.com
  1357. 25.16 s Downloaded cached cargo-package-walkdir (114 KiB) in 34ms
  1358. 25.16 s Progress: 0 of 1 built, 537 of 675 downloaded from cache (15 downloading)
  1359. 25.16 s Downloaded cached cargo-package-vte (320 KiB) in 36ms
  1360. 25.16 s Downloading cached cargo-package-wezterm-blob-leases from https://cache.nix-ci.com
  1361. 25.16 s Progress: 0 of 1 built, 538 of 675 downloaded from cache (15 downloading)
  1362. 25.16 s Downloading cached cargo-package-wezterm-color-types from https://cache.nix-ci.com
  1363. 25.16 s Downloaded cached cargo-package-wasip3-0.4.0+wasi-0.3.0-rc-2026-01 (1.1 MiB) in 36ms
  1364. 25.16 s Progress: 0 of 1 built, 539 of 675 downloaded from cache (15 downloading)
  1365. 25.16 s Downloading cached cargo-package-wezterm-dynamic from https://cache.nix-ci.com
  1366. 25.17 s Downloaded cached cargo-package-wasm-bindgen-macro-support (319 KiB) in 26ms
  1367. 25.17 s Progress: 0 of 1 built, 540 of 675 downloaded from cache (15 downloading)
  1368. 25.17 s Downloading cached cargo-package-wezterm-dynamic-derive from https://cache.nix-ci.com
  1369. 25.17 s Downloaded cached cargo-package-wasm-metadata (122 KiB) in 24ms
  1370. 25.17 s Progress: 0 of 1 built, 541 of 675 downloaded from cache (15 downloading)
  1371. 25.17 s Downloading cached cargo-package-wezterm-input-types from https://cache.nix-ci.com
  1372. 25.17 s Downloaded cached cargo-package-wasm-bindgen-macro (27 KiB) in 29ms
  1373. 25.17 s Progress: 0 of 1 built, 542 of 675 downloaded from cache (15 downloading)
  1374. 25.17 s Downloading cached cargo-package-which from https://cache.nix-ci.com
  1375. 25.17 s Downloaded cached cargo-package-wasm-bindgen (265 KiB) in 34ms
  1376. 25.17 s Progress: 0 of 1 built, 543 of 675 downloaded from cache (15 downloading)
  1377. 25.17 s Downloading cached cargo-package-wide from https://cache.nix-ci.com
  1378. 25.17 s Downloaded cached cargo-package-wasm-bindgen-shared (32 KiB) in 32ms
  1379. 25.17 s Progress: 0 of 1 built, 544 of 675 downloaded from cache (15 downloading)
  1380. 25.17 s Downloading cached cargo-package-wide from https://cache.nix-ci.com
  1381. 25.18 s Downloaded cached cargo-package-wasm-encoder (580 KiB) in 33ms
  1382. 25.18 s Progress: 0 of 1 built, 545 of 675 downloaded from cache (15 downloading)
  1383. 25.18 s Downloading cached cargo-package-wide from https://cache.nix-ci.com
  1384. 25.18 s Downloaded cached cargo-package-wezterm-color-types (51 KiB) in 20ms
  1385. 25.18 s Progress: 0 of 1 built, 546 of 675 downloaded from cache (15 downloading)
  1386. 25.18 s Downloading cached cargo-package-winapi from https://cache.nix-ci.com
  1387. 25.18 s Downloaded cached cargo-package-wezterm-blob-leases (32 KiB) in 21ms
  1388. 25.18 s Progress: 0 of 1 built, 547 of 675 downloaded from cache (15 downloading)
  1389. 25.18 s Downloading cached cargo-package-winapi-i686-pc-windows-gnu from https://cache.nix-ci.com
  1390. 25.18 s Downloaded cached cargo-package-wasm-minimal-protocol (35 KiB) in 30ms
  1391. 25.18 s Progress: 0 of 1 built, 548 of 675 downloaded from cache (15 downloading)
  1392. 25.18 s Downloading cached cargo-package-winapi-util from https://cache.nix-ci.com
  1393. 25.19 s Downloaded cached cargo-package-wezterm-bidi (362 KiB) in 32ms
  1394. 25.19 s Progress: 0 of 1 built, 549 of 675 downloaded from cache (15 downloading)
  1395. 25.19 s Downloading cached cargo-package-winapi-x86_64-pc-windows-gnu from https://cache.nix-ci.com
  1396. 25.19 s Downloaded cached cargo-package-wasmtime-jit-icache-coherence (21 KiB) in 36ms
  1397. 25.19 s Progress: 0 of 1 built, 550 of 675 downloaded from cache (15 downloading)
  1398. 25.19 s Downloaded cached cargo-package-web-time (59 KiB) in 35ms
  1399. 25.19 s Downloading cached cargo-package-windows from https://cache.nix-ci.com
  1400. 25.19 s Progress: 0 of 1 built, 551 of 675 downloaded from cache (15 downloading)
  1401. 25.19 s Downloading cached cargo-package-windows-core from https://cache.nix-ci.com
  1402. 25.19 s Downloaded cached cargo-package-web-time (67 KiB) in 36ms
  1403. 25.19 s Progress: 0 of 1 built, 552 of 675 downloaded from cache (15 downloading)
  1404. 25.19 s Downloading cached cargo-package-windows-implement from https://cache.nix-ci.com
  1405. 25.20 s Downloaded cached cargo-package-wasmparser (1.4 MiB) in 43ms
  1406. 25.20 s Progress: 0 of 1 built, 553 of 675 downloaded from cache (15 downloading)
  1407. 25.20 s Downloading cached cargo-package-windows-interface from https://cache.nix-ci.com
  1408. 25.20 s Downloaded cached cargo-package-wezterm-dynamic (56 KiB) in 32ms
  1409. 25.20 s Progress: 0 of 1 built, 554 of 675 downloaded from cache (15 downloading)
  1410. 25.20 s Downloading cached cargo-package-windows-link from https://cache.nix-ci.com
  1411. 25.20 s Downloaded cached cargo-package-wezterm-dynamic-derive (40 KiB) in 34ms
  1412. 25.20 s Progress: 0 of 1 built, 555 of 675 downloaded from cache (15 downloading)
  1413. 25.20 s Downloading cached cargo-package-windows-result from https://cache.nix-ci.com
  1414. 25.20 s Downloaded cached cargo-package-wezterm-input-types (99 KiB) in 34ms
  1415. 25.20 s Progress: 0 of 1 built, 556 of 675 downloaded from cache (15 downloading)
  1416. 25.20 s Downloaded cached cargo-package-which (117 KiB) in 34ms
  1417. 25.20 s Downloading cached cargo-package-windows-sys from https://cache.nix-ci.com
  1418. 25.20 s Progress: 0 of 1 built, 557 of 675 downloaded from cache (15 downloading)
  1419. 25.20 s Downloading cached cargo-package-windows-sys from https://cache.nix-ci.com
  1420. 25.21 s Downloaded cached cargo-package-wide (1.1 MiB) in 33ms
  1421. 25.21 s Progress: 0 of 1 built, 558 of 675 downloaded from cache (15 downloading)
  1422. 25.21 s Downloading cached cargo-package-windows-sys from https://cache.nix-ci.com
  1423. 25.22 s Downloaded cached cargo-package-wide (747 KiB) in 42ms
  1424. 25.22 s Progress: 0 of 1 built, 559 of 675 downloaded from cache (15 downloading)
  1425. 25.22 s Downloading cached cargo-package-windows-sys from https://cache.nix-ci.com
  1426. 25.22 s Downloaded cached cargo-package-wide (1 MiB) in 42ms
  1427. 25.22 s Progress: 0 of 1 built, 560 of 675 downloaded from cache (15 downloading)
  1428. 25.22 s Downloading cached cargo-package-windows-targets from https://cache.nix-ci.com
  1429. 25.22 s Downloaded cached cargo-package-winapi-util (48 KiB) in 33ms
  1430. 25.22 s Progress: 0 of 1 built, 561 of 675 downloaded from cache (15 downloading)
  1431. 25.22 s Downloading cached cargo-package-windows-targets from https://cache.nix-ci.com
  1432. 25.23 s Downloaded cached cargo-package-windows-link (17 KiB) in 29ms
  1433. 25.23 s Progress: 0 of 1 built, 562 of 675 downloaded from cache (15 downloading)
  1434. 25.23 s Downloading cached cargo-package-windows_aarch64_gnullvm from https://cache.nix-ci.com
  1435. 25.23 s Downloaded cached cargo-package-windows-implement (37 KiB) in 33ms
  1436. 25.23 s Progress: 0 of 1 built, 563 of 675 downloaded from cache (15 downloading)
  1437. 25.23 s Downloading cached cargo-package-windows_aarch64_gnullvm from https://cache.nix-ci.com
  1438. 25.24 s Downloaded cached cargo-package-windows-core (300 KiB) in 46ms
  1439. 25.24 s Progress: 0 of 1 built, 564 of 675 downloaded from cache (15 downloading)
  1440. 25.24 s Downloading cached cargo-package-windows_aarch64_msvc from https://cache.nix-ci.com
  1441. 25.25 s Downloaded cached cargo-package-windows-interface (40 KiB) in 52ms
  1442. 25.25 s Progress: 0 of 1 built, 565 of 675 downloaded from cache (15 downloading)
  1443. 25.25 s Downloading cached cargo-package-windows_aarch64_msvc from https://cache.nix-ci.com
  1444. 25.27 s Downloaded cached cargo-package-windows-result (35 KiB) in 68ms
  1445. 25.27 s Progress: 0 of 1 built, 566 of 675 downloaded from cache (15 downloading)
  1446. 25.27 s Downloading cached cargo-package-windows_i686_gnu from https://cache.nix-ci.com
  1447. 25.29 s Downloaded cached cargo-package-windows-targets (22 KiB) in 68ms
  1448. 25.29 s Progress: 0 of 1 built, 567 of 675 downloaded from cache (15 downloading)
  1449. 25.29 s Downloading cached cargo-package-windows_i686_gnu from https://cache.nix-ci.com
  1450. 25.29 s Downloaded cached cargo-package-windows-targets (20 KiB) in 76ms
  1451. 25.29 s Progress: 0 of 1 built, 568 of 675 downloaded from cache (15 downloading)
  1452. 25.29 s Downloading cached cargo-package-windows_i686_gnullvm from https://cache.nix-ci.com
  1453. 25.30 s Downloaded cached cargo-package-winapi (6.7 MiB) in 120ms
  1454. 25.30 s Progress: 0 of 1 built, 569 of 675 downloaded from cache (15 downloading)
  1455. 25.30 s Downloading cached cargo-package-windows_i686_gnullvm from https://cache.nix-ci.com
  1456. 25.35 s Downloaded cached cargo-package-web-sys (10.9 MiB) in 196ms
  1457. 25.35 s Progress: 0 of 1 built, 570 of 675 downloaded from cache (15 downloading)
  1458. 25.35 s Downloading cached cargo-package-windows_i686_msvc from https://cache.nix-ci.com
  1459. 25.39 s Downloaded cached cargo-package-windows_aarch64_gnullvm (3.7 MiB) in 162ms
  1460. 25.39 s Progress: 0 of 1 built, 571 of 675 downloaded from cache (15 downloading)
  1461. 25.39 s Downloading cached cargo-package-windows_i686_msvc from https://cache.nix-ci.com
  1462. 25.40 s Downloaded cached cargo-package-windows_aarch64_gnullvm (4.9 MiB) in 170ms
  1463. 25.40 s Progress: 0 of 1 built, 572 of 675 downloaded from cache (15 downloading)
  1464. 25.40 s Downloading cached cargo-package-windows_x86_64_gnu from https://cache.nix-ci.com
  1465. 25.42 s Downloaded cached cargo-package-windows_aarch64_msvc (5 MiB) in 181ms
  1466. 25.42 s Progress: 0 of 1 built, 573 of 675 downloaded from cache (15 downloading)
  1467. 25.42 s Downloading cached cargo-package-windows_x86_64_gnu from https://cache.nix-ci.com
  1468. 25.45 s Downloaded cached cargo-package-windows_aarch64_msvc (5 MiB) in 198ms
  1469. 25.45 s Progress: 0 of 1 built, 574 of 675 downloaded from cache (15 downloading)
  1470. 25.45 s Downloading cached cargo-package-windows_x86_64_gnullvm from https://cache.nix-ci.com
  1471. 25.46 s Downloaded cached cargo-package-windows_i686_gnullvm (5.2 MiB) in 155ms
  1472. 25.46 s Progress: 0 of 1 built, 575 of 675 downloaded from cache (15 downloading)
  1473. 25.46 s Downloading cached cargo-package-windows_x86_64_gnullvm from https://cache.nix-ci.com
  1474. 25.47 s Downloaded cached cargo-package-windows-sys (16.4 MiB) in 262ms
  1475. 25.47 s Progress: 0 of 1 built, 576 of 675 downloaded from cache (15 downloading)
  1476. 25.47 s Downloading cached cargo-package-windows_x86_64_msvc from https://cache.nix-ci.com
  1477. 25.48 s Downloaded cached cargo-package-windows-sys (20.6 MiB) in 280ms
  1478. 25.48 s Progress: 0 of 1 built, 577 of 675 downloaded from cache (15 downloading)
  1479. 25.48 s Downloading cached cargo-package-windows_x86_64_msvc from https://cache.nix-ci.com
  1480. 25.50 s Downloaded cached cargo-package-windows_i686_gnullvm (3.9 MiB) in 203ms
  1481. 25.50 s Progress: 0 of 1 built, 578 of 675 downloaded from cache (15 downloading)
  1482. 25.50 s Downloading cached cargo-package-winnow from https://cache.nix-ci.com
  1483. 25.50 s Downloaded cached cargo-package-windows-sys (17.5 MiB) in 288ms
  1484. 25.50 s Progress: 0 of 1 built, 579 of 675 downloaded from cache (15 downloading)
  1485. 25.50 s Downloading cached cargo-package-winnow from https://cache.nix-ci.com
  1486. 25.51 s Downloaded cached cargo-package-windows_i686_gnu (12.6 MiB) in 236ms
  1487. 25.51 s Progress: 0 of 1 built, 580 of 675 downloaded from cache (15 downloading)
  1488. 25.51 s Downloading cached cargo-package-wit-bindgen from https://cache.nix-ci.com
  1489. 25.51 s Downloaded cached cargo-package-winapi-i686-pc-windows-gnu (48.9 MiB) in 324ms
  1490. 25.51 s Progress: 0 of 1 built, 581 of 675 downloaded from cache (15 downloading)
  1491. 25.51 s Downloading cached cargo-package-wit-bindgen from https://cache.nix-ci.com
  1492. 25.51 s Downloaded cached cargo-package-windows_i686_gnu (12.6 MiB) in 227ms
  1493. 25.51 s Progress: 0 of 1 built, 582 of 675 downloaded from cache (15 downloading)
  1494. 25.51 s Downloading cached cargo-package-wit-bindgen-core from https://cache.nix-ci.com
  1495. 25.52 s Downloaded cached cargo-package-windows-sys (17.4 MiB) in 308ms
  1496. 25.52 s Progress: 0 of 1 built, 583 of 675 downloaded from cache (15 downloading)
  1497. 25.52 s Downloading cached cargo-package-wit-bindgen-rust from https://cache.nix-ci.com
  1498. 25.53 s Downloaded cached cargo-package-windows_i686_msvc (5.3 MiB) in 181ms
  1499. 25.53 s Progress: 0 of 1 built, 584 of 675 downloaded from cache (15 downloading)
  1500. 25.53 s Downloading cached cargo-package-wit-bindgen-rust-macro from https://cache.nix-ci.com
  1501. 25.54 s Downloaded cached cargo-package-winapi-x86_64-pc-windows-gnu (51 MiB) in 351ms
  1502. 25.54 s Progress: 0 of 1 built, 585 of 675 downloaded from cache (15 downloading)
  1503. 25.54 s Downloading cached cargo-package-wit-component from https://cache.nix-ci.com
  1504. 25.55 s Downloaded cached cargo-package-windows_i686_msvc (5.3 MiB) in 159ms
  1505. 25.55 s Progress: 0 of 1 built, 586 of 675 downloaded from cache (15 downloading)
  1506. 25.55 s Downloading cached cargo-package-wit-parser from https://cache.nix-ci.com
  1507. 25.56 s Downloaded cached cargo-package-windows_x86_64_gnu (12.1 MiB) in 162ms
  1508. 25.56 s Progress: 0 of 1 built, 587 of 675 downloaded from cache (15 downloading)
  1509. 25.56 s Downloading cached cargo-package-wyz from https://cache.nix-ci.com
  1510. 25.57 s Downloaded cached cargo-package-wit-bindgen-core (167 KiB) in 51ms
  1511. 25.57 s Downloaded cached cargo-package-wit-bindgen (285 KiB) in 59ms
  1512. 25.57 s Progress: 0 of 1 built, 588 of 675 downloaded from cache (15 downloading)
  1513. 25.57 s Downloaded cached cargo-package-wit-bindgen (274 KiB) in 60ms
  1514. 25.57 s Progress: 0 of 1 built, 589 of 675 downloaded from cache (15 downloading)
  1515. 25.57 s Downloading cached cargo-package-xpct from https://cache.nix-ci.com
  1516. 25.57 s Progress: 0 of 1 built, 590 of 675 downloaded from cache (14 downloading)
  1517. 25.57 s Downloading cached cargo-package-zerocopy from https://cache.nix-ci.com
  1518. 25.57 s Downloading cached cargo-package-xprec from https://cache.nix-ci.com
  1519. 25.57 s Downloaded cached cargo-package-windows_x86_64_gnullvm (3.7 MiB) in 123ms
  1520. 25.57 s Progress: 0 of 1 built, 591 of 675 downloaded from cache (15 downloading)
  1521. 25.57 s Downloading cached cargo-package-zerocopy-derive from https://cache.nix-ci.com
  1522. 25.58 s Downloaded cached cargo-package-windows_x86_64_gnullvm (4.9 MiB) in 121ms
  1523. 25.58 s Progress: 0 of 1 built, 592 of 675 downloaded from cache (15 downloading)
  1524. 25.58 s Downloading cached cargo-package-zmij from https://cache.nix-ci.com
  1525. 25.58 s Downloaded cached cargo-package-windows_x86_64_gnu (12.1 MiB) in 160ms
  1526. 25.58 s Progress: 0 of 1 built, 593 of 675 downloaded from cache (15 downloading)
  1527. 25.58 s Downloading cached libunistring from https://cache.nix-ci.com
  1528. 25.59 s Downloaded cached cargo-package-windows_x86_64_msvc (5 MiB) in 120ms
  1529. 25.59 s Progress: 0 of 1 built, 594 of 675 downloaded from cache (15 downloading)
  1530. 25.59 s Downloading cached linkLockedDeps from https://cache.nix-ci.com
  1531. 25.60 s Downloaded cached cargo-package-wit-bindgen-rust (265 KiB) in 71ms
  1532. 25.60 s Progress: 0 of 1 built, 595 of 675 downloaded from cache (15 downloading)
  1533. 25.60 s Downloading cached publicsuffix-list-0-unstable-2026-05 from https://cache.nix-ci.com
  1534. 25.60 s Downloaded cached cargo-package-winnow (1.3 MiB) in 101ms
  1535. 25.60 s Progress: 0 of 1 built, 596 of 675 downloaded from cache (15 downloading)
  1536. 25.60 s Downloaded cached cargo-package-winnow (1.3 MiB) in 107ms
  1537. 25.60 s Progress: 0 of 1 built, 597 of 675 downloaded from cache (14 downloading)
  1538. 25.61 s Downloaded cached cargo-package-wit-bindgen-rust-macro (59 KiB) in 78ms
  1539. 25.61 s Progress: 0 of 1 built, 598 of 675 downloaded from cache (13 downloading)
  1540. 25.61 s Downloaded cached cargo-package-windows_x86_64_msvc (5 MiB) in 128ms
  1541. 25.61 s Progress: 0 of 1 built, 599 of 675 downloaded from cache (12 downloading)
  1542. 25.62 s Downloaded cached cargo-package-zmij (95 KiB) in 39ms
  1543. 25.62 s Progress: 0 of 1 built, 600 of 675 downloaded from cache (11 downloading)
  1544. 25.63 s Downloaded cached cargo-package-xprec (141 KiB) in 60ms
  1545. 25.63 s Progress: 0 of 1 built, 601 of 675 downloaded from cache (10 downloading)
  1546. 25.63 s Downloaded cached publicsuffix-list-0-unstable-2026-05 (329 KiB) in 34ms
  1547. 25.63 s Progress: 0 of 1 built, 602 of 675 downloaded from cache (9 downloading)
  1548. 25.63 s Downloaded cached cargo-package-zerocopy-derive (973 KiB) in 62ms
  1549. 25.63 s Downloaded cached cargo-package-wyz (63 KiB) in 71ms
  1550. 25.63 s Progress: 0 of 1 built, 603 of 675 downloaded from cache (8 downloading)
  1551. 25.63 s Progress: 0 of 1 built, 604 of 675 downloaded from cache (7 downloading)
  1552. 25.64 s Downloaded cached linkLockedDeps (1128 B) in 47ms
  1553. 25.64 s Progress: 0 of 1 built, 605 of 675 downloaded from cache (6 downloading)
  1554. 25.64 s Downloaded cached libunistring (2 MiB) in 54ms
  1555. 25.64 s Progress: 0 of 1 built, 606 of 675 downloaded from cache (5 downloading)
  1556. 25.64 s Downloading cached libidn2 from https://cache.nix-ci.com
  1557. 25.64 s Downloaded cached cargo-package-xpct (654 KiB) in 77ms
  1558. 25.64 s Progress: 0 of 1 built, 607 of 675 downloaded from cache (5 downloading)
  1559. 25.65 s Downloaded cached cargo-package-zerocopy (1.7 MiB) in 83ms
  1560. 25.65 s Progress: 0 of 1 built, 608 of 675 downloaded from cache (4 downloading)
  1561. 25.66 s Downloaded cached cargo-package-wit-parser (948 KiB) in 106ms
  1562. 25.66 s Progress: 0 of 1 built, 609 of 675 downloaded from cache (3 downloading)
  1563. 25.66 s Downloaded cached libidn2 (359 KiB) in 24ms
  1564. 25.66 s Progress: 0 of 1 built, 610 of 675 downloaded from cache (2 downloading)
  1565. 25.66 s Downloading cached glibc-2.42 from https://cache.nix-ci.com
  1566. 25.67 s Downloaded cached cargo-package-wit-component (1.6 MiB) in 125ms
  1567. 25.67 s Progress: 0 of 1 built, 611 of 675 downloaded from cache (2 downloading)
  1568. 25.84 s Downloaded cached cargo-package-windows (117.3 MiB) in 650ms
  1569. 25.84 s Progress: 0 of 1 built, 612 of 675 downloaded from cache (1 downloading)
  1570. 25.85 s Downloading cached vendor-registry from https://cache.nix-ci.com
  1571. 25.88 s Downloaded cached vendor-registry (162 KiB) in 34ms
  1572. 25.88 s Progress: 0 of 1 built, 613 of 675 downloaded from cache (1 downloading)
  1573. 25.88 s Downloading cached vendor-cargo-deps from https://cache.nix-ci.com
  1574. 25.88 s Downloaded cached vendor-cargo-deps (1752 B) in 2ms
  1575. 25.88 s Progress: 0 of 1 built, 614 of 675 downloaded from cache (1 downloading)
  1576. 25.99 s Downloaded cached glibc-2.42 (33.5 MiB) in 327ms
  1577. 25.99 s Progress: 0 of 1 built, 615 of 675 downloaded from cache
  1578. 25.99 s Downloading cached attr from https://cache.nix-ci.com
  1579. 25.99 s Downloading cached aws-c-common from https://cache.nix-ci.com
  1580. 25.99 s Downloading cached bash from https://cache.nix-ci.com
  1581. 25.99 s Downloading cached brotli-1.2.0-lib from https://cache.nix-ci.com
  1582. 25.99 s Downloading cached bzip2 from https://cache.nix-ci.com
  1583. 25.99 s Downloading cached editline-1.17.1-unstable-2025-05 from https://cache.nix-ci.com
  1584. 25.99 s Downloading cached gcc-15.2.0-lib from https://cache.nix-ci.com
  1585. 25.99 s Downloading cached hwloc-2.14.0-lib from https://cache.nix-ci.com
  1586. 25.99 s Downloading cached keyutils-1.6.3-lib from https://cache.nix-ci.com
  1587. 25.99 s Downloading cached libcpuid from https://cache.nix-ci.com
  1588. 25.99 s Downloading cached libpsl from https://cache.nix-ci.com
  1589. 25.99 s Downloading cached libsodium-1.0.22-unstable-2026-04 from https://cache.nix-ci.com
  1590. 25.99 s Downloading cached libxml2 from https://cache.nix-ci.com
  1591. 25.99 s Downloading cached llhttp from https://cache.nix-ci.com
  1592. 25.99 s Downloading cached lowdown-3.0.1-lib from https://cache.nix-ci.com
  1593. 25.99 s Downloading cached libseccomp-2.6.0-lib from https://cache.nix-ci.com
  1594. 26.02 s Downloaded cached bzip2 (86 KiB) in 25ms
  1595. 26.02 s Progress: 0 of 1 built, 616 of 675 downloaded from cache (15 downloading)
  1596. 26.02 s Downloading cached nghttp2-1.69.0-lib from https://cache.nix-ci.com
  1597. 26.02 s Downloaded cached llhttp (89 KiB) in 25ms
  1598. 26.02 s Progress: 0 of 1 built, 617 of 675 downloaded from cache (15 downloading)
  1599. 26.02 s Downloading cached nghttp3 from https://cache.nix-ci.com
  1600. 26.02 s Downloaded cached libpsl (114 KiB) in 26ms
  1601. 26.02 s Downloaded cached libseccomp-2.6.0-lib (193 KiB) in 26ms
  1602. 26.02 s Progress: 0 of 1 built, 618 of 675 downloaded from cache (15 downloading)
  1603. 26.02 s Downloading cached openssl from https://cache.nix-ci.com
  1604. 26.02 s Progress: 0 of 1 built, 619 of 675 downloaded from cache (15 downloading)
  1605. 26.02 s Downloading cached pcre2 from https://cache.nix-ci.com
  1606. 26.02 s Downloaded cached libsodium-1.0.22-unstable-2026-04 (666 KiB) in 29ms
  1607. 26.02 s Progress: 0 of 1 built, 620 of 675 downloaded from cache (15 downloading)
  1608. 26.02 s Downloading cached xz from https://cache.nix-ci.com
  1609. 26.02 s Downloaded cached aws-c-common (1.1 MiB) in 33ms
  1610. 26.02 s Progress: 0 of 1 built, 621 of 675 downloaded from cache (15 downloading)
  1611. 26.02 s Downloading cached zlib from https://cache.nix-ci.com
  1612. 26.03 s Downloaded cached libcpuid (326 KiB) in 34ms
  1613. 26.03 s Progress: 0 of 1 built, 622 of 675 downloaded from cache (15 downloading)
  1614. 26.03 s Downloading cached aws-c-compression from https://cache.nix-ci.com
  1615. 26.03 s Downloaded cached attr (90 KiB) in 37ms
  1616. 26.03 s Progress: 0 of 1 built, 623 of 675 downloaded from cache (15 downloading)
  1617. 26.03 s Downloading cached aws-c-sdkutils from https://cache.nix-ci.com
  1618. 26.03 s Downloaded cached bash (1.8 MiB) in 42ms
  1619. 26.03 s Progress: 0 of 1 built, 624 of 675 downloaded from cache (15 downloading)
  1620. 26.03 s Downloading cached acl from https://cache.nix-ci.com
  1621. 26.03 s Downloaded cached keyutils-1.6.3-lib (41 KiB) in 43ms
  1622. 26.03 s Progress: 0 of 1 built, 625 of 675 downloaded from cache (15 downloading)
  1623. 26.03 s Downloading cached aws-checksums from https://cache.nix-ci.com
  1624. 26.03 s Downloaded cached editline-1.17.1-unstable-2025-05 (58 KiB) in 44ms
  1625. 26.03 s Progress: 0 of 1 built, 626 of 675 downloaded from cache (15 downloading)
  1626. 26.04 s Downloaded cached lowdown-3.0.1-lib (341 KiB) in 49ms
  1627. 26.04 s Progress: 0 of 1 built, 627 of 675 downloaded from cache (14 downloading)
  1628. 26.04 s Downloaded cached hwloc-2.14.0-lib (459 KiB) in 50ms
  1629. 26.04 s Progress: 0 of 1 built, 628 of 675 downloaded from cache (13 downloading)
  1630. 26.04 s Downloaded cached libxml2 (1.4 MiB) in 52ms
  1631. 26.04 s Progress: 0 of 1 built, 629 of 675 downloaded from cache (12 downloading)
  1632. 26.05 s Downloaded cached brotli-1.2.0-lib (961 KiB) in 55ms
  1633. 26.05 s Progress: 0 of 1 built, 630 of 675 downloaded from cache (11 downloading)
  1634. 26.05 s Downloaded cached nghttp3 (228 KiB) in 29ms
  1635. 26.05 s Progress: 0 of 1 built, 631 of 675 downloaded from cache (10 downloading)
  1636. 26.05 s Downloaded cached nghttp2-1.69.0-lib (225 KiB) in 31ms
  1637. 26.05 s Progress: 0 of 1 built, 632 of 675 downloaded from cache (9 downloading)
  1638. 26.06 s Downloaded cached aws-c-compression (31 KiB) in 33ms
  1639. 26.06 s Downloaded cached zlib (129 KiB) in 35ms
  1640. 26.06 s Progress: 0 of 1 built, 633 of 675 downloaded from cache (8 downloading)
  1641. 26.06 s Progress: 0 of 1 built, 634 of 675 downloaded from cache (7 downloading)
  1642. 26.06 s Downloading cached sqlite from https://cache.nix-ci.com
  1643. 26.06 s Downloaded cached aws-c-sdkutils (155 KiB) in 34ms
  1644. 26.06 s Progress: 0 of 1 built, 635 of 675 downloaded from cache (7 downloading)
  1645. 26.07 s Downloaded cached xz (837 KiB) in 46ms
  1646. 26.07 s Progress: 0 of 1 built, 636 of 675 downloaded from cache (6 downloading)
  1647. 26.07 s Downloaded cached aws-checksums (86 KiB) in 33ms
  1648. 26.07 s Progress: 0 of 1 built, 637 of 675 downloaded from cache (5 downloading)
  1649. 26.07 s Downloaded cached acl (125 KiB) in 34ms
  1650. 26.07 s Progress: 0 of 1 built, 638 of 675 downloaded from cache (4 downloading)
  1651. 26.07 s Downloaded cached pcre2 (2 MiB) in 51ms
  1652. 26.07 s Progress: 0 of 1 built, 639 of 675 downloaded from cache (3 downloading)
  1653. 26.08 s Downloaded cached openssl (8.9 MiB) in 65ms
  1654. 26.08 s Progress: 0 of 1 built, 640 of 675 downloaded from cache (2 downloading)
  1655. 26.08 s Downloading cached aws-c-cal from https://cache.nix-ci.com
  1656. 26.08 s Downloading cached krb5-1.22.2-lib from https://cache.nix-ci.com
  1657. 26.08 s Downloading cached libssh2 from https://cache.nix-ci.com
  1658. 26.08 s Downloading cached ngtcp2 from https://cache.nix-ci.com
  1659. 26.08 s Downloading cached s2n-tls from https://cache.nix-ci.com
  1660. 26.11 s Downloaded cached aws-c-cal (158 KiB) in 22ms
  1661. 26.11 s Progress: 0 of 1 built, 641 of 675 downloaded from cache (6 downloading)
  1662. 26.11 s Downloaded cached libssh2 (330 KiB) in 22ms
  1663. 26.11 s Progress: 0 of 1 built, 642 of 675 downloaded from cache (5 downloading)
  1664. 26.11 s Downloading cached libgit2-1.9.4-lib from https://cache.nix-ci.com
  1665. 26.11 s Downloaded cached ngtcp2 (515 KiB) in 24ms
  1666. 26.11 s Progress: 0 of 1 built, 643 of 675 downloaded from cache (5 downloading)
  1667. 26.11 s Downloaded cached sqlite (5.7 MiB) in 48ms
  1668. 26.11 s Progress: 0 of 1 built, 644 of 675 downloaded from cache (4 downloading)
  1669. 26.12 s Downloaded cached gcc-15.2.0-lib (9.8 MiB) in 126ms
  1670. 26.12 s Progress: 0 of 1 built, 645 of 675 downloaded from cache (3 downloading)
  1671. 26.12 s Downloading cached boehm-gc from https://cache.nix-ci.com
  1672. 26.12 s Downloading cached gammaloop-workspace-deps-deps from https://cache.nix-ci.com
  1673. 26.12 s Downloading cached icu4c from https://cache.nix-ci.com
  1674. 26.12 s Downloading cached onetbb from https://cache.nix-ci.com
  1675. 26.12 s Downloading cached zstd from https://cache.nix-ci.com
  1676. 26.12 s Downloaded cached s2n-tls (1.3 MiB) in 35ms
  1677. 26.12 s Progress: 0 of 1 built, 646 of 675 downloaded from cache (7 downloading)
  1678. 26.12 s Downloading cached aws-c-io from https://cache.nix-ci.com
  1679. 26.12 s Downloaded cached krb5-1.22.2-lib (2.7 MiB) in 37ms
  1680. 26.12 s Progress: 0 of 1 built, 647 of 675 downloaded from cache (7 downloading)
  1681. 26.13 s Downloaded cached libgit2-1.9.4-lib (1.6 MiB) in 20ms
  1682. 26.13 s Progress: 0 of 1 built, 648 of 675 downloaded from cache (6 downloading)
  1683. 26.13 s Downloaded cached boehm-gc (312 KiB) in 15ms
  1684. 26.13 s Progress: 0 of 1 built, 649 of 675 downloaded from cache (5 downloading)
  1685. 26.14 s Downloaded cached zstd (1.1 MiB) in 23ms
  1686. 26.14 s Downloaded cached onetbb (626 KiB) in 23ms
  1687. 26.14 s Progress: 0 of 1 built, 650 of 675 downloaded from cache (4 downloading)
  1688. 26.14 s Downloading cached curl from https://cache.nix-ci.com
  1689. 26.14 s Downloading cached libarchive-3.8.8-lib from https://cache.nix-ci.com
  1690. 26.14 s Progress: 0 of 1 built, 651 of 675 downloaded from cache (5 downloading)
  1691. 26.14 s Downloading cached libblake3 from https://cache.nix-ci.com
  1692. 26.15 s Downloaded cached aws-c-io (648 KiB) in 31ms
  1693. 26.15 s Progress: 0 of 1 built, 652 of 675 downloaded from cache (5 downloading)
  1694. 26.15 s Downloading cached aws-c-event-stream from https://cache.nix-ci.com
  1695. 26.15 s Downloading cached aws-c-http from https://cache.nix-ci.com
  1696. 26.18 s Downloaded cached libblake3 (117 KiB) in 33ms
  1697. 26.18 s Progress: 0 of 1 built, 653 of 675 downloaded from cache (6 downloading)
  1698. 26.19 s Downloaded cached aws-c-event-stream (176 KiB) in 37ms
  1699. 26.19 s Progress: 0 of 1 built, 654 of 675 downloaded from cache (5 downloading)
  1700. 26.19 s Downloaded cached curl (1.2 MiB) in 50ms
  1701. 26.19 s Progress: 0 of 1 built, 655 of 675 downloaded from cache (4 downloading)
  1702. 26.19 s Downloaded cached libarchive-3.8.8-lib (953 KiB) in 50ms
  1703. 26.19 s Progress: 0 of 1 built, 656 of 675 downloaded from cache (3 downloading)
  1704. 26.19 s Downloaded cached aws-c-http (641 KiB) in 43ms
  1705. 26.19 s Progress: 0 of 1 built, 657 of 675 downloaded from cache (2 downloading)
  1706. 26.20 s Downloading cached aws-c-mqtt from https://cache.nix-ci.com
  1707. 26.20 s Downloading cached aws-c-auth from https://cache.nix-ci.com
  1708. 26.24 s Downloaded cached aws-c-mqtt (557 KiB) in 46ms
  1709. 26.24 s Progress: 0 of 1 built, 658 of 675 downloaded from cache (3 downloading)
  1710. 26.24 s Downloaded cached aws-c-auth (387 KiB) in 47ms
  1711. 26.24 s Progress: 0 of 1 built, 659 of 675 downloaded from cache (2 downloading)
  1712. 26.24 s Downloading cached aws-c-s3 from https://cache.nix-ci.com
  1713. 26.28 s Downloaded cached aws-c-s3 (384 KiB) in 37ms
  1714. 26.28 s Progress: 0 of 1 built, 660 of 675 downloaded from cache (2 downloading)
  1715. 26.28 s Downloading cached aws-crt-cpp from https://cache.nix-ci.com
  1716. 26.28 s Downloaded cached icu4c (38.2 MiB) in 165ms
  1717. 26.28 s Progress: 0 of 1 built, 661 of 675 downloaded from cache (2 downloading)
  1718. 26.28 s Downloading cached boost from https://cache.nix-ci.com
  1719. 26.29 s Downloaded cached aws-crt-cpp (979 KiB) in 13ms
  1720. 26.83 s Progress: 0 of 1 built, 662 of 675 downloaded from cache (2 downloading)
  1721. 26.86 s Downloaded cached boost (14.5 MiB) in 580ms
  1722. 26.86 s Progress: 0 of 1 built, 663 of 675 downloaded from cache (1 downloading)
  1723. 26.86 s Downloading cached nix-util from https://cache.nix-ci.com
  1724. 26.87 s Downloaded cached nix-util (2.4 MiB) in 5ms
  1725. 26.87 s Progress: 0 of 1 built, 664 of 675 downloaded from cache (1 downloading)
  1726. 26.87 s Downloading cached nix-nswrapper from https://cache.nix-ci.com
  1727. 26.87 s Downloading cached nix-store from https://cache.nix-ci.com
  1728. 26.87 s Downloaded cached nix-nswrapper (131 KiB) in 2ms
  1729. 26.87 s Progress: 0 of 1 built, 665 of 675 downloaded from cache (2 downloading)
  1730. 26.88 s Downloaded cached nix-store (5.8 MiB) in 12ms
  1731. 26.88 s Progress: 0 of 1 built, 666 of 675 downloaded from cache (1 downloading)
  1732. 26.88 s Downloading cached nix-fetchers from https://cache.nix-ci.com
  1733. 26.88 s Downloading cached nix-main from https://cache.nix-ci.com
  1734. 26.89 s Downloaded cached nix-main (393 KiB) in 5ms
  1735. 26.89 s Progress: 0 of 1 built, 667 of 675 downloaded from cache (2 downloading)
  1736. 26.89 s Downloaded cached nix-fetchers (1.5 MiB) in 5ms
  1737. 26.89 s Progress: 0 of 1 built, 668 of 675 downloaded from cache (1 downloading)
  1738. 26.89 s Downloading cached nix-expr from https://cache.nix-ci.com
  1739. 26.90 s Downloaded cached nix-expr (3.3 MiB) in 8ms
  1740. 26.90 s Progress: 0 of 1 built, 669 of 675 downloaded from cache (1 downloading)
  1741. 26.90 s Downloading cached nix-flake from https://cache.nix-ci.com
  1742. 26.90 s Downloaded cached nix-flake (956 KiB) in 3ms
  1743. 26.90 s Progress: 0 of 1 built, 670 of 675 downloaded from cache (1 downloading)
  1744. 26.90 s Downloading cached nix-cmd from https://cache.nix-ci.com
  1745. 26.90 s Downloaded cached nix-cmd (1 MiB) in 4ms
  1746. 26.90 s Progress: 0 of 1 built, 671 of 675 downloaded from cache (1 downloading)
  1747. 26.90 s Downloading cached nix from https://cache.nix-ci.com
  1748. 26.91 s Downloaded cached nix (3.9 MiB) in 9ms
  1749. 26.91 s Progress: 0 of 1 built, 672 of 675 downloaded from cache (1 downloading)
  1750. 26.91 s Downloading cached nix from https://cache.nix-ci.com
  1751. 26.92 s Downloaded cached nix (8848 B) in 1ms
  1752. 26.92 s Progress: 0 of 1 built, 673 of 675 downloaded from cache (1 downloading)
  1753. 28.92 s Downloaded cached gammaloop-workspace-deps-deps (354.1 MiB) in 2.8s
  1754. 28.92 s Progress: 0 of 1 built, 674 of 675 downloaded from cache
  1755. 28.92 s Downloading cached nix-ci-check-gammaloop-doctest from https://cache.nix-ci.com
  1756. 28.93 s Downloaded cached nix-ci-check-gammaloop-doctest (1000 B) in 3ms
  1757. 28.93 s Progress: 0 of 1 built, 675 of 675 downloaded from cache
  1758. 34.91 s evaluating derivation 'g copying '/nix/store/xi5g evaluating derivation 'g querying gammaloop-works [0.0 KiB DL] querying in [28.3/27.6 KiB DL] query [0/6 built, 54.7 KiB DL] [0/25 built, 16/12/73 co [0/23 built, 16/23/73 co [0/21 built, 16/34/73 co [0/20 built, 16/43/73 co [0/17 built, 12/54/73 co [0/12 built, 7/61/73 cop [0/12 built, 7/62/73 cop [0/12 built, 7/63/73 cop [0/12 built, 6/64/73 cop [0/11 built, 5/65/73 cop [0/10 built, 4/66/73 cop [0/9 built, 3/67/73 copi [0/8 built, 2/68/73 copi [0/6 built, 1/71/73 copi [0/5 built, 1/72/73 copi [1/0/5 built, 1/72/73 co [2/0/4 built, 73 copied rust-stable-with-std (post)> Uploading to the NixCI cache: /nix/store/imnwv6nazijihjlgf2h3l1qm63m7l9wk-rust-stable-with-std-2026-07-09
  1759. 34.94 s rust-stable-with-std (post)> warning: 'warn-short-path-literals' is deprecated, use 'lint-short-path-literals = ignore' instead
  1760. 34.97 s rust-stable-with-std (post)> copying 0 paths...
  1761. 35.01 s rust-stable-with-std (post)> warning: 'warn-short-path-literals' is deprecated, use 'lint-short-path-literals = ignore' instead
  1762. 36.20 s rust-stable-with-std (post)> copying 0 paths...
  1763. 36.36 s [1/1/5 built, 73 copied clippy-stable-with-std (post)> Uploading to the NixCI cache: /nix/store/r4bjy93lvnfma1awpi480n2mz3af0adx-clippy-stable-with-std-2026-07-09
  1764. 36.40 s clippy-stable-with-std (post)> warning: 'warn-short-path-literals' is deprecated, use 'lint-short-path-literals = ignore' instead
  1765. 36.42 s clippy-stable-with-std (post)> copying 0 paths...
  1766. 36.46 s clippy-stable-with-std (post)> warning: 'warn-short-path-literals' is deprecated, use 'lint-short-path-literals = ignore' instead
  1767. 36.50 s clippy-stable-with-std (post)> copying 0 paths...
  1768. 36.58 s [1/2/4 built, 73 copied rust-stable-with-components> /nix/store/imnwv6nazijihjlgf2h3l1qm63m7l9wk-rust-stable-with-std-2026-07-09/lib:
  1769. 36.58 s rust-stable-with-components> librustc_driver-a39fc8bf9e61dbb9.so: Keeping existing link to /nix/store/r4bjy93lvnfma1awpi480n2mz3af0adx-clippy-stable-with-std-2026-07-09/lib/librustc_driver-a39fc8bf9e61dbb9.so
  1770. 36.58 s rust-stable-with-components> /nix/store/imnwv6nazijihjlgf2h3l1qm63m7l9wk-rust-stable-with-std-2026-07-09/bin:
  1771. 36.58 s rust-stable-with-components> rust-lldb: Keeping existing link to /nix/store/r4bjy93lvnfma1awpi480n2mz3af0adx-clippy-stable-with-std-2026-07-09/bin/rust-lldb
  1772. 36.58 s rust-stable-with-components> rust-gdbgui: Keeping existing link to /nix/store/r4bjy93lvnfma1awpi480n2mz3af0adx-clippy-stable-with-std-2026-07-09/bin/rust-gdbgui
  1773. 36.58 s rust-stable-with-components> rustc: Keeping existing link to /nix/store/r4bjy93lvnfma1awpi480n2mz3af0adx-clippy-stable-with-std-2026-07-09/bin/rustc
  1774. 36.58 s rust-stable-with-components> rustdoc: Keeping existing link to /nix/store/r4bjy93lvnfma1awpi480n2mz3af0adx-clippy-stable-with-std-2026-07-09/bin/rustdoc
  1775. 36.58 s rust-stable-with-components> rust-gdb: Keeping existing link to /nix/store/r4bjy93lvnfma1awpi480n2mz3af0adx-clippy-stable-with-std-2026-07-09/bin/rust-gdb
  1776. 37.11 s rust-stable-with-components (post)> Uploading to the NixCI cache: /nix/store/9pb4ikjdw4gp766ayxl6gg3b7hqm6ds4-rust-stable-with-components-2026-07-09
  1777. 37.15 s rust-stable-with-components (post)> warning: 'warn-short-path-literals' is deprecated, use 'lint-short-path-literals = ignore' instead
  1778. 37.18 s rust-stable-with-components (post)> copying 0 paths...
  1779. 37.22 s rust-stable-with-components (post)> warning: 'warn-short-path-literals' is deprecated, use 'lint-short-path-literals = ignore' instead
  1780. 37.27 s rust-stable-with-components (post)> copying 0 paths...
  1781. 37.46 s [3/5 built, 73 copied (1 [1/3/4 built, 73 copied gammaloop-workspace-doctest> Running phase: unpackPhase
  1782. 37.46 s gammaloop-workspace-doctest> unpacking source archive /nix/store/j2ncg4pj99fhx17lqnr4ncczqgxk2q5z-source
  1783. 37.59 s gammaloop-workspace-doctest> source root is source
  1784. 37.61 s gammaloop-workspace-doctest> Running phase: patchPhase
  1785. 37.61 s gammaloop-workspace-doctest> Executing configureCargoCommonVars
  1786. 37.61 s gammaloop-workspace-doctest> decompressing cargo artifacts from /nix/store/8rkh7d3hq722l839568nhnwihnsx041a-gammaloop-workspace-deps-deps-0.1.0/target.tar.zst to target
  1787. 39.14 s gammaloop-workspace-doctest> Running phase: updateAutotoolsGnuConfigScriptsPhase
  1788. 39.65 s gammaloop-workspace-doctest> Running phase: configurePhase
  1789. 39.65 s gammaloop-workspace-doctest> will append /build/source/.cargo-home/config.toml with contents of /nix/store/xdy1vvhll2bijdplvl9fcc2b9plkxhaa-vendor-cargo-deps/config.toml
  1790. 39.65 s gammaloop-workspace-doctest> default configurePhase, nothing to do
  1791. 39.65 s gammaloop-workspace-doctest> Running phase: buildPhase
  1792. 39.66 s gammaloop-workspace-doctest> +++ command cargo --version
  1793. 39.66 s gammaloop-workspace-doctest> cargo 1.97.0 (c980f4866 2026-06-30)
  1794. 39.69 s gammaloop-workspace-doctest> +++ command cargo test --profile ci-optim --doc --locked --workspace --features gammaloop-api/cli,gammaloop-tracing-filter/clap,gammaloop-tracing-filter/symbolica,idenso/bincode,idenso/reference-cases,linnet/bincode,linnet/drawing,linnet/nodestore-vec,linnet/rkyv,linnet/serde,linnet/symbolica,spenso-macros/shadowing,spenso/shadowing,symbolica/tracing_max_level_info
  1795. 40.02 s gammaloop-workspace-doctest> Compiling target-lexicon v0.13.5
  1796. 40.04 s gammaloop-workspace-doctest> Compiling symbolica v2.2.0 (https://github.com/symbolica-dev/symbolica?branch=dev#0441bd7a)
  1797. 40.04 s gammaloop-workspace-doctest> Compiling maplit v1.0.2
  1798. 40.04 s gammaloop-workspace-doctest> Compiling gammaloop-tracing-filter-macros v0.1.0 (/build/source/crates/gammaloop-tracing-filter-macros)
  1799. 40.04 s gammaloop-workspace-doctest> Compiling vakint v0.1.2 (/build/source/crates/vakint)
  1800. 40.05 s gammaloop-workspace-doctest> Compiling gammalooprs v0.3.4 (/build/source/crates/gammalooprs)
  1801. 40.05 s gammaloop-workspace-doctest> Compiling alphal00p-docs-macros v0.1.0 (/build/source/crates/alphal00p-docs-macros)
  1802. 40.05 s gammaloop-workspace-doctest> Compiling alphal00p-docs-schema v0.1.0 (/build/source/crates/alphal00p-docs-schema)
  1803. 40.05 s gammaloop-workspace-doctest> Compiling rustc_version v0.4.1
  1804. 40.06 s gammaloop-workspace-doctest> Compiling bincode v1.3.3
  1805. 40.07 s gammaloop-workspace-doctest> Compiling gungraun-runner v0.18.2
  1806. 40.07 s gammaloop-workspace-doctest> Compiling iai-callgrind-runner v0.14.2
  1807. 40.07 s gammaloop-workspace-doctest> Compiling target-triple v1.0.1
  1808. 40.08 s gammaloop-workspace-doctest> Compiling gammaloop-integration-tests v0.1.0 (/build/source/tests)
  1809. 40.08 s gammaloop-workspace-doctest> Compiling test-log-core v0.2.20
  1810. 40.23 s gammaloop-workspace-doctest> Compiling wait-timeout v0.2.1
  1811. 40.26 s gammaloop-workspace-doctest> Compiling bit-vec v0.8.0
  1812. 40.27 s gammaloop-workspace-doctest> Compiling quick-error v1.2.3
  1813. 40.28 s gammaloop-workspace-doctest> Compiling iai-callgrind v0.14.2
  1814. 40.36 s gammaloop-workspace-doctest> Compiling rusty-fork v0.3.1
  1815. 40.45 s gammaloop-workspace-doctest> Compiling bit-set v0.8.0
  1816. 40.46 s gammaloop-workspace-doctest> Compiling iai-callgrind-macros v0.5.1
  1817. 40.46 s gammaloop-workspace-doctest> Compiling rand_xorshift v0.4.0
  1818. 40.48 s gammaloop-workspace-doctest> Compiling console v0.15.11
  1819. 40.55 s gammaloop-workspace-doctest> Compiling base64 v0.21.7
  1820. 40.57 s gammaloop-workspace-doctest> Compiling unarray v0.1.4
  1821. 40.59 s gammaloop-workspace-doctest> Compiling glob v0.3.4
  1822. 40.61 s gammaloop-workspace-doctest> Compiling termcolor v1.4.1
  1823. 40.64 s gammaloop-workspace-doctest> Compiling gungraun-macros v0.8.0
  1824. 40.78 s gammaloop-workspace-doctest> Compiling trybuild v1.0.120
  1825. 40.96 s gammaloop-workspace-doctest> Compiling alphal00p-docs-builder v0.1.0 (/build/source/crates/alphal00p-docs-builder)
  1826. 40.97 s gammaloop-workspace-doctest> Compiling ron v0.8.1
  1827. 41.06 s gammaloop-workspace-doctest> Compiling alphal00p-docs-catalogs v0.1.0 (/build/source/crates/alphal00p-docs-catalogs)
  1828. 41.14 s gammaloop-workspace-doctest> Compiling similar-asserts v1.7.0
  1829. 41.21 s gammaloop-workspace-doctest> Compiling pyo3-build-config v0.28.3
  1830. 41.25 s gammaloop-workspace-doctest> Compiling proptest v1.11.0
  1831. 41.36 s gammaloop-workspace-doctest> Compiling kurvst v0.1.0 (/build/source/crates/kurvst)
  1832. 41.60 s gammaloop-workspace-doctest> Compiling test-log-macros v0.2.20
  1833. 43.14 s gammaloop-workspace-doctest> Compiling test-log v0.2.20
  1834. 43.38 s gammaloop-workspace-doctest> Compiling alphal00p-docs-examples v0.1.0 (/build/source/crates/alphal00p-docs-examples)
  1835. 44.73 s gammaloop-workspace-doctest> Compiling pyo3-macros-backend v0.28.3
  1836. 44.79 s gammaloop-workspace-doctest> Compiling pyo3-ffi v0.28.3
  1837. 44.94 s gammaloop-workspace-doctest> Compiling pyo3 v0.28.3
  1838. 45.17 s gammaloop-workspace-doctest> Compiling numpy v0.28.0
  1839. 45.23 s gammaloop-workspace-doctest> Compiling gammaloop-api v0.1.0 (/build/source/crates/gammaloop-api)
  1840. 45.35 s gammaloop-workspace-doctest> Compiling gungraun v0.18.2
  1841. 50.00 s gammaloop-workspace-doctest> Compiling pyo3-macros v0.28.3
  1842. 54.59 s gammaloop-workspace-doctest> Compiling pyo3-stub-gen v0.17.2
  1843. 55.20 s gammaloop-workspace-doctest> Compiling numerica v2.2.0 (https://github.com/symbolica-dev/symbolica?branch=dev#0441bd7a)
  1844. 57.20 s gammaloop-workspace-doctest> Compiling graphica v2.1.0 (https://github.com/symbolica-dev/symbolica?branch=dev#0441bd7a)
  1845. 58.83 s gammaloop-workspace-doctest> Compiling symbolica-utils v0.1.0 (/build/source/crates/symbolica-utils)
  1846. 235.73 s gammaloop-workspace-doctest> Compiling gammaloop-workspace-hack v0.1.0 (/build/source/crates/gammaloop-workspace-hack)
  1847. 238.33 s gammaloop-workspace-doctest> Compiling spenso-macros v0.3.2 (/build/source/crates/spenso-macros)
  1848. 238.33 s gammaloop-workspace-doctest> Compiling linnet v0.17.0 (/build/source/crates/linnet)
  1849. 238.97 s gammaloop-workspace-doctest> Compiling spenso v0.6.0 (/build/source/crates/spenso)
  1850. 246.85 s gammaloop-workspace-doctest> Compiling idenso v0.3.0 (/build/source/crates/idenso)
  1851. 246.86 s gammaloop-workspace-doctest> Compiling gammaloop-tracing-filter v0.1.0 (/build/source/crates/gammaloop-tracing-filter)
  1852. 251.34 s gammaloop-workspace-doctest> Compiling spenso-hep-lib v0.1.7 (/build/source/crates/spenso-hep-lib)
  1853. 251.56 s gammaloop-workspace-doctest> Compiling spynso3 v0.1.2 (/build/source/crates/spynso3)
  1854. 290.53 s gammaloop-workspace-doctest> Compiling linnest v0.1.0 (/build/source/crates/linnest)
  1855. 290.55 s gammaloop-workspace-doctest> Compiling linnet-py v0.1.0 (/build/source/crates/linnet-py)
  1856. 450.68 s gammaloop-workspace-doctest> Finished `ci-optim` profile [optimized] target(s) in 6m 50s
  1857. 450.79 s gammaloop-workspace-doctest> warning: the following packages contain code that will be rejected by a future version of Rust: proc-macro-error2 v2.0.1
  1858. 450.79 s gammaloop-workspace-doctest> note: to see what the problems were, use the option `--future-incompat-report`, or run `cargo report future-incompatibilities --id 1`
  1859. 450.82 s gammaloop-workspace-doctest> Doc-tests alphal00p_docs_builder
  1860. 450.97 s gammaloop-workspace-doctest>
  1861. 450.97 s gammaloop-workspace-doctest> running 0 tests
  1862. 450.97 s gammaloop-workspace-doctest>
  1863. 450.97 s gammaloop-workspace-doctest> test result: ok. 0 passed; 0 failed; 0 ignored; 0 measured; 0 filtered out; finished in 0.00s
  1864. 450.97 s gammaloop-workspace-doctest>
  1865. 450.97 s gammaloop-workspace-doctest> Doc-tests alphal00p_docs_catalogs
  1866. 452.19 s gammaloop-workspace-doctest>
  1867. 452.19 s gammaloop-workspace-doctest> running 0 tests
  1868. 452.19 s gammaloop-workspace-doctest>
  1869. 452.19 s gammaloop-workspace-doctest> test result: ok. 0 passed; 0 failed; 0 ignored; 0 measured; 0 filtered out; finished in 0.00s
  1870. 452.19 s gammaloop-workspace-doctest>
  1871. 452.19 s gammaloop-workspace-doctest> Doc-tests alphal00p_docs_examples
  1872. 452.21 s gammaloop-workspace-doctest>
  1873. 452.21 s gammaloop-workspace-doctest> running 0 tests
  1874. 452.21 s gammaloop-workspace-doctest>
  1875. 452.21 s gammaloop-workspace-doctest> test result: ok. 0 passed; 0 failed; 0 ignored; 0 measured; 0 filtered out; finished in 0.00s
  1876. 452.21 s gammaloop-workspace-doctest>
  1877. 452.21 s gammaloop-workspace-doctest> Doc-tests alphal00p_docs
  1878. 452.26 s gammaloop-workspace-doctest>
  1879. 452.26 s gammaloop-workspace-doctest> running 0 tests
  1880. 452.26 s gammaloop-workspace-doctest>
  1881. 452.26 s gammaloop-workspace-doctest> test result: ok. 0 passed; 0 failed; 0 ignored; 0 measured; 0 filtered out; finished in 0.00s
  1882. 452.26 s gammaloop-workspace-doctest>
  1883. 452.26 s gammaloop-workspace-doctest> Doc-tests alphal00p_docs_schema
  1884. 452.34 s gammaloop-workspace-doctest>
  1885. 452.34 s gammaloop-workspace-doctest> running 0 tests
  1886. 452.34 s gammaloop-workspace-doctest>
  1887. 452.34 s gammaloop-workspace-doctest> test result: ok. 0 passed; 0 failed; 0 ignored; 0 measured; 0 filtered out; finished in 0.00s
  1888. 452.34 s gammaloop-workspace-doctest>
  1889. 452.34 s gammaloop-workspace-doctest> Doc-tests gammaloop_api
  1890. 453.27 s gammaloop-workspace-doctest>
  1891. 453.27 s gammaloop-workspace-doctest> running 16 tests
  1892. 453.29 s gammaloop-workspace-doctest> test crates/gammaloop-api/src/python.rs - python::GammaLoopAPI::get_default_runtime_settings (line 3796) ... FAILED
  1893. 453.29 s gammaloop-workspace-doctest> test crates/gammaloop-api/src/python.rs - python::GammaLoopAPI::get_active_command_blocks (line 3760) ... FAILED
  1894. 453.29 s gammaloop-workspace-doctest> test crates/gammaloop-api/src/python.rs - python::GammaLoopAPI::evaluate_samples (line 3108) ... FAILED
  1895. 453.29 s gammaloop-workspace-doctest> test crates/gammaloop-api/src/python.rs - python::PyHistogramAccumulator (line 871) ... FAILED
  1896. 453.29 s gammaloop-workspace-doctest> test crates/gammaloop-api/src/python.rs - python::GammaLoopAPI::evaluate_sample (line 2967) ... FAILED
  1897. 453.29 s gammaloop-workspace-doctest> test crates/gammaloop-api/src/python.rs - python::GammaLoopAPI::get_integrand_settings (line 3647) ... FAILED
  1898. 453.29 s gammaloop-workspace-doctest> test crates/gammaloop-api/src/python.rs - python::GammaLoopAPI::get_integrand_info (line 3585) ... FAILED
  1899. 453.34 s gammaloop-workspace-doctest> test crates/gammaloop-api/src/lib.rs - (line 18) - compile ... ok
  1900. 453.37 s gammaloop-workspace-doctest> test crates/gammaloop-api/src/python.rs - python::GammaLoopAPI::run_command (line 3901) ... FAILED
  1901. 453.38 s gammaloop-workspace-doctest> test crates/gammaloop-api/src/python.rs - python::GammaLoopAPI::get_global_settings (line 3739) ... FAILED
  1902. 453.39 s gammaloop-workspace-doctest> test crates/gammaloop-api/src/python.rs - python::evaluate_graph_overall_factor (line 95) ... FAILED
  1903. 453.39 s gammaloop-workspace-doctest> test crates/gammaloop-api/src/python.rs - python::atom_to_canonical_string (line 128) ... FAILED
  1904. 453.40 s gammaloop-workspace-doctest> test crates/gammaloop-api/src/python.rs - python::GammaLoopAPI::get_run_history (line 3711) ... FAILED
  1905. 453.40 s gammaloop-workspace-doctest> test crates/gammaloop-api/src/python.rs - python::atom_to_dots (line 157) ... FAILED
  1906. 453.42 s gammaloop-workspace-doctest> test crates/gammaloop-api/src/python.rs - python::GammaLoopAPI::new_python (line 2834) ... FAILED
  1907. 455.94 s gammaloop-workspace-doctest> test crates/gammaloop-api/src/commands/evaluate_samples.rs - commands::evaluate_samples::EvaluateSamples (line 50) ... ok
  1908. 455.97 s gammaloop-workspace-doctest>
  1909. 455.97 s gammaloop-workspace-doctest> failures:
  1910. 455.97 s gammaloop-workspace-doctest>
  1911. 455.97 s gammaloop-workspace-doctest> ---- crates/gammaloop-api/src/python.rs - python::GammaLoopAPI::get_default_runtime_settings (line 3796) stdout ----
  1912. 455.97 s gammaloop-workspace-doctest> error: expected one of `!` or `::`, found `=`
  1913. 455.97 s gammaloop-workspace-doctest> --> crates/gammaloop-api/src/python.rs:3797:9
  1914. 455.97 s gammaloop-workspace-doctest> |
  1915. 455.97 s gammaloop-workspace-doctest> 3797 | runtime = api.get_default_runtime_settings()
  1916. 455.97 s gammaloop-workspace-doctest> | ^ expected one of `!` or `::`
  1917. 455.97 s gammaloop-workspace-doctest>
  1918. 455.97 s gammaloop-workspace-doctest> error: aborting due to 1 previous error
  1919. 455.97 s gammaloop-workspace-doctest>
  1920. 455.97 s gammaloop-workspace-doctest> Couldn't compile the test.
  1921. 455.97 s gammaloop-workspace-doctest> ---- crates/gammaloop-api/src/python.rs - python::GammaLoopAPI::get_active_command_blocks (line 3760) stdout ----
  1922. 455.97 s gammaloop-workspace-doctest> error: expected item, found keyword `for`
  1923. 455.97 s gammaloop-workspace-doctest> --> crates/gammaloop-api/src/python.rs:3761:1
  1924. 455.97 s gammaloop-workspace-doctest> |
  1925. 455.97 s gammaloop-workspace-doctest> 3761 | for name, commands in api.get_active_command_blocks().items():
  1926. 455.97 s gammaloop-workspace-doctest> | ^^^ expected item
  1927. 455.97 s gammaloop-workspace-doctest> |
  1928. 455.97 s gammaloop-workspace-doctest> = note: for a full list of items that can appear in modules, see <https://doc.rust-lang.org/reference/items.html>
  1929. 455.97 s gammaloop-workspace-doctest>
  1930. 455.97 s gammaloop-workspace-doctest> error: aborting due to 1 previous error
  1931. 455.97 s gammaloop-workspace-doctest>
  1932. 455.97 s gammaloop-workspace-doctest> Couldn't compile the test.
  1933. 455.97 s gammaloop-workspace-doctest> ---- crates/gammaloop-api/src/python.rs - python::GammaLoopAPI::evaluate_samples (line 3108) stdout ----
  1934. 455.97 s gammaloop-workspace-doctest> error: expected one of `!` or `::`, found `pathlib`
  1935. 455.97 s gammaloop-workspace-doctest> --> crates/gammaloop-api/src/python.rs:3109:6
  1936. 455.97 s gammaloop-workspace-doctest> |
  1937. 455.97 s gammaloop-workspace-doctest> 3109 | from pathlib import Path
  1938. 455.97 s gammaloop-workspace-doctest> | ^^^^^^^ expected one of `!` or `::`
  1939. 455.97 s gammaloop-workspace-doctest>
  1940. 455.97 s gammaloop-workspace-doctest> error: aborting due to 1 previous error
  1941. 455.97 s gammaloop-workspace-doctest>
  1942. 455.97 s gammaloop-workspace-doctest> Couldn't compile the test.
  1943. 455.97 s gammaloop-workspace-doctest> ---- crates/gammaloop-api/src/python.rs - python::PyHistogramAccumulator (line 871) stdout ----
  1944. 455.97 s gammaloop-workspace-doctest> error: expected one of `!` or `::`, found `gammaloop`
  1945. 455.97 s gammaloop-workspace-doctest> --> crates/gammaloop-api/src/python.rs:872:6
  1946. 455.97 s gammaloop-workspace-doctest> |
  1947. 455.97 s gammaloop-workspace-doctest> 872 | from gammaloop import HistogramAccumulator
  1948. 455.97 s gammaloop-workspace-doctest> | ^^^^^^^^^ expected one of `!` or `::`
  1949. 455.97 s gammaloop-workspace-doctest>
  1950. 455.97 s gammaloop-workspace-doctest> error: aborting due to 1 previous error
  1951. 455.97 s gammaloop-workspace-doctest>
  1952. 455.97 s gammaloop-workspace-doctest> Couldn't compile the test.
  1953. 455.97 s gammaloop-workspace-doctest> ---- crates/gammaloop-api/src/python.rs - python::GammaLoopAPI::evaluate_sample (line 2967) stdout ----
  1954. 455.97 s gammaloop-workspace-doctest> error: expected one of `!` or `::`, found `pathlib`
  1955. 455.97 s gammaloop-workspace-doctest> --> crates/gammaloop-api/src/python.rs:2968:6
  1956. 455.97 s gammaloop-workspace-doctest> |
  1957. 455.97 s gammaloop-workspace-doctest> 2968 | from pathlib import Path
  1958. 455.97 s gammaloop-workspace-doctest> | ^^^^^^^ expected one of `!` or `::`
  1959. 455.97 s gammaloop-workspace-doctest>
  1960. 455.97 s gammaloop-workspace-doctest> error: aborting due to 1 previous error
  1961. 455.97 s gammaloop-workspace-doctest>
  1962. 455.97 s gammaloop-workspace-doctest> Couldn't compile the test.
  1963. 455.97 s gammaloop-workspace-doctest> ---- crates/gammaloop-api/src/python.rs - python::GammaLoopAPI::get_integrand_settings (line 3647) stdout ----
  1964. 455.97 s gammaloop-workspace-doctest> error: expected one of `!` or `::`, found `=`
  1965. 455.97 s gammaloop-workspace-doctest> --> crates/gammaloop-api/src/python.rs:3648:10
  1966. 455.97 s gammaloop-workspace-doctest> |
  1967. 455.97 s gammaloop-workspace-doctest> 3648 | settings = api.get_integrand_settings(process_id=0)
  1968. 455.97 s gammaloop-workspace-doctest> | ^ expected one of `!` or `::`
  1969. 455.97 s gammaloop-workspace-doctest>
  1970. 455.97 s gammaloop-workspace-doctest> error: aborting due to 1 previous error
  1971. 455.97 s gammaloop-workspace-doctest>
  1972. 455.97 s gammaloop-workspace-doctest> Couldn't compile the test.
  1973. 455.97 s gammaloop-workspace-doctest> ---- crates/gammaloop-api/src/python.rs - python::GammaLoopAPI::get_integrand_info (line 3585) stdout ----
  1974. 455.97 s gammaloop-workspace-doctest> error: expected one of `!` or `::`, found `pathlib`
  1975. 455.97 s gammaloop-workspace-doctest> --> crates/gammaloop-api/src/python.rs:3586:6
  1976. 455.97 s gammaloop-workspace-doctest> |
  1977. 455.97 s gammaloop-workspace-doctest> 3586 | from pathlib import Path
  1978. 455.97 s gammaloop-workspace-doctest> | ^^^^^^^ expected one of `!` or `::`
  1979. 455.97 s gammaloop-workspace-doctest>
  1980. 455.97 s gammaloop-workspace-doctest> error: aborting due to 1 previous error
  1981. 455.97 s gammaloop-workspace-doctest>
  1982. 455.97 s gammaloop-workspace-doctest> Couldn't compile the test.
  1983. 455.97 s gammaloop-workspace-doctest> ---- crates/gammaloop-api/src/python.rs - python::GammaLoopAPI::run_command (line 3901) stdout ----
  1984. 455.97 s gammaloop-workspace-doctest> error[E0425]: cannot find value `api` in this scope
  1985. 455.97 s gammaloop-workspace-doctest> --> crates/gammaloop-api/src/python.rs:3902:1
  1986. 455.97 s gammaloop-workspace-doctest> |
  1987. 455.97 s gammaloop-workspace-doctest> 3902 | api.run("display processes")
  1988. 455.97 s gammaloop-workspace-doctest> | ^^^ not found in this scope
  1989. 455.97 s gammaloop-workspace-doctest>
  1990. 455.97 s gammaloop-workspace-doctest> error: aborting due to 1 previous error
  1991. 455.97 s gammaloop-workspace-doctest>
  1992. 455.97 s gammaloop-workspace-doctest> For more information about this error, try `rustc --explain E0425`.
  1993. 455.97 s gammaloop-workspace-doctest> Couldn't compile the test.
  1994. 455.97 s gammaloop-workspace-doctest> ---- crates/gammaloop-api/src/python.rs - python::GammaLoopAPI::get_global_settings (line 3739) stdout ----
  1995. 455.97 s gammaloop-workspace-doctest> error[E0425]: cannot find value `settings_toml` in this scope
  1996. 455.97 s gammaloop-workspace-doctest> --> crates/gammaloop-api/src/python.rs:3740:1
  1997. 455.97 s gammaloop-workspace-doctest> |
  1998. 455.97 s gammaloop-workspace-doctest> 3740 | settings_toml = api.get_global_settings()
  1999. 455.97 s gammaloop-workspace-doctest> | ^^^^^^^^^^^^^
  2000. 455.97 s gammaloop-workspace-doctest> |
  2001. 455.97 s gammaloop-workspace-doctest> help: you might have meant to introduce a new binding
  2002. 455.97 s gammaloop-workspace-doctest> |
  2003. 455.97 s gammaloop-workspace-doctest> 3740 | let settings_toml = api.get_global_settings()
  2004. 455.97 s gammaloop-workspace-doctest> | +++
  2005. 455.97 s gammaloop-workspace-doctest>
  2006. 455.97 s gammaloop-workspace-doctest> error[E0425]: cannot find value `api` in this scope
  2007. 455.97 s gammaloop-workspace-doctest> --> crates/gammaloop-api/src/python.rs:3740:17
  2008. 455.97 s gammaloop-workspace-doctest> |
  2009. 455.97 s gammaloop-workspace-doctest> 3740 | settings_toml = api.get_global_settings()
  2010. 455.97 s gammaloop-workspace-doctest> | ^^^ not found in this scope
  2011. 455.97 s gammaloop-workspace-doctest>
  2012. 455.97 s gammaloop-workspace-doctest> error: aborting due to 2 previous errors
  2013. 455.97 s gammaloop-workspace-doctest>
  2014. 455.97 s gammaloop-workspace-doctest> For more information about this error, try `rustc --explain E0425`.
  2015. 455.97 s gammaloop-workspace-doctest> Couldn't compile the test.
  2016. 455.97 s gammaloop-workspace-doctest> ---- crates/gammaloop-api/src/python.rs - python::evaluate_graph_overall_factor (line 95) stdout ----
  2017. 455.97 s gammaloop-workspace-doctest> error[E0425]: cannot find function `evaluate_graph_overall_factor` in this scope
  2018. 455.97 s gammaloop-workspace-doctest> --> crates/gammaloop-api/src/python.rs:96:1
  2019. 455.97 s gammaloop-workspace-doctest> |
  2020. 455.97 s gammaloop-workspace-doctest> 96 | evaluate_graph_overall_factor(
  2021. 455.97 s gammaloop-workspace-doctest> | ^^^^^^^^^^^^^^^^^^^^^^^^^^^^^ not found in this scope
  2022. 455.97 s gammaloop-workspace-doctest>
  2023. 455.97 s gammaloop-workspace-doctest> error: aborting due to 1 previous error
  2024. 455.97 s gammaloop-workspace-doctest>
  2025. 455.97 s gammaloop-workspace-doctest> For more information about this error, try `rustc --explain E0425`.
  2026. 455.97 s gammaloop-workspace-doctest> Couldn't compile the test.
  2027. 455.97 s gammaloop-workspace-doctest> ---- crates/gammaloop-api/src/python.rs - python::atom_to_canonical_string (line 128) stdout ----
  2028. 455.97 s gammaloop-workspace-doctest> error[E0425]: cannot find function `atom_to_canonical_string` in this scope
  2029. 455.97 s gammaloop-workspace-doctest> --> crates/gammaloop-api/src/python.rs:129:1
  2030. 455.97 s gammaloop-workspace-doctest> |
  2031. 455.97 s gammaloop-workspace-doctest> 129 | atom_to_canonical_string("x + x")
  2032. 455.97 s gammaloop-workspace-doctest> | ^^^^^^^^^^^^^^^^^^^^^^^^ not found in this scope
  2033. 455.97 s gammaloop-workspace-doctest>
  2034. 455.97 s gammaloop-workspace-doctest> error: aborting due to 1 previous error
  2035. 455.97 s gammaloop-workspace-doctest>
  2036. 455.97 s gammaloop-workspace-doctest> For more information about this error, try `rustc --explain E0425`.
  2037. 455.97 s gammaloop-workspace-doctest> Couldn't compile the test.
  2038. 455.97 s gammaloop-workspace-doctest> ---- crates/gammaloop-api/src/python.rs - python::GammaLoopAPI::get_run_history (line 3711) stdout ----
  2039. 455.97 s gammaloop-workspace-doctest> error[E0425]: cannot find value `run_card_toml` in this scope
  2040. 455.97 s gammaloop-workspace-doctest> --> crates/gammaloop-api/src/python.rs:3712:1
  2041. 455.97 s gammaloop-workspace-doctest> |
  2042. 455.97 s gammaloop-workspace-doctest> 3712 | run_card_toml = api.get_run_history()
  2043. 455.97 s gammaloop-workspace-doctest> | ^^^^^^^^^^^^^
  2044. 455.97 s gammaloop-workspace-doctest> |
  2045. 455.97 s gammaloop-workspace-doctest> help: you might have meant to introduce a new binding
  2046. 455.97 s gammaloop-workspace-doctest> |
  2047. 455.97 s gammaloop-workspace-doctest> 3712 | let run_card_toml = api.get_run_history()
  2048. 455.97 s gammaloop-workspace-doctest> | +++
  2049. 455.97 s gammaloop-workspace-doctest>
  2050. 455.97 s gammaloop-workspace-doctest> error[E0425]: cannot find value `api` in this scope
  2051. 455.97 s gammaloop-workspace-doctest> --> crates/gammaloop-api/src/python.rs:3712:17
  2052. 455.97 s gammaloop-workspace-doctest> |
  2053. 455.97 s gammaloop-workspace-doctest> 3712 | run_card_toml = api.get_run_history()
  2054. 455.97 s gammaloop-workspace-doctest> | ^^^ not found in this scope
  2055. 455.97 s gammaloop-workspace-doctest>
  2056. 455.97 s gammaloop-workspace-doctest> error: aborting due to 2 previous errors
  2057. 455.97 s gammaloop-workspace-doctest>
  2058. 455.97 s gammaloop-workspace-doctest> For more information about this error, try `rustc --explain E0425`.
  2059. 455.97 s gammaloop-workspace-doctest> Couldn't compile the test.
  2060. 455.97 s gammaloop-workspace-doctest> ---- crates/gammaloop-api/src/python.rs - python::atom_to_dots (line 157) stdout ----
  2061. 455.97 s gammaloop-workspace-doctest> error[E0425]: cannot find function `to_dots` in this scope
  2062. 455.97 s gammaloop-workspace-doctest> --> crates/gammaloop-api/src/python.rs:158:1
  2063. 455.97 s gammaloop-workspace-doctest> |
  2064. 455.97 s gammaloop-workspace-doctest> 158 | to_dots("p(mu) * q(mu)")
  2065. 455.97 s gammaloop-workspace-doctest> | ^^^^^^^ not found in this scope
  2066. 455.97 s gammaloop-workspace-doctest>
  2067. 455.97 s gammaloop-workspace-doctest> error: aborting due to 1 previous error
  2068. 455.97 s gammaloop-workspace-doctest>
  2069. 455.97 s gammaloop-workspace-doctest> For more information about this error, try `rustc --explain E0425`.
  2070. 455.97 s gammaloop-workspace-doctest> Couldn't compile the test.
  2071. 455.97 s gammaloop-workspace-doctest> ---- crates/gammaloop-api/src/python.rs - python::GammaLoopAPI::new_python (line 2834) stdout ----
  2072. 455.97 s gammaloop-workspace-doctest> error[E0425]: cannot find value `api` in this scope
  2073. 455.97 s gammaloop-workspace-doctest> --> crates/gammaloop-api/src/python.rs:2835:1
  2074. 455.97 s gammaloop-workspace-doctest> |
  2075. 455.97 s gammaloop-workspace-doctest> 2835 | api = GammaLoopAPI(state_folder="./state", read_only_state=True)
  2076. 455.97 s gammaloop-workspace-doctest> | ^^^
  2077. 455.97 s gammaloop-workspace-doctest> |
  2078. 455.97 s gammaloop-workspace-doctest> help: you might have meant to introduce a new binding
  2079. 455.97 s gammaloop-workspace-doctest> |
  2080. 455.97 s gammaloop-workspace-doctest> 2835 | let api = GammaLoopAPI(state_folder="./state", read_only_state=True)
  2081. 455.97 s gammaloop-workspace-doctest> | +++
  2082. 455.97 s gammaloop-workspace-doctest>
  2083. 455.97 s gammaloop-workspace-doctest> error[E0425]: cannot find value `state_folder` in this scope
  2084. 455.97 s gammaloop-workspace-doctest> --> crates/gammaloop-api/src/python.rs:2835:20
  2085. 455.97 s gammaloop-workspace-doctest> |
  2086. 455.97 s gammaloop-workspace-doctest> 2835 | api = GammaLoopAPI(state_folder="./state", read_only_state=True)
  2087. 455.97 s gammaloop-workspace-doctest> | ^^^^^^^^^^^^ not found in this scope
  2088. 455.97 s gammaloop-workspace-doctest>
  2089. 455.97 s gammaloop-workspace-doctest> error[E0425]: cannot find value `read_only_state` in this scope
  2090. 455.97 s gammaloop-workspace-doctest> --> crates/gammaloop-api/src/python.rs:2835:44
  2091. 455.97 s gammaloop-workspace-doctest> |
  2092. 455.97 s gammaloop-workspace-doctest> 2835 | api = GammaLoopAPI(state_folder="./state", read_only_state=True)
  2093. 455.97 s gammaloop-workspace-doctest> | ^^^^^^^^^^^^^^^ not found in this scope
  2094. 455.97 s gammaloop-workspace-doctest>
  2095. 455.97 s gammaloop-workspace-doctest> error[E0425]: cannot find value `True` in this scope
  2096. 455.97 s gammaloop-workspace-doctest> --> crates/gammaloop-api/src/python.rs:2835:60
  2097. 455.97 s gammaloop-workspace-doctest> |
  2098. 455.97 s gammaloop-workspace-doctest> 2835 | api = GammaLoopAPI(state_folder="./state", read_only_state=True)
  2099. 455.97 s gammaloop-workspace-doctest> | ^^^^ not found in this scope
  2100. 455.97 s gammaloop-workspace-doctest> |
  2101. 455.97 s gammaloop-workspace-doctest> help: you may want to use a bool value instead
  2102. 455.97 s gammaloop-workspace-doctest> |
  2103. 455.97 s gammaloop-workspace-doctest> 2835 - api = GammaLoopAPI(state_folder="./state", read_only_state=True)
  2104. 455.97 s gammaloop-workspace-doctest> 2835 + api = GammaLoopAPI(state_folder="./state", read_only_state=true)
  2105. 455.97 s gammaloop-workspace-doctest> |
  2106. 455.97 s gammaloop-workspace-doctest>
  2107. 455.97 s gammaloop-workspace-doctest> error[E0425]: cannot find function, tuple struct or tuple variant `GammaLoopAPI` in this scope
  2108. 455.97 s gammaloop-workspace-doctest> --> crates/gammaloop-api/src/python.rs:2835:7
  2109. 455.97 s gammaloop-workspace-doctest> |
  2110. 455.97 s gammaloop-workspace-doctest> 2835 | api = GammaLoopAPI(state_folder="./state", read_only_state=True)
  2111. 455.97 s gammaloop-workspace-doctest> | ^^^^^^^^^^^^ not found in this scope
  2112. 455.97 s gammaloop-workspace-doctest>
  2113. 455.97 s gammaloop-workspace-doctest> error: aborting due to 5 previous errors
  2114. 455.97 s gammaloop-workspace-doctest>
  2115. 455.97 s gammaloop-workspace-doctest> For more information about this error, try `rustc --explain E0425`.
  2116. 455.97 s gammaloop-workspace-doctest> Couldn't compile the test.
  2117. 455.97 s gammaloop-workspace-doctest>
  2118. 455.97 s gammaloop-workspace-doctest> failures:
  2119. 455.97 s gammaloop-workspace-doctest> crates/gammaloop-api/src/python.rs - python::GammaLoopAPI::evaluate_sample (line 2967)
  2120. 455.97 s gammaloop-workspace-doctest> crates/gammaloop-api/src/python.rs - python::GammaLoopAPI::evaluate_samples (line 3108)
  2121. 455.97 s gammaloop-workspace-doctest> crates/gammaloop-api/src/python.rs - python::GammaLoopAPI::get_active_command_blocks (line 3760)
  2122. 455.97 s gammaloop-workspace-doctest> crates/gammaloop-api/src/python.rs - python::GammaLoopAPI::get_default_runtime_settings (line 3796)
  2123. 455.97 s gammaloop-workspace-doctest> crates/gammaloop-api/src/python.rs - python::GammaLoopAPI::get_global_settings (line 3739)
  2124. 455.97 s gammaloop-workspace-doctest> crates/gammaloop-api/src/python.rs - python::GammaLoopAPI::get_integrand_info (line 3585)
  2125. 455.97 s gammaloop-workspace-doctest> crates/gammaloop-api/src/python.rs - python::GammaLoopAPI::get_integrand_settings (line 3647)
  2126. 455.97 s gammaloop-workspace-doctest> crates/gammaloop-api/src/python.rs - python::GammaLoopAPI::get_run_history (line 3711)
  2127. 455.97 s gammaloop-workspace-doctest> crates/gammaloop-api/src/python.rs - python::GammaLoopAPI::new_python (line 2834)
  2128. 455.97 s gammaloop-workspace-doctest> crates/gammaloop-api/src/python.rs - python::GammaLoopAPI::run_command (line 3901)
  2129. 455.97 s gammaloop-workspace-doctest> crates/gammaloop-api/src/python.rs - python::PyHistogramAccumulator (line 871)
  2130. 455.97 s gammaloop-workspace-doctest> crates/gammaloop-api/src/python.rs - python::atom_to_canonical_string (line 128)
  2131. 455.97 s gammaloop-workspace-doctest> crates/gammaloop-api/src/python.rs - python::atom_to_dots (line 157)
  2132. 455.97 s gammaloop-workspace-doctest> crates/gammaloop-api/src/python.rs - python::evaluate_graph_overall_factor (line 95)
  2133. 455.97 s gammaloop-workspace-doctest>
  2134. 455.97 s gammaloop-workspace-doctest> test result: FAILED. 2 passed; 14 failed; 0 ignored; 0 measured; 0 filtered out; finished in 2.67s
  2135. 455.97 s gammaloop-workspace-doctest>
  2136. 455.97 s gammaloop-workspace-doctest> error: doctest failed, to rerun pass `-p gammaloop-api --doc`
  2137. 456.42 s error: Cannot build '/nix/store/q3rgbccmd61xgar5zy984yip45msxdh7-gammaloop-workspace-doctest-0.1.0.drv'.
  2138. 456.42 s Reason: builder failed with exit code 101.
  2139. 456.42 s Output paths:
  2140. 456.42 s /nix/store/kgprf5k2zpbrmlyzcfkch5hhbjn62g3v-gammaloop-workspace-doctest-0.1.0
  2141. 456.42 s Last 356 log lines:
  2142. 456.42 s > Running phase: unpackPhase
  2143. 456.42 s > unpacking source archive /nix/store/j2ncg4pj99fhx17lqnr4ncczqgxk2q5z-source
  2144. 456.42 s > source root is source
  2145. 456.42 s > Running phase: patchPhase
  2146. 456.42 s > Executing configureCargoCommonVars
  2147. 456.42 s > decompressing cargo artifacts from /nix/store/8rkh7d3hq722l839568nhnwihnsx041a-gammaloop-workspace-deps-deps-0.1.0/target.tar.zst to target
  2148. 456.42 s > Running phase: updateAutotoolsGnuConfigScriptsPhase
  2149. 456.42 s > Running phase: configurePhase
  2150. 456.42 s > will append /build/source/.cargo-home/config.toml with contents of /nix/store/xdy1vvhll2bijdplvl9fcc2b9plkxhaa-vendor-cargo-deps/config.toml
  2151. 456.42 s > default configurePhase, nothing to do
  2152. 456.42 s > Running phase: buildPhase
  2153. 456.42 s > +++ command cargo --version
  2154. 456.42 s > cargo 1.97.0 (c980f4866 2026-06-30)
  2155. 456.42 s > +++ command cargo test --profile ci-optim --doc --locked --workspace --features gammaloop-api/cli,gammaloop-tracing-filter/clap,gammaloop-tracing-filter/symbolica,idenso/bincode,idenso/reference-cases,linnet/bincode,linnet/drawing,linnet/nodestore-vec,linnet/rkyv,linnet/serde,linnet/symbolica,spenso-macros/shadowing,spenso/shadowing,symbolica/tracing_max_level_info
  2156. 456.42 s > Compiling target-lexicon v0.13.5
  2157. 456.42 s > Compiling symbolica v2.2.0 (https://github.com/symbolica-dev/symbolica?branch=dev#0441bd7a)
  2158. 456.42 s > Compiling maplit v1.0.2
  2159. 456.42 s > Compiling gammaloop-tracing-filter-macros v0.1.0 (/build/source/crates/gammaloop-tracing-filter-macros)
  2160. 456.42 s > Compiling vakint v0.1.2 (/build/source/crates/vakint)
  2161. 456.42 s > Compiling gammalooprs v0.3.4 (/build/source/crates/gammalooprs)
  2162. 456.42 s > Compiling alphal00p-docs-macros v0.1.0 (/build/source/crates/alphal00p-docs-macros)
  2163. 456.42 s > Compiling alphal00p-docs-schema v0.1.0 (/build/source/crates/alphal00p-docs-schema)
  2164. 456.42 s > Compiling rustc_version v0.4.1
  2165. 456.42 s > Compiling bincode v1.3.3
  2166. 456.42 s > Compiling gungraun-runner v0.18.2
  2167. 456.42 s > Compiling iai-callgrind-runner v0.14.2
  2168. 456.42 s > Compiling target-triple v1.0.1
  2169. 456.42 s > Compiling gammaloop-integration-tests v0.1.0 (/build/source/tests)
  2170. 456.42 s > Compiling test-log-core v0.2.20
  2171. 456.42 s > Compiling wait-timeout v0.2.1
  2172. 456.42 s > Compiling bit-vec v0.8.0
  2173. 456.42 s > Compiling quick-error v1.2.3
  2174. 456.42 s > Compiling iai-callgrind v0.14.2
  2175. 456.42 s > Compiling rusty-fork v0.3.1
  2176. 456.42 s > Compiling bit-set v0.8.0
  2177. 456.42 s > Compiling iai-callgrind-macros v0.5.1
  2178. 456.42 s > Compiling rand_xorshift v0.4.0
  2179. 456.42 s > Compiling console v0.15.11
  2180. 456.42 s > Compiling base64 v0.21.7
  2181. 456.42 s > Compiling unarray v0.1.4
  2182. 456.42 s > Compiling glob v0.3.4
  2183. 456.42 s > Compiling termcolor v1.4.1
  2184. 456.42 s > Compiling gungraun-macros v0.8.0
  2185. 456.42 s > Compiling trybuild v1.0.120
  2186. 456.42 s > Compiling alphal00p-docs-builder v0.1.0 (/build/source/crates/alphal00p-docs-builder)
  2187. 456.42 s > Compiling ron v0.8.1
  2188. 456.42 s > Compiling alphal00p-docs-catalogs v0.1.0 (/build/source/crates/alphal00p-docs-catalogs)
  2189. 456.42 s > Compiling similar-asserts v1.7.0
  2190. 456.42 s > Compiling pyo3-build-config v0.28.3
  2191. 456.42 s > Compiling proptest v1.11.0
  2192. 456.42 s > Compiling kurvst v0.1.0 (/build/source/crates/kurvst)
  2193. 456.42 s > Compiling test-log-macros v0.2.20
  2194. 456.42 s > Compiling test-log v0.2.20
  2195. 456.42 s > Compiling alphal00p-docs-examples v0.1.0 (/build/source/crates/alphal00p-docs-examples)
  2196. 456.42 s > Compiling pyo3-macros-backend v0.28.3
  2197. 456.42 s > Compiling pyo3-ffi v0.28.3
  2198. 456.42 s > Compiling pyo3 v0.28.3
  2199. 456.42 s > Compiling numpy v0.28.0
  2200. 456.42 s > Compiling gammaloop-api v0.1.0 (/build/source/crates/gammaloop-api)
  2201. 456.42 s > Compiling gungraun v0.18.2
  2202. 456.42 s > Compiling pyo3-macros v0.28.3
  2203. 456.42 s > Compiling pyo3-stub-gen v0.17.2
  2204. 456.42 s > Compiling numerica v2.2.0 (https://github.com/symbolica-dev/symbolica?branch=dev#0441bd7a)
  2205. 456.42 s > Compiling graphica v2.1.0 (https://github.com/symbolica-dev/symbolica?branch=dev#0441bd7a)
  2206. 456.42 s > Compiling symbolica-utils v0.1.0 (/build/source/crates/symbolica-utils)
  2207. 456.42 s > Compiling gammaloop-workspace-hack v0.1.0 (/build/source/crates/gammaloop-workspace-hack)
  2208. 456.42 s > Compiling spenso-macros v0.3.2 (/build/source/crates/spenso-macros)
  2209. 456.42 s > Compiling linnet v0.17.0 (/build/source/crates/linnet)
  2210. 456.42 s > Compiling spenso v0.6.0 (/build/source/crates/spenso)
  2211. 456.42 s > Compiling idenso v0.3.0 (/build/source/crates/idenso)
  2212. 456.42 s > Compiling gammaloop-tracing-filter v0.1.0 (/build/source/crates/gammaloop-tracing-filter)
  2213. 456.42 s > Compiling spenso-hep-lib v0.1.7 (/build/source/crates/spenso-hep-lib)
  2214. 456.42 s > Compiling spynso3 v0.1.2 (/build/source/crates/spynso3)
  2215. 456.42 s > Compiling linnest v0.1.0 (/build/source/crates/linnest)
  2216. 456.42 s > Compiling linnet-py v0.1.0 (/build/source/crates/linnet-py)
  2217. 456.42 s > Finished `ci-optim` profile [optimized] target(s) in 6m 50s
  2218. 456.42 s > warning: the following packages contain code that will be rejected by a future version of Rust: proc-macro-error2 v2.0.1
  2219. 456.42 s > note: to see what the problems were, use the option `--future-incompat-report`, or run `cargo report future-incompatibilities --id 1`
  2220. 456.42 s > Doc-tests alphal00p_docs_builder
  2221. 456.42 s >
  2222. 456.42 s > running 0 tests
  2223. 456.42 s >
  2224. 456.42 s > test result: ok. 0 passed; 0 failed; 0 ignored; 0 measured; 0 filtered out; finished in 0.00s
  2225. 456.42 s >
  2226. 456.42 s > Doc-tests alphal00p_docs_catalogs
  2227. 456.42 s >
  2228. 456.42 s > running 0 tests
  2229. 456.42 s >
  2230. 456.42 s > test result: ok. 0 passed; 0 failed; 0 ignored; 0 measured; 0 filtered out; finished in 0.00s
  2231. 456.42 s >
  2232. 456.42 s > Doc-tests alphal00p_docs_examples
  2233. 456.42 s >
  2234. 456.42 s > running 0 tests
  2235. 456.42 s >
  2236. 456.42 s > test result: ok. 0 passed; 0 failed; 0 ignored; 0 measured; 0 filtered out; finished in 0.00s
  2237. 456.42 s >
  2238. 456.42 s > Doc-tests alphal00p_docs
  2239. 456.42 s >
  2240. 456.42 s > running 0 tests
  2241. 456.42 s >
  2242. 456.42 s > test result: ok. 0 passed; 0 failed; 0 ignored; 0 measured; 0 filtered out; finished in 0.00s
  2243. 456.42 s >
  2244. 456.42 s > Doc-tests alphal00p_docs_schema
  2245. 456.42 s >
  2246. 456.42 s > running 0 tests
  2247. 456.42 s >
  2248. 456.42 s > test result: ok. 0 passed; 0 failed; 0 ignored; 0 measured; 0 filtered out; finished in 0.00s
  2249. 456.42 s >
  2250. 456.42 s > Doc-tests gammaloop_api
  2251. 456.42 s >
  2252. 456.42 s > running 16 tests
  2253. 456.42 s > test crates/gammaloop-api/src/python.rs - python::GammaLoopAPI::get_default_runtime_settings (line 3796) ... FAILED
  2254. 456.42 s > test crates/gammaloop-api/src/python.rs - python::GammaLoopAPI::get_active_command_blocks (line 3760) ... FAILED
  2255. 456.42 s > test crates/gammaloop-api/src/python.rs - python::GammaLoopAPI::evaluate_samples (line 3108) ... FAILED
  2256. 456.42 s > test crates/gammaloop-api/src/python.rs - python::PyHistogramAccumulator (line 871) ... FAILED
  2257. 456.42 s > test crates/gammaloop-api/src/python.rs - python::GammaLoopAPI::evaluate_sample (line 2967) ... FAILED
  2258. 456.42 s > test crates/gammaloop-api/src/python.rs - python::GammaLoopAPI::get_integrand_settings (line 3647) ... FAILED
  2259. 456.42 s > test crates/gammaloop-api/src/python.rs - python::GammaLoopAPI::get_integrand_info (line 3585) ... FAILED
  2260. 456.42 s > test crates/gammaloop-api/src/lib.rs - (line 18) - compile ... ok
  2261. 456.42 s > test crates/gammaloop-api/src/python.rs - python::GammaLoopAPI::run_command (line 3901) ... FAILED
  2262. 456.42 s > test crates/gammaloop-api/src/python.rs - python::GammaLoopAPI::get_global_settings (line 3739) ... FAILED
  2263. 456.42 s > test crates/gammaloop-api/src/python.rs - python::evaluate_graph_overall_factor (line 95) ... FAILED
  2264. 456.42 s > test crates/gammaloop-api/src/python.rs - python::atom_to_canonical_string (line 128) ... FAILED
  2265. 456.42 s > test crates/gammaloop-api/src/python.rs - python::GammaLoopAPI::get_run_history (line 3711) ... FAILED
  2266. 456.42 s > test crates/gammaloop-api/src/python.rs - python::atom_to_dots (line 157) ... FAILED
  2267. 456.42 s > test crates/gammaloop-api/src/python.rs - python::GammaLoopAPI::new_python (line 2834) ... FAILED
  2268. 456.42 s > test crates/gammaloop-api/src/commands/evaluate_samples.rs - commands::evaluate_samples::EvaluateSamples (line 50) ... ok
  2269. 456.42 s >
  2270. 456.42 s > failures:
  2271. 456.42 s >
  2272. 456.42 s > ---- crates/gammaloop-api/src/python.rs - python::GammaLoopAPI::get_default_runtime_settings (line 3796) stdout ----
  2273. 456.42 s > error: expected one of `!` or `::`, found `=`
  2274. 456.42 s > --> crates/gammaloop-api/src/python.rs:3797:9
  2275. 456.42 s > |
  2276. 456.42 s > 3797 | runtime = api.get_default_runtime_settings()
  2277. 456.42 s > | ^ expected one of `!` or `::`
  2278. 456.42 s >
  2279. 456.42 s > error: aborting due to 1 previous error
  2280. 456.42 s >
  2281. 456.42 s > Couldn't compile the test.
  2282. 456.42 s > ---- crates/gammaloop-api/src/python.rs - python::GammaLoopAPI::get_active_command_blocks (line 3760) stdout ----
  2283. 456.42 s > error: expected item, found keyword `for`
  2284. 456.42 s > --> crates/gammaloop-api/src/python.rs:3761:1
  2285. 456.42 s > |
  2286. 456.42 s > 3761 | for name, commands in api.get_active_command_blocks().items():
  2287. 456.42 s > | ^^^ expected item
  2288. 456.42 s > |
  2289. 456.42 s > = note: for a full list of items that can appear in modules, see <https://doc.rust-lang.org/reference/items.html>
  2290. 456.42 s >
  2291. 456.42 s > error: aborting due to 1 previous error
  2292. 456.42 s >
  2293. 456.42 s > Couldn't compile the test.
  2294. 456.42 s > ---- crates/gammaloop-api/src/python.rs - python::GammaLoopAPI::evaluate_samples (line 3108) stdout ----
  2295. 456.42 s > error: expected one of `!` or `::`, found `pathlib`
  2296. 456.42 s > --> crates/gammaloop-api/src/python.rs:3109:6
  2297. 456.42 s > |
  2298. 456.42 s > 3109 | from pathlib import Path
  2299. 456.42 s > | ^^^^^^^ expected one of `!` or `::`
  2300. 456.42 s >
  2301. 456.42 s > error: aborting due to 1 previous error
  2302. 456.42 s >
  2303. 456.42 s > Couldn't compile the test.
  2304. 456.42 s > ---- crates/gammaloop-api/src/python.rs - python::PyHistogramAccumulator (line 871) stdout ----
  2305. 456.42 s > error: expected one of `!` or `::`, found `gammaloop`
  2306. 456.42 s > --> crates/gammaloop-api/src/python.rs:872:6
  2307. 456.42 s > |
  2308. 456.42 s > 872 | from gammaloop import HistogramAccumulator
  2309. 456.42 s > | ^^^^^^^^^ expected one of `!` or `::`
  2310. 456.42 s >
  2311. 456.42 s > error: aborting due to 1 previous error
  2312. 456.42 s >
  2313. 456.42 s > Couldn't compile the test.
  2314. 456.42 s > ---- crates/gammaloop-api/src/python.rs - python::GammaLoopAPI::evaluate_sample (line 2967) stdout ----
  2315. 456.42 s > error: expected one of `!` or `::`, found `pathlib`
  2316. 456.42 s > --> crates/gammaloop-api/src/python.rs:2968:6
  2317. 456.42 s > |
  2318. 456.42 s > 2968 | from pathlib import Path
  2319. 456.42 s > | ^^^^^^^ expected one of `!` or `::`
  2320. 456.42 s >
  2321. 456.42 s > error: aborting due to 1 previous error
  2322. 456.42 s >
  2323. 456.42 s > Couldn't compile the test.
  2324. 456.42 s > ---- crates/gammaloop-api/src/python.rs - python::GammaLoopAPI::get_integrand_settings (line 3647) stdout ----
  2325. 456.42 s > error: expected one of `!` or `::`, found `=`
  2326. 456.42 s > --> crates/gammaloop-api/src/python.rs:3648:10
  2327. 456.42 s > |
  2328. 456.42 s > 3648 | settings = api.get_integrand_settings(process_id=0)
  2329. 456.42 s > | ^ expected one of `!` or `::`
  2330. 456.42 s >
  2331. 456.42 s > error: aborting due to 1 previous error
  2332. 456.42 s >
  2333. 456.42 s > Couldn't compile the test.
  2334. 456.42 s > ---- crates/gammaloop-api/src/python.rs - python::GammaLoopAPI::get_integrand_info (line 3585) stdout ----
  2335. 456.42 s > error: expected one of `!` or `::`, found `pathlib`
  2336. 456.42 s > --> crates/gammaloop-api/src/python.rs:3586:6
  2337. 456.42 s > |
  2338. 456.42 s > 3586 | from pathlib import Path
  2339. 456.42 s > | ^^^^^^^ expected one of `!` or `::`
  2340. 456.42 s >
  2341. 456.42 s > error: aborting due to 1 previous error
  2342. 456.42 s >
  2343. 456.42 s > Couldn't compile the test.
  2344. 456.42 s > ---- crates/gammaloop-api/src/python.rs - python::GammaLoopAPI::run_command (line 3901) stdout ----
  2345. 456.42 s > error[E0425]: cannot find value `api` in this scope
  2346. 456.42 s > --> crates/gammaloop-api/src/python.rs:3902:1
  2347. 456.42 s > |
  2348. 456.42 s > 3902 | api.run("display processes")
  2349. 456.42 s > | ^^^ not found in this scope
  2350. 456.42 s >
  2351. 456.42 s > error: aborting due to 1 previous error
  2352. 456.42 s >
  2353. 456.42 s > For more information about this error, try `rustc --explain E0425`.
  2354. 456.42 s > Couldn't compile the test.
  2355. 456.42 s > ---- crates/gammaloop-api/src/python.rs - python::GammaLoopAPI::get_global_settings (line 3739) stdout ----
  2356. 456.42 s > error[E0425]: cannot find value `settings_toml` in this scope
  2357. 456.42 s > --> crates/gammaloop-api/src/python.rs:3740:1
  2358. 456.42 s > |
  2359. 456.42 s > 3740 | settings_toml = api.get_global_settings()
  2360. 456.42 s > | ^^^^^^^^^^^^^
  2361. 456.42 s > |
  2362. 456.42 s > help: you might have meant to introduce a new binding
  2363. 456.42 s > |
  2364. 456.42 s > 3740 | let settings_toml = api.get_global_settings()
  2365. 456.42 s > | +++
  2366. 456.42 s >
  2367. 456.42 s > error[E0425]: cannot find value `api` in this scope
  2368. 456.42 s > --> crates/gammaloop-api/src/python.rs:3740:17
  2369. 456.42 s > |
  2370. 456.42 s > 3740 | settings_toml = api.get_global_settings()
  2371. 456.42 s > | ^^^ not found in this scope
  2372. 456.42 s >
  2373. 456.42 s > error: aborting due to 2 previous errors
  2374. 456.42 s >
  2375. 456.42 s > For more information about this error, try `rustc --explain E0425`.
  2376. 456.42 s > Couldn't compile the test.
  2377. 456.42 s > ---- crates/gammaloop-api/src/python.rs - python::evaluate_graph_overall_factor (line 95) stdout ----
  2378. 456.42 s > error[E0425]: cannot find function `evaluate_graph_overall_factor` in this scope
  2379. 456.42 s > --> crates/gammaloop-api/src/python.rs:96:1
  2380. 456.42 s > |
  2381. 456.42 s > 96 | evaluate_graph_overall_factor(
  2382. 456.42 s > | ^^^^^^^^^^^^^^^^^^^^^^^^^^^^^ not found in this scope
  2383. 456.42 s >
  2384. 456.42 s > error: aborting due to 1 previous error
  2385. 456.42 s >
  2386. 456.42 s > For more information about this error, try `rustc --explain E0425`.
  2387. 456.42 s > Couldn't compile the test.
  2388. 456.42 s > ---- crates/gammaloop-api/src/python.rs - python::atom_to_canonical_string (line 128) stdout ----
  2389. 456.42 s > error[E0425]: cannot find function `atom_to_canonical_string` in this scope
  2390. 456.42 s > --> crates/gammaloop-api/src/python.rs:129:1
  2391. 456.42 s > |
  2392. 456.42 s > 129 | atom_to_canonical_string("x + x")
  2393. 456.42 s > | ^^^^^^^^^^^^^^^^^^^^^^^^ not found in this scope
  2394. 456.42 s >
  2395. 456.42 s > error: aborting due to 1 previous error
  2396. 456.42 s >
  2397. 456.42 s > For more information about this error, try `rustc --explain E0425`.
  2398. 456.42 s > Couldn't compile the test.
  2399. 456.42 s > ---- crates/gammaloop-api/src/python.rs - python::GammaLoopAPI::get_run_history (line 3711) stdout ----
  2400. 456.42 s > error[E0425]: cannot find value `run_card_toml` in this scope
  2401. 456.42 s > --> crates/gammaloop-api/src/python.rs:3712:1
  2402. 456.42 s > |
  2403. 456.42 s > 3712 | run_card_toml = api.get_run_history()
  2404. 456.42 s > | ^^^^^^^^^^^^^
  2405. 456.42 s > |
  2406. 456.42 s > help: you might have meant to introduce a new binding
  2407. 456.42 s > |
  2408. 456.42 s > 3712 | let run_card_toml = api.get_run_history()
  2409. 456.42 s > | +++
  2410. 456.42 s >
  2411. 456.42 s > error[E0425]: cannot find value `api` in this scope
  2412. 456.42 s > --> crates/gammaloop-api/src/python.rs:3712:17
  2413. 456.42 s > |
  2414. 456.42 s > 3712 | run_card_toml = api.get_run_history()
  2415. 456.42 s > | ^^^ not found in this scope
  2416. 456.42 s >
  2417. 456.42 s > error: aborting due to 2 previous errors
  2418. 456.42 s >
  2419. 456.42 s > For more information about this error, try `rustc --explain E0425`.
  2420. 456.42 s > Couldn't compile the test.
  2421. 456.42 s > ---- crates/gammaloop-api/src/python.rs - python::atom_to_dots (line 157) stdout ----
  2422. 456.42 s > error[E0425]: cannot find function `to_dots` in this scope
  2423. 456.42 s > --> crates/gammaloop-api/src/python.rs:158:1
  2424. 456.42 s > |
  2425. 456.42 s > 158 | to_dots("p(mu) * q(mu)")
  2426. 456.42 s > | ^^^^^^^ not found in this scope
  2427. 456.42 s >
  2428. 456.42 s > error: aborting due to 1 previous error
  2429. 456.42 s >
  2430. 456.42 s > For more information about this error, try `rustc --explain E0425`.
  2431. 456.42 s > Couldn't compile the test.
  2432. 456.42 s > ---- crates/gammaloop-api/src/python.rs - python::GammaLoopAPI::new_python (line 2834) stdout ----
  2433. 456.42 s > error[E0425]: cannot find value `api` in this scope
  2434. 456.42 s > --> crates/gammaloop-api/src/python.rs:2835:1
  2435. 456.42 s > |
  2436. 456.42 s > 2835 | api = GammaLoopAPI(state_folder="./state", read_only_state=True)
  2437. 456.42 s > | ^^^
  2438. 456.42 s > |
  2439. 456.42 s > help: you might have meant to introduce a new binding
  2440. 456.42 s > |
  2441. 456.42 s > 2835 | let api = GammaLoopAPI(state_folder="./state", read_only_state=True)
  2442. 456.42 s > | +++
  2443. 456.42 s >
  2444. 456.42 s > error[E0425]: cannot find value `state_folder` in this scope
  2445. 456.42 s > --> crates/gammaloop-api/src/python.rs:2835:20
  2446. 456.42 s > |
  2447. 456.42 s > 2835 | api = GammaLoopAPI(state_folder="./state", read_only_state=True)
  2448. 456.42 s > | ^^^^^^^^^^^^ not found in this scope
  2449. 456.42 s >
  2450. 456.42 s > error[E0425]: cannot find value `read_only_state` in this scope
  2451. 456.42 s > --> crates/gammaloop-api/src/python.rs:2835:44
  2452. 456.42 s > |
  2453. 456.42 s > 2835 | api = GammaLoopAPI(state_folder="./state", read_only_state=True)
  2454. 456.42 s > | ^^^^^^^^^^^^^^^ not found in this scope
  2455. 456.42 s >
  2456. 456.42 s > error[E0425]: cannot find value `True` in this scope
  2457. 456.42 s > --> crates/gammaloop-api/src/python.rs:2835:60
  2458. 456.42 s > |
  2459. 456.42 s > 2835 | api = GammaLoopAPI(state_folder="./state", read_only_state=True)
  2460. 456.42 s > | ^^^^ not found in this scope
  2461. 456.42 s > |
  2462. 456.42 s > help: you may want to use a bool value instead
  2463. 456.42 s > |
  2464. 456.42 s > 2835 - api = GammaLoopAPI(state_folder="./state", read_only_state=True)
  2465. 456.42 s > 2835 + api = GammaLoopAPI(state_folder="./state", read_only_state=true)
  2466. 456.42 s > |
  2467. 456.42 s >
  2468. 456.42 s > error[E0425]: cannot find function, tuple struct or tuple variant `GammaLoopAPI` in this scope
  2469. 456.42 s > --> crates/gammaloop-api/src/python.rs:2835:7
  2470. 456.42 s > |
  2471. 456.42 s > 2835 | api = GammaLoopAPI(state_folder="./state", read_only_state=True)
  2472. 456.42 s > | ^^^^^^^^^^^^ not found in this scope
  2473. 456.42 s >
  2474. 456.42 s > error: aborting due to 5 previous errors
  2475. 456.42 s >
  2476. 456.42 s > For more information about this error, try `rustc --explain E0425`.
  2477. 456.42 s > Couldn't compile the test.
  2478. 456.42 s >
  2479. 456.42 s > failures:
  2480. 456.42 s > crates/gammaloop-api/src/python.rs - python::GammaLoopAPI::evaluate_sample (line 2967)
  2481. 456.42 s > crates/gammaloop-api/src/python.rs - python::GammaLoopAPI::evaluate_samples (line 3108)
  2482. 456.42 s > crates/gammaloop-api/src/python.rs - python::GammaLoopAPI::get_active_command_blocks (line 3760)
  2483. 456.42 s > crates/gammaloop-api/src/python.rs - python::GammaLoopAPI::get_default_runtime_settings (line 3796)
  2484. 456.42 s > crates/gammaloop-api/src/python.rs - python::GammaLoopAPI::get_global_settings (line 3739)
  2485. 456.42 s > crates/gammaloop-api/src/python.rs - python::GammaLoopAPI::get_integrand_info (line 3585)
  2486. 456.42 s > crates/gammaloop-api/src/python.rs - python::GammaLoopAPI::get_integrand_settings (line 3647)
  2487. 456.42 s > crates/gammaloop-api/src/python.rs - python::GammaLoopAPI::get_run_history (line 3711)
  2488. 456.42 s > crates/gammaloop-api/src/python.rs - python::GammaLoopAPI::new_python (line 2834)
  2489. 456.42 s > crates/gammaloop-api/src/python.rs - python::GammaLoopAPI::run_command (line 3901)
  2490. 456.42 s > crates/gammaloop-api/src/python.rs - python::PyHistogramAccumulator (line 871)
  2491. 456.42 s > crates/gammaloop-api/src/python.rs - python::atom_to_canonical_string (line 128)
  2492. 456.42 s > crates/gammaloop-api/src/python.rs - python::atom_to_dots (line 157)
  2493. 456.42 s > crates/gammaloop-api/src/python.rs - python::evaluate_graph_overall_factor (line 95)
  2494. 456.42 s >
  2495. 456.42 s > test result: FAILED. 2 passed; 14 failed; 0 ignored; 0 measured; 0 filtered out; finished in 2.67s
  2496. 456.42 s >
  2497. 456.42 s > error: doctest failed, to rerun pass `-p gammaloop-api --doc`
  2498. 456.42 s For full logs, run:
  2499. 456.42 s nix log /nix/store/q3rgbccmd61xgar5zy984yip45msxdh7-gammaloop-workspace-doctest-0.1.0.drv
  2500. 456.50 s [3 built (1 failed), 73 Run failed.