test packages.x86_64-linux.nix-ci-check-gammaloop-nextest-integration

Reproduce this run
Retry Run
  1. 232.29 s gammaloop-nextest-integration> | dod2_bubble | rls.integrated | GL0 | pass | 0.0sigma | compatible within 2sigma | - |
  2. 232.29 s gammaloop-nextest-integration> +-------------+-----------------+---------+--------+----------+-----------------------------------------------------------------------------------------------------------------------+-------+
  3. 232.29 s gammaloop-nextest-integration> | dod2_bubble | mu_r.inspect | inspect | pass | - | best inspect relative delta 6.951e-1 >= 1000*accuracy 1.000e-7 (accuracy=1.000e-10, exponent=+0.0, seed=0, probes=10) | - |
  4. 232.29 s gammaloop-nextest-integration> +-------------+-----------------+---------+--------+----------+-----------------------------------------------------------------------------------------------------------------------+-------+
  5. 232.29 s gammaloop-nextest-integration> | dod2_bubble | target | - | pass | - | 2sigma | - |
  6. 232.29 s gammaloop-nextest-integration> +-------------+-----------------+---------+--------+----------+-----------------------------------------------------------------------------------------------------------------------+-------+
  7. 232.29 s gammaloop-nextest-integration> test dod2_bubble_uv ... FAILED
  8. 232.29 s gammaloop-nextest-integration>
  9. 232.29 s gammaloop-nextest-integration> failures:
  10. 232.29 s gammaloop-nextest-integration>
  11. 232.29 s gammaloop-nextest-integration> failures:
  12. 232.29 s gammaloop-nextest-integration> dod2_bubble_uv
  13. 232.29 s gammaloop-nextest-integration>
  14. 232.29 s gammaloop-nextest-integration> test result: FAILED. 0 passed; 1 failed; 0 ignored; 0 measured; 24 filtered out; finished in 66.65s
  15. 232.29 s gammaloop-nextest-integration> system-err
  16. 232.29 s gammaloop-nextest-integration> [2026-09-02 14:26:20.484] @gammaloop_api::se... INFO : Running command run generate
  17. 232.29 s gammaloop-nextest-integration> [2026-09-02 14:26:20.484] @gammaloop_api::se... INFO : Starting command block generate
  18. 232.29 s gammaloop-nextest-integration> [2026-09-02 14:26:20.485] @gammaloop_api::se... INFO : Running command import model scalars-default.json
  19. 232.29 s gammaloop-nextest-integration> [2026-09-02 14:26:20.485] @import::model INFO : Loading built-in JSON model scalars-default
  20. 232.29 s gammaloop-nextest-integration> [2026-09-02 14:26:20.492] @gammalooprs::model INFO : The following 2 external parameters were forced to zero by the restriction card:
  21. 232.29 s gammaloop-nextest-integration> width_scalar_1, width_scalar_2
  22. 232.29 s gammaloop-nextest-integration> [2026-09-02 14:26:20.496] @gammaloop_api::se... INFO : Running command remove processes
  23. 232.29 s gammaloop-nextest-integration> [2026-09-02 14:26:20.496] @gammaloop_api::se... INFO : Running command set global kv global.generation.uv.generate_integrated=true
  24. 232.29 s gammaloop-nextest-integration> [2026-09-02 14:26:20.497] @gammaloop_api::se... INFO : Running command import graphs ./tests/resources/graphs/scalar/dod2_bubble.dot -p bubble_dod2 -i scalar_bubble_below_thres
  25. 232.29 s gammaloop-nextest-integration> [2026-09-02 14:26:20.497] @commands::import INFO : Loading graphs from '/build/source/tests/resources/graphs/scalar/dod2_bubble.dot'
  26. 232.29 s gammaloop-nextest-integration> [2026-09-02 14:26:20.503] @gammaloop_api::se... INFO : Running command generate existing -p bubble_dod2 -i scalar_bubble_below_thres
  27. 232.29 s gammaloop-nextest-integration> [2026-09-02 14:26:20.507] @approx::local_4d [{#uv, #inspect, #integrated}] DEBUG : Rescaled momenta expanded
  28. 232.29 s gammaloop-nextest-integration> field value
  29. 232.29 s gammaloop-nextest-integration> res n-terms: 1, byte size: 3,expr:
  30. 232.29 s gammaloop-nextest-integration> 1
  31. 232.29 s gammaloop-nextest-integration> [2026-09-02 14:26:20.513] @approx::local_4d [{#uv, #inspect, #integrated}] DEBUG : Rescaled momenta expanded
  32. 232.29 s gammaloop-nextest-integration> field value
  33. 232.29 s gammaloop-nextest-integration> res n-terms: 1, byte size: 585,expr:
  34. 232.29 s gammaloop-nextest-integration> -SCALAR_COUPLING²·q₀(αᵉ².¹)·q₀(αᵉ³.¹)·q₂(αᵉ².¹)·q₂(αᵉ³.¹)
  35. 232.29 s gammaloop-nextest-integration> /(t²·denom(3,-q₀-q₂/t,mass_scalar_2²,-mass_scalar_2²+2·(q₀.q₂)/t+(q₂.q₂)/t²+(q₀.q₀))
  36. 232.29 s gammaloop-nextest-integration> ·denom(2,q₂/t,mass_scalar_2²,-mass_scalar_2²+(q₂.q₂)/t²))
  37. 232.29 s gammaloop-nextest-integration> [2026-09-02 14:26:20.521] @approx::final_integrand[{#generation, #profile, #uv, #graph, #summary}] DEBUG : Computed global numerator
  38. 232.29 s gammaloop-nextest-integration> field value
  39. 232.29 s gammaloop-nextest-integration> global_num n-terms: 1, byte size: 4,expr:
  40. 232.29 s gammaloop-nextest-integration> 1/2
  41. 232.29 s gammaloop-nextest-integration> span build_3d{span_context=true graph=GL0 current=subgraph=0, topo_order=0, dod=0}
  42. 232.29 s gammaloop-nextest-integration> [2026-09-02 14:26:20.527] @uv::approx [{#generation, #uv, #fourd}] DEBUG : Computing 4D
  43. 232.29 s gammaloop-nextest-integration> field value
  44. 232.29 s gammaloop-nextest-integration> simple subgraph(S_11,S_y)*Approx(subgraph(S_y,0)) of GL0
  45. 232.29 s gammaloop-nextest-integration> span compute_4d{span_context=true graph=GL0 current=subgraph=y, topo_order=1, dod=2 given=subgraph=0, topo_order=0, dod=0 reduced=SubSet { set: BitVec<usize, bitvec::order::Lsb0> { addr: 0x7fffec027530, head: 000000, bits: 6, capacity: 64 } [0, 0, 1, 1, 1, 1], id: PhantomData<linnet::half_edge::involution::Hedge> }}
  46. 232.29 s gammaloop-nextest-integration> [2026-09-02 14:26:20.528] @approx::local_4d [{#uv, #algebra, #integrated, #start}] DEBUG :
  47. 232.29 s gammaloop-nextest-integration> field value
  48. 232.29 s gammaloop-nextest-integration> integrand n-terms: 1, byte size: 409,expr:
  49. 232.29 s gammaloop-nextest-integration> SCALAR_COUPLING²·(q₀(αᵉ³.¹)+q₃(αᵉ³.¹))·q₀(αᵉ².¹)·q₀(αᵉ³.¹)·q₂(αᵉ².¹)
  50. 232.29 s gammaloop-nextest-integration> /(denom(2,q₂,mass_scalar_2²,-mass_scalar_2²+(q₂.q₂))·denom(3,q₃,mass_scalar_2²,-mass_scalar_2²+(q₃.q₃)))
  51. 232.29 s gammaloop-nextest-integration> reduced y
  52. 232.29 s gammaloop-nextest-integration> span grow{span_context=true current=subgraph=y, topo_order=1, dod=2 given=subgraph=0, topo_order=0, dod=0}
  53. 232.29 s gammaloop-nextest-integration> [2026-09-02 14:26:20.528] @approx::local_4d [{#uv, #inspect, #integrated}] DEBUG : Rescaled momenta expanded
  54. 232.29 s gammaloop-nextest-integration> field value
  55. 232.29 s gammaloop-nextest-integration> res n-terms: 1, byte size: 585,expr:
  56. 232.29 s gammaloop-nextest-integration> -SCALAR_COUPLING²·q₀(αᵉ².¹)·q₀(αᵉ³.¹)·q₂(αᵉ².¹)·q₂(αᵉ³.¹)
  57. 232.29 s gammaloop-nextest-integration> /(t²·denom(3,-q₀-q₂/t,mass_scalar_2²,-mass_scalar_2²+2·(q₀.q₂)/t+(q₂.q₂)/t²+(q₀.q₀))
  58. 232.29 s gammaloop-nextest-integration> ·denom(2,q₂/t,mass_scalar_2²,-mass_scalar_2²+(q₂.q₂)/t²))
  59. 232.29 s gammaloop-nextest-integration> span t{span_context=true current=subgraph=y, topo_order=1, dod=2 given=subgraph=0, topo_order=0, dod=0}
  60. 232.29 s gammaloop-nextest-integration> [2026-09-02 14:26:20.529] @approx::local_4d [{#uv, #integrated, #rescaled}] DEBUG : Rescaled expanded
  61. 232.29 s gammaloop-nextest-integration> field value
  62. 232.29 s gammaloop-nextest-integration> n_loops 1
  63. 232.29 s gammaloop-nextest-integration> res n-terms: 1, byte size: 707,expr:
  64. 232.29 s gammaloop-nextest-integration> -SCALAR_COUPLING²·q₀(αᵉ².¹)·q₀(αᵉ³.¹)·q₂(αᵉ².¹)·q₂(αᵉ³.¹)
  65. 232.29 s gammaloop-nextest-integration> /(t²·denom(3,-q₂,mUVexp²+t²·mass_scalar_2²,-mUV²+t²·(-mass_scalar_2²+2·(q₀.q₂)/t+(q₂.q₂)/t²+(q₀.q₀))+t²·mUVexp²)
  66. 232.29 s gammaloop-nextest-integration> ·denom(2,q₂,mUVexp²+t²·mass_scalar_2²,-mUV²+t²·(-mass_scalar_2²+(q₂.q₂)/t²)+t²·mUVexp²))
  67. 232.29 s gammaloop-nextest-integration> span t{span_context=true current=subgraph=y, topo_order=1, dod=2 given=subgraph=0, topo_order=0, dod=0}
  68. 232.29 s gammaloop-nextest-integration> [2026-09-02 14:26:20.535] @approx::local_4d [{#uv, #integrated, #series}] DEBUG : Series expanded
  69. 232.29 s gammaloop-nextest-integration> field value
  70. 232.29 s gammaloop-nextest-integration> res n-terms: 3, byte size: 1896,expr:
  71. 232.29 s gammaloop-nextest-integration> (1/2·SCALAR_COUPLING²·(2·mUVexp²-2·mass_scalar_2²)/(denom(2,q₂,mUVexp²,-mUV²+(q₂.q₂))²·denom(3,-q₂,mUVexp²,-mUV²+(q₂.q₂)))
  72. 232.29 s gammaloop-nextest-integration> -SCALAR_COUPLING²
  73. 232.29 s gammaloop-nextest-integration> ·(-1/2·(2·mUVexp²-2·mass_scalar_2²+2·(q₀.q₀))/denom(3,-q₂,mUVexp²,-mUV²+(q₂.q₂))
  74. 232.29 s gammaloop-nextest-integration> +4·(q₀.q₂)²/denom(3,-q₂,mUVexp²,-mUV²+(q₂.q₂))²
  75. 232.29 s gammaloop-nextest-integration> )/(denom(2,q₂,mUVexp²,-mUV²+(q₂.q₂))·denom(3,-q₂,mUVexp²,-mUV²+(q₂.q₂)))
  76. 232.29 s gammaloop-nextest-integration> )·q₀(αᵉ².¹)·q₀(αᵉ³.¹)·q₂(αᵉ².¹)·q₂(αᵉ³.¹)
  77. 232.29 s gammaloop-nextest-integration> +2·SCALAR_COUPLING²·(q₀.q₂)·q₀(αᵉ².¹)·q₀(αᵉ³.¹)·q₂(αᵉ².¹)·q₂(αᵉ³.¹)
  78. 232.29 s gammaloop-nextest-integration> /(t·denom(2,q₂,mUVexp²,-mUV²+(q₂.q₂))·denom(3,-q₂,mUVexp²,-mUV²+(q₂.q₂))²)
  79. 232.29 s gammaloop-nextest-integration> -SCALAR_COUPLING²·q₀(αᵉ².¹)·q₀(αᵉ³.¹)·q₂(αᵉ².¹)·q₂(αᵉ³.¹)
  80. 232.29 s gammaloop-nextest-integration> /(t²·denom(2,q₂,mUVexp²,-mUV²+(q₂.q₂))·denom(3,-q₂,mUVexp²,-mUV²+(q₂.q₂)))
  81. 232.29 s gammaloop-nextest-integration> span t{span_context=true current=subgraph=y, topo_order=1, dod=2 given=subgraph=0, topo_order=0, dod=0}
  82. 232.29 s gammaloop-nextest-integration> [2026-09-02 14:26:20.537] @approx::local_4d [{#uv, #integrated, #series}] DEBUG : Evaluated at t = 1
  83. 232.29 s gammaloop-nextest-integration> field value
  84. 232.29 s gammaloop-nextest-integration> res n-terms: 3, byte size: 1880,expr:
  85. 232.29 s gammaloop-nextest-integration> (1/2·SCALAR_COUPLING²·(2·mUVexp²-2·mass_scalar_2²)/(denom(2,q₂,mUVexp²,-mUV²+(q₂.q₂))²·denom(3,-q₂,mUVexp²,-mUV²+(q₂.q₂)))
  86. 232.29 s gammaloop-nextest-integration> -SCALAR_COUPLING²
  87. 232.29 s gammaloop-nextest-integration> ·(-1/2·(2·mUVexp²-2·mass_scalar_2²+2·(q₀.q₀))/denom(3,-q₂,mUVexp²,-mUV²+(q₂.q₂))
  88. 232.29 s gammaloop-nextest-integration> +4·(q₀.q₂)²/denom(3,-q₂,mUVexp²,-mUV²+(q₂.q₂))²
  89. 232.29 s gammaloop-nextest-integration> )/(denom(2,q₂,mUVexp²,-mUV²+(q₂.q₂))·denom(3,-q₂,mUVexp²,-mUV²+(q₂.q₂)))
  90. 232.29 s gammaloop-nextest-integration> )·q₀(αᵉ².¹)·q₀(αᵉ³.¹)·q₂(αᵉ².¹)·q₂(αᵉ³.¹)
  91. 232.29 s gammaloop-nextest-integration> -SCALAR_COUPLING²·q₀(αᵉ².¹)·q₀(αᵉ³.¹)·q₂(αᵉ².¹)·q₂(αᵉ³.¹)
  92. 232.29 s gammaloop-nextest-integration> /(denom(2,q₂,mUVexp²,-mUV²+(q₂.q₂))·denom(3,-q₂,mUVexp²,-mUV²+(q₂.q₂)))
  93. 232.29 s gammaloop-nextest-integration> +2·SCALAR_COUPLING²·(q₀.q₂)·q₀(αᵉ².¹)·q₀(αᵉ³.¹)·q₂(αᵉ².¹)·q₂(αᵉ³.¹)
  94. 232.29 s gammaloop-nextest-integration> /(denom(2,q₂,mUVexp²,-mUV²+(q₂.q₂))·denom(3,-q₂,mUVexp²,-mUV²+(q₂.q₂))²)
  95. 232.29 s gammaloop-nextest-integration> span t{span_context=true current=subgraph=y, topo_order=1, dod=2 given=subgraph=0, topo_order=0, dod=0}
  96. 232.29 s gammaloop-nextest-integration> [2026-09-02 14:26:20.539] @approx::local_4d [{#uv, #collect, #integrated}] DEBUG : After gamma chain collection
  97. 232.29 s gammaloop-nextest-integration> field value
  98. 232.29 s gammaloop-nextest-integration> expr n-terms: 3, byte size: 1880,expr:
  99. 232.29 s gammaloop-nextest-integration> (1/2·SCALAR_COUPLING²·(2·mUVexp²-2·mass_scalar_2²)/(denom(2,q₂,mUVexp²,-mUV²+(q₂.q₂))²·denom(3,-q₂,mUVexp²,-mUV²+(q₂.q₂)))
  100. 232.29 s gammaloop-nextest-integration> -SCALAR_COUPLING²
  101. 232.29 s gammaloop-nextest-integration> ·(-1/2·(2·mUVexp²-2·mass_scalar_2²+2·(q₀.q₀))/denom(3,-q₂,mUVexp²,-mUV²+(q₂.q₂))
  102. 232.29 s gammaloop-nextest-integration> +4·(q₀.q₂)²/denom(3,-q₂,mUVexp²,-mUV²+(q₂.q₂))²
  103. 232.29 s gammaloop-nextest-integration> )/(denom(2,q₂,mUVexp²,-mUV²+(q₂.q₂))·denom(3,-q₂,mUVexp²,-mUV²+(q₂.q₂)))
  104. 232.29 s gammaloop-nextest-integration> )·q₀(αᵉ².¹)·q₀(αᵉ³.¹)·q₂(αᵉ².¹)·q₂(αᵉ³.¹)
  105. 232.29 s gammaloop-nextest-integration> -SCALAR_COUPLING²·q₀(αᵉ².¹)·q₀(αᵉ³.¹)·q₂(αᵉ².¹)·q₂(αᵉ³.¹)
  106. 232.29 s gammaloop-nextest-integration> /(denom(2,q₂,mUVexp²,-mUV²+(q₂.q₂))·denom(3,-q₂,mUVexp²,-mUV²+(q₂.q₂)))
  107. 232.29 s gammaloop-nextest-integration> +2·SCALAR_COUPLING²·(q₀.q₂)·q₀(αᵉ².¹)·q₀(αᵉ³.¹)·q₂(αᵉ².¹)·q₂(αᵉ³.¹)
  108. 232.29 s gammaloop-nextest-integration> /(denom(2,q₂,mUVexp²,-mUV²+(q₂.q₂))·denom(3,-q₂,mUVexp²,-mUV²+(q₂.q₂))²)
  109. 232.29 s gammaloop-nextest-integration> span t{span_context=true current=subgraph=y, topo_order=1, dod=2 given=subgraph=0, topo_order=0, dod=0}
  110. 232.29 s gammaloop-nextest-integration> [2026-09-02 14:26:20.546] @approx::local_4d [{#profile, #uv, #collect, #integrated, #start, #trace}] DEBUG : After gamma schoonschip
  111. 232.29 s gammaloop-nextest-integration> field value
  112. 232.29 s gammaloop-nextest-integration> expr n-terms: 3, byte size: 1631,expr:
  113. 232.29 s gammaloop-nextest-integration> (1/2·SCALAR_COUPLING²·(2·mUVexp²-2·mass_scalar_2²)/(denom(2,q₂,mUVexp²,-mUV²+(q₂.q₂))²·denom(3,-q₂,mUVexp²,-mUV²+(q₂.q₂)))
  114. 232.29 s gammaloop-nextest-integration> -SCALAR_COUPLING²
  115. 232.29 s gammaloop-nextest-integration> ·(-1/2·(2·mUVexp²-2·mass_scalar_2²+2·(q₀.q₀))/denom(3,-q₂,mUVexp²,-mUV²+(q₂.q₂))
  116. 232.29 s gammaloop-nextest-integration> +4·(q₀.q₂)²/denom(3,-q₂,mUVexp²,-mUV²+(q₂.q₂))²
  117. 232.29 s gammaloop-nextest-integration> )/(denom(2,q₂,mUVexp²,-mUV²+(q₂.q₂))·denom(3,-q₂,mUVexp²,-mUV²+(q₂.q₂)))
  118. 232.29 s gammaloop-nextest-integration> )·(q₀.q₂)²
  119. 232.29 s gammaloop-nextest-integration> -SCALAR_COUPLING²·(q₀.q₂)²/(denom(2,q₂,mUVexp²,-mUV²+(q₂.q₂))·denom(3,-q₂,mUVexp²,-mUV²+(q₂.q₂)))
  120. 232.29 s gammaloop-nextest-integration> +2·SCALAR_COUPLING²·(q₀.q₂)·(q₀.q₂)²
  121. 232.29 s gammaloop-nextest-integration> /(denom(2,q₂,mUVexp²,-mUV²+(q₂.q₂))·denom(3,-q₂,mUVexp²,-mUV²+(q₂.q₂))²)
  122. 232.29 s gammaloop-nextest-integration> span t{span_context=true current=subgraph=y, topo_order=1, dod=2 given=subgraph=0, topo_order=0, dod=0}
  123. 232.29 s gammaloop-nextest-integration> [2026-09-02 14:26:20.555] @approx::local_4d [{#profile, #uv, #collect, #integrated, #start, #trace}] DEBUG : After gamma collection
  124. 232.29 s gammaloop-nextest-integration> field value
  125. 232.29 s gammaloop-nextest-integration> expr n-terms: 1, byte size: 1347,expr:
  126. 232.29 s gammaloop-nextest-integration> SCALAR_COUPLING²
  127. 232.29 s gammaloop-nextest-integration> ·(-denom(2,q₂,mUVexp²,-mUV²+(q₂.q₂))·denom(3,-q₂,mUVexp²,-mUV²+(q₂.q₂))²
  128. 232.29 s gammaloop-nextest-integration> +1/2·(2·mUVexp²-2·mass_scalar_2²)·denom(3,-q₂,mUVexp²,-mUV²+(q₂.q₂))²
  129. 232.29 s gammaloop-nextest-integration> -(-1/2·(2·mUVexp²-2·mass_scalar_2²+2·(q₀.q₀))·denom(3,-q₂,mUVexp²,-mUV²+(q₂.q₂))+4·(q₀.q₂)²)
  130. 232.29 s gammaloop-nextest-integration> ·denom(2,q₂,mUVexp²,-mUV²+(q₂.q₂))
  131. 232.29 s gammaloop-nextest-integration> +2·(q₀.q₂)·denom(2,q₂,mUVexp²,-mUV²+(q₂.q₂))·denom(3,-q₂,mUVexp²,-mUV²+(q₂.q₂))
  132. 232.29 s gammaloop-nextest-integration> )·(q₀.q₂)²/(denom(2,q₂,mUVexp²,-mUV²+(q₂.q₂))²·denom(3,-q₂,mUVexp²,-mUV²+(q₂.q₂))³)
  133. 232.29 s gammaloop-nextest-integration> span t{span_context=true current=subgraph=y, topo_order=1, dod=2 given=subgraph=0, topo_order=0, dod=0}
  134. 232.29 s gammaloop-nextest-integration> [2026-09-02 14:26:20.560] @approx::local_4d [{#profile, #uv, #gamma, #integrated, #start, #trace, #vakint}] DEBUG : After gamma simplification
  135. 232.29 s gammaloop-nextest-integration> ... omitted 3263 more lines; see full nextest output above
  136. 232.29 s gammaloop-nextest-integration>
  137. 232.29 s gammaloop-nextest-integration> 8. gammaloop-integration-tests::uv::sunrise_scalar_1_uv
  138. 232.32 s gammaloop-nextest-integration> failure: test failure with exit code 101
  139. 232.32 s gammaloop-nextest-integration> system-out
  140. 232.32 s gammaloop-nextest-integration> running 1 test
  141. 232.32 s gammaloop-nextest-integration> test sunrise_scalar_1_uv has been running for over 60 seconds
  142. 232.32 s gammaloop-nextest-integration> +------------------+------------------------+--------------+--------+----------+----------------------------------------------------------------------------------------------------------------------+-------+
  143. 232.32 s gammaloop-nextest-integration> | case | check | graph | status | sigma | threshold | error |
  144. 232.32 s gammaloop-nextest-integration> +------------------+------------------------+--------------+--------+----------+----------------------------------------------------------------------------------------------------------------------+-------+
  145. 232.32 s gammaloop-nextest-integration> | sunrise_scalar_1 | uv_profile | - | FAIL | - | - | - |
  146. 232.32 s gammaloop-nextest-integration> +------------------+------------------------+--------------+--------+----------+----------------------------------------------------------------------------------------------------------------------+-------+
  147. 232.32 s gammaloop-nextest-integration> | sunrise_scalar_1 | m_uv.inspect | inspect | pass | - | best inspect relative delta 1.624e0 >= 1000*accuracy 1.000e-3 (accuracy=1.000e-6, exponent=+1.0, seed=1, probes=10) | - |
  148. 232.32 s gammaloop-nextest-integration> +------------------+------------------------+--------------+--------+----------+----------------------------------------------------------------------------------------------------------------------+-------+
  149. 232.32 s gammaloop-nextest-integration> | sunrise_scalar_1 | m_uv.integrated | sunrise | pass | 0.1sigma | compatible within 2sigma | - |
  150. 232.32 s gammaloop-nextest-integration> +------------------+------------------------+--------------+--------+----------+----------------------------------------------------------------------------------------------------------------------+-------+
  151. 232.32 s gammaloop-nextest-integration> | sunrise_scalar_1 | rls.inspect | inspect | pass | - | best inspect relative delta 8.682e-1 >= 1000*accuracy 1.000e-3 (accuracy=1.000e-6, exponent=+1.0, seed=1, probes=10) | - |
  152. 232.32 s gammaloop-nextest-integration> +------------------+------------------------+--------------+--------+----------+----------------------------------------------------------------------------------------------------------------------+-------+
  153. 232.32 s gammaloop-nextest-integration> | sunrise_scalar_1 | rls.integrated | sunrise | pass | 0.0sigma | compatible within 2sigma | - |
  154. 232.32 s gammaloop-nextest-integration> +------------------+------------------------+--------------+--------+----------+----------------------------------------------------------------------------------------------------------------------+-------+
  155. 232.32 s gammaloop-nextest-integration> | sunrise_scalar_1 | mu_r.inspect | inspect | pass | - | best inspect relative delta 1.752e0 >= 1000*accuracy 1.000e-3 (accuracy=1.000e-6, exponent=+1.0, seed=1, probes=10) | - |
  156. 232.32 s gammaloop-nextest-integration> +------------------+------------------------+--------------+--------+----------+----------------------------------------------------------------------------------------------------------------------+-------+
  157. 232.32 s gammaloop-nextest-integration> | sunrise_scalar_1 | integrated.relerr | integrated | pass | - | relative error 9.20% <= 10.00% | - |
  158. 232.32 s gammaloop-nextest-integration> +------------------+------------------------+--------------+--------+----------+----------------------------------------------------------------------------------------------------------------------+-------+
  159. 232.32 s gammaloop-nextest-integration> | sunrise_scalar_1 | m_uv.integrated.relerr | m_uv-shifted | pass | - | relative error 5.89% <= 10.00% | - |
  160. 232.32 s gammaloop-nextest-integration> +------------------+------------------------+--------------+--------+----------+----------------------------------------------------------------------------------------------------------------------+-------+
  161. 232.32 s gammaloop-nextest-integration> | sunrise_scalar_1 | target | - | pass | - | 2sigma | - |
  162. 232.32 s gammaloop-nextest-integration> +------------------+------------------------+--------------+--------+----------+----------------------------------------------------------------------------------------------------------------------+-------+
  163. 232.32 s gammaloop-nextest-integration> test sunrise_scalar_1_uv ... FAILED
  164. 232.32 s gammaloop-nextest-integration>
  165. 232.32 s gammaloop-nextest-integration> failures:
  166. 232.32 s gammaloop-nextest-integration>
  167. 232.32 s gammaloop-nextest-integration> failures:
  168. 232.32 s gammaloop-nextest-integration> sunrise_scalar_1_uv
  169. 232.32 s gammaloop-nextest-integration>
  170. 232.32 s gammaloop-nextest-integration> test result: FAILED. 0 passed; 1 failed; 0 ignored; 0 measured; 24 filtered out; finished in 125.43s
  171. 232.33 s gammaloop-nextest-integration> system-err
  172. 232.33 s gammaloop-nextest-integration> [2026-09-02 14:26:31.719] @gammaloop_api::se... INFO : Running command run generate
  173. 232.33 s gammaloop-nextest-integration> [2026-09-02 14:26:31.719] @gammaloop_api::se... INFO : Starting command block generate
  174. 232.33 s gammaloop-nextest-integration> [2026-09-02 14:26:31.720] @gammaloop_api::se... INFO : Running command import model scalars-default.json
  175. 232.33 s gammaloop-nextest-integration> [2026-09-02 14:26:31.720] @import::model INFO : Loading built-in JSON model scalars-default
  176. 232.33 s gammaloop-nextest-integration> [2026-09-02 14:26:31.724] @gammalooprs::model INFO : The following 2 external parameters were forced to zero by the restriction card:
  177. 232.33 s gammaloop-nextest-integration> width_scalar_1, width_scalar_2
  178. 232.33 s gammaloop-nextest-integration> [2026-09-02 14:26:31.724] @gammaloop_api::se... INFO : Running command remove processes
  179. 232.33 s gammaloop-nextest-integration> [2026-09-02 14:26:31.724] @gammaloop_api::se... INFO : Running command set global kv global.generation.uv.generate_integrated=true
  180. 232.33 s gammaloop-nextest-integration> [2026-09-02 14:26:31.725] @gammaloop_api::se... INFO : Running command import graphs ./tests/resources/graphs/scalar_sunrise.dot -p sunrise_scalar_1 -i scalar_sunrise
  181. 232.33 s gammaloop-nextest-integration> [2026-09-02 14:26:31.725] @commands::import INFO : Loading graphs from '/build/source/tests/resources/graphs/scalar_sunrise.dot'
  182. 232.33 s gammaloop-nextest-integration> [2026-09-02 14:26:31.734] @gammaloop_api::se... INFO : Running command generate existing -p sunrise_scalar_1 -i scalar_sunrise
  183. 232.33 s gammaloop-nextest-integration> [2026-09-02 14:26:31.736] @approx::local_4d [{#uv, #inspect, #integrated}] DEBUG : Rescaled momenta expanded
  184. 232.33 s gammaloop-nextest-integration> field value
  185. 232.33 s gammaloop-nextest-integration> res n-terms: 1, byte size: 3,expr:
  186. 232.33 s gammaloop-nextest-integration> 1
  187. 232.33 s gammaloop-nextest-integration> [2026-09-02 14:26:31.740] @approx::local_4d [{#uv, #inspect, #integrated}] DEBUG : Rescaled momenta expanded
  188. 232.33 s gammaloop-nextest-integration> field value
  189. 232.33 s gammaloop-nextest-integration> res n-terms: 1, byte size: 611,expr:
  190. 232.33 s gammaloop-nextest-integration> 1/(denom(0,q₀/t,mass_scalar_1²,-mass_scalar_1²+(q₀.q₀)/t²)
  191. 232.33 s gammaloop-nextest-integration> ·denom(2,-q₁+q₃-q₀/t,mass_scalar_1²,
  192. 232.33 s gammaloop-nextest-integration> -mass_scalar_1²+2·(q₀.q₁)/t-2·(q₀.q₃)/t+(q₀.q₀)/t²+(q₁.q₁)
  193. 232.33 s gammaloop-nextest-integration> -2·(q₁.q₃)+(q₃.q₃)
  194. 232.33 s gammaloop-nextest-integration> ))
  195. 232.33 s gammaloop-nextest-integration> [2026-09-02 14:26:31.742] @approx::local_4d [{#uv, #inspect, #integrated}] DEBUG : Rescaled momenta expanded
  196. 232.33 s gammaloop-nextest-integration> field value
  197. 232.33 s gammaloop-nextest-integration> res n-terms: 1, byte size: 611,expr:
  198. 232.33 s gammaloop-nextest-integration> 1/(denom(0,q₀/t,mass_scalar_1²,-mass_scalar_1²+(q₀.q₀)/t²)
  199. 232.33 s gammaloop-nextest-integration> ·denom(1,-q₂+q₃-q₀/t,mass_scalar_1²,
  200. 232.33 s gammaloop-nextest-integration> -mass_scalar_1²+2·(q₀.q₂)/t-2·(q₀.q₃)/t+(q₀.q₀)/t²+(q₂.q₂)
  201. 232.33 s gammaloop-nextest-integration> -2·(q₂.q₃)+(q₃.q₃)
  202. 232.33 s gammaloop-nextest-integration> ))
  203. 232.33 s gammaloop-nextest-integration> [2026-09-02 14:26:31.745] @approx::local_4d [{#uv, #inspect, #integrated}] DEBUG : Rescaled momenta expanded
  204. 232.33 s gammaloop-nextest-integration> field value
  205. 232.33 s gammaloop-nextest-integration> res n-terms: 1, byte size: 611,expr:
  206. 232.33 s gammaloop-nextest-integration> 1/(denom(1,q₁/t,mass_scalar_1²,-mass_scalar_1²+(q₁.q₁)/t²)
  207. 232.33 s gammaloop-nextest-integration> ·denom(2,-q₀+q₃-q₁/t,mass_scalar_1²,
  208. 232.33 s gammaloop-nextest-integration> -mass_scalar_1²+2·(q₀.q₁)/t-2·(q₁.q₃)/t+(q₁.q₁)/t²+(q₀.q₀)
  209. 232.33 s gammaloop-nextest-integration> -2·(q₀.q₃)+(q₃.q₃)
  210. 232.33 s gammaloop-nextest-integration> ))
  211. 232.33 s gammaloop-nextest-integration> [2026-09-02 14:26:31.747] @approx::local_4d [{#uv, #inspect, #integrated}] DEBUG : Rescaled momenta expanded
  212. 232.33 s gammaloop-nextest-integration> field value
  213. 232.33 s gammaloop-nextest-integration> res n-terms: 1, byte size: 777,expr:
  214. 232.33 s gammaloop-nextest-integration> 1/(denom(0,q₀/t,mass_scalar_1²,-mass_scalar_1²+(q₀.q₀)/t²)·denom(1,q₁/t,mass_scalar_1²,-mass_scalar_1²+(q₁.q₁)/t²)
  215. 232.33 s gammaloop-nextest-integration> ·denom(2,q₄-q₀/t-q₁/t,mass_scalar_1²,
  216. 232.33 s gammaloop-nextest-integration> -mass_scalar_1²-2·(q₀.q₄)/t-2·(q₁.q₄)/t+(q₀.q₀)/t²+2·(q₀.q₁)/t²
  217. 232.33 s gammaloop-nextest-integration> +(q₁.q₁)/t²+(q₄.q₄)
  218. 232.33 s gammaloop-nextest-integration> ))
  219. 232.33 s gammaloop-nextest-integration> [2026-09-02 14:26:31.757] @approx::final_integrand[{#generation, #profile, #uv, #graph, #summary}] DEBUG : Computed global numerator
  220. 232.33 s gammaloop-nextest-integration> field value
  221. 232.33 s gammaloop-nextest-integration> global_num n-terms: 1, byte size: 3,expr:
  222. 232.33 s gammaloop-nextest-integration> 1
  223. 232.33 s gammaloop-nextest-integration> span build_3d{span_context=true graph=sunrise current=subgraph=0, topo_order=0, dod=0}
  224. 232.33 s gammaloop-nextest-integration> [2026-09-02 14:26:31.775] @uv::approx [{#generation, #uv, #fourd}] DEBUG : Computing 4D
  225. 232.33 s gammaloop-nextest-integration> field value
  226. 232.33 s gammaloop-nextest-integration> simple subgraph(S_47,S_3I)*Approx(subgraph(S_3I,0)) of sunrise
  227. 232.33 s gammaloop-nextest-integration> span compute_4d{span_context=true graph=sunrise current=subgraph=3I, topo_order=1, dod=0 given=subgraph=0, topo_order=0, dod=0 reduced=SubSet { set: BitVec<usize, bitvec::order::Lsb0> { addr: 0x7fffec01a280, head: 000000, bits: 8, capacity: 64 } [0, 0, 1, 1, 0, 0, 1, 1], id: PhantomData<linnet::half_edge::involution::Hedge> }}
  228. 232.33 s gammaloop-nextest-integration> [2026-09-02 14:26:31.780] @approx::local_4d [{#uv, #algebra, #integrated, #start}] DEBUG :
  229. 232.33 s gammaloop-nextest-integration> field value
  230. 232.33 s gammaloop-nextest-integration> integrand n-terms: 1, byte size: 217,expr:
  231. 232.33 s gammaloop-nextest-integration> 1/(denom(0,q₀,mass_scalar_1²,-mass_scalar_1²+(q₀.q₀))·denom(2,q₂,mass_scalar_1²,-mass_scalar_1²+(q₂.q₂)))
  232. 232.33 s gammaloop-nextest-integration> reduced 3I
  233. 232.33 s gammaloop-nextest-integration> span grow{span_context=true current=subgraph=3I, topo_order=1, dod=0 given=subgraph=0, topo_order=0, dod=0}
  234. 232.33 s gammaloop-nextest-integration> [2026-09-02 14:26:31.780] @approx::local_4d [{#uv, #inspect, #integrated}] DEBUG : Rescaled momenta expanded
  235. 232.33 s gammaloop-nextest-integration> field value
  236. 232.33 s gammaloop-nextest-integration> res n-terms: 1, byte size: 611,expr:
  237. 232.33 s gammaloop-nextest-integration> 1/(denom(0,q₀/t,mass_scalar_1²,-mass_scalar_1²+(q₀.q₀)/t²)
  238. 232.33 s gammaloop-nextest-integration> ·denom(2,-q₁+q₃-q₀/t,mass_scalar_1²,
  239. 232.33 s gammaloop-nextest-integration> -mass_scalar_1²+2·(q₀.q₁)/t-2·(q₀.q₃)/t+(q₀.q₀)/t²+(q₁.q₁)
  240. 232.33 s gammaloop-nextest-integration> -2·(q₁.q₃)+(q₃.q₃)
  241. 232.33 s gammaloop-nextest-integration> ))
  242. 232.33 s gammaloop-nextest-integration> span t{span_context=true current=subgraph=3I, topo_order=1, dod=0 given=subgraph=0, topo_order=0, dod=0}
  243. 232.33 s gammaloop-nextest-integration> [2026-09-02 14:26:31.793] @approx::local_4d [{#uv, #integrated, #rescaled}] DEBUG : Rescaled expanded
  244. 232.33 s gammaloop-nextest-integration> field value
  245. 232.33 s gammaloop-nextest-integration> n_loops 1
  246. 232.33 s gammaloop-nextest-integration> res n-terms: 1, byte size: 723,expr:
  247. 232.33 s gammaloop-nextest-integration> 1/(denom(0,q₀,mUVexp²+t²·mass_scalar_1²,-mUV²+t²·(-mass_scalar_1²+(q₀.q₀)/t²)+t²·mUVexp²)
  248. 232.33 s gammaloop-nextest-integration> ·denom(2,-q₀,mUVexp²+t²·mass_scalar_1²,
  249. 232.33 s gammaloop-nextest-integration> -mUV²
  250. 232.33 s gammaloop-nextest-integration> +t²
  251. 232.33 s gammaloop-nextest-integration> ·(-mass_scalar_1²+2·(q₀.q₁)/t-2·(q₀.q₃)/t+(q₀.q₀)/t²+(q₁.q₁)
  252. 232.33 s gammaloop-nextest-integration> -2·(q₁.q₃)+(q₃.q₃)
  253. 232.33 s gammaloop-nextest-integration> )
  254. 232.33 s gammaloop-nextest-integration> +t²·mUVexp²
  255. 232.33 s gammaloop-nextest-integration> ))
  256. 232.33 s gammaloop-nextest-integration> span t{span_context=true current=subgraph=3I, topo_order=1, dod=0 given=subgraph=0, topo_order=0, dod=0}
  257. 232.33 s gammaloop-nextest-integration> [2026-09-02 14:26:31.793] @approx::local_4d [{#uv, #integrated, #series}] DEBUG : Series expanded
  258. 232.33 s gammaloop-nextest-integration> field value
  259. 232.33 s gammaloop-nextest-integration> res n-terms: 1, byte size: 223,expr:
  260. 232.33 s gammaloop-nextest-integration> 1/(denom(0,q₀,mUVexp²,-mUV²+(q₀.q₀))·denom(2,-q₀,mUVexp²,-mUV²+(q₀.q₀)))
  261. 232.33 s gammaloop-nextest-integration> span t{span_context=true current=subgraph=3I, topo_order=1, dod=0 given=subgraph=0, topo_order=0, dod=0}
  262. 232.33 s gammaloop-nextest-integration> [2026-09-02 14:26:31.793] @approx::local_4d [{#uv, #integrated, #series}] DEBUG : Evaluated at t = 1
  263. 232.33 s gammaloop-nextest-integration> field value
  264. 232.33 s gammaloop-nextest-integration> res n-terms: 1, byte size: 223,expr:
  265. 232.33 s gammaloop-nextest-integration> 1/(denom(0,q₀,mUVexp²,-mUV²+(q₀.q₀))·denom(2,-q₀,mUVexp²,-mUV²+(q₀.q₀)))
  266. 232.33 s gammaloop-nextest-integration> span t{span_context=true current=subgraph=3I, topo_order=1, dod=0 given=subgraph=0, topo_order=0, dod=0}
  267. 232.33 s gammaloop-nextest-integration> [2026-09-02 14:26:31.797] @approx::local_4d [{#uv, #collect, #integrated}] DEBUG : After gamma chain collection
  268. 232.33 s gammaloop-nextest-integration> field value
  269. 232.33 s gammaloop-nextest-integration> expr n-terms: 1, byte size: 223,expr:
  270. 232.33 s gammaloop-nextest-integration> 1/(denom(0,q₀,mUVexp²,-mUV²+(q₀.q₀))·denom(2,-q₀,mUVexp²,-mUV²+(q₀.q₀)))
  271. 232.33 s gammaloop-nextest-integration> span t{span_context=true current=subgraph=3I, topo_order=1, dod=0 given=subgraph=0, topo_order=0, dod=0}
  272. 232.33 s gammaloop-nextest-integration> [2026-09-02 14:26:31.797] @approx::local_4d [{#profile, #uv, #collect, #integrated, #start, #trace}] DEBUG : After gamma schoonschip
  273. 232.33 s gammaloop-nextest-integration> field value
  274. 232.33 s gammaloop-nextest-integration> expr n-terms: 1, byte size: 223,expr:
  275. 232.33 s gammaloop-nextest-integration> 1/(denom(0,q₀,mUVexp²,-mUV²+(q₀.q₀))·denom(2,-q₀,mUVexp²,-mUV²+(q₀.q₀)))
  276. 232.33 s gammaloop-nextest-integration> span t{span_context=true current=subgraph=3I, topo_order=1, dod=0 given=subgraph=0, topo_order=0, dod=0}
  277. 232.33 s gammaloop-nextest-integration> [2026-09-02 14:26:31.798] @approx::local_4d [{#profile, #uv, #collect, #integrated, #start, #trace}] DEBUG : After gamma collection
  278. 232.33 s gammaloop-nextest-integration> field value
  279. 232.33 s gammaloop-nextest-integration> expr n-terms: 1, byte size: 223,expr:
  280. 232.33 s gammaloop-nextest-integration> 1/(denom(0,q₀,mUVexp²,-mUV²+(q₀.q₀))·denom(2,-q₀,mUVexp²,-mUV²+(q₀.q₀)))
  281. 232.33 s gammaloop-nextest-integration> span t{span_context=true current=subgraph=3I, topo_order=1, dod=0 given=subgraph=0, topo_order=0, dod=0}
  282. 232.33 s gammaloop-nextest-integration> [2026-09-02 14:26:31.798] @approx::local_4d [{#profile, #uv, #gamma, #integrated, #start, #trace, #vakint}] DEBUG : After gamma simplification
  283. 232.33 s gammaloop-nextest-integration> field value
  284. 232.33 s gammaloop-nextest-integration> expr n-terms: 1, byte size: 223,expr:
  285. 232.33 s gammaloop-nextest-integration> 1/(denom(0,q₀,mUVexp²,-mUV²+(q₀.q₀))·denom(2,-q₀,mUVexp²,-mUV²+(q₀.q₀)))
  286. 232.33 s gammaloop-nextest-integration> span t{span_context=true current=subgraph=3I, topo_order=1, dod=0 given=subgraph=0, topo_order=0, dod=0}
  287. 232.33 s gammaloop-nextest-integration> [2026-09-02 14:26:31.801] @approx::local_4d [{#profile, #uv, #integrated, #schoonschip, #start, #trace, #vakint}] DEBUG : After Schoonschip net
  288. 232.33 s gammaloop-nextest-integration> field value
  289. 232.33 s gammaloop-nextest-integration> expr n-terms: 1, byte size: 223,expr:
  290. 232.33 s gammaloop-nextest-integration> 1/(denom(0,q₀,mUVexp²,-mUV²+(q₀.q₀))·denom(2,-q₀,mUVexp²,-mUV²+(q₀.q₀)))
  291. 232.33 s gammaloop-nextest-integration> ... omitted 20090 more lines; see full nextest output above
  292. 232.33 s gammaloop-nextest-integration>
  293. 232.33 s gammaloop-nextest-integration> 9. gammaloop-integration-tests::uv::se1l_uv
  294. 232.33 s gammaloop-nextest-integration> failure: test failure with exit code 101
  295. 232.33 s gammaloop-nextest-integration> system-out
  296. 232.33 s gammaloop-nextest-integration> running 1 test
  297. 232.33 s gammaloop-nextest-integration> test se1l_uv has been running for over 60 seconds
  298. 232.33 s gammaloop-nextest-integration> +------+-----------------+---------+--------+----------+-----------------------------------------------------------------------------------------------------------------------+-------+
  299. 232.33 s gammaloop-nextest-integration> | case | check | graph | status | sigma | threshold | error |
  300. 232.33 s gammaloop-nextest-integration> +------+-----------------+---------+--------+----------+-----------------------------------------------------------------------------------------------------------------------+-------+
  301. 232.33 s gammaloop-nextest-integration> | se1l | uv_profile | - | FAIL | - | - | - |
  302. 232.33 s gammaloop-nextest-integration> +------+-----------------+---------+--------+----------+-----------------------------------------------------------------------------------------------------------------------+-------+
  303. 232.33 s gammaloop-nextest-integration> | se1l | m_uv.inspect | inspect | pass | - | best inspect relative delta 1.097e-1 >= 1000*accuracy 1.000e-7 (accuracy=1.000e-10, exponent=+2.0, seed=1, probes=10) | - |
  304. 232.33 s gammaloop-nextest-integration> +------+-----------------+---------+--------+----------+-----------------------------------------------------------------------------------------------------------------------+-------+
  305. 232.33 s gammaloop-nextest-integration> | se1l | m_uv.integrated | se1l | pass | 0.1sigma | compatible within 2sigma | - |
  306. 232.33 s gammaloop-nextest-integration> +------+-----------------+---------+--------+----------+-----------------------------------------------------------------------------------------------------------------------+-------+
  307. 232.33 s gammaloop-nextest-integration> | se1l | rls.inspect | inspect | pass | - | best inspect relative delta 4.499e-2 >= 1000*accuracy 1.000e-7 (accuracy=1.000e-10, exponent=+2.0, seed=1, probes=10) | - |
  308. 232.33 s gammaloop-nextest-integration> +------+-----------------+---------+--------+----------+-----------------------------------------------------------------------------------------------------------------------+-------+
  309. 232.33 s gammaloop-nextest-integration> | se1l | rls.integrated | se1l | pass | 0.0sigma | compatible within 2sigma | - |
  310. 232.33 s gammaloop-nextest-integration> +------+-----------------+---------+--------+----------+-----------------------------------------------------------------------------------------------------------------------+-------+
  311. 232.33 s gammaloop-nextest-integration> | se1l | mu_r.inspect | inspect | pass | - | best inspect relative delta 1.424e-1 >= 1000*accuracy 1.000e-7 (accuracy=1.000e-10, exponent=+2.0, seed=1, probes=10) | - |
  312. 232.33 s gammaloop-nextest-integration> +------+-----------------+---------+--------+----------+-----------------------------------------------------------------------------------------------------------------------+-------+
  313. 232.33 s gammaloop-nextest-integration> | se1l | target | - | pass | - | 2sigma | - |
  314. 232.33 s gammaloop-nextest-integration> +------+-----------------+---------+--------+----------+-----------------------------------------------------------------------------------------------------------------------+-------+
  315. 232.33 s gammaloop-nextest-integration> test se1l_uv ... FAILED
  316. 232.33 s gammaloop-nextest-integration>
  317. 232.33 s gammaloop-nextest-integration> failures:
  318. 232.33 s gammaloop-nextest-integration>
  319. 232.33 s gammaloop-nextest-integration> failures:
  320. 232.33 s gammaloop-nextest-integration> se1l_uv
  321. 232.33 s gammaloop-nextest-integration>
  322. 232.33 s gammaloop-nextest-integration> test result: FAILED. 0 passed; 1 failed; 0 ignored; 0 measured; 24 filtered out; finished in 135.84s
  323. 232.33 s gammaloop-nextest-integration> system-err
  324. 232.33 s gammaloop-nextest-integration> [2026-09-02 14:26:30.857] @gammaloop_api::se... INFO : Running command run generate
  325. 232.33 s gammaloop-nextest-integration> [2026-09-02 14:26:30.857] @gammaloop_api::se... INFO : Starting command block generate
  326. 232.33 s gammaloop-nextest-integration> [2026-09-02 14:26:30.857] @gammaloop_api::se... INFO : Running command import model sm-default
  327. 232.33 s gammaloop-nextest-integration> [2026-09-02 14:26:30.857] @import::model INFO : Loading built-in JSON model sm-default
  328. 232.33 s gammaloop-nextest-integration> [2026-09-02 14:26:30.937] @gammalooprs::model INFO : The following 11 external parameters were forced to zero by the restriction card:
  329. 232.33 s gammaloop-nextest-integration> lamWS, AWS, rhoWS, etaWS, ymc, yme, ymm, MC, Me, MM, WTau
  330. 232.33 s gammaloop-nextest-integration> [2026-09-02 14:26:30.937] @gammalooprs::model INFO : The following 34 vertex rules were removed by the restriction card:
  331. 232.33 s gammaloop-nextest-integration> V_82 -> (c~, d, G+) | V_83 -> (t~, d, G+) | V_84 -> (c~, s, G+) | V_85 -> (t~, s, G+) | V_86 -> (u~, b, G+) | V_87 -> (c~, b, G+) | V_90 -> (c~, d, W+) | V_91 -> (t~, d, W+) | V_92 -> (u~, s, W+) | V_94 -> (t~, s, W+) | V_95 -> (u~, b, W+) | V_96 -> (c~, b, W+) | V_101 -> (e+, e-, G0) | V_102 -> (mu+, mu-, G0) | V_104 -> (e+, e-, H) | V_105 -> (mu+, mu-, H) | V_110 -> (ve~, e-, G+) | V_111 -> (vm~, mu-, G+) | V_116 -> (b~, u, G-) | V_117 -> (d~, c, G-) | V_118 -> (s~, c, G-) | V_119 -> (b~, c, G-) | V_120 -> (d~, t, G-) | V_121 -> (s~, t, G-) | V_124 -> (s~, u, W-) | V_125 -> (b~, u, W-) | V_126 -> (d~, c, W-) | V_128 -> (b~, c, W-) | V_129 -> (d~, t, W-) | V_130 -> (s~, t, W-) | V_138 -> (c~, c, G0) | V_140 -> (c~, c, H) | V_145 -> (e+, ve, G-) | V_146 -> (mu+, vm, G-)
  332. 232.33 s gammaloop-nextest-integration> [2026-09-02 14:26:30.938] @gammalooprs::model INFO : The following 36 couplings were removed by the restriction card:
  333. 232.33 s gammaloop-nextest-integration> GC_13, GC_14, GC_16, GC_17, GC_18, GC_19, GC_20, GC_22, GC_23, GC_24, GC_25, GC_26, GC_28, GC_29, GC_42, GC_43, GC_44, GC_46, GC_47, GC_48, GC_84, GC_85, GC_86, GC_87, GC_88, GC_89, GC_90, GC_91, GC_92, GC_93, GC_101, GC_102, GC_103, GC_105, GC_106, GC_107
  334. 232.33 s gammaloop-nextest-integration> [2026-09-02 14:26:30.939] @gammaloop_api::se... INFO : Running command remove processes
  335. 232.33 s gammaloop-nextest-integration> [2026-09-02 14:26:30.939] @gammaloop_api::se... INFO : Running command set global kv global.generation.uv.generate_integrated=true
  336. 232.33 s gammaloop-nextest-integration> [2026-09-02 14:26:30.940] @gammaloop_api::se... INFO : Running command import graphs ./tests/resources/graphs/uv_tests/se1l.dot -p se1l -i se1l
  337. 232.33 s gammaloop-nextest-integration> [2026-09-02 14:26:30.940] @commands::import INFO : Loading graphs from '/build/source/tests/resources/graphs/uv_tests/se1l.dot'
  338. 232.33 s gammaloop-nextest-integration> [2026-09-02 14:26:30.945] @gammaloop_api::se... INFO : Running command generate existing -p se1l -i se1l
  339. 232.33 s gammaloop-nextest-integration> [2026-09-02 14:26:32.607] @commands::generate INFO :
  340. 232.33 s gammaloop-nextest-integration> Integrand generation summary
  341. 232.33 s gammaloop-nextest-integration> peak RAM 90.07 MiB | cores 1
  342. 232.33 s gammaloop-nextest-integration> ╭───────────┬───────┬─────────┬─────────────┬─────────────┬────────────────┬─────────────╮
  343. 232.33 s gammaloop-nextest-integration> │ integrand │ graph │ # evals │ expr build │ spenso │ symbolica eval │ compile │
  344. 232.33 s gammaloop-nextest-integration> ├───────────┼───────┼─────────┼─────────────┼─────────────┼────────────────┼─────────────┤
  345. 232.33 s gammaloop-nextest-integration> │ se1l │ se1l │ 5 │ 1.39s (88%) │ 46ms (3.0%) │ 140ms (8.9%) │ 0ms (0.00%) │
  346. 232.33 s gammaloop-nextest-integration> ├───────────┼───────┼─────────┼─────────────┼─────────────┼────────────────┼─────────────┤
  347. 232.33 s gammaloop-nextest-integration> │ Total │ │ 5 │ 1.39s (88%) │ 46ms (3.0%) │ 140ms (8.9%) │ 0ms (0.00%) │
  348. 232.33 s gammaloop-nextest-integration> ╰───────────┴───────┴─────────┴─────────────┴─────────────┴────────────────┴─────────────╯
  349. 232.33 s gammaloop-nextest-integration> [2026-09-02 14:26:32.616] @gammaloop_api::se... INFO : Running command set process -p se1l -i se1l kv general.m_uv=0.2
  350. 232.33 s gammaloop-nextest-integration> [2026-09-02 14:26:32.626] @gammaloop_api::se... INFO : Running command set process -p se1l -i se1l kv general.mu_r=0.2
  351. 232.33 s gammaloop-nextest-integration> [2026-09-02 14:26:32.631] @gammaloop_api::se... INFO : Running command set process -p se1l -i se1l kv general.renormalization_localization_scale=0.2
  352. 232.33 s gammaloop-nextest-integration> [2026-09-02 14:26:32.633] @gammaloop_api::se... INFO : Running command duplicate integrand -p se1l -i se1l --output_process_name se1l --output_integrand_name se1l_muv_shifted
  353. 232.33 s gammaloop-nextest-integration> [2026-09-02 14:26:32.635] @gammaloop_api::se... INFO : Running command set process -p se1l -i se1l_muv_shifted kv general.m_uv=0.5
  354. 232.33 s gammaloop-nextest-integration> [2026-09-02 14:26:32.637] @gammaloop_api::se... INFO : Running command duplicate integrand -p se1l -i se1l --output_process_name se1l --output_integrand_name se1l_rls_shifted
  355. 232.33 s gammaloop-nextest-integration> [2026-09-02 14:26:32.641] @gammaloop_api::se... INFO : Running command set process -p se1l -i se1l_rls_shifted kv general.renormalization_localization_scale=1
  356. 232.33 s gammaloop-nextest-integration> [2026-09-02 14:26:32.643] @gammaloop_api::se... INFO : Running command duplicate integrand -p se1l -i se1l --output_process_name se1l --output_integrand_name se1l_mur_shifted
  357. 232.33 s gammaloop-nextest-integration> [2026-09-02 14:26:32.647] @gammaloop_api::se... INFO : Running command set process -p se1l -i se1l_mur_shifted kv general.mu_r=0.8
  358. 232.33 s gammaloop-nextest-integration> [2026-09-02 14:26:32.657] @process::amplitude WARNING : External state 0 ('g', PDG 21, helicity +) is off shell: p^2 = +2.5e5, expected m^2 = +0e0 (|Δ| = +2.5e5). Fixed-helicity spinor/vector/tensor external states may be ill-defined at this kinematic point.
  359. 232.33 s gammaloop-nextest-integration> field value
  360. 232.33 s gammaloop-nextest-integration> span warm_up{integrand.name=se1l}
  361. 232.33 s gammaloop-nextest-integration> [2026-09-02 14:26:32.657] @process::amplitude WARNING : External state 1 ('g', PDG 21, helicity -) is off shell: p^2 = +2.5e5, expected m^2 = +0e0 (|Δ| = +2.5e5). Fixed-helicity spinor/vector/tensor external states may be ill-defined at this kinematic point.
  362. 232.33 s gammaloop-nextest-integration> field value
  363. 232.33 s gammaloop-nextest-integration> span warm_up{integrand.name=se1l}
  364. 232.33 s gammaloop-nextest-integration> [2026-09-02 14:26:32.657] @process::amplitude INFO : Input is above threshold: 1 existing threshold E-surfaces across 1/1 graph groups
  365. 232.33 s gammaloop-nextest-integration> field value
  366. 232.33 s gammaloop-nextest-integration> existing_esurfaces 1
  367. 232.33 s gammaloop-nextest-integration> group_count 1
  368. 232.33 s gammaloop-nextest-integration> groups_above_threshold 1
  369. 232.33 s gammaloop-nextest-integration> integrand se1l
  370. 232.33 s gammaloop-nextest-integration> span warm_up{integrand.name=se1l}
  371. 232.33 s gammaloop-nextest-integration> threshold_status above threshold
  372. 232.33 s gammaloop-nextest-integration> [2026-09-02 14:26:32.658] @process::amplitude INFO : overlap structure of group 0: [1: [0(2,3)]]
  373. 232.33 s gammaloop-nextest-integration> field value
  374. 232.33 s gammaloop-nextest-integration> span warm_up{integrand.name=se1l}
  375. 232.33 s gammaloop-nextest-integration> [2026-09-02 14:26:33.269] @commands::profile INFO :
  376. 232.33 s gammaloop-nextest-integration> ╭───────┬──────┬──────────┬───────┬─────┬──────────┬───────────╮
  377. 232.33 s gammaloop-nextest-integration> │ fixed │ → ∞ │ slope │ r2 │ DOD │ bare DOD │ inspect │
  378. 232.33 s gammaloop-nextest-integration> ├───────┼──────┼──────────┼───────┼─────┼──────────┼───────────┤
  379. 232.33 s gammaloop-nextest-integration> │ {} │ {e3} │ 1.639236 │ 0.904 │ 2 │ 2 │ arb retry │
  380. 232.33 s gammaloop-nextest-integration> │ {} │ {e2} │ 1.698834 │ 0.902 │ 2 │ 2 │ arb retry │
  381. 232.33 s gammaloop-nextest-integration> ╰───────┴──────┴──────────┴───────┴─────┴──────────┴───────────╯
  382. 232.33 s gammaloop-nextest-integration> [2026-09-02 14:26:33.269] @commands::profile INFO :
  383. 232.33 s gammaloop-nextest-integration> ╭───────┬──────┬─────────────┬──────────┬───────┬─────┬──────────┬───────────╮
  384. 232.33 s gammaloop-nextest-integration> │ fixed │ → ∞ │ orientation │ slope │ r2 │ DOD │ bare DOD │ inspect │
  385. 232.33 s gammaloop-nextest-integration> ├───────┼──────┼─────────────┼──────────┼───────┼─────┼──────────┼───────────┤
  386. 232.33 s gammaloop-nextest-integration> │ {} │ {e3} │ 00-+ │ 0.343429 │ 0.145 │ 0 │ 2 │ arb retry │
  387. 232.33 s gammaloop-nextest-integration> │ {} │ {e3} │ 00+- │ 0.342577 │ 0.135 │ 0 │ 2 │ arb retry │
  388. 232.33 s gammaloop-nextest-integration> │ {} │ {e2} │ 00-+ │ 0.385975 │ 0.161 │ 0 │ 2 │ arb retry │
  389. 232.33 s gammaloop-nextest-integration> │ {} │ {e2} │ 00+- │ 0.384920 │ 0.192 │ 0 │ 2 │ arb retry │
  390. 232.33 s gammaloop-nextest-integration> ╰───────┴──────┴─────────────┴──────────┴───────┴─────┴──────────┴───────────╯
  391. 232.33 s gammaloop-nextest-integration> [2026-09-02 14:26:33.271] @gammaloop_api::se... INFO : Running command set process kv integrator.target_relative_accuracy=0.001 integrator.n_increase=0 integrator.n_start=50000 integrator.n_max=400000 integrator.seed=1337
  392. 232.33 s gammaloop-nextest-integration> [2026-09-02 14:26:33.272] @commands::integrate INFO : Created workspace directory at /build/source/tests/artifacts/se1l/integration_workspace_se1l
  393. 232.33 s gammaloop-nextest-integration> [2026-09-02 14:26:33.301] @commands::integrate INFO : No integration state found, starting new integration
  394. 232.33 s gammaloop-nextest-integration> [2026-09-02 14:26:33.301] @commands::integrate INFO : Gammaloop now integrates se1l@se1l, se1l@se1l_muv_shifted, se1l@se1l_rls_shifted
  395. 232.33 s gammaloop-nextest-integration> [2026-09-02 14:26:33.302] @process::amplitude WARNING : External state 0 ('g', PDG 21, helicity +) is off shell: p^2 = +2.5e5, expected m^2 = +0e0 (|Δ| = +2.5e5). Fixed-helicity spinor/vector/tensor external states may be ill-defined at this kinematic point.
  396. 232.33 s gammaloop-nextest-integration> field value
  397. 232.33 s gammaloop-nextest-integration> span warm_up{integrand.name=se1l}
  398. 232.33 s gammaloop-nextest-integration> [2026-09-02 14:26:33.302] @process::amplitude WARNING : External state 1 ('g', PDG 21, helicity -) is off shell: p^2 = +2.5e5, expected m^2 = +0e0 (|Δ| = +2.5e5). Fixed-helicity spinor/vector/tensor external states may be ill-defined at this kinematic point.
  399. 232.33 s gammaloop-nextest-integration> field value
  400. 232.33 s gammaloop-nextest-integration> span warm_up{integrand.name=se1l}
  401. 232.33 s gammaloop-nextest-integration> [2026-09-02 14:26:33.303] @process::amplitude INFO : Input is above threshold: 1 existing threshold E-surfaces across 1/1 graph groups
  402. 232.33 s gammaloop-nextest-integration> field value
  403. 232.33 s gammaloop-nextest-integration> existing_esurfaces 1
  404. 232.33 s gammaloop-nextest-integration> group_count 1
  405. 232.33 s gammaloop-nextest-integration> groups_above_threshold 1
  406. 232.33 s gammaloop-nextest-integration> integrand se1l
  407. 232.33 s gammaloop-nextest-integration> span warm_up{integrand.name=se1l}
  408. 232.33 s gammaloop-nextest-integration> threshold_status above threshold
  409. 232.33 s gammaloop-nextest-integration> [2026-09-02 14:26:33.303] @process::amplitude INFO : overlap structure of group 0: [1: [0(2,3)]]
  410. 232.33 s gammaloop-nextest-integration> field value
  411. 232.33 s gammaloop-nextest-integration> span warm_up{integrand.name=se1l}
  412. 232.33 s gammaloop-nextest-integration> [2026-09-02 14:26:33.304] @process::amplitude WARNING : External state 0 ('g', PDG 21, helicity +) is off shell: p^2 = +2.5e5, expected m^2 = +0e0 (|Δ| = +2.5e5). Fixed-helicity spinor/vector/tensor external states may be ill-defined at this kinematic point.
  413. 232.33 s gammaloop-nextest-integration> field value
  414. 232.33 s gammaloop-nextest-integration> span warm_up{integrand.name=se1l_muv_shifted}
  415. 232.33 s gammaloop-nextest-integration> [2026-09-02 14:26:33.305] @process::amplitude WARNING : External state 1 ('g', PDG 21, helicity -) is off shell: p^2 = +2.5e5, expected m^2 = +0e0 (|Δ| = +2.5e5). Fixed-helicity spinor/vector/tensor external states may be ill-defined at this kinematic point.
  416. 232.33 s gammaloop-nextest-integration> field value
  417. 232.33 s gammaloop-nextest-integration> span warm_up{integrand.name=se1l_muv_shifted}
  418. 232.33 s gammaloop-nextest-integration> [2026-09-02 14:26:33.305] @process::amplitude INFO : Input is above threshold: 1 existing threshold E-surfaces across 1/1 graph groups
  419. 232.33 s gammaloop-nextest-integration> field value
  420. 232.33 s gammaloop-nextest-integration> existing_esurfaces 1
  421. 232.33 s gammaloop-nextest-integration> group_count 1
  422. 232.33 s gammaloop-nextest-integration> groups_above_threshold 1
  423. 232.33 s gammaloop-nextest-integration> integrand se1l_muv_shifted
  424. 232.33 s gammaloop-nextest-integration> span warm_up{integrand.name=se1l_muv_shifted}
  425. 232.33 s gammaloop-nextest-integration> threshold_status above threshold
  426. 232.33 s gammaloop-nextest-integration> [2026-09-02 14:26:33.305] @process::amplitude INFO : overlap structure of group 0: [1: [0(2,3)]]
  427. 232.33 s gammaloop-nextest-integration> field value
  428. 232.33 s gammaloop-nextest-integration> span warm_up{integrand.name=se1l_muv_shifted}
  429. 232.33 s gammaloop-nextest-integration> [2026-09-02 14:26:33.307] @process::amplitude WARNING : External state 0 ('g', PDG 21, helicity +) is off shell: p^2 = +2.5e5, expected m^2 = +0e0 (|Δ| = +2.5e5). Fixed-helicity spinor/vector/tensor external states may be ill-defined at this kinematic point.
  430. 232.33 s gammaloop-nextest-integration> field value
  431. 232.33 s gammaloop-nextest-integration> span warm_up{integrand.name=se1l_rls_shifted}
  432. 232.33 s gammaloop-nextest-integration> [2026-09-02 14:26:33.308] @process::amplitude WARNING : External state 1 ('g', PDG 21, helicity -) is off shell: p^2 = +2.5e5, expected m^2 = +0e0 (|Δ| = +2.5e5). Fixed-helicity spinor/vector/tensor external states may be ill-defined at this kinematic point.
  433. 232.33 s gammaloop-nextest-integration> field value
  434. 232.33 s gammaloop-nextest-integration> span warm_up{integrand.name=se1l_rls_shifted}
  435. 232.33 s gammaloop-nextest-integration> [2026-09-02 14:26:33.308] @process::amplitude INFO : Input is above threshold: 1 existing threshold E-surfaces across 1/1 graph groups
  436. 232.33 s gammaloop-nextest-integration> field value
  437. 232.33 s gammaloop-nextest-integration> existing_esurfaces 1
  438. 232.33 s gammaloop-nextest-integration> group_count 1
  439. 232.33 s gammaloop-nextest-integration> groups_above_threshold 1
  440. 232.33 s gammaloop-nextest-integration> integrand se1l_rls_shifted
  441. 232.33 s gammaloop-nextest-integration> span warm_up{integrand.name=se1l_rls_shifted}
  442. 232.33 s gammaloop-nextest-integration> threshold_status above threshold
  443. 232.33 s gammaloop-nextest-integration> ... omitted 1410 more lines; see full nextest output above
  444. 232.33 s gammaloop-nextest-integration> =========================================
  445. 232.62 s error: Cannot build '/nix/store/zpyfjihmv7i6ghxwmb5sjv51y6brg4wy-gammaloop-nextest-integration.drv'.
  446. 232.62 s Reason: builder failed with exit code 100.
  447. 232.62 s Output paths:
  448. 232.62 s /nix/store/k1knsdpdly6yc14pxdqxjbszfxpz040p-gammaloop-nextest-integration
  449. 232.62 s Last 2048 log lines:
  450. 232.62 s > threshold_status above threshold
  451. 232.62 s > [2026-09-02 14:28:46.192] @process::amplitude INFO : overlap structure of group 0: [1: [0(2,3)]]
  452. 232.62 s > field value
  453. 232.62 s > span warm_up{integrand.name=se1l_muv_shifted}
  454. 232.62 s > [2026-09-02 14:28:46.195] @process::amplitude WARNING : External state 0 ('g', PDG 21, helicity +) is off shell: p^2 = +2.5e5, expected m^2 = +0e0 (|Δ| = +2.5e5). Fixed-helicity spinor/vector/tensor external states may be ill-defined at this kinematic point.
  455. 232.62 s > field value
  456. 232.62 s > span warm_up{integrand.name=se1l}
  457. 232.62 s > [2026-09-02 14:28:46.196] @process::amplitude WARNING : External state 1 ('g', PDG 21, helicity -) is off shell: p^2 = +2.5e5, expected m^2 = +0e0 (|Δ| = +2.5e5). Fixed-helicity spinor/vector/tensor external states may be ill-defined at this kinematic point.
  458. 232.62 s > field value
  459. 232.62 s > span warm_up{integrand.name=se1l}
  460. 232.62 s > [2026-09-02 14:28:46.196] @process::amplitude INFO : Input is above threshold: 1 existing threshold E-surfaces across 1/1 graph groups
  461. 232.62 s > field value
  462. 232.62 s > existing_esurfaces 1
  463. 232.62 s > group_count 1
  464. 232.62 s > groups_above_threshold 1
  465. 232.62 s > integrand se1l
  466. 232.62 s > span warm_up{integrand.name=se1l}
  467. 232.62 s > threshold_status above threshold
  468. 232.62 s > [2026-09-02 14:28:46.196] @process::amplitude INFO : overlap structure of group 0: [1: [0(2,3)]]
  469. 232.62 s > field value
  470. 232.62 s > span warm_up{integrand.name=se1l}
  471. 232.62 s > [2026-09-02 14:28:46.199] @process::amplitude WARNING : External state 0 ('g', PDG 21, helicity +) is off shell: p^2 = +2.5e5, expected m^2 = +0e0 (|Δ| = +2.5e5). Fixed-helicity spinor/vector/tensor external states may be ill-defined at this kinematic point.
  472. 232.62 s > field value
  473. 232.62 s > span warm_up{integrand.name=se1l_muv_shifted}
  474. 232.62 s > [2026-09-02 14:28:46.200] @process::amplitude WARNING : External state 1 ('g', PDG 21, helicity -) is off shell: p^2 = +2.5e5, expected m^2 = +0e0 (|Δ| = +2.5e5). Fixed-helicity spinor/vector/tensor external states may be ill-defined at this kinematic point.
  475. 232.62 s > field value
  476. 232.62 s > span warm_up{integrand.name=se1l_muv_shifted}
  477. 232.62 s > [2026-09-02 14:28:46.200] @process::amplitude INFO : Input is above threshold: 1 existing threshold E-surfaces across 1/1 graph groups
  478. 232.62 s > field value
  479. 232.62 s > existing_esurfaces 1
  480. 232.62 s > group_count 1
  481. 232.62 s > groups_above_threshold 1
  482. 232.62 s > integrand se1l_muv_shifted
  483. 232.62 s > span warm_up{integrand.name=se1l_muv_shifted}
  484. 232.62 s > threshold_status above threshold
  485. 232.62 s > [2026-09-02 14:28:46.200] @process::amplitude INFO : overlap structure of group 0: [1: [0(2,3)]]
  486. 232.62 s > field value
  487. 232.62 s > span warm_up{integrand.name=se1l_muv_shifted}
  488. 232.62 s > [2026-09-02 14:28:46.203] @process::amplitude WARNING : External state 0 ('g', PDG 21, helicity +) is off shell: p^2 = +2.5e5, expected m^2 = +0e0 (|Δ| = +2.5e5). Fixed-helicity spinor/vector/tensor external states may be ill-defined at this kinematic point.
  489. 232.62 s > field value
  490. 232.62 s > span warm_up{integrand.name=se1l}
  491. 232.62 s > [2026-09-02 14:28:46.204] @process::amplitude WARNING : External state 1 ('g', PDG 21, helicity -) is off shell: p^2 = +2.5e5, expected m^2 = +0e0 (|Δ| = +2.5e5). Fixed-helicity spinor/vector/tensor external states may be ill-defined at this kinematic point.
  492. 232.62 s > field value
  493. 232.62 s > span warm_up{integrand.name=se1l}
  494. 232.62 s > [2026-09-02 14:28:46.204] @process::amplitude INFO : Input is above threshold: 1 existing threshold E-surfaces across 1/1 graph groups
  495. 232.62 s > field value
  496. 232.62 s > existing_esurfaces 1
  497. 232.62 s > group_count 1
  498. 232.62 s > groups_above_threshold 1
  499. 232.62 s > integrand se1l
  500. 232.62 s > span warm_up{integrand.name=se1l}
  501. 232.62 s > threshold_status above threshold
  502. 232.62 s > [2026-09-02 14:28:46.204] @process::amplitude INFO : overlap structure of group 0: [1: [0(2,3)]]
  503. 232.62 s > field value
  504. 232.62 s > span warm_up{integrand.name=se1l}
  505. 232.62 s > [2026-09-02 14:28:46.207] @process::amplitude WARNING : External state 0 ('g', PDG 21, helicity +) is off shell: p^2 = +2.5e5, expected m^2 = +0e0 (|Δ| = +2.5e5). Fixed-helicity spinor/vector/tensor external states may be ill-defined at this kinematic point.
  506. 232.62 s > field value
  507. 232.62 s > span warm_up{integrand.name=se1l_muv_shifted}
  508. 232.62 s > [2026-09-02 14:28:46.208] @process::amplitude WARNING : External state 1 ('g', PDG 21, helicity -) is off shell: p^2 = +2.5e5, expected m^2 = +0e0 (|Δ| = +2.5e5). Fixed-helicity spinor/vector/tensor external states may be ill-defined at this kinematic point.
  509. 232.62 s > field value
  510. 232.62 s > span warm_up{integrand.name=se1l_muv_shifted}
  511. 232.62 s > [2026-09-02 14:28:46.208] @process::amplitude INFO : Input is above threshold: 1 existing threshold E-surfaces across 1/1 graph groups
  512. 232.62 s > field value
  513. 232.62 s > existing_esurfaces 1
  514. 232.62 s > group_count 1
  515. 232.62 s > groups_above_threshold 1
  516. 232.62 s > integrand se1l_muv_shifted
  517. 232.62 s > span warm_up{integrand.name=se1l_muv_shifted}
  518. 232.62 s > threshold_status above threshold
  519. 232.62 s > [2026-09-02 14:28:46.208] @process::amplitude INFO : overlap structure of group 0: [1: [0(2,3)]]
  520. 232.62 s > field value
  521. 232.62 s > span warm_up{integrand.name=se1l_muv_shifted}
  522. 232.62 s > [2026-09-02 14:28:46.212] @process::amplitude WARNING : External state 0 ('g', PDG 21, helicity +) is off shell: p^2 = +2.5e5, expected m^2 = +0e0 (|Δ| = +2.5e5). Fixed-helicity spinor/vector/tensor external states may be ill-defined at this kinematic point.
  523. 232.62 s > field value
  524. 232.62 s > span warm_up{integrand.name=se1l}
  525. 232.62 s > [2026-09-02 14:28:46.212] @process::amplitude WARNING : External state 1 ('g', PDG 21, helicity -) is off shell: p^2 = +2.5e5, expected m^2 = +0e0 (|Δ| = +2.5e5). Fixed-helicity spinor/vector/tensor external states may be ill-defined at this kinematic point.
  526. 232.62 s > field value
  527. 232.62 s > span warm_up{integrand.name=se1l}
  528. 232.62 s > [2026-09-02 14:28:46.212] @process::amplitude INFO : Input is above threshold: 1 existing threshold E-surfaces across 1/1 graph groups
  529. 232.62 s > field value
  530. 232.62 s > existing_esurfaces 1
  531. 232.62 s > group_count 1
  532. 232.62 s > groups_above_threshold 1
  533. 232.62 s > integrand se1l
  534. 232.62 s > span warm_up{integrand.name=se1l}
  535. 232.62 s > threshold_status above threshold
  536. 232.62 s > [2026-09-02 14:28:46.212] @process::amplitude INFO : overlap structure of group 0: [1: [0(2,3)]]
  537. 232.62 s > field value
  538. 232.62 s > span warm_up{integrand.name=se1l}
  539. 232.62 s > [2026-09-02 14:28:46.216] @process::amplitude WARNING : External state 0 ('g', PDG 21, helicity +) is off shell: p^2 = +2.5e5, expected m^2 = +0e0 (|Δ| = +2.5e5). Fixed-helicity spinor/vector/tensor external states may be ill-defined at this kinematic point.
  540. 232.62 s > field value
  541. 232.62 s > span warm_up{integrand.name=se1l_muv_shifted}
  542. 232.62 s > [2026-09-02 14:28:46.216] @process::amplitude WARNING : External state 1 ('g', PDG 21, helicity -) is off shell: p^2 = +2.5e5, expected m^2 = +0e0 (|Δ| = +2.5e5). Fixed-helicity spinor/vector/tensor external states may be ill-defined at this kinematic point.
  543. 232.62 s > field value
  544. 232.62 s > span warm_up{integrand.name=se1l_muv_shifted}
  545. 232.62 s > [2026-09-02 14:28:46.216] @process::amplitude INFO : Input is above threshold: 1 existing threshold E-surfaces across 1/1 graph groups
  546. 232.62 s > field value
  547. 232.62 s > existing_esurfaces 1
  548. 232.62 s > group_count 1
  549. 232.62 s > groups_above_threshold 1
  550. 232.62 s > integrand se1l_muv_shifted
  551. 232.62 s > span warm_up{integrand.name=se1l_muv_shifted}
  552. 232.62 s > threshold_status above threshold
  553. 232.62 s > [2026-09-02 14:28:46.216] @process::amplitude INFO : overlap structure of group 0: [1: [0(2,3)]]
  554. 232.62 s > field value
  555. 232.62 s > span warm_up{integrand.name=se1l_muv_shifted}
  556. 232.62 s > [2026-09-02 14:28:46.220] @process::amplitude WARNING : External state 0 ('g', PDG 21, helicity +) is off shell: p^2 = +2.5e5, expected m^2 = +0e0 (|Δ| = +2.5e5). Fixed-helicity spinor/vector/tensor external states may be ill-defined at this kinematic point.
  557. 232.62 s > field value
  558. 232.62 s > span warm_up{integrand.name=se1l}
  559. 232.62 s > [2026-09-02 14:28:46.220] @process::amplitude WARNING : External state 1 ('g', PDG 21, helicity -) is off shell: p^2 = +2.5e5, expected m^2 = +0e0 (|Δ| = +2.5e5). Fixed-helicity spinor/vector/tensor external states may be ill-defined at this kinematic point.
  560. 232.62 s > field value
  561. 232.62 s > span warm_up{integrand.name=se1l}
  562. 232.62 s > [2026-09-02 14:28:46.220] @process::amplitude INFO : Input is above threshold: 1 existing threshold E-surfaces across 1/1 graph groups
  563. 232.62 s > field value
  564. 232.62 s > existing_esurfaces 1
  565. 232.62 s > group_count 1
  566. 232.62 s > groups_above_threshold 1
  567. 232.62 s > integrand se1l
  568. 232.62 s > span warm_up{integrand.name=se1l}
  569. 232.62 s > threshold_status above threshold
  570. 232.62 s > [2026-09-02 14:28:46.220] @process::amplitude INFO : overlap structure of group 0: [1: [0(2,3)]]
  571. 232.62 s > field value
  572. 232.62 s > span warm_up{integrand.name=se1l}
  573. 232.62 s > [2026-09-02 14:28:46.224] @process::amplitude WARNING : External state 0 ('g', PDG 21, helicity +) is off shell: p^2 = +2.5e5, expected m^2 = +0e0 (|Δ| = +2.5e5). Fixed-helicity spinor/vector/tensor external states may be ill-defined at this kinematic point.
  574. 232.62 s > field value
  575. 232.62 s > span warm_up{integrand.name=se1l_rls_shifted}
  576. 232.62 s > [2026-09-02 14:28:46.224] @process::amplitude WARNING : External state 1 ('g', PDG 21, helicity -) is off shell: p^2 = +2.5e5, expected m^2 = +0e0 (|Δ| = +2.5e5). Fixed-helicity spinor/vector/tensor external states may be ill-defined at this kinematic point.
  577. 232.62 s > field value
  578. 232.62 s > span warm_up{integrand.name=se1l_rls_shifted}
  579. 232.62 s > [2026-09-02 14:28:46.224] @process::amplitude INFO : Input is above threshold: 1 existing threshold E-surfaces across 1/1 graph groups
  580. 232.62 s > field value
  581. 232.62 s > existing_esurfaces 1
  582. 232.62 s > group_count 1
  583. 232.62 s > groups_above_threshold 1
  584. 232.62 s > integrand se1l_rls_shifted
  585. 232.62 s > span warm_up{integrand.name=se1l_rls_shifted}
  586. 232.62 s > threshold_status above threshold
  587. 232.62 s > [2026-09-02 14:28:46.224] @process::amplitude INFO : overlap structure of group 0: [1: [0(2,3)]]
  588. 232.62 s > field value
  589. 232.62 s > span warm_up{integrand.name=se1l_rls_shifted}
  590. 232.62 s > [2026-09-02 14:28:46.228] @process::amplitude WARNING : External state 0 ('g', PDG 21, helicity +) is off shell: p^2 = +2.5e5, expected m^2 = +0e0 (|Δ| = +2.5e5). Fixed-helicity spinor/vector/tensor external states may be ill-defined at this kinematic point.
  591. 232.62 s > field value
  592. 232.62 s > span warm_up{integrand.name=se1l}
  593. 232.62 s > [2026-09-02 14:28:46.228] @process::amplitude WARNING : External state 1 ('g', PDG 21, helicity -) is off shell: p^2 = +2.5e5, expected m^2 = +0e0 (|Δ| = +2.5e5). Fixed-helicity spinor/vector/tensor external states may be ill-defined at this kinematic point.
  594. 232.62 s > field value
  595. 232.62 s > span warm_up{integrand.name=se1l}
  596. 232.62 s > [2026-09-02 14:28:46.228] @process::amplitude INFO : Input is above threshold: 1 existing threshold E-surfaces across 1/1 graph groups
  597. 232.62 s > field value
  598. 232.62 s > existing_esurfaces 1
  599. 232.62 s > group_count 1
  600. 232.62 s > groups_above_threshold 1
  601. 232.62 s > integrand se1l
  602. 232.62 s > span warm_up{integrand.name=se1l}
  603. 232.62 s > threshold_status above threshold
  604. 232.62 s > [2026-09-02 14:28:46.228] @process::amplitude INFO : overlap structure of group 0: [1: [0(2,3)]]
  605. 232.62 s > field value
  606. 232.62 s > span warm_up{integrand.name=se1l}
  607. 232.62 s > [2026-09-02 14:28:46.232] @process::amplitude WARNING : External state 0 ('g', PDG 21, helicity +) is off shell: p^2 = +2.5e5, expected m^2 = +0e0 (|Δ| = +2.5e5). Fixed-helicity spinor/vector/tensor external states may be ill-defined at this kinematic point.
  608. 232.62 s > field value
  609. 232.62 s > span warm_up{integrand.name=se1l_rls_shifted}
  610. 232.62 s > [2026-09-02 14:28:46.232] @process::amplitude WARNING : External state 1 ('g', PDG 21, helicity -) is off shell: p^2 = +2.5e5, expected m^2 = +0e0 (|Δ| = +2.5e5). Fixed-helicity spinor/vector/tensor external states may be ill-defined at this kinematic point.
  611. 232.62 s > field value
  612. 232.62 s > span warm_up{integrand.name=se1l_rls_shifted}
  613. 232.62 s > [2026-09-02 14:28:46.232] @process::amplitude INFO : Input is above threshold: 1 existing threshold E-surfaces across 1/1 graph groups
  614. 232.62 s > field value
  615. 232.62 s > existing_esurfaces 1
  616. 232.62 s > group_count 1
  617. 232.62 s > groups_above_threshold 1
  618. 232.62 s > integrand se1l_rls_shifted
  619. 232.62 s > span warm_up{integrand.name=se1l_rls_shifted}
  620. 232.62 s > threshold_status above threshold
  621. 232.62 s > [2026-09-02 14:28:46.232] @process::amplitude INFO : overlap structure of group 0: [1: [0(2,3)]]
  622. 232.62 s > field value
  623. 232.62 s > span warm_up{integrand.name=se1l_rls_shifted}
  624. 232.62 s > [2026-09-02 14:28:46.236] @process::amplitude WARNING : External state 0 ('g', PDG 21, helicity +) is off shell: p^2 = +2.5e5, expected m^2 = +0e0 (|Δ| = +2.5e5). Fixed-helicity spinor/vector/tensor external states may be ill-defined at this kinematic point.
  625. 232.62 s > field value
  626. 232.62 s > span warm_up{integrand.name=se1l}
  627. 232.62 s > [2026-09-02 14:28:46.236] @process::amplitude WARNING : External state 1 ('g', PDG 21, helicity -) is off shell: p^2 = +2.5e5, expected m^2 = +0e0 (|Δ| = +2.5e5). Fixed-helicity spinor/vector/tensor external states may be ill-defined at this kinematic point.
  628. 232.62 s > field value
  629. 232.62 s > span warm_up{integrand.name=se1l}
  630. 232.62 s > [2026-09-02 14:28:46.236] @process::amplitude INFO : Input is above threshold: 1 existing threshold E-surfaces across 1/1 graph groups
  631. 232.62 s > field value
  632. 232.62 s > existing_esurfaces 1
  633. 232.62 s > group_count 1
  634. 232.62 s > groups_above_threshold 1
  635. 232.62 s > integrand se1l
  636. 232.62 s > span warm_up{integrand.name=se1l}
  637. 232.62 s > threshold_status above threshold
  638. 232.62 s > [2026-09-02 14:28:46.237] @process::amplitude INFO : overlap structure of group 0: [1: [0(2,3)]]
  639. 232.62 s > field value
  640. 232.62 s > span warm_up{integrand.name=se1l}
  641. 232.62 s > [2026-09-02 14:28:46.240] @process::amplitude WARNING : External state 0 ('g', PDG 21, helicity +) is off shell: p^2 = +2.5e5, expected m^2 = +0e0 (|Δ| = +2.5e5). Fixed-helicity spinor/vector/tensor external states may be ill-defined at this kinematic point.
  642. 232.62 s > field value
  643. 232.62 s > span warm_up{integrand.name=se1l_rls_shifted}
  644. 232.62 s > [2026-09-02 14:28:46.240] @process::amplitude WARNING : External state 1 ('g', PDG 21, helicity -) is off shell: p^2 = +2.5e5, expected m^2 = +0e0 (|Δ| = +2.5e5). Fixed-helicity spinor/vector/tensor external states may be ill-defined at this kinematic point.
  645. 232.62 s > field value
  646. 232.62 s > span warm_up{integrand.name=se1l_rls_shifted}
  647. 232.62 s > [2026-09-02 14:28:46.241] @process::amplitude INFO : Input is above threshold: 1 existing threshold E-surfaces across 1/1 graph groups
  648. 232.62 s > field value
  649. 232.62 s > existing_esurfaces 1
  650. 232.62 s > group_count 1
  651. 232.62 s > groups_above_threshold 1
  652. 232.62 s > integrand se1l_rls_shifted
  653. 232.62 s > span warm_up{integrand.name=se1l_rls_shifted}
  654. 232.62 s > threshold_status above threshold
  655. 232.62 s > [2026-09-02 14:28:46.241] @process::amplitude INFO : overlap structure of group 0: [1: [0(2,3)]]
  656. 232.62 s > field value
  657. 232.62 s > span warm_up{integrand.name=se1l_rls_shifted}
  658. 232.62 s > [2026-09-02 14:28:46.244] @process::amplitude WARNING : External state 0 ('g', PDG 21, helicity +) is off shell: p^2 = +2.5e5, expected m^2 = +0e0 (|Δ| = +2.5e5). Fixed-helicity spinor/vector/tensor external states may be ill-defined at this kinematic point.
  659. 232.62 s > field value
  660. 232.62 s > span warm_up{integrand.name=se1l}
  661. 232.62 s > [2026-09-02 14:28:46.244] @process::amplitude WARNING : External state 1 ('g', PDG 21, helicity -) is off shell: p^2 = +2.5e5, expected m^2 = +0e0 (|Δ| = +2.5e5). Fixed-helicity spinor/vector/tensor external states may be ill-defined at this kinematic point.
  662. 232.62 s > field value
  663. 232.62 s > span warm_up{integrand.name=se1l}
  664. 232.62 s > [2026-09-02 14:28:46.245] @process::amplitude INFO : Input is above threshold: 1 existing threshold E-surfaces across 1/1 graph groups
  665. 232.62 s > field value
  666. 232.62 s > existing_esurfaces 1
  667. 232.62 s > group_count 1
  668. 232.62 s > groups_above_threshold 1
  669. 232.62 s > integrand se1l
  670. 232.62 s > span warm_up{integrand.name=se1l}
  671. 232.62 s > threshold_status above threshold
  672. 232.62 s > [2026-09-02 14:28:46.245] @process::amplitude INFO : overlap structure of group 0: [1: [0(2,3)]]
  673. 232.62 s > field value
  674. 232.62 s > span warm_up{integrand.name=se1l}
  675. 232.62 s > [2026-09-02 14:28:46.249] @process::amplitude WARNING : External state 0 ('g', PDG 21, helicity +) is off shell: p^2 = +2.5e5, expected m^2 = +0e0 (|Δ| = +2.5e5). Fixed-helicity spinor/vector/tensor external states may be ill-defined at this kinematic point.
  676. 232.62 s > field value
  677. 232.62 s > span warm_up{integrand.name=se1l_rls_shifted}
  678. 232.62 s > [2026-09-02 14:28:46.249] @process::amplitude WARNING : External state 1 ('g', PDG 21, helicity -) is off shell: p^2 = +2.5e5, expected m^2 = +0e0 (|Δ| = +2.5e5). Fixed-helicity spinor/vector/tensor external states may be ill-defined at this kinematic point.
  679. 232.62 s > field value
  680. 232.62 s > span warm_up{integrand.name=se1l_rls_shifted}
  681. 232.62 s > [2026-09-02 14:28:46.249] @process::amplitude INFO : Input is above threshold: 1 existing threshold E-surfaces across 1/1 graph groups
  682. 232.62 s > field value
  683. 232.62 s > existing_esurfaces 1
  684. 232.62 s > group_count 1
  685. 232.62 s > groups_above_threshold 1
  686. 232.62 s > integrand se1l_rls_shifted
  687. 232.62 s > span warm_up{integrand.name=se1l_rls_shifted}
  688. 232.62 s > threshold_status above threshold
  689. 232.62 s > [2026-09-02 14:28:46.249] @process::amplitude INFO : overlap structure of group 0: [1: [0(2,3)]]
  690. 232.62 s > field value
  691. 232.62 s > span warm_up{integrand.name=se1l_rls_shifted}
  692. 232.62 s > [2026-09-02 14:28:46.253] @process::amplitude WARNING : External state 0 ('g', PDG 21, helicity +) is off shell: p^2 = +2.5e5, expected m^2 = +0e0 (|Δ| = +2.5e5). Fixed-helicity spinor/vector/tensor external states may be ill-defined at this kinematic point.
  693. 232.62 s > field value
  694. 232.62 s > span warm_up{integrand.name=se1l}
  695. 232.62 s > [2026-09-02 14:28:46.253] @process::amplitude WARNING : External state 1 ('g', PDG 21, helicity -) is off shell: p^2 = +2.5e5, expected m^2 = +0e0 (|Δ| = +2.5e5). Fixed-helicity spinor/vector/tensor external states may be ill-defined at this kinematic point.
  696. 232.62 s > field value
  697. 232.62 s > span warm_up{integrand.name=se1l}
  698. 232.62 s > [2026-09-02 14:28:46.253] @process::amplitude INFO : Input is above threshold: 1 existing threshold E-surfaces across 1/1 graph groups
  699. 232.62 s > field value
  700. 232.62 s > existing_esurfaces 1
  701. 232.62 s > group_count 1
  702. 232.62 s > groups_above_threshold 1
  703. 232.62 s > integrand se1l
  704. 232.62 s > span warm_up{integrand.name=se1l}
  705. 232.62 s > threshold_status above threshold
  706. 232.62 s > [2026-09-02 14:28:46.253] @process::amplitude INFO : overlap structure of group 0: [1: [0(2,3)]]
  707. 232.62 s > field value
  708. 232.62 s > span warm_up{integrand.name=se1l}
  709. 232.62 s > [2026-09-02 14:28:46.257] @process::amplitude WARNING : External state 0 ('g', PDG 21, helicity +) is off shell: p^2 = +2.5e5, expected m^2 = +0e0 (|Δ| = +2.5e5). Fixed-helicity spinor/vector/tensor external states may be ill-defined at this kinematic point.
  710. 232.62 s > field value
  711. 232.62 s > span warm_up{integrand.name=se1l_rls_shifted}
  712. 232.62 s > [2026-09-02 14:28:46.257] @process::amplitude WARNING : External state 1 ('g', PDG 21, helicity -) is off shell: p^2 = +2.5e5, expected m^2 = +0e0 (|Δ| = +2.5e5). Fixed-helicity spinor/vector/tensor external states may be ill-defined at this kinematic point.
  713. 232.62 s > field value
  714. 232.62 s > span warm_up{integrand.name=se1l_rls_shifted}
  715. 232.62 s > [2026-09-02 14:28:46.257] @process::amplitude INFO : Input is above threshold: 1 existing threshold E-surfaces across 1/1 graph groups
  716. 232.62 s > field value
  717. 232.62 s > existing_esurfaces 1
  718. 232.62 s > group_count 1
  719. 232.62 s > groups_above_threshold 1
  720. 232.62 s > integrand se1l_rls_shifted
  721. 232.62 s > span warm_up{integrand.name=se1l_rls_shifted}
  722. 232.62 s > threshold_status above threshold
  723. 232.62 s > [2026-09-02 14:28:46.257] @process::amplitude INFO : overlap structure of group 0: [1: [0(2,3)]]
  724. 232.62 s > field value
  725. 232.62 s > span warm_up{integrand.name=se1l_rls_shifted}
  726. 232.62 s > [2026-09-02 14:28:46.261] @process::amplitude WARNING : External state 0 ('g', PDG 21, helicity +) is off shell: p^2 = +2.5e5, expected m^2 = +0e0 (|Δ| = +2.5e5). Fixed-helicity spinor/vector/tensor external states may be ill-defined at this kinematic point.
  727. 232.62 s > field value
  728. 232.62 s > span warm_up{integrand.name=se1l}
  729. 232.62 s > [2026-09-02 14:28:46.261] @process::amplitude WARNING : External state 1 ('g', PDG 21, helicity -) is off shell: p^2 = +2.5e5, expected m^2 = +0e0 (|Δ| = +2.5e5). Fixed-helicity spinor/vector/tensor external states may be ill-defined at this kinematic point.
  730. 232.62 s > field value
  731. 232.62 s > span warm_up{integrand.name=se1l}
  732. 232.62 s > [2026-09-02 14:28:46.261] @process::amplitude INFO : Input is above threshold: 1 existing threshold E-surfaces across 1/1 graph groups
  733. 232.62 s > field value
  734. 232.62 s > existing_esurfaces 1
  735. 232.62 s > group_count 1
  736. 232.62 s > groups_above_threshold 1
  737. 232.62 s > integrand se1l
  738. 232.62 s > span warm_up{integrand.name=se1l}
  739. 232.62 s > threshold_status above threshold
  740. 232.62 s > [2026-09-02 14:28:46.261] @process::amplitude INFO : overlap structure of group 0: [1: [0(2,3)]]
  741. 232.62 s > field value
  742. 232.62 s > span warm_up{integrand.name=se1l}
  743. 232.62 s > [2026-09-02 14:28:46.265] @process::amplitude WARNING : External state 0 ('g', PDG 21, helicity +) is off shell: p^2 = +2.5e5, expected m^2 = +0e0 (|Δ| = +2.5e5). Fixed-helicity spinor/vector/tensor external states may be ill-defined at this kinematic point.
  744. 232.62 s > field value
  745. 232.62 s > span warm_up{integrand.name=se1l_rls_shifted}
  746. 232.62 s > [2026-09-02 14:28:46.265] @process::amplitude WARNING : External state 1 ('g', PDG 21, helicity -) is off shell: p^2 = +2.5e5, expected m^2 = +0e0 (|Δ| = +2.5e5). Fixed-helicity spinor/vector/tensor external states may be ill-defined at this kinematic point.
  747. 232.62 s > field value
  748. 232.62 s > span warm_up{integrand.name=se1l_rls_shifted}
  749. 232.62 s > [2026-09-02 14:28:46.265] @process::amplitude INFO : Input is above threshold: 1 existing threshold E-surfaces across 1/1 graph groups
  750. 232.62 s > field value
  751. 232.62 s > existing_esurfaces 1
  752. 232.62 s > group_count 1
  753. 232.62 s > groups_above_threshold 1
  754. 232.62 s > integrand se1l_rls_shifted
  755. 232.62 s > span warm_up{integrand.name=se1l_rls_shifted}
  756. 232.62 s > threshold_status above threshold
  757. 232.62 s > [2026-09-02 14:28:46.265] @process::amplitude INFO : overlap structure of group 0: [1: [0(2,3)]]
  758. 232.62 s > field value
  759. 232.62 s > span warm_up{integrand.name=se1l_rls_shifted}
  760. 232.62 s > [2026-09-02 14:28:46.269] @process::amplitude WARNING : External state 0 ('g', PDG 21, helicity +) is off shell: p^2 = +2.5e5, expected m^2 = +0e0 (|Δ| = +2.5e5). Fixed-helicity spinor/vector/tensor external states may be ill-defined at this kinematic point.
  761. 232.62 s > field value
  762. 232.62 s > span warm_up{integrand.name=se1l}
  763. 232.62 s > [2026-09-02 14:28:46.269] @process::amplitude WARNING : External state 1 ('g', PDG 21, helicity -) is off shell: p^2 = +2.5e5, expected m^2 = +0e0 (|Δ| = +2.5e5). Fixed-helicity spinor/vector/tensor external states may be ill-defined at this kinematic point.
  764. 232.62 s > field value
  765. 232.62 s > span warm_up{integrand.name=se1l}
  766. 232.62 s > [2026-09-02 14:28:46.269] @process::amplitude INFO : Input is above threshold: 1 existing threshold E-surfaces across 1/1 graph groups
  767. 232.62 s > field value
  768. 232.62 s > existing_esurfaces 1
  769. 232.62 s > group_count 1
  770. 232.62 s > groups_above_threshold 1
  771. 232.62 s > integrand se1l
  772. 232.62 s > span warm_up{integrand.name=se1l}
  773. 232.62 s > threshold_status above threshold
  774. 232.62 s > [2026-09-02 14:28:46.269] @process::amplitude INFO : overlap structure of group 0: [1: [0(2,3)]]
  775. 232.62 s > field value
  776. 232.62 s > span warm_up{integrand.name=se1l}
  777. 232.62 s > [2026-09-02 14:28:46.273] @process::amplitude WARNING : External state 0 ('g', PDG 21, helicity +) is off shell: p^2 = +2.5e5, expected m^2 = +0e0 (|Δ| = +2.5e5). Fixed-helicity spinor/vector/tensor external states may be ill-defined at this kinematic point.
  778. 232.62 s > field value
  779. 232.62 s > span warm_up{integrand.name=se1l_rls_shifted}
  780. 232.62 s > [2026-09-02 14:28:46.273] @process::amplitude WARNING : External state 1 ('g', PDG 21, helicity -) is off shell: p^2 = +2.5e5, expected m^2 = +0e0 (|Δ| = +2.5e5). Fixed-helicity spinor/vector/tensor external states may be ill-defined at this kinematic point.
  781. 232.62 s > field value
  782. 232.62 s > span warm_up{integrand.name=se1l_rls_shifted}
  783. 232.62 s > [2026-09-02 14:28:46.273] @process::amplitude INFO : Input is above threshold: 1 existing threshold E-surfaces across 1/1 graph groups
  784. 232.62 s > field value
  785. 232.62 s > existing_esurfaces 1
  786. 232.62 s > group_count 1
  787. 232.62 s > groups_above_threshold 1
  788. 232.62 s > integrand se1l_rls_shifted
  789. 232.62 s > span warm_up{integrand.name=se1l_rls_shifted}
  790. 232.62 s > threshold_status above threshold
  791. 232.62 s > [2026-09-02 14:28:46.273] @process::amplitude INFO : overlap structure of group 0: [1: [0(2,3)]]
  792. 232.62 s > field value
  793. 232.62 s > span warm_up{integrand.name=se1l_rls_shifted}
  794. 232.62 s > [2026-09-02 14:28:46.277] @process::amplitude WARNING : External state 0 ('g', PDG 21, helicity +) is off shell: p^2 = +2.5e5, expected m^2 = +0e0 (|Δ| = +2.5e5). Fixed-helicity spinor/vector/tensor external states may be ill-defined at this kinematic point.
  795. 232.62 s > field value
  796. 232.62 s > span warm_up{integrand.name=se1l}
  797. 232.62 s > [2026-09-02 14:28:46.277] @process::amplitude WARNING : External state 1 ('g', PDG 21, helicity -) is off shell: p^2 = +2.5e5, expected m^2 = +0e0 (|Δ| = +2.5e5). Fixed-helicity spinor/vector/tensor external states may be ill-defined at this kinematic point.
  798. 232.62 s > field value
  799. 232.62 s > span warm_up{integrand.name=se1l}
  800. 232.62 s > [2026-09-02 14:28:46.277] @process::amplitude INFO : Input is above threshold: 1 existing threshold E-surfaces across 1/1 graph groups
  801. 232.62 s > field value
  802. 232.62 s > existing_esurfaces 1
  803. 232.62 s > group_count 1
  804. 232.62 s > groups_above_threshold 1
  805. 232.62 s > integrand se1l
  806. 232.62 s > span warm_up{integrand.name=se1l}
  807. 232.62 s > threshold_status above threshold
  808. 232.62 s > [2026-09-02 14:28:46.277] @process::amplitude INFO : overlap structure of group 0: [1: [0(2,3)]]
  809. 232.62 s > field value
  810. 232.62 s > span warm_up{integrand.name=se1l}
  811. 232.62 s > [2026-09-02 14:28:46.281] @process::amplitude WARNING : External state 0 ('g', PDG 21, helicity +) is off shell: p^2 = +2.5e5, expected m^2 = +0e0 (|Δ| = +2.5e5). Fixed-helicity spinor/vector/tensor external states may be ill-defined at this kinematic point.
  812. 232.62 s > field value
  813. 232.62 s > span warm_up{integrand.name=se1l_rls_shifted}
  814. 232.62 s > [2026-09-02 14:28:46.281] @process::amplitude WARNING : External state 1 ('g', PDG 21, helicity -) is off shell: p^2 = +2.5e5, expected m^2 = +0e0 (|Δ| = +2.5e5). Fixed-helicity spinor/vector/tensor external states may be ill-defined at this kinematic point.
  815. 232.62 s > field value
  816. 232.62 s > span warm_up{integrand.name=se1l_rls_shifted}
  817. 232.62 s > [2026-09-02 14:28:46.281] @process::amplitude INFO : Input is above threshold: 1 existing threshold E-surfaces across 1/1 graph groups
  818. 232.62 s > field value
  819. 232.62 s > existing_esurfaces 1
  820. 232.62 s > group_count 1
  821. 232.62 s > groups_above_threshold 1
  822. 232.62 s > integrand se1l_rls_shifted
  823. 232.62 s > span warm_up{integrand.name=se1l_rls_shifted}
  824. 232.62 s > threshold_status above threshold
  825. 232.62 s > [2026-09-02 14:28:46.281] @process::amplitude INFO : overlap structure of group 0: [1: [0(2,3)]]
  826. 232.62 s > field value
  827. 232.62 s > span warm_up{integrand.name=se1l_rls_shifted}
  828. 232.62 s > [2026-09-02 14:28:46.285] @process::amplitude WARNING : External state 0 ('g', PDG 21, helicity +) is off shell: p^2 = +2.5e5, expected m^2 = +0e0 (|Δ| = +2.5e5). Fixed-helicity spinor/vector/tensor external states may be ill-defined at this kinematic point.
  829. 232.62 s > field value
  830. 232.62 s > span warm_up{integrand.name=se1l}
  831. 232.62 s > [2026-09-02 14:28:46.285] @process::amplitude WARNING : External state 1 ('g', PDG 21, helicity -) is off shell: p^2 = +2.5e5, expected m^2 = +0e0 (|Δ| = +2.5e5). Fixed-helicity spinor/vector/tensor external states may be ill-defined at this kinematic point.
  832. 232.62 s > field value
  833. 232.62 s > span warm_up{integrand.name=se1l}
  834. 232.62 s > [2026-09-02 14:28:46.285] @process::amplitude INFO : Input is above threshold: 1 existing threshold E-surfaces across 1/1 graph groups
  835. 232.62 s > field value
  836. 232.62 s > existing_esurfaces 1
  837. 232.62 s > group_count 1
  838. 232.62 s > groups_above_threshold 1
  839. 232.62 s > integrand se1l
  840. 232.62 s > span warm_up{integrand.name=se1l}
  841. 232.62 s > threshold_status above threshold
  842. 232.62 s > [2026-09-02 14:28:46.286] @process::amplitude INFO : overlap structure of group 0: [1: [0(2,3)]]
  843. 232.62 s > field value
  844. 232.62 s > span warm_up{integrand.name=se1l}
  845. 232.62 s > [2026-09-02 14:28:46.289] @process::amplitude WARNING : External state 0 ('g', PDG 21, helicity +) is off shell: p^2 = +2.5e5, expected m^2 = +0e0 (|Δ| = +2.5e5). Fixed-helicity spinor/vector/tensor external states may be ill-defined at this kinematic point.
  846. 232.62 s > field value
  847. 232.62 s > span warm_up{integrand.name=se1l_rls_shifted}
  848. 232.62 s > [2026-09-02 14:28:46.289] @process::amplitude WARNING : External state 1 ('g', PDG 21, helicity -) is off shell: p^2 = +2.5e5, expected m^2 = +0e0 (|Δ| = +2.5e5). Fixed-helicity spinor/vector/tensor external states may be ill-defined at this kinematic point.
  849. 232.62 s > field value
  850. 232.62 s > span warm_up{integrand.name=se1l_rls_shifted}
  851. 232.62 s > [2026-09-02 14:28:46.290] @process::amplitude INFO : Input is above threshold: 1 existing threshold E-surfaces across 1/1 graph groups
  852. 232.62 s > field value
  853. 232.62 s > existing_esurfaces 1
  854. 232.62 s > group_count 1
  855. 232.62 s > groups_above_threshold 1
  856. 232.62 s > integrand se1l_rls_shifted
  857. 232.62 s > span warm_up{integrand.name=se1l_rls_shifted}
  858. 232.62 s > threshold_status above threshold
  859. 232.62 s > [2026-09-02 14:28:46.290] @process::amplitude INFO : overlap structure of group 0: [1: [0(2,3)]]
  860. 232.62 s > field value
  861. 232.62 s > span warm_up{integrand.name=se1l_rls_shifted}
  862. 232.62 s > [2026-09-02 14:28:46.293] @process::amplitude WARNING : External state 0 ('g', PDG 21, helicity +) is off shell: p^2 = +2.5e5, expected m^2 = +0e0 (|Δ| = +2.5e5). Fixed-helicity spinor/vector/tensor external states may be ill-defined at this kinematic point.
  863. 232.62 s > field value
  864. 232.62 s > span warm_up{integrand.name=se1l}
  865. 232.62 s > [2026-09-02 14:28:46.293] @process::amplitude WARNING : External state 1 ('g', PDG 21, helicity -) is off shell: p^2 = +2.5e5, expected m^2 = +0e0 (|Δ| = +2.5e5). Fixed-helicity spinor/vector/tensor external states may be ill-defined at this kinematic point.
  866. 232.62 s > field value
  867. 232.62 s > span warm_up{integrand.name=se1l}
  868. 232.62 s > [2026-09-02 14:28:46.294] @process::amplitude INFO : Input is above threshold: 1 existing threshold E-surfaces across 1/1 graph groups
  869. 232.62 s > field value
  870. 232.62 s > existing_esurfaces 1
  871. 232.62 s > group_count 1
  872. 232.62 s > groups_above_threshold 1
  873. 232.62 s > integrand se1l
  874. 232.62 s > span warm_up{integrand.name=se1l}
  875. 232.62 s > threshold_status above threshold
  876. 232.62 s > [2026-09-02 14:28:46.294] @process::amplitude INFO : overlap structure of group 0: [1: [0(2,3)]]
  877. 232.62 s > field value
  878. 232.62 s > span warm_up{integrand.name=se1l}
  879. 232.62 s > [2026-09-02 14:28:46.298] @process::amplitude WARNING : External state 0 ('g', PDG 21, helicity +) is off shell: p^2 = +2.5e5, expected m^2 = +0e0 (|Δ| = +2.5e5). Fixed-helicity spinor/vector/tensor external states may be ill-defined at this kinematic point.
  880. 232.62 s > field value
  881. 232.62 s > span warm_up{integrand.name=se1l_rls_shifted}
  882. 232.62 s > [2026-09-02 14:28:46.298] @process::amplitude WARNING : External state 1 ('g', PDG 21, helicity -) is off shell: p^2 = +2.5e5, expected m^2 = +0e0 (|Δ| = +2.5e5). Fixed-helicity spinor/vector/tensor external states may be ill-defined at this kinematic point.
  883. 232.62 s > field value
  884. 232.62 s > span warm_up{integrand.name=se1l_rls_shifted}
  885. 232.62 s > [2026-09-02 14:28:46.298] @process::amplitude INFO : Input is above threshold: 1 existing threshold E-surfaces across 1/1 graph groups
  886. 232.62 s > field value
  887. 232.62 s > existing_esurfaces 1
  888. 232.62 s > group_count 1
  889. 232.62 s > groups_above_threshold 1
  890. 232.62 s > integrand se1l_rls_shifted
  891. 232.62 s > span warm_up{integrand.name=se1l_rls_shifted}
  892. 232.62 s > threshold_status above threshold
  893. 232.62 s > [2026-09-02 14:28:46.298] @process::amplitude INFO : overlap structure of group 0: [1: [0(2,3)]]
  894. 232.62 s > field value
  895. 232.62 s > span warm_up{integrand.name=se1l_rls_shifted}
  896. 232.62 s > [2026-09-02 14:28:46.302] @process::amplitude WARNING : External state 0 ('g', PDG 21, helicity +) is off shell: p^2 = +2.5e5, expected m^2 = +0e0 (|Δ| = +2.5e5). Fixed-helicity spinor/vector/tensor external states may be ill-defined at this kinematic point.
  897. 232.62 s > field value
  898. 232.62 s > span warm_up{integrand.name=se1l}
  899. 232.62 s > [2026-09-02 14:28:46.302] @process::amplitude WARNING : External state 1 ('g', PDG 21, helicity -) is off shell: p^2 = +2.5e5, expected m^2 = +0e0 (|Δ| = +2.5e5). Fixed-helicity spinor/vector/tensor external states may be ill-defined at this kinematic point.
  900. 232.62 s > field value
  901. 232.62 s > span warm_up{integrand.name=se1l}
  902. 232.62 s > [2026-09-02 14:28:46.302] @process::amplitude INFO : Input is above threshold: 1 existing threshold E-surfaces across 1/1 graph groups
  903. 232.62 s > field value
  904. 232.62 s > existing_esurfaces 1
  905. 232.62 s > group_count 1
  906. 232.62 s > groups_above_threshold 1
  907. 232.62 s > integrand se1l
  908. 232.62 s > span warm_up{integrand.name=se1l}
  909. 232.62 s > threshold_status above threshold
  910. 232.62 s > [2026-09-02 14:28:46.302] @process::amplitude INFO : overlap structure of group 0: [1: [0(2,3)]]
  911. 232.62 s > field value
  912. 232.62 s > span warm_up{integrand.name=se1l}
  913. 232.62 s > [2026-09-02 14:28:46.306] @process::amplitude WARNING : External state 0 ('g', PDG 21, helicity +) is off shell: p^2 = +2.5e5, expected m^2 = +0e0 (|Δ| = +2.5e5). Fixed-helicity spinor/vector/tensor external states may be ill-defined at this kinematic point.
  914. 232.62 s > field value
  915. 232.62 s > span warm_up{integrand.name=se1l_mur_shifted}
  916. 232.62 s > [2026-09-02 14:28:46.306] @process::amplitude WARNING : External state 1 ('g', PDG 21, helicity -) is off shell: p^2 = +2.5e5, expected m^2 = +0e0 (|Δ| = +2.5e5). Fixed-helicity spinor/vector/tensor external states may be ill-defined at this kinematic point.
  917. 232.62 s > field value
  918. 232.62 s > span warm_up{integrand.name=se1l_mur_shifted}
  919. 232.62 s > [2026-09-02 14:28:46.306] @process::amplitude INFO : Input is above threshold: 1 existing threshold E-surfaces across 1/1 graph groups
  920. 232.62 s > field value
  921. 232.62 s > existing_esurfaces 1
  922. 232.62 s > group_count 1
  923. 232.62 s > groups_above_threshold 1
  924. 232.62 s > integrand se1l_mur_shifted
  925. 232.62 s > span warm_up{integrand.name=se1l_mur_shifted}
  926. 232.62 s > threshold_status above threshold
  927. 232.62 s > [2026-09-02 14:28:46.306] @process::amplitude INFO : overlap structure of group 0: [1: [0(2,3)]]
  928. 232.62 s > field value
  929. 232.62 s > span warm_up{integrand.name=se1l_mur_shifted}
  930. 232.62 s > [2026-09-02 14:28:46.310] @process::amplitude WARNING : External state 0 ('g', PDG 21, helicity +) is off shell: p^2 = +2.5e5, expected m^2 = +0e0 (|Δ| = +2.5e5). Fixed-helicity spinor/vector/tensor external states may be ill-defined at this kinematic point.
  931. 232.62 s > field value
  932. 232.62 s > span warm_up{integrand.name=se1l}
  933. 232.62 s > [2026-09-02 14:28:46.310] @process::amplitude WARNING : External state 1 ('g', PDG 21, helicity -) is off shell: p^2 = +2.5e5, expected m^2 = +0e0 (|Δ| = +2.5e5). Fixed-helicity spinor/vector/tensor external states may be ill-defined at this kinematic point.
  934. 232.62 s > field value
  935. 232.62 s > span warm_up{integrand.name=se1l}
  936. 232.62 s > [2026-09-02 14:28:46.310] @process::amplitude INFO : Input is above threshold: 1 existing threshold E-surfaces across 1/1 graph groups
  937. 232.62 s > field value
  938. 232.62 s > existing_esurfaces 1
  939. 232.62 s > group_count 1
  940. 232.62 s > groups_above_threshold 1
  941. 232.62 s > integrand se1l
  942. 232.62 s > span warm_up{integrand.name=se1l}
  943. 232.62 s > threshold_status above threshold
  944. 232.62 s > [2026-09-02 14:28:46.310] @process::amplitude INFO : overlap structure of group 0: [1: [0(2,3)]]
  945. 232.62 s > field value
  946. 232.62 s > span warm_up{integrand.name=se1l}
  947. 232.62 s > [2026-09-02 14:28:46.314] @process::amplitude WARNING : External state 0 ('g', PDG 21, helicity +) is off shell: p^2 = +2.5e5, expected m^2 = +0e0 (|Δ| = +2.5e5). Fixed-helicity spinor/vector/tensor external states may be ill-defined at this kinematic point.
  948. 232.62 s > field value
  949. 232.62 s > span warm_up{integrand.name=se1l_mur_shifted}
  950. 232.62 s > [2026-09-02 14:28:46.314] @process::amplitude WARNING : External state 1 ('g', PDG 21, helicity -) is off shell: p^2 = +2.5e5, expected m^2 = +0e0 (|Δ| = +2.5e5). Fixed-helicity spinor/vector/tensor external states may be ill-defined at this kinematic point.
  951. 232.62 s > field value
  952. 232.62 s > span warm_up{integrand.name=se1l_mur_shifted}
  953. 232.62 s > [2026-09-02 14:28:46.314] @process::amplitude INFO : Input is above threshold: 1 existing threshold E-surfaces across 1/1 graph groups
  954. 232.62 s > field value
  955. 232.62 s > existing_esurfaces 1
  956. 232.62 s > group_count 1
  957. 232.62 s > groups_above_threshold 1
  958. 232.62 s > integrand se1l_mur_shifted
  959. 232.62 s > span warm_up{integrand.name=se1l_mur_shifted}
  960. 232.62 s > threshold_status above threshold
  961. 232.62 s > [2026-09-02 14:28:46.314] @process::amplitude INFO : overlap structure of group 0: [1: [0(2,3)]]
  962. 232.62 s > field value
  963. 232.62 s > span warm_up{integrand.name=se1l_mur_shifted}
  964. 232.62 s > [2026-09-02 14:28:46.318] @process::amplitude WARNING : External state 0 ('g', PDG 21, helicity +) is off shell: p^2 = +2.5e5, expected m^2 = +0e0 (|Δ| = +2.5e5). Fixed-helicity spinor/vector/tensor external states may be ill-defined at this kinematic point.
  965. 232.62 s > field value
  966. 232.62 s > span warm_up{integrand.name=se1l}
  967. 232.62 s > [2026-09-02 14:28:46.318] @process::amplitude WARNING : External state 1 ('g', PDG 21, helicity -) is off shell: p^2 = +2.5e5, expected m^2 = +0e0 (|Δ| = +2.5e5). Fixed-helicity spinor/vector/tensor external states may be ill-defined at this kinematic point.
  968. 232.62 s > field value
  969. 232.62 s > span warm_up{integrand.name=se1l}
  970. 232.62 s > [2026-09-02 14:28:46.318] @process::amplitude INFO : Input is above threshold: 1 existing threshold E-surfaces across 1/1 graph groups
  971. 232.62 s > field value
  972. 232.62 s > existing_esurfaces 1
  973. 232.62 s > group_count 1
  974. 232.62 s > groups_above_threshold 1
  975. 232.62 s > integrand se1l
  976. 232.62 s > span warm_up{integrand.name=se1l}
  977. 232.62 s > threshold_status above threshold
  978. 232.62 s > [2026-09-02 14:28:46.318] @process::amplitude INFO : overlap structure of group 0: [1: [0(2,3)]]
  979. 232.62 s > field value
  980. 232.62 s > span warm_up{integrand.name=se1l}
  981. 232.62 s > [2026-09-02 14:28:46.322] @process::amplitude WARNING : External state 0 ('g', PDG 21, helicity +) is off shell: p^2 = +2.5e5, expected m^2 = +0e0 (|Δ| = +2.5e5). Fixed-helicity spinor/vector/tensor external states may be ill-defined at this kinematic point.
  982. 232.62 s > field value
  983. 232.62 s > span warm_up{integrand.name=se1l_mur_shifted}
  984. 232.62 s > [2026-09-02 14:28:46.322] @process::amplitude WARNING : External state 1 ('g', PDG 21, helicity -) is off shell: p^2 = +2.5e5, expected m^2 = +0e0 (|Δ| = +2.5e5). Fixed-helicity spinor/vector/tensor external states may be ill-defined at this kinematic point.
  985. 232.62 s > field value
  986. 232.62 s > span warm_up{integrand.name=se1l_mur_shifted}
  987. 232.62 s > [2026-09-02 14:28:46.322] @process::amplitude INFO : Input is above threshold: 1 existing threshold E-surfaces across 1/1 graph groups
  988. 232.62 s > field value
  989. 232.62 s > existing_esurfaces 1
  990. 232.62 s > group_count 1
  991. 232.62 s > groups_above_threshold 1
  992. 232.62 s > integrand se1l_mur_shifted
  993. 232.62 s > span warm_up{integrand.name=se1l_mur_shifted}
  994. 232.62 s > threshold_status above threshold
  995. 232.62 s > [2026-09-02 14:28:46.322] @process::amplitude INFO : overlap structure of group 0: [1: [0(2,3)]]
  996. 232.62 s > field value
  997. 232.62 s > span warm_up{integrand.name=se1l_mur_shifted}
  998. 232.62 s > [2026-09-02 14:28:46.326] @process::amplitude WARNING : External state 0 ('g', PDG 21, helicity +) is off shell: p^2 = +2.5e5, expected m^2 = +0e0 (|Δ| = +2.5e5). Fixed-helicity spinor/vector/tensor external states may be ill-defined at this kinematic point.
  999. 232.62 s > field value
  1000. 232.62 s > span warm_up{integrand.name=se1l}
  1001. 232.62 s > [2026-09-02 14:28:46.326] @process::amplitude WARNING : External state 1 ('g', PDG 21, helicity -) is off shell: p^2 = +2.5e5, expected m^2 = +0e0 (|Δ| = +2.5e5). Fixed-helicity spinor/vector/tensor external states may be ill-defined at this kinematic point.
  1002. 232.62 s > field value
  1003. 232.62 s > span warm_up{integrand.name=se1l}
  1004. 232.62 s > [2026-09-02 14:28:46.326] @process::amplitude INFO : Input is above threshold: 1 existing threshold E-surfaces across 1/1 graph groups
  1005. 232.62 s > field value
  1006. 232.62 s > existing_esurfaces 1
  1007. 232.62 s > group_count 1
  1008. 232.62 s > groups_above_threshold 1
  1009. 232.62 s > integrand se1l
  1010. 232.62 s > span warm_up{integrand.name=se1l}
  1011. 232.62 s > threshold_status above threshold
  1012. 232.62 s > [2026-09-02 14:28:46.327] @process::amplitude INFO : overlap structure of group 0: [1: [0(2,3)]]
  1013. 232.62 s > field value
  1014. 232.62 s > span warm_up{integrand.name=se1l}
  1015. 232.62 s > [2026-09-02 14:28:46.330] @process::amplitude WARNING : External state 0 ('g', PDG 21, helicity +) is off shell: p^2 = +2.5e5, expected m^2 = +0e0 (|Δ| = +2.5e5). Fixed-helicity spinor/vector/tensor external states may be ill-defined at this kinematic point.
  1016. 232.62 s > field value
  1017. 232.62 s > span warm_up{integrand.name=se1l_mur_shifted}
  1018. 232.62 s > [2026-09-02 14:28:46.330] @process::amplitude WARNING : External state 1 ('g', PDG 21, helicity -) is off shell: p^2 = +2.5e5, expected m^2 = +0e0 (|Δ| = +2.5e5). Fixed-helicity spinor/vector/tensor external states may be ill-defined at this kinematic point.
  1019. 232.62 s > field value
  1020. 232.62 s > span warm_up{integrand.name=se1l_mur_shifted}
  1021. 232.62 s > [2026-09-02 14:28:46.331] @process::amplitude INFO : Input is above threshold: 1 existing threshold E-surfaces across 1/1 graph groups
  1022. 232.62 s > field value
  1023. 232.62 s > existing_esurfaces 1
  1024. 232.62 s > group_count 1
  1025. 232.62 s > groups_above_threshold 1
  1026. 232.62 s > integrand se1l_mur_shifted
  1027. 232.62 s > span warm_up{integrand.name=se1l_mur_shifted}
  1028. 232.62 s > threshold_status above threshold
  1029. 232.62 s > [2026-09-02 14:28:46.331] @process::amplitude INFO : overlap structure of group 0: [1: [0(2,3)]]
  1030. 232.62 s > field value
  1031. 232.62 s > span warm_up{integrand.name=se1l_mur_shifted}
  1032. 232.62 s > [2026-09-02 14:28:46.335] @process::amplitude WARNING : External state 0 ('g', PDG 21, helicity +) is off shell: p^2 = +2.5e5, expected m^2 = +0e0 (|Δ| = +2.5e5). Fixed-helicity spinor/vector/tensor external states may be ill-defined at this kinematic point.
  1033. 232.62 s > field value
  1034. 232.62 s > span warm_up{integrand.name=se1l}
  1035. 232.62 s > [2026-09-02 14:28:46.335] @process::amplitude WARNING : External state 1 ('g', PDG 21, helicity -) is off shell: p^2 = +2.5e5, expected m^2 = +0e0 (|Δ| = +2.5e5). Fixed-helicity spinor/vector/tensor external states may be ill-defined at this kinematic point.
  1036. 232.62 s > field value
  1037. 232.62 s > span warm_up{integrand.name=se1l}
  1038. 232.62 s > [2026-09-02 14:28:46.335] @process::amplitude INFO : Input is above threshold: 1 existing threshold E-surfaces across 1/1 graph groups
  1039. 232.62 s > field value
  1040. 232.62 s > existing_esurfaces 1
  1041. 232.62 s > group_count 1
  1042. 232.62 s > groups_above_threshold 1
  1043. 232.62 s > integrand se1l
  1044. 232.62 s > span warm_up{integrand.name=se1l}
  1045. 232.62 s > threshold_status above threshold
  1046. 232.62 s > [2026-09-02 14:28:46.335] @process::amplitude INFO : overlap structure of group 0: [1: [0(2,3)]]
  1047. 232.62 s > field value
  1048. 232.62 s > span warm_up{integrand.name=se1l}
  1049. 232.62 s > [2026-09-02 14:28:46.339] @process::amplitude WARNING : External state 0 ('g', PDG 21, helicity +) is off shell: p^2 = +2.5e5, expected m^2 = +0e0 (|Δ| = +2.5e5). Fixed-helicity spinor/vector/tensor external states may be ill-defined at this kinematic point.
  1050. 232.62 s > field value
  1051. 232.62 s > span warm_up{integrand.name=se1l_mur_shifted}
  1052. 232.62 s > [2026-09-02 14:28:46.339] @process::amplitude WARNING : External state 1 ('g', PDG 21, helicity -) is off shell: p^2 = +2.5e5, expected m^2 = +0e0 (|Δ| = +2.5e5). Fixed-helicity spinor/vector/tensor external states may be ill-defined at this kinematic point.
  1053. 232.62 s > field value
  1054. 232.62 s > span warm_up{integrand.name=se1l_mur_shifted}
  1055. 232.62 s > [2026-09-02 14:28:46.339] @process::amplitude INFO : Input is above threshold: 1 existing threshold E-surfaces across 1/1 graph groups
  1056. 232.62 s > field value
  1057. 232.62 s > existing_esurfaces 1
  1058. 232.62 s > group_count 1
  1059. 232.62 s > groups_above_threshold 1
  1060. 232.62 s > integrand se1l_mur_shifted
  1061. 232.62 s > span warm_up{integrand.name=se1l_mur_shifted}
  1062. 232.62 s > threshold_status above threshold
  1063. 232.62 s > [2026-09-02 14:28:46.339] @process::amplitude INFO : overlap structure of group 0: [1: [0(2,3)]]
  1064. 232.62 s > field value
  1065. 232.62 s > span warm_up{integrand.name=se1l_mur_shifted}
  1066. 232.62 s > [2026-09-02 14:28:46.343] @process::amplitude WARNING : External state 0 ('g', PDG 21, helicity +) is off shell: p^2 = +2.5e5, expected m^2 = +0e0 (|Δ| = +2.5e5). Fixed-helicity spinor/vector/tensor external states may be ill-defined at this kinematic point.
  1067. 232.62 s > field value
  1068. 232.62 s > span warm_up{integrand.name=se1l}
  1069. 232.62 s > [2026-09-02 14:28:46.343] @process::amplitude WARNING : External state 1 ('g', PDG 21, helicity -) is off shell: p^2 = +2.5e5, expected m^2 = +0e0 (|Δ| = +2.5e5). Fixed-helicity spinor/vector/tensor external states may be ill-defined at this kinematic point.
  1070. 232.62 s > field value
  1071. 232.62 s > span warm_up{integrand.name=se1l}
  1072. 232.62 s > [2026-09-02 14:28:46.343] @process::amplitude INFO : Input is above threshold: 1 existing threshold E-surfaces across 1/1 graph groups
  1073. 232.62 s > field value
  1074. 232.62 s > existing_esurfaces 1
  1075. 232.62 s > group_count 1
  1076. 232.62 s > groups_above_threshold 1
  1077. 232.62 s > integrand se1l
  1078. 232.62 s > span warm_up{integrand.name=se1l}
  1079. 232.62 s > threshold_status above threshold
  1080. 232.62 s > [2026-09-02 14:28:46.343] @process::amplitude INFO : overlap structure of group 0: [1: [0(2,3)]]
  1081. 232.62 s > field value
  1082. 232.62 s > span warm_up{integrand.name=se1l}
  1083. 232.62 s > [2026-09-02 14:28:46.347] @process::amplitude WARNING : External state 0 ('g', PDG 21, helicity +) is off shell: p^2 = +2.5e5, expected m^2 = +0e0 (|Δ| = +2.5e5). Fixed-helicity spinor/vector/tensor external states may be ill-defined at this kinematic point.
  1084. 232.62 s > field value
  1085. 232.62 s > span warm_up{integrand.name=se1l_mur_shifted}
  1086. 232.62 s > [2026-09-02 14:28:46.347] @process::amplitude WARNING : External state 1 ('g', PDG 21, helicity -) is off shell: p^2 = +2.5e5, expected m^2 = +0e0 (|Δ| = +2.5e5). Fixed-helicity spinor/vector/tensor external states may be ill-defined at this kinematic point.
  1087. 232.62 s > field value
  1088. 232.62 s > span warm_up{integrand.name=se1l_mur_shifted}
  1089. 232.62 s > [2026-09-02 14:28:46.347] @process::amplitude INFO : Input is above threshold: 1 existing threshold E-surfaces across 1/1 graph groups
  1090. 232.62 s > field value
  1091. 232.62 s > existing_esurfaces 1
  1092. 232.62 s > group_count 1
  1093. 232.62 s > groups_above_threshold 1
  1094. 232.62 s > integrand se1l_mur_shifted
  1095. 232.62 s > span warm_up{integrand.name=se1l_mur_shifted}
  1096. 232.62 s > threshold_status above threshold
  1097. 232.62 s > [2026-09-02 14:28:46.347] @process::amplitude INFO : overlap structure of group 0: [1: [0(2,3)]]
  1098. 232.62 s > field value
  1099. 232.62 s > span warm_up{integrand.name=se1l_mur_shifted}
  1100. 232.62 s > [2026-09-02 14:28:46.351] @process::amplitude WARNING : External state 0 ('g', PDG 21, helicity +) is off shell: p^2 = +2.5e5, expected m^2 = +0e0 (|Δ| = +2.5e5). Fixed-helicity spinor/vector/tensor external states may be ill-defined at this kinematic point.
  1101. 232.62 s > field value
  1102. 232.62 s > span warm_up{integrand.name=se1l}
  1103. 232.62 s > [2026-09-02 14:28:46.351] @process::amplitude WARNING : External state 1 ('g', PDG 21, helicity -) is off shell: p^2 = +2.5e5, expected m^2 = +0e0 (|Δ| = +2.5e5). Fixed-helicity spinor/vector/tensor external states may be ill-defined at this kinematic point.
  1104. 232.62 s > field value
  1105. 232.62 s > span warm_up{integrand.name=se1l}
  1106. 232.62 s > [2026-09-02 14:28:46.351] @process::amplitude INFO : Input is above threshold: 1 existing threshold E-surfaces across 1/1 graph groups
  1107. 232.62 s > field value
  1108. 232.62 s > existing_esurfaces 1
  1109. 232.62 s > group_count 1
  1110. 232.62 s > groups_above_threshold 1
  1111. 232.62 s > integrand se1l
  1112. 232.62 s > span warm_up{integrand.name=se1l}
  1113. 232.62 s > threshold_status above threshold
  1114. 232.62 s > [2026-09-02 14:28:46.351] @process::amplitude INFO : overlap structure of group 0: [1: [0(2,3)]]
  1115. 232.62 s > field value
  1116. 232.62 s > span warm_up{integrand.name=se1l}
  1117. 232.62 s > [2026-09-02 14:28:46.355] @process::amplitude WARNING : External state 0 ('g', PDG 21, helicity +) is off shell: p^2 = +2.5e5, expected m^2 = +0e0 (|Δ| = +2.5e5). Fixed-helicity spinor/vector/tensor external states may be ill-defined at this kinematic point.
  1118. 232.62 s > field value
  1119. 232.62 s > span warm_up{integrand.name=se1l_mur_shifted}
  1120. 232.62 s > [2026-09-02 14:28:46.355] @process::amplitude WARNING : External state 1 ('g', PDG 21, helicity -) is off shell: p^2 = +2.5e5, expected m^2 = +0e0 (|Δ| = +2.5e5). Fixed-helicity spinor/vector/tensor external states may be ill-defined at this kinematic point.
  1121. 232.62 s > field value
  1122. 232.62 s > span warm_up{integrand.name=se1l_mur_shifted}
  1123. 232.62 s > [2026-09-02 14:28:46.355] @process::amplitude INFO : Input is above threshold: 1 existing threshold E-surfaces across 1/1 graph groups
  1124. 232.62 s > field value
  1125. 232.62 s > existing_esurfaces 1
  1126. 232.62 s > group_count 1
  1127. 232.62 s > groups_above_threshold 1
  1128. 232.62 s > integrand se1l_mur_shifted
  1129. 232.62 s > span warm_up{integrand.name=se1l_mur_shifted}
  1130. 232.62 s > threshold_status above threshold
  1131. 232.62 s > [2026-09-02 14:28:46.355] @process::amplitude INFO : overlap structure of group 0: [1: [0(2,3)]]
  1132. 232.62 s > field value
  1133. 232.62 s > span warm_up{integrand.name=se1l_mur_shifted}
  1134. 232.62 s > [2026-09-02 14:28:46.359] @process::amplitude WARNING : External state 0 ('g', PDG 21, helicity +) is off shell: p^2 = +2.5e5, expected m^2 = +0e0 (|Δ| = +2.5e5). Fixed-helicity spinor/vector/tensor external states may be ill-defined at this kinematic point.
  1135. 232.62 s > field value
  1136. 232.62 s > span warm_up{integrand.name=se1l}
  1137. 232.62 s > [2026-09-02 14:28:46.359] @process::amplitude WARNING : External state 1 ('g', PDG 21, helicity -) is off shell: p^2 = +2.5e5, expected m^2 = +0e0 (|Δ| = +2.5e5). Fixed-helicity spinor/vector/tensor external states may be ill-defined at this kinematic point.
  1138. 232.62 s > field value
  1139. 232.62 s > span warm_up{integrand.name=se1l}
  1140. 232.62 s > [2026-09-02 14:28:46.359] @process::amplitude INFO : Input is above threshold: 1 existing threshold E-surfaces across 1/1 graph groups
  1141. 232.62 s > field value
  1142. 232.62 s > existing_esurfaces 1
  1143. 232.62 s > group_count 1
  1144. 232.62 s > groups_above_threshold 1
  1145. 232.62 s > integrand se1l
  1146. 232.62 s > span warm_up{integrand.name=se1l}
  1147. 232.62 s > threshold_status above threshold
  1148. 232.62 s > [2026-09-02 14:28:46.359] @process::amplitude INFO : overlap structure of group 0: [1: [0(2,3)]]
  1149. 232.62 s > field value
  1150. 232.62 s > span warm_up{integrand.name=se1l}
  1151. 232.62 s > [2026-09-02 14:28:46.363] @process::amplitude WARNING : External state 0 ('g', PDG 21, helicity +) is off shell: p^2 = +2.5e5, expected m^2 = +0e0 (|Δ| = +2.5e5). Fixed-helicity spinor/vector/tensor external states may be ill-defined at this kinematic point.
  1152. 232.62 s > field value
  1153. 232.62 s > span warm_up{integrand.name=se1l_mur_shifted}
  1154. 232.62 s > [2026-09-02 14:28:46.363] @process::amplitude WARNING : External state 1 ('g', PDG 21, helicity -) is off shell: p^2 = +2.5e5, expected m^2 = +0e0 (|Δ| = +2.5e5). Fixed-helicity spinor/vector/tensor external states may be ill-defined at this kinematic point.
  1155. 232.62 s > field value
  1156. 232.62 s > span warm_up{integrand.name=se1l_mur_shifted}
  1157. 232.62 s > [2026-09-02 14:28:46.363] @process::amplitude INFO : Input is above threshold: 1 existing threshold E-surfaces across 1/1 graph groups
  1158. 232.62 s > field value
  1159. 232.62 s > existing_esurfaces 1
  1160. 232.62 s > group_count 1
  1161. 232.62 s > groups_above_threshold 1
  1162. 232.62 s > integrand se1l_mur_shifted
  1163. 232.62 s > span warm_up{integrand.name=se1l_mur_shifted}
  1164. 232.62 s > threshold_status above threshold
  1165. 232.62 s > [2026-09-02 14:28:46.363] @process::amplitude INFO : overlap structure of group 0: [1: [0(2,3)]]
  1166. 232.62 s > field value
  1167. 232.62 s > span warm_up{integrand.name=se1l_mur_shifted}
  1168. 232.62 s > [2026-09-02 14:28:46.367] @process::amplitude WARNING : External state 0 ('g', PDG 21, helicity +) is off shell: p^2 = +2.5e5, expected m^2 = +0e0 (|Δ| = +2.5e5). Fixed-helicity spinor/vector/tensor external states may be ill-defined at this kinematic point.
  1169. 232.62 s > field value
  1170. 232.62 s > span warm_up{integrand.name=se1l}
  1171. 232.62 s > [2026-09-02 14:28:46.367] @process::amplitude WARNING : External state 1 ('g', PDG 21, helicity -) is off shell: p^2 = +2.5e5, expected m^2 = +0e0 (|Δ| = +2.5e5). Fixed-helicity spinor/vector/tensor external states may be ill-defined at this kinematic point.
  1172. 232.62 s > field value
  1173. 232.62 s > span warm_up{integrand.name=se1l}
  1174. 232.62 s > [2026-09-02 14:28:46.367] @process::amplitude INFO : Input is above threshold: 1 existing threshold E-surfaces across 1/1 graph groups
  1175. 232.62 s > field value
  1176. 232.62 s > existing_esurfaces 1
  1177. 232.62 s > group_count 1
  1178. 232.62 s > groups_above_threshold 1
  1179. 232.62 s > integrand se1l
  1180. 232.62 s > span warm_up{integrand.name=se1l}
  1181. 232.62 s > threshold_status above threshold
  1182. 232.62 s > [2026-09-02 14:28:46.367] @process::amplitude INFO : overlap structure of group 0: [1: [0(2,3)]]
  1183. 232.62 s > field value
  1184. 232.62 s > span warm_up{integrand.name=se1l}
  1185. 232.62 s > [2026-09-02 14:28:46.371] @process::amplitude WARNING : External state 0 ('g', PDG 21, helicity +) is off shell: p^2 = +2.5e5, expected m^2 = +0e0 (|Δ| = +2.5e5). Fixed-helicity spinor/vector/tensor external states may be ill-defined at this kinematic point.
  1186. 232.62 s > field value
  1187. 232.62 s > span warm_up{integrand.name=se1l_mur_shifted}
  1188. 232.62 s > [2026-09-02 14:28:46.371] @process::amplitude WARNING : External state 1 ('g', PDG 21, helicity -) is off shell: p^2 = +2.5e5, expected m^2 = +0e0 (|Δ| = +2.5e5). Fixed-helicity spinor/vector/tensor external states may be ill-defined at this kinematic point.
  1189. 232.62 s > field value
  1190. 232.62 s > span warm_up{integrand.name=se1l_mur_shifted}
  1191. 232.62 s > [2026-09-02 14:28:46.371] @process::amplitude INFO : Input is above threshold: 1 existing threshold E-surfaces across 1/1 graph groups
  1192. 232.62 s > field value
  1193. 232.62 s > existing_esurfaces 1
  1194. 232.62 s > group_count 1
  1195. 232.62 s > groups_above_threshold 1
  1196. 232.62 s > integrand se1l_mur_shifted
  1197. 232.62 s > span warm_up{integrand.name=se1l_mur_shifted}
  1198. 232.62 s > threshold_status above threshold
  1199. 232.62 s > [2026-09-02 14:28:46.371] @process::amplitude INFO : overlap structure of group 0: [1: [0(2,3)]]
  1200. 232.62 s > field value
  1201. 232.62 s > span warm_up{integrand.name=se1l_mur_shifted}
  1202. 232.62 s > [2026-09-02 14:28:46.375] @process::amplitude WARNING : External state 0 ('g', PDG 21, helicity +) is off shell: p^2 = +2.5e5, expected m^2 = +0e0 (|Δ| = +2.5e5). Fixed-helicity spinor/vector/tensor external states may be ill-defined at this kinematic point.
  1203. 232.62 s > field value
  1204. 232.62 s > span warm_up{integrand.name=se1l}
  1205. 232.62 s > [2026-09-02 14:28:46.375] @process::amplitude WARNING : External state 1 ('g', PDG 21, helicity -) is off shell: p^2 = +2.5e5, expected m^2 = +0e0 (|Δ| = +2.5e5). Fixed-helicity spinor/vector/tensor external states may be ill-defined at this kinematic point.
  1206. 232.62 s > field value
  1207. 232.62 s > span warm_up{integrand.name=se1l}
  1208. 232.62 s > [2026-09-02 14:28:46.375] @process::amplitude INFO : Input is above threshold: 1 existing threshold E-surfaces across 1/1 graph groups
  1209. 232.62 s > field value
  1210. 232.62 s > existing_esurfaces 1
  1211. 232.62 s > group_count 1
  1212. 232.62 s > groups_above_threshold 1
  1213. 232.62 s > integrand se1l
  1214. 232.62 s > span warm_up{integrand.name=se1l}
  1215. 232.62 s > threshold_status above threshold
  1216. 232.62 s > [2026-09-02 14:28:46.375] @process::amplitude INFO : overlap structure of group 0: [1: [0(2,3)]]
  1217. 232.62 s > field value
  1218. 232.62 s > span warm_up{integrand.name=se1l}
  1219. 232.62 s > [2026-09-02 14:28:46.379] @process::amplitude WARNING : External state 0 ('g', PDG 21, helicity +) is off shell: p^2 = +2.5e5, expected m^2 = +0e0 (|Δ| = +2.5e5). Fixed-helicity spinor/vector/tensor external states may be ill-defined at this kinematic point.
  1220. 232.62 s > field value
  1221. 232.62 s > span warm_up{integrand.name=se1l_mur_shifted}
  1222. 232.62 s > [2026-09-02 14:28:46.379] @process::amplitude WARNING : External state 1 ('g', PDG 21, helicity -) is off shell: p^2 = +2.5e5, expected m^2 = +0e0 (|Δ| = +2.5e5). Fixed-helicity spinor/vector/tensor external states may be ill-defined at this kinematic point.
  1223. 232.62 s > field value
  1224. 232.62 s > span warm_up{integrand.name=se1l_mur_shifted}
  1225. 232.62 s > [2026-09-02 14:28:46.379] @process::amplitude INFO : Input is above threshold: 1 existing threshold E-surfaces across 1/1 graph groups
  1226. 232.62 s > field value
  1227. 232.62 s > existing_esurfaces 1
  1228. 232.62 s > group_count 1
  1229. 232.62 s > groups_above_threshold 1
  1230. 232.62 s > integrand se1l_mur_shifted
  1231. 232.62 s > span warm_up{integrand.name=se1l_mur_shifted}
  1232. 232.62 s > threshold_status above threshold
  1233. 232.62 s > [2026-09-02 14:28:46.379] @process::amplitude INFO : overlap structure of group 0: [1: [0(2,3)]]
  1234. 232.62 s > field value
  1235. 232.62 s > span warm_up{integrand.name=se1l_mur_shifted}
  1236. 232.62 s > The application panicked (crashed).
  1237. 232.62 s > Message: Integrated UV case failed: se1l
  1238. 232.62 s > Location: tests/tests/uv.rs:1068
  1239. 232.62 s >
  1240. 232.62 s > ━━━━━━━━━━━━━━━━━━━━━━━━━━━━━━━━━━ BACKTRACE ━━━━━━━━━━━━━━━━━━━━━━━━━━━━━━━━━━━
  1241. 232.62 s > 1: <color_eyre[bb06c27fa12d52c3]::config::PanicHook>::panic_report<unknown>
  1242. 232.62 s > at <unknown source file>:<unknown line>
  1243. 232.62 s > 2: <color_eyre[bb06c27fa12d52c3]::config::PanicHook>::into_panic_hook::{closure#0}<unknown>
  1244. 232.62 s > at <unknown source file>:<unknown line>
  1245. 232.62 s > 3: std[5167731717db2e51]::panicking::panic_with_hook<unknown>
  1246. 232.62 s > at <unknown source file>:<unknown line>
  1247. 232.62 s > 4: std[5167731717db2e51]::panicking::panic_handler::{closure#0}<unknown>
  1248. 232.62 s > at <unknown source file>:<unknown line>
  1249. 232.62 s > 5: std[5167731717db2e51]::sys::backtrace::__rust_end_short_backtrace::<std[5167731717db2e51]::panicking::panic_handler::{closure#0}, !><unknown>
  1250. 232.62 s > at <unknown source file>:<unknown line>
  1251. 232.62 s > 6: __rustc[4b1ee1ef74718a7b]::rust_begin_unwind<unknown>
  1252. 232.62 s > at <unknown source file>:<unknown line>
  1253. 232.62 s > 7: core[8c5ac2f034688f9a]::panicking::panic_fmt<unknown>
  1254. 232.62 s > at <unknown source file>:<unknown line>
  1255. 232.62 s > 8: uv[654cd04bf7185af1]::run_single_integrated_uv_case<unknown>
  1256. 232.62 s > at <unknown source file>:<unknown line>
  1257. 232.62 s > 9: <uv[654cd04bf7185af1]::se1l_uv::{closure#0} as core[8c5ac2f034688f9a]::ops::function::FnOnce<()>>::call_once<unknown>
  1258. 232.62 s > at <unknown source file>:<unknown line>
  1259. 232.62 s > 10: test[7974841f8dbd3561]::__rust_begin_short_backtrace::<core[8c5ac2f034688f9a]::result::Result<(), alloc[93e694a8365d93dd]::string::String>, fn() -> core[8c5ac2f034688f9a]::result::Result<(), alloc[93e694a8365d93dd]::string::String>><unknown>
  1260. 232.62 s > at <unknown source file>:<unknown line>
  1261. 232.62 s > 11: test[7974841f8dbd3561]::run_test::{closure#0}<unknown>
  1262. 232.62 s > at <unknown source file>:<unknown line>
  1263. 232.62 s > 12: std[5167731717db2e51]::sys::backtrace::__rust_begin_short_backtrace::<test[7974841f8dbd3561]::run_test::{closure#1}, ()><unknown>
  1264. 232.62 s > at <unknown source file>:<unknown line>
  1265. 232.62 s > 13: <std[5167731717db2e51]::thread::lifecycle::spawn_unchecked<test[7974841f8dbd3561]::run_test::{closure#1}, ()>::{closure#1} as core[8c5ac2f034688f9a]::ops::function::FnOnce<()>>::call_once::{shim:vtable#0}<unknown>
  1266. 232.62 s > at <unknown source file>:<unknown line>
  1267. 232.62 s > 14: <std[5167731717db2e51]::sys::thread::unix::Thread>::new::thread_start<unknown>
  1268. 232.62 s > at <unknown source file>:<unknown line>
  1269. 232.62 s > 15: start_thread<unknown>
  1270. 232.62 s > at <unknown source file>:<unknown line>
  1271. 232.62 s > 16: __clone3<unknown>
  1272. 232.62 s > at <unknown source file>:<unknown line>
  1273. 232.62 s >
  1274. 232.62 s > Run with COLORBT_SHOW_HIDDEN=1 environment variable to disable frame filtering.
  1275. 232.62 s > Run with RUST_BACKTRACE=full to include source snippets.
  1276. 232.62 s >
  1277. 232.62 s > error: test run failed
  1278. 232.62 s >
  1279. 232.62 s > ========== nextest test summary ==========
  1280. 232.62 s > report: target/nextest/ci_gammaloop/junit.xml
  1281. 232.62 s > tests: 106, failures: 9, errors: 0
  1282. 232.62 s >
  1283. 232.62 s > 1. gammaloop-integration-tests::test_runs::approach::approach_momentum_space_reports_incomplete_triplet_cleanly
  1284. 232.62 s > failure: test failure with exit code 101
  1285. 232.62 s > system-out
  1286. 232.62 s > running 1 test
  1287. 232.62 s > test approach::approach_momentum_space_reports_incomplete_triplet_cleanly ... FAILED
  1288. 232.62 s >
  1289. 232.62 s > failures:
  1290. 232.62 s >
  1291. 232.62 s > failures:
  1292. 232.62 s > approach::approach_momentum_space_reports_incomplete_triplet_cleanly
  1293. 232.62 s >
  1294. 232.62 s > test result: FAILED. 0 passed; 1 failed; 0 ignored; 0 measured; 82 filtered out; finished in 1.54s
  1295. 232.62 s > system-err
  1296. 232.62 s > [2026-09-02 14:26:08.189] @gammaloop_api::se... INFO : Running command import model scalars-default.json
  1297. 232.62 s > [2026-09-02 14:26:08.189] @import::model INFO : Loading built-in JSON model scalars-default
  1298. 232.62 s > [2026-09-02 14:26:08.196] @gammalooprs::model INFO : The following 2 external parameters were forced to zero by the restriction card:
  1299. 232.62 s > width_scalar_1, width_scalar_2
  1300. 232.62 s > [2026-09-02 14:26:08.197] @gammaloop_api::se... INFO : Running command remove processes
  1301. 232.62 s > [2026-09-02 14:26:08.199] @gammaloop_api::se... INFO : Running command generate amp scalar_1 > scalar_0 scalar_0 [{1}] --allowed-vertex-interactions V_3_SCALAR_022 V_3_SCALAR_122 -p triangle -i scalar_tri
  1302. 232.62 s > [2026-09-02 14:26:08.201] @feyngen::diagram_... INFO : 0s | Δ=0s | Starting Feynman graph generation with Symbolica...
  1303. 232.62 s > [2026-09-02 14:26:08.201] @feyngen::diagram_... INFO : 0s | Δ=0s | Number of graphs resulting from Symbolica generation: 1
  1304. 232.62 s > [2026-09-02 14:26:08.204] @feyngen::diagram_... INFO : 0s | Δ=0s | Number of graphs retained after removal of vetoed topologies: 1
  1305. 232.62 s > [2026-09-02 14:26:08.206] @feyngen::diagram_... INFO : 0s | Δ=0s | Number of graphs after vertex info assignment: 1
  1306. 232.62 s > [2026-09-02 14:26:08.206] @feyngen::diagram_... INFO : 0s | Δ=0s | Number of graphs after all complete graphs filters are applied: 1
  1307. 232.62 s > [2026-09-02 14:26:08.210] @feyngen::diagram_... INFO : 0s | Δ=0s | Number of graphs after closed fermion chains analysis: 1
  1308. 232.62 s > [2026-09-02 14:26:08.210] @feyngen::diagram_... INFO : 0s | Δ=0s | Number of graphs after symmetrization of external states: 1
  1309. 232.62 s > [2026-09-02 14:26:08.213] @feyngen::diagram_... INFO : 0s | Δ=0s | Number of graphs after canonization of vertices, edges and flows (graph labels assigned here): 1
  1310. 232.62 s > [2026-09-02 14:26:08.244] @feyngen::diagram_... INFO : 0s | Δ=0s | Number of graphs after numerator-aware grouping with strategy 'up to a scalar rescaling': 1 (1 isomorphically unique graph, 0 color zero, 0 lorentz zero, 0 grouped and 0 cancellation)
  1311. 232.62 s > [2026-09-02 14:26:08.244] @feyngen::diagram_... INFO : ( Sum of the symmetry factors from each graph generated = 1 )
  1312. 232.62 s > [2026-09-02 14:26:08.244] @commands::generate INFO : Generated amplitude 1 graphs.
  1313. 232.62 s > [2026-09-02 14:26:08.350] @settings::runtime WARNING : No external kinematics were provided; using default-generated external momenta and helicities.
  1314. 232.62 s > [2026-09-02 14:26:08.374] @commands::generate INFO :
  1315. 232.62 s > Integrand generation summary
  1316. 232.62 s > peak RAM 65.44 MiB | cores 1
  1317. 232.62 s > ╭────────────┬───────┬─────────┬────────────┬────────────┬────────────────┬─────────────╮
  1318. 232.62 s > │ integrand │ graph │ # evals │ expr build │ spenso │ symbolica eval │ compile │
  1319. 232.62 s > ├────────────┼───────┼─────────┼────────────┼────────────┼────────────────┼─────────────┤
  1320. 232.62 s > │ scalar_tri │ GL0 │ 9 │ 61ms (64%) │ 4ms (4.2%) │ 31ms (32%) │ 0ms (0.00%) │
  1321. 232.62 s > ├────────────┼───────┼─────────┼────────────┼────────────┼────────────────┼─────────────┤
  1322. 232.62 s > │ Total │ │ 9 │ 61ms (64%) │ 4ms (4.2%) │ 31ms (32%) │ 0ms (0.00%) │
  1323. 232.62 s > ╰────────────┴───────┴─────────┴────────────┴────────────┴────────────────┴─────────────╯
  1324. 232.62 s > [2026-09-02 14:26:08.376] @gammaloop_api::se... INFO : Running command generate amp scalar_0 scalar_0 > scalar_0 scalar_0 [{1}] --allowed-vertex-interactions V_3_SCALAR_022 -p box -i scalar_box --select-graphs GL0
  1325. 232.62 s > [2026-09-02 14:26:08.384] @feyngen::diagram_... INFO : 0s | Δ=0s | Starting Feynman graph generation with Symbolica...
  1326. 232.62 s > [2026-09-02 14:26:08.384] @feyngen::diagram_... INFO : 0s | Δ=0s | Number of graphs resulting from Symbolica generation: 3
  1327. 232.62 s > [2026-09-02 14:26:08.385] @feyngen::diagram_... INFO : 0s | Δ=0s | Number of graphs retained after removal of vetoed topologies: 3
  1328. 232.62 s > [2026-09-02 14:26:08.386] @feyngen::diagram_... INFO : 0s | Δ=0s | Number of graphs after vertex info assignment: 3
  1329. 232.62 s > [2026-09-02 14:26:08.386] @feyngen::diagram_... INFO : 0s | Δ=0s | Number of graphs after all complete graphs filters are applied: 3
  1330. 232.62 s > [2026-09-02 14:26:08.386] @feyngen::diagram_... INFO : 0s | Δ=0s | Number of graphs after closed fermion chains analysis: 3
  1331. 232.62 s > [2026-09-02 14:26:08.386] @feyngen::diagram_... INFO : 0s | Δ=0s | Number of graphs after symmetrization of external states: 3
  1332. 232.62 s > [2026-09-02 14:26:08.386] @feyngen::diagram_... INFO : 0s | Δ=0s | Number of graphs after canonization of vertices, edges and flows (graph labels assigned here): 3
  1333. 232.62 s > [2026-09-02 14:26:08.416] @feyngen::diagram_... INFO : 0s | Δ=0s | Number of graphs after numerator-aware grouping with strategy 'up to a scalar rescaling': 1 (1 isomorphically unique graph, 0 color zero, 0 lorentz zero, 0 grouped and 0 cancellation)
  1334. 232.62 s > [2026-09-02 14:26:08.416] @feyngen::diagram_... INFO : ( Sum of the symmetry factors from each graph generated = 1 )
  1335. 232.62 s > [2026-09-02 14:26:08.416] @commands::generate INFO : Generated amplitude 1 graphs.
  1336. 232.62 s > [2026-09-02 14:26:08.918] @settings::runtime WARNING : No external kinematics were provided; using default-generated external momenta and helicities.
  1337. 232.62 s > [2026-09-02 14:26:08.977] @commands::generate INFO :
  1338. 232.62 s > Integrand generation summary
  1339. 232.62 s > peak RAM 69.71 MiB | cores 1
  1340. 232.62 s > ╭────────────┬───────┬─────────┬─────────────┬────────────┬────────────────┬─────────────╮
  1341. 232.62 s > │ integrand │ graph │ # evals │ expr build │ spenso │ symbolica eval │ compile │
  1342. 232.62 s > ├────────────┼───────┼─────────┼─────────────┼────────────┼────────────────┼─────────────┤
  1343. 232.62 s > │ scalar_box │ GL0 │ 13 │ 339ms (69%) │ 58ms (12%) │ 96ms (20%) │ 0ms (0.00%) │
  1344. 232.62 s > ├────────────┼───────┼─────────┼─────────────┼────────────┼────────────────┼─────────────┤
  1345. 232.62 s > │ Total │ │ 13 │ 339ms (69%) │ 58ms (12%) │ 96ms (20%) │ 0ms (0.00%) │
  1346. 232.62 s > ╰────────────┴───────┴─────────┴─────────────┴────────────┴────────────────┴─────────────╯
  1347. 232.62 s > [2026-09-02 14:26:08.979] @gammaloop_api::se... INFO : Running command generate
  1348. 232.62 s > [2026-09-02 14:26:09.186] @settings::runtime WARNING : No external kinematics were provided; using default-generated external momenta and helicities.
  1349. 232.62 s > [2026-09-02 14:26:09.252] @settings::runtime WARNING : No external kinematics were provided; using default-generated external momenta and helicities.
  1350. 232.62 s > [2026-09-02 14:26:09.301] @commands::generate INFO :
  1351. 232.62 s > Integrand generation summary
  1352. 232.62 s > peak RAM 71.14 MiB | cores 1
  1353. 232.62 s > ╭────────────┬───────┬─────────┬─────────────┬─────────────┬────────────────┬─────────────╮
  1354. 232.62 s > │ integrand │ graph │ # evals │ expr build │ spenso │ symbolica eval │ compile │
  1355. 232.62 s > ├────────────┼───────┼─────────┼─────────────┼─────────────┼────────────────┼─────────────┤
  1356. 232.62 s > │ scalar_tri │ GL0 │ 9 │ 29ms (57%) │ 5ms (9.7%) │ 17ms (33%) │ 0ms (0.00%) │
  1357. 232.62 s > │ scalar_box │ GL0 │ 13 │ 150ms (70%) │ 13ms (6.4%) │ 50ms (23%) │ 0ms (0.00%) │
  1358. 232.62 s > ├────────────┼───────┼─────────┼─────────────┼─────────────┼────────────────┼─────────────┤
  1359. 232.62 s > │ Total │ │ 22 │ 180ms (68%) │ 18ms (7.1%) │ 67ms (25%) │ 0ms (0.00%) │
  1360. 232.62 s > ╰────────────┴───────┴─────────┴─────────────┴─────────────┴────────────────┴─────────────╯
  1361. 232.62 s > [2026-09-02 14:26:09.303] @gammaloop_api::se... INFO : Running command set model mass_scalar_2=2.0
  1362. 232.62 s > [2026-09-02 14:26:09.318] @gammaloop_api::se... INFO : Running command set model mass_scalar_1=1.0
  1363. 232.62 s > [2026-09-02 14:26:09.342] @gammaloop_api::se... INFO : Running command set process -p triangle -i scalar_tri string '
  1364. 232.62 s > [kinematics.externals]
  1365. 232.62 s > type = "constant"
  1366. 232.62 s >
  1367. 232.62 s > [kinematics.externals.data]
  1368. 232.62 s > [...]
  1369. 232.62 s > [2026-09-02 14:26:09.351] @gammaloop_api::se... INFO : Running command set process -p box -i scalar_box string '
  1370. 232.62 s > [kinematics.externals]
  1371. 232.62 s > type = "constant"
  1372. 232.62 s >
  1373. 232.62 s > [kinematics.externals.data]
  1374. 232.62 s > [...]
  1375. 232.62 s > [2026-09-02 14:26:09.356] @gammaloop_api::se... INFO : Running command approach -x 1.0000000000000001e-1,2.0000000000000001e-1,2.9999999999999999e-1,4.0000000000000002e-1 --approach-axis 1.0000000000000000e-3,0.0000000000000000e0,0.0000000000000000e0,0.0000000000000000e0 --n-points 1 --n-cores 1 --output-results /build/source/tests/artifacts/scalar_box_invalid_momentum_approach/approach_momentum.json --momentum-space --graph-id 0
  1376. 232.62 s > The application panicked (crashed).
  1377. 232.62 s > Message: There are 2 processes available. Please specify a process.
  1378. 232.62 s > Location: tests/tests/test_runs/approach.rs:332
  1379. 232.62 s >
  1380. 232.62 s > ━━━━━━━━━━━━━━━━━━━━━━━━━━━━━━━━━━ BACKTRACE ━━━━━━━━━━━━━━━━━━━━━━━━━━━━━━━━━━━
  1381. 232.62 s > 1: <color_eyre[bb06c27fa12d52c3]::config::PanicHook>::panic_report<unknown>
  1382. 232.62 s > at <unknown source file>:<unknown line>
  1383. 232.62 s > 2: <color_eyre[bb06c27fa12d52c3]::config::PanicHook>::into_panic_hook::{closure#0}<unknown>
  1384. 232.62 s > at <unknown source file>:<unknown line>
  1385. 232.62 s > 3: std[5167731717db2e51]::panicking::panic_with_hook<unknown>
  1386. 232.62 s > at <unknown source file>:<unknown line>
  1387. 232.62 s > 4: std[5167731717db2e51]::panicking::panic_handler::{closure#0}<unknown>
  1388. 232.62 s > at <unknown source file>:<unknown line>
  1389. 232.62 s > 5: std[5167731717db2e51]::sys::backtrace::__rust_end_short_backtrace::<std[5167731717db2e51]::panicking::panic_handler::{closure#0}, !><unknown>
  1390. 232.62 s > at <unknown source file>:<unknown line>
  1391. 232.62 s > 6: __rustc[4b1ee1ef74718a7b]::rust_begin_unwind<unknown>
  1392. 232.62 s > at <unknown source file>:<unknown line>
  1393. 232.62 s > 7: core[8c5ac2f034688f9a]::panicking::panic_fmt<unknown>
  1394. 232.62 s > at <unknown source file>:<unknown line>
  1395. 232.62 s > 8: test_runs[928b8788563090d0]::approach::approach_momentum_space_reports_incomplete_triplet_cleanly<unknown>
  1396. 232.62 s > at <unknown source file>:<unknown line>
  1397. 232.62 s > 9: <test_runs[928b8788563090d0]::approach::approach_momentum_space_reports_incomplete_triplet_cleanly::{closure#0} as core[8c5ac2f034688f9a]::ops::function::FnOnce<()>>::call_once<unknown>
  1398. 232.62 s > at <unknown source file>:<unknown line>
  1399. 232.62 s > 10: test[7974841f8dbd3561]::__rust_begin_short_backtrace::<core[8c5ac2f034688f9a]::result::Result<(), alloc[93e694a8365d93dd]::string::String>, fn() -> core[8c5ac2f034688f9a]::result::Result<(), alloc[93e694a8365d93dd]::string::String>><unknown>
  1400. 232.62 s > at <unknown source file>:<unknown line>
  1401. 232.62 s > 11: test[7974841f8dbd3561]::run_test::{closure#0}<unknown>
  1402. 232.62 s > at <unknown source file>:<unknown line>
  1403. 232.62 s > 12: std[5167731717db2e51]::sys::backtrace::__rust_begin_short_backtrace::<test[7974841f8dbd3561]::run_test::{closure#1}, ()><unknown>
  1404. 232.62 s > at <unknown source file>:<unknown line>
  1405. 232.62 s > 13: <std[5167731717db2e51]::thread::lifecycle::spawn_unchecked<test[7974841f8dbd3561]::run_test::{closure#1}, ()>::{closure#1} as core[8c5ac2f034688f9a]::ops::function::FnOnce<()>>::call_once::{shim:vtable#0}<unknown>
  1406. 232.62 s > at <unknown source file>:<unknown line>
  1407. 232.62 s > 14: <std[5167731717db2e51]::sys::thread::unix::Thread>::new::thread_start<unknown>
  1408. 232.62 s > at <unknown source file>:<unknown line>
  1409. 232.62 s > 15: start_thread<unknown>
  1410. 232.62 s > at <unknown source file>:<unknown line>
  1411. 232.62 s > 16: __clone3<unknown>
  1412. 232.62 s > at <unknown source file>:<unknown line>
  1413. 232.62 s >
  1414. 232.62 s > Run with COLORBT_SHOW_HIDDEN=1 environment variable to disable frame filtering.
  1415. 232.62 s > ... omitted 1 more lines; see full nextest output above
  1416. 232.62 s >
  1417. 232.62 s > 2. gammaloop-integration-tests::test_runs::profile_bulk::dotted_bubble_amp_bulk_profile_passes
  1418. 232.62 s > failure: test failure with exit code 101
  1419. 232.62 s > Error:
  1420. 232.62 s > 0: IR profiling requested arbitrary precision but received a quad-precision result
  1421. 232.62 s >
  1422. 232.62 s > Location:
  1423. 232.62 s > crates/gammalooprs/src/integrands/process/ir.rs:2123
  1424. 232.62 s >
  1425. 232.62 s > ━━━━━━━━━━━━━━━━━━━━━━━━━━━━━━━━━━ BACKTRACE ━━━━━━━━━━━━━━━━━━━━━━━━━━━━━━━━━━━
  1426. 232.62 s > 1: <color_eyre[bb06c27fa12d52c3]::config::EyreHook>::into_eyre_hook::{closure#0}<unknown>
  1427. 232.62 s > at <unknown source file>:<unknown line>
  1428. 232.62 s > 2: eyre[9f660d63ab6a72c5]::capture_handler<unknown>
  1429. 232.62 s > at <unknown source file>:<unknown line>
  1430. 232.62 s > 3: eyre[9f660d63ab6a72c5]::private::format_err<unknown>
  1431. 232.62 s > at <unknown source file>:<unknown line>
  1432. 232.62 s > 4: gammalooprs[1b273202b0029755]::integrands::process::ir::evaluate_profile_momentum_point_arb::<gammalooprs[1b273202b0029755]::integrands::process::amplitude::AmplitudeIntegrand><unknown>
  1433. 232.62 s > at <unknown source file>:<unknown line>
  1434. 232.62 s > 5: <gammalooprs[1b273202b0029755]::integrands::process::amplitude::AmplitudeIntegrand>::test_single_ir_limit_impl<unknown>
  1435. 232.62 s > at <unknown source file>:<unknown line>
  1436. 232.62 s > 6: gammalooprs[1b273202b0029755]::integrands::process::ir::run_ir_profile::<gammalooprs[1b273202b0029755]::integrands::process::amplitude::AmplitudeIntegrand, <gammalooprs[1b273202b0029755]::integrands::process::amplitude::AmplitudeIntegrand>::enumerate_ir_limits, <gammalooprs[1b273202b0029755]::integrands::process::amplitude::AmplitudeIntegrand>::graph_cut_definitions, <gammalooprs[1b273202b0029755]::integrands::process::amplitude::AmplitudeIntegrand>::test_single_ir_limit_impl><unknown>
  1437. 232.62 s > at <unknown source file>:<unknown line>
  1438. 232.62 s > 7: <gammalooprs[1b273202b0029755]::integrands::process::amplitude::AmplitudeIntegrand>::test_ir<unknown>
  1439. 232.62 s > at <unknown source file>:<unknown line>
  1440. 232.62 s > 8: <gammaloop_api[9fdde70dfc7501ea]::commands::profile::Profile>::run<unknown>
  1441. 232.62 s > at <unknown source file>:<unknown line>
  1442. 232.62 s > 9: test_runs[928b8788563090d0]::profile_bulk::dotted_bubble_amp_bulk_profile_passes<unknown>
  1443. 232.62 s > at <unknown source file>:<unknown line>
  1444. 232.62 s > 10: <test_runs[928b8788563090d0]::profile_bulk::dotted_bubble_amp_bulk_profile_passes::{closure#0} as core[8c5ac2f034688f9a]::ops::function::FnOnce<()>>::call_once<unknown>
  1445. 232.62 s > at <unknown source file>:<unknown line>
  1446. 232.62 s > 11: test[7974841f8dbd3561]::__rust_begin_short_backtrace::<core[8c5ac2f034688f9a]::result::Result<(), alloc[93e694a8365d93dd]::string::String>, fn() -> core[8c5ac2f034688f9a]::result::Result<(), alloc[93e694a8365d93dd]::string::String>><unknown>
  1447. 232.62 s > at <unknown source file>:<unknown line>
  1448. 232.62 s > 12: test[7974841f8dbd3561]::run_test::{closure#0}<unknown>
  1449. 232.62 s > at <unknown source file>:<unknown line>
  1450. 232.62 s > 13: std[5167731717db2e51]::sys::backtrace::__rust_begin_short_backtrace::<test[7974841f8dbd3561]::run_test::{closure#1}, ()><unknown>
  1451. 232.62 s > at <unknown source file>:<unknown line>
  1452. 232.62 s > 14: <std[5167731717db2e51]::thread::lifecycle::spawn_unchecked<test[7974841f8dbd3561]::run_test::{closure#1}, ()>::{closure#1} as core[8c5ac2f034688f9a]::ops::function::FnOnce<()>>::call_once::{shim:vtable#0}<unknown>
  1453. 232.62 s > at <unknown source file>:<unknown line>
  1454. 232.62 s > 15: <std[5167731717db2e51]::sys::thread::unix::Thread>::new::thread_start<unknown>
  1455. 232.62 s > at <unknown source file>:<unknown line>
  1456. 232.62 s > 16: start_thread<unknown>
  1457. 232.62 s > at <unknown source file>:<unknown line>
  1458. 232.62 s > 17: __clone3<unknown>
  1459. 232.62 s > at <unknown source file>:<unknown line>
  1460. 232.62 s >
  1461. 232.62 s > Run with COLORBT_SHOW_HIDDEN=1 environment variable to disable frame filtering.
  1462. 232.62 s > Run with RUST_BACKTRACE=full to include source snippets.
  1463. 232.62 s > Warning: SpanTrace capture is Unsupported.
  1464. 232.62 s > Ensure that you've setup a tracing-error ErrorLayer and the semver versions are compatible
  1465. 232.62 s > system-out
  1466. 232.62 s > running 1 test
  1467. 232.62 s > test profile_bulk::dotted_bubble_amp_bulk_profile_passes ... FAILED
  1468. 232.62 s >
  1469. 232.62 s > failures:
  1470. 232.62 s >
  1471. 232.62 s > failures:
  1472. 232.62 s > profile_bulk::dotted_bubble_amp_bulk_profile_passes
  1473. 232.62 s >
  1474. 232.62 s > test result: FAILED. 0 passed; 1 failed; 0 ignored; 0 measured; 82 filtered out; finished in 0.83s
  1475. 232.62 s > system-err
  1476. 232.62 s > [2026-09-02 14:26:13.204] @gammaloop_api::se... INFO : Running command import model ./assets/models/json/scalars/scalars_2p_3p.json
  1477. 232.62 s > [2026-09-02 14:26:13.204] @import::model INFO : Loading JSON model scalars_2p_3p-default from /build/source/assets/models/json/scalars/scalars_2p_3p
  1478. 232.62 s > [2026-09-02 14:26:13.209] @gammaloop_api::se... INFO : Running command import graphs ./tests/resources/graphs/dotted_bubble_amp.dot
  1479. 232.62 s > [2026-09-02 14:26:13.209] @commands::import INFO : Loading graphs from '/build/source/tests/resources/graphs/dotted_bubble_amp.dot'
  1480. 232.62 s > [2026-09-02 14:26:13.233] @gammaloop_api::se... INFO : Running command generate
  1481. 232.62 s > [2026-09-02 14:26:13.338] @commands::generate INFO :
  1482. 232.62 s > Integrand generation summary
  1483. 232.62 s > peak RAM 63.47 MiB | cores 1
  1484. 232.62 s > ╭───────────┬───────────────────┬─────────┬────────────┬────────────┬────────────────┬─────────────╮
  1485. 232.62 s > │ integrand │ graph │ # evals │ expr build │ spenso │ symbolica eval │ compile │
  1486. 232.62 s > ├───────────┼───────────────────┼─────────┼────────────┼────────────┼────────────────┼─────────────┤
  1487. 232.62 s > │ default │ dotted_bubble_amp │ 8 │ 43ms (49%) │ 21ms (24%) │ 23ms (27%) │ 0ms (0.00%) │
  1488. 232.62 s > ├───────────┼───────────────────┼─────────┼────────────┼────────────┼────────────────┼─────────────┤
  1489. 232.62 s > │ Total │ │ 8 │ 43ms (49%) │ 21ms (24%) │ 23ms (27%) │ 0ms (0.00%) │
  1490. 232.62 s > ╰───────────┴───────────────────┴─────────┴────────────┴────────────┴────────────────┴─────────────╯
  1491. 232.62 s > [2026-09-02 14:26:13.340] @process::amplitude INFO : Input is above threshold: 1 existing threshold E-surfaces across 1/1 graph groups
  1492. 232.62 s > [2026-09-02 14:26:13.340] @process::amplitude INFO : overlap structure of group 0: [1: [1(1,3)]]
  1493. 232.62 s > Error:
  1494. 232.62 s > 0: IR profiling requested arbitrary precision but received a quad-precision result
  1495. 232.62 s >
  1496. 232.62 s > Location:
  1497. 232.62 s > crates/gammalooprs/src/integrands/process/ir.rs:2123
  1498. 232.62 s >
  1499. 232.62 s > ━━━━━━━━━━━━━━━━━━━━━━━━━━━━━━━━━━ BACKTRACE ━━━━━━━━━━━━━━━━━━━━━━━━━━━━━━━━━━━
  1500. 232.62 s > 1: <color_eyre[bb06c27fa12d52c3]::config::EyreHook>::into_eyre_hook::{closure#0}<unknown>
  1501. 232.62 s > at <unknown source file>:<unknown line>
  1502. 232.62 s > 2: eyre[9f660d63ab6a72c5]::capture_handler<unknown>
  1503. 232.62 s > at <unknown source file>:<unknown line>
  1504. 232.62 s > 3: eyre[9f660d63ab6a72c5]::private::format_err<unknown>
  1505. 232.62 s > at <unknown source file>:<unknown line>
  1506. 232.62 s > 4: gammalooprs[1b273202b0029755]::integrands::process::ir::evaluate_profile_momentum_point_arb::<gammalooprs[1b273202b0029755]::integrands::process::amplitude::AmplitudeIntegrand><unknown>
  1507. 232.62 s > at <unknown source file>:<unknown line>
  1508. 232.62 s > 5: <gammalooprs[1b273202b0029755]::integrands::process::amplitude::AmplitudeIntegrand>::test_single_ir_limit_impl<unknown>
  1509. 232.62 s > at <unknown source file>:<unknown line>
  1510. 232.62 s > 6: gammalooprs[1b273202b0029755]::integrands::process::ir::run_ir_profile::<gammalooprs[1b273202b0029755]::integrands::process::amplitude::AmplitudeIntegrand, <gammalooprs[1b273202b0029755]::integrands::process::amplitude::AmplitudeIntegrand>::enumerate_ir_limits, <gammalooprs[1b273202b0029755]::integrands::process::amplitude::AmplitudeIntegrand>::graph_cut_definitions, <gammalooprs[1b273202b0029755]::integrands::process::amplitude::AmplitudeIntegrand>::test_single_ir_limit_impl><unknown>
  1511. 232.62 s > at <unknown source file>:<unknown line>
  1512. 232.62 s > 7: <gammalooprs[1b273202b0029755]::integrands::process::amplitude::AmplitudeIntegrand>::test_ir<unknown>
  1513. 232.62 s > at <unknown source file>:<unknown line>
  1514. 232.62 s > 8: <gammaloop_api[9fdde70dfc7501ea]::commands::profile::Profile>::run<unknown>
  1515. 232.62 s > at <unknown source file>:<unknown line>
  1516. 232.62 s > 9: test_runs[928b8788563090d0]::profile_bulk::dotted_bubble_amp_bulk_profile_passes<unknown>
  1517. 232.62 s > at <unknown source file>:<unknown line>
  1518. 232.62 s > 10: <test_runs[928b8788563090d0]::profile_bulk::dotted_bubble_amp_bulk_profile_passes::{closure#0} as core[8c5ac2f034688f9a]::ops::function::FnOnce<()>>::call_once<unknown>
  1519. 232.62 s > at <unknown source file>:<unknown line>
  1520. 232.62 s > 11: test[7974841f8dbd3561]::__rust_begin_short_backtrace::<core[8c5ac2f034688f9a]::result::Result<(), alloc[93e694a8365d93dd]::string::String>, fn() -> core[8c5ac2f034688f9a]::result::Result<(), alloc[93e694a8365d93dd]::string::String>><unknown>
  1521. 232.62 s > at <unknown source file>:<unknown line>
  1522. 232.62 s > 12: test[7974841f8dbd3561]::run_test::{closure#0}<unknown>
  1523. 232.62 s > at <unknown source file>:<unknown line>
  1524. 232.62 s > 13: std[5167731717db2e51]::sys::backtrace::__rust_begin_short_backtrace::<test[7974841f8dbd3561]::run_test::{closure#1}, ()><unknown>
  1525. 232.62 s > at <unknown source file>:<unknown line>
  1526. 232.62 s > 14: <std[5167731717db2e51]::thread::lifecycle::spawn_unchecked<test[7974841f8dbd3561]::run_test::{closure#1}, ()>::{closure#1} as core[8c5ac2f034688f9a]::ops::function::FnOnce<()>>::call_once::{shim:vtable#0}<unknown>
  1527. 232.62 s > at <unknown source file>:<unknown line>
  1528. 232.62 s > 15: <std[5167731717db2e51]::sys::thread::unix::Thread>::new::thread_start<unknown>
  1529. 232.62 s > at <unknown source file>:<unknown line>
  1530. 232.62 s > 16: start_thread<unknown>
  1531. 232.62 s > at <unknown source file>:<unknown line>
  1532. 232.62 s > 17: __clone3<unknown>
  1533. 232.62 s > at <unknown source file>:<unknown line>
  1534. 232.62 s >
  1535. 232.62 s > Run with COLORBT_SHOW_HIDDEN=1 environment variable to disable frame filtering.
  1536. 232.62 s > Run with RUST_BACKTRACE=full to include source snippets.
  1537. 232.62 s > Warning: SpanTrace capture is Unsupported.
  1538. 232.62 s > Ensure that you've setup a tracing-error ErrorLayer and the semver versions are compatible
  1539. 232.62 s >
  1540. 232.62 s > 3. gammaloop-integration-tests::test_runs::profile_bulk::double_dotted_bubble_amp_bulk_profile_passes
  1541. 232.62 s > failure: test failure with exit code 101
  1542. 232.62 s > Error:
  1543. 232.62 s > 0: IR profiling requested arbitrary precision but received a quad-precision result
  1544. 232.62 s >
  1545. 232.62 s > Location:
  1546. 232.62 s > crates/gammalooprs/src/integrands/process/ir.rs:2123
  1547. 232.62 s >
  1548. 232.62 s > ━━━━━━━━━━━━━━━━━━━━━━━━━━━━━━━━━━ BACKTRACE ━━━━━━━━━━━━━━━━━━━━━━━━━━━━━━━━━━━
  1549. 232.62 s > 1: <color_eyre[bb06c27fa12d52c3]::config::EyreHook>::into_eyre_hook::{closure#0}<unknown>
  1550. 232.62 s > at <unknown source file>:<unknown line>
  1551. 232.62 s > 2: eyre[9f660d63ab6a72c5]::capture_handler<unknown>
  1552. 232.62 s > at <unknown source file>:<unknown line>
  1553. 232.62 s > 3: eyre[9f660d63ab6a72c5]::private::format_err<unknown>
  1554. 232.62 s > at <unknown source file>:<unknown line>
  1555. 232.62 s > 4: gammalooprs[1b273202b0029755]::integrands::process::ir::evaluate_profile_momentum_point_arb::<gammalooprs[1b273202b0029755]::integrands::process::amplitude::AmplitudeIntegrand><unknown>
  1556. 232.62 s > at <unknown source file>:<unknown line>
  1557. 232.62 s > 5: <gammalooprs[1b273202b0029755]::integrands::process::amplitude::AmplitudeIntegrand>::test_single_ir_limit_impl<unknown>
  1558. 232.62 s > at <unknown source file>:<unknown line>
  1559. 232.62 s > 6: gammalooprs[1b273202b0029755]::integrands::process::ir::run_ir_profile::<gammalooprs[1b273202b0029755]::integrands::process::amplitude::AmplitudeIntegrand, <gammalooprs[1b273202b0029755]::integrands::process::amplitude::AmplitudeIntegrand>::enumerate_ir_limits, <gammalooprs[1b273202b0029755]::integrands::process::amplitude::AmplitudeIntegrand>::graph_cut_definitions, <gammalooprs[1b273202b0029755]::integrands::process::amplitude::AmplitudeIntegrand>::test_single_ir_limit_impl><unknown>
  1560. 232.62 s > at <unknown source file>:<unknown line>
  1561. 232.62 s > 7: <gammalooprs[1b273202b0029755]::integrands::process::amplitude::AmplitudeIntegrand>::test_ir<unknown>
  1562. 232.62 s > at <unknown source file>:<unknown line>
  1563. 232.62 s > 8: <gammaloop_api[9fdde70dfc7501ea]::commands::profile::Profile>::run<unknown>
  1564. 232.62 s > at <unknown source file>:<unknown line>
  1565. 232.62 s > 9: test_runs[928b8788563090d0]::profile_bulk::double_dotted_bubble_amp_bulk_profile_passes<unknown>
  1566. 232.62 s > at <unknown source file>:<unknown line>
  1567. 232.62 s > 10: <test_runs[928b8788563090d0]::profile_bulk::double_dotted_bubble_amp_bulk_profile_passes::{closure#0} as core[8c5ac2f034688f9a]::ops::function::FnOnce<()>>::call_once<unknown>
  1568. 232.62 s > at <unknown source file>:<unknown line>
  1569. 232.62 s > 11: test[7974841f8dbd3561]::__rust_begin_short_backtrace::<core[8c5ac2f034688f9a]::result::Result<(), alloc[93e694a8365d93dd]::string::String>, fn() -> core[8c5ac2f034688f9a]::result::Result<(), alloc[93e694a8365d93dd]::string::String>><unknown>
  1570. 232.62 s > at <unknown source file>:<unknown line>
  1571. 232.62 s > 12: test[7974841f8dbd3561]::run_test::{closure#0}<unknown>
  1572. 232.62 s > at <unknown source file>:<unknown line>
  1573. 232.62 s > 13: std[5167731717db2e51]::sys::backtrace::__rust_begin_short_backtrace::<test[7974841f8dbd3561]::run_test::{closure#1}, ()><unknown>
  1574. 232.62 s > at <unknown source file>:<unknown line>
  1575. 232.62 s > 14: <std[5167731717db2e51]::thread::lifecycle::spawn_unchecked<test[7974841f8dbd3561]::run_test::{closure#1}, ()>::{closure#1} as core[8c5ac2f034688f9a]::ops::function::FnOnce<()>>::call_once::{shim:vtable#0}<unknown>
  1576. 232.62 s > at <unknown source file>:<unknown line>
  1577. 232.62 s > 15: <std[5167731717db2e51]::sys::thread::unix::Thread>::new::thread_start<unknown>
  1578. 232.62 s > at <unknown source file>:<unknown line>
  1579. 232.62 s > 16: start_thread<unknown>
  1580. 232.62 s > at <unknown source file>:<unknown line>
  1581. 232.62 s > 17: __clone3<unknown>
  1582. 232.62 s > at <unknown source file>:<unknown line>
  1583. 232.62 s >
  1584. 232.63 s > Run with COLORBT_SHOW_HIDDEN=1 environment variable to disable frame filtering.
  1585. 232.63 s > Run with RUST_BACKTRACE=full to include source snippets.
  1586. 232.63 s > Warning: SpanTrace capture is Unsupported.
  1587. 232.63 s > Ensure that you've setup a tracing-error ErrorLayer and the semver versions are compatible
  1588. 232.63 s > system-out
  1589. 232.63 s > running 1 test
  1590. 232.63 s > test profile_bulk::double_dotted_bubble_amp_bulk_profile_passes ... FAILED
  1591. 232.63 s >
  1592. 232.63 s > failures:
  1593. 232.63 s >
  1594. 232.63 s > failures:
  1595. 232.63 s > profile_bulk::double_dotted_bubble_amp_bulk_profile_passes
  1596. 232.63 s >
  1597. 232.63 s > test result: FAILED. 0 passed; 1 failed; 0 ignored; 0 measured; 82 filtered out; finished in 0.68s
  1598. 232.63 s > system-err
  1599. 232.63 s > [2026-09-02 14:26:13.315] @gammaloop_api::se... INFO : Running command import model ./assets/models/json/scalars/scalars_2p_3p.json
  1600. 232.63 s > [2026-09-02 14:26:13.315] @import::model INFO : Loading JSON model scalars_2p_3p-default from /build/source/assets/models/json/scalars/scalars_2p_3p
  1601. 232.63 s > [2026-09-02 14:26:13.318] @gammaloop_api::se... INFO : Running command import graphs ./tests/resources/graphs/double_dotted_bubble_amp.dot
  1602. 232.63 s > [2026-09-02 14:26:13.319] @commands::import INFO : Loading graphs from '/build/source/tests/resources/graphs/double_dotted_bubble_amp.dot'
  1603. 232.63 s > [2026-09-02 14:26:13.342] @gammaloop_api::se... INFO : Running command generate
  1604. 232.63 s > [2026-09-02 14:26:13.568] @commands::generate INFO :
  1605. 232.63 s > Integrand generation summary
  1606. 232.63 s > peak RAM 66.99 MiB | cores 1
  1607. 232.63 s > ╭───────────┬──────────────────────────┬─────────┬────────────┬────────────┬────────────────┬─────────────╮
  1608. 232.63 s > │ integrand │ graph │ # evals │ expr build │ spenso │ symbolica eval │ compile │
  1609. 232.63 s > ├───────────┼──────────────────────────┼─────────┼────────────┼────────────┼────────────────┼─────────────┤
  1610. 232.63 s > │ default │ double_dotted_bubble_amp │ 11 │ 70ms (52%) │ 7ms (5.6%) │ 58ms (42%) │ 0ms (0.00%) │
  1611. 232.63 s > ├───────────┼──────────────────────────┼─────────┼────────────┼────────────┼────────────────┼─────────────┤
  1612. 232.63 s > │ Total │ │ 11 │ 70ms (52%) │ 7ms (5.6%) │ 58ms (42%) │ 0ms (0.00%) │
  1613. 232.63 s > ╰───────────┴──────────────────────────┴─────────┴────────────┴────────────┴────────────────┴─────────────╯
  1614. 232.63 s > [2026-09-02 14:26:13.570] @process::amplitude INFO : Input is above threshold: 1 existing threshold E-surfaces across 1/1 graph groups
  1615. 232.63 s > [2026-09-02 14:26:13.570] @process::amplitude INFO : overlap structure of group 0: [1: [1(1,4)]]
  1616. 232.63 s > Error:
  1617. 232.63 s > 0: IR profiling requested arbitrary precision but received a quad-precision result
  1618. 232.63 s >
  1619. 232.63 s > Location:
  1620. 232.63 s > crates/gammalooprs/src/integrands/process/ir.rs:2123
  1621. 232.63 s >
  1622. 232.63 s > ━━━━━━━━━━━━━━━━━━━━━━━━━━━━━━━━━━ BACKTRACE ━━━━━━━━━━━━━━━━━━━━━━━━━━━━━━━━━━━
  1623. 232.63 s > 1: <color_eyre[bb06c27fa12d52c3]::config::EyreHook>::into_eyre_hook::{closure#0}<unknown>
  1624. 232.63 s > at <unknown source file>:<unknown line>
  1625. 232.63 s > 2: eyre[9f660d63ab6a72c5]::capture_handler<unknown>
  1626. 232.63 s > at <unknown source file>:<unknown line>
  1627. 232.63 s > 3: eyre[9f660d63ab6a72c5]::private::format_err<unknown>
  1628. 232.63 s > at <unknown source file>:<unknown line>
  1629. 232.63 s > 4: gammalooprs[1b273202b0029755]::integrands::process::ir::evaluate_profile_momentum_point_arb::<gammalooprs[1b273202b0029755]::integrands::process::amplitude::AmplitudeIntegrand><unknown>
  1630. 232.63 s > at <unknown source file>:<unknown line>
  1631. 232.63 s > 5: <gammalooprs[1b273202b0029755]::integrands::process::amplitude::AmplitudeIntegrand>::test_single_ir_limit_impl<unknown>
  1632. 232.63 s > at <unknown source file>:<unknown line>
  1633. 232.63 s > 6: gammalooprs[1b273202b0029755]::integrands::process::ir::run_ir_profile::<gammalooprs[1b273202b0029755]::integrands::process::amplitude::AmplitudeIntegrand, <gammalooprs[1b273202b0029755]::integrands::process::amplitude::AmplitudeIntegrand>::enumerate_ir_limits, <gammalooprs[1b273202b0029755]::integrands::process::amplitude::AmplitudeIntegrand>::graph_cut_definitions, <gammalooprs[1b273202b0029755]::integrands::process::amplitude::AmplitudeIntegrand>::test_single_ir_limit_impl><unknown>
  1634. 232.63 s > at <unknown source file>:<unknown line>
  1635. 232.63 s > 7: <gammalooprs[1b273202b0029755]::integrands::process::amplitude::AmplitudeIntegrand>::test_ir<unknown>
  1636. 232.63 s > at <unknown source file>:<unknown line>
  1637. 232.63 s > 8: <gammaloop_api[9fdde70dfc7501ea]::commands::profile::Profile>::run<unknown>
  1638. 232.63 s > at <unknown source file>:<unknown line>
  1639. 232.63 s > 9: test_runs[928b8788563090d0]::profile_bulk::double_dotted_bubble_amp_bulk_profile_passes<unknown>
  1640. 232.63 s > at <unknown source file>:<unknown line>
  1641. 232.63 s > 10: <test_runs[928b8788563090d0]::profile_bulk::double_dotted_bubble_amp_bulk_profile_passes::{closure#0} as core[8c5ac2f034688f9a]::ops::function::FnOnce<()>>::call_once<unknown>
  1642. 232.63 s > at <unknown source file>:<unknown line>
  1643. 232.63 s > 11: test[7974841f8dbd3561]::__rust_begin_short_backtrace::<core[8c5ac2f034688f9a]::result::Result<(), alloc[93e694a8365d93dd]::string::String>, fn() -> core[8c5ac2f034688f9a]::result::Result<(), alloc[93e694a8365d93dd]::string::String>><unknown>
  1644. 232.63 s > at <unknown source file>:<unknown line>
  1645. 232.63 s > 12: test[7974841f8dbd3561]::run_test::{closure#0}<unknown>
  1646. 232.63 s > at <unknown source file>:<unknown line>
  1647. 232.63 s > 13: std[5167731717db2e51]::sys::backtrace::__rust_begin_short_backtrace::<test[7974841f8dbd3561]::run_test::{closure#1}, ()><unknown>
  1648. 232.63 s > at <unknown source file>:<unknown line>
  1649. 232.63 s > 14: <std[5167731717db2e51]::thread::lifecycle::spawn_unchecked<test[7974841f8dbd3561]::run_test::{closure#1}, ()>::{closure#1} as core[8c5ac2f034688f9a]::ops::function::FnOnce<()>>::call_once::{shim:vtable#0}<unknown>
  1650. 232.63 s > at <unknown source file>:<unknown line>
  1651. 232.63 s > 15: <std[5167731717db2e51]::sys::thread::unix::Thread>::new::thread_start<unknown>
  1652. 232.63 s > at <unknown source file>:<unknown line>
  1653. 232.63 s > 16: start_thread<unknown>
  1654. 232.63 s > at <unknown source file>:<unknown line>
  1655. 232.63 s > 17: __clone3<unknown>
  1656. 232.63 s > at <unknown source file>:<unknown line>
  1657. 232.63 s >
  1658. 232.63 s > Run with COLORBT_SHOW_HIDDEN=1 environment variable to disable frame filtering.
  1659. 232.63 s > Run with RUST_BACKTRACE=full to include source snippets.
  1660. 232.63 s > Warning: SpanTrace capture is Unsupported.
  1661. 232.63 s > Ensure that you've setup a tracing-error ErrorLayer and the semver versions are compatible
  1662. 232.63 s >
  1663. 232.63 s > 4. gammaloop-integration-tests::test_runs::profile_bulk::box_4e_bulk_profile_passes
  1664. 232.63 s > failure: test failure with exit code 101
  1665. 232.63 s > Error:
  1666. 232.63 s > 0: IR profiling requested arbitrary precision but received a quad-precision result
  1667. 232.63 s >
  1668. 232.63 s > Location:
  1669. 232.63 s > crates/gammalooprs/src/integrands/process/ir.rs:2123
  1670. 232.63 s >
  1671. 232.63 s > ━━━━━━━━━━━━━━━━━━━━━━━━━━━━━━━━━━ BACKTRACE ━━━━━━━━━━━━━━━━━━━━━━━━━━━━━━━━━━━
  1672. 232.63 s > 1: <color_eyre[bb06c27fa12d52c3]::config::EyreHook>::into_eyre_hook::{closure#0}<unknown>
  1673. 232.63 s > at <unknown source file>:<unknown line>
  1674. 232.63 s > 2: eyre[9f660d63ab6a72c5]::capture_handler<unknown>
  1675. 232.63 s > at <unknown source file>:<unknown line>
  1676. 232.63 s > 3: eyre[9f660d63ab6a72c5]::private::format_err<unknown>
  1677. 232.63 s > at <unknown source file>:<unknown line>
  1678. 232.63 s > 4: gammalooprs[1b273202b0029755]::integrands::process::ir::evaluate_profile_momentum_point_arb::<gammalooprs[1b273202b0029755]::integrands::process::amplitude::AmplitudeIntegrand><unknown>
  1679. 232.63 s > at <unknown source file>:<unknown line>
  1680. 232.63 s > 5: <gammalooprs[1b273202b0029755]::integrands::process::amplitude::AmplitudeIntegrand>::test_single_ir_limit_impl<unknown>
  1681. 232.63 s > at <unknown source file>:<unknown line>
  1682. 232.63 s > 6: gammalooprs[1b273202b0029755]::integrands::process::ir::run_ir_profile::<gammalooprs[1b273202b0029755]::integrands::process::amplitude::AmplitudeIntegrand, <gammalooprs[1b273202b0029755]::integrands::process::amplitude::AmplitudeIntegrand>::enumerate_ir_limits, <gammalooprs[1b273202b0029755]::integrands::process::amplitude::AmplitudeIntegrand>::graph_cut_definitions, <gammalooprs[1b273202b0029755]::integrands::process::amplitude::AmplitudeIntegrand>::test_single_ir_limit_impl><unknown>
  1683. 232.63 s > at <unknown source file>:<unknown line>
  1684. 232.63 s > 7: <gammalooprs[1b273202b0029755]::integrands::process::amplitude::AmplitudeIntegrand>::test_ir<unknown>
  1685. 232.63 s > at <unknown source file>:<unknown line>
  1686. 232.63 s > 8: <gammaloop_api[9fdde70dfc7501ea]::commands::profile::Profile>::run<unknown>
  1687. 232.63 s > at <unknown source file>:<unknown line>
  1688. 232.63 s > 9: test_runs[928b8788563090d0]::profile_bulk::box_4e_bulk_profile_passes<unknown>
  1689. 232.63 s > at <unknown source file>:<unknown line>
  1690. 232.63 s > 10: <test_runs[928b8788563090d0]::profile_bulk::box_4e_bulk_profile_passes::{closure#0} as core[8c5ac2f034688f9a]::ops::function::FnOnce<()>>::call_once<unknown>
  1691. 232.63 s > at <unknown source file>:<unknown line>
  1692. 232.63 s > 11: test[7974841f8dbd3561]::__rust_begin_short_backtrace::<core[8c5ac2f034688f9a]::result::Result<(), alloc[93e694a8365d93dd]::string::String>, fn() -> core[8c5ac2f034688f9a]::result::Result<(), alloc[93e694a8365d93dd]::string::String>><unknown>
  1693. 232.63 s > at <unknown source file>:<unknown line>
  1694. 232.63 s > 12: test[7974841f8dbd3561]::run_test::{closure#0}<unknown>
  1695. 232.63 s > at <unknown source file>:<unknown line>
  1696. 232.63 s > 13: std[5167731717db2e51]::sys::backtrace::__rust_begin_short_backtrace::<test[7974841f8dbd3561]::run_test::{closure#1}, ()><unknown>
  1697. 232.63 s > at <unknown source file>:<unknown line>
  1698. 232.63 s > 14: <std[5167731717db2e51]::thread::lifecycle::spawn_unchecked<test[7974841f8dbd3561]::run_test::{closure#1}, ()>::{closure#1} as core[8c5ac2f034688f9a]::ops::function::FnOnce<()>>::call_once::{shim:vtable#0}<unknown>
  1699. 232.63 s > at <unknown source file>:<unknown line>
  1700. 232.63 s > 15: <std[5167731717db2e51]::sys::thread::unix::Thread>::new::thread_start<unknown>
  1701. 232.63 s > at <unknown source file>:<unknown line>
  1702. 232.63 s > 16: start_thread<unknown>
  1703. 232.63 s > at <unknown source file>:<unknown line>
  1704. 232.63 s > 17: __clone3<unknown>
  1705. 232.63 s > at <unknown source file>:<unknown line>
  1706. 232.63 s >
  1707. 232.63 s > Run with COLORBT_SHOW_HIDDEN=1 environment variable to disable frame filtering.
  1708. 232.63 s > Run with RUST_BACKTRACE=full to include source snippets.
  1709. 232.63 s > Warning: SpanTrace capture is Unsupported.
  1710. 232.63 s > Ensure that you've setup a tracing-error ErrorLayer and the semver versions are compatible
  1711. 232.63 s > system-out
  1712. 232.63 s > running 1 test
  1713. 232.63 s > test profile_bulk::box_4e_bulk_profile_passes ... FAILED
  1714. 232.63 s >
  1715. 232.63 s > failures:
  1716. 232.63 s >
  1717. 232.63 s > failures:
  1718. 232.63 s > profile_bulk::box_4e_bulk_profile_passes
  1719. 232.63 s >
  1720. 232.63 s > test result: FAILED. 0 passed; 1 failed; 0 ignored; 0 measured; 82 filtered out; finished in 1.76s
  1721. 232.63 s > system-err
  1722. 232.63 s > [2026-09-02 14:26:13.326] @gammaloop_api::se... INFO : Running command import model ./assets/models/json/scalars/scalars.json
  1723. 232.63 s > [2026-09-02 14:26:13.326] @import::model INFO : Loading JSON model scalars-default from /build/source/assets/models/json/scalars/scalars
  1724. 232.63 s > [2026-09-02 14:26:13.334] @gammalooprs::model INFO : The following 2 external parameters were forced to zero by the restriction card:
  1725. 232.63 s > width_scalar_1, width_scalar_2
  1726. 232.63 s > [2026-09-02 14:26:13.336] @gammaloop_api::se... INFO : Running command import graphs ./tests/resources/graphs/massless_box.dot
  1727. 232.63 s > [2026-09-02 14:26:13.336] @commands::import INFO : Loading graphs from '/build/source/tests/resources/graphs/massless_box.dot'
  1728. 232.63 s > [2026-09-02 14:26:13.350] @gammaloop_api::se... INFO : Running command generate
  1729. 232.63 s > [2026-09-02 14:26:14.000] @commands::generate INFO :
  1730. 232.63 s > Integrand generation summary
  1731. 232.63 s > peak RAM 67.60 MiB | cores 1
  1732. 232.63 s > ╭───────────┬────────────────┬─────────┬─────────────┬────────────┬────────────────┬─────────────╮
  1733. 232.63 s > │ integrand │ graph │ # evals │ expr build │ spenso │ symbolica eval │ compile │
  1734. 232.63 s > ├───────────┼────────────────┼─────────┼─────────────┼────────────┼────────────────┼─────────────┤
  1735. 232.63 s > │ default │ massless_box_0 │ 14 │ 382ms (66%) │ 91ms (16%) │ 109ms (19%) │ 0ms (0.00%) │
  1736. 232.63 s > ├───────────┼────────────────┼─────────┼─────────────┼────────────┼────────────────┼─────────────┤
  1737. 232.63 s > │ Total │ │ 14 │ 382ms (66%) │ 91ms (16%) │ 109ms (19%) │ 0ms (0.00%) │
  1738. 232.63 s > ╰───────────┴────────────────┴─────────┴─────────────┴────────────┴────────────────┴─────────────╯
  1739. 232.63 s > [2026-09-02 14:26:14.014] @process::amplitude INFO : Input is above threshold: 4 existing threshold E-surfaces across 1/1 graph groups
  1740. 232.63 s > [2026-09-02 14:26:14.028] @process::amplitude INFO : overlap structure of group 0: [2: [4(3,4), 8(4,6)], 2: [9(3,5), 11(5,6)], 2: [4(3,4), 9(3,5)], 2: [8(4,6), 11(5,6)]]
  1741. 232.63 s > Error:
  1742. 232.63 s > 0: IR profiling requested arbitrary precision but received a quad-precision result
  1743. 232.63 s >
  1744. 232.63 s > Location:
  1745. 232.63 s > crates/gammalooprs/src/integrands/process/ir.rs:2123
  1746. 232.63 s >
  1747. 232.63 s > ━━━━━━━━━━━━━━━━━━━━━━━━━━━━━━━━━━ BACKTRACE ━━━━━━━━━━━━━━━━━━━━━━━━━━━━━━━━━━━
  1748. 232.63 s > 1: <color_eyre[bb06c27fa12d52c3]::config::EyreHook>::into_eyre_hook::{closure#0}<unknown>
  1749. 232.63 s > at <unknown source file>:<unknown line>
  1750. 232.63 s > 2: eyre[9f660d63ab6a72c5]::capture_handler<unknown>
  1751. 232.63 s > at <unknown source file>:<unknown line>
  1752. 232.63 s > 3: eyre[9f660d63ab6a72c5]::private::format_err<unknown>
  1753. 232.63 s > at <unknown source file>:<unknown line>
  1754. 232.63 s > 4: gammalooprs[1b273202b0029755]::integrands::process::ir::evaluate_profile_momentum_point_arb::<gammalooprs[1b273202b0029755]::integrands::process::amplitude::AmplitudeIntegrand><unknown>
  1755. 232.63 s > at <unknown source file>:<unknown line>
  1756. 232.63 s > 5: <gammalooprs[1b273202b0029755]::integrands::process::amplitude::AmplitudeIntegrand>::test_single_ir_limit_impl<unknown>
  1757. 232.63 s > at <unknown source file>:<unknown line>
  1758. 232.63 s > 6: gammalooprs[1b273202b0029755]::integrands::process::ir::run_ir_profile::<gammalooprs[1b273202b0029755]::integrands::process::amplitude::AmplitudeIntegrand, <gammalooprs[1b273202b0029755]::integrands::process::amplitude::AmplitudeIntegrand>::enumerate_ir_limits, <gammalooprs[1b273202b0029755]::integrands::process::amplitude::AmplitudeIntegrand>::graph_cut_definitions, <gammalooprs[1b273202b0029755]::integrands::process::amplitude::AmplitudeIntegrand>::test_single_ir_limit_impl><unknown>
  1759. 232.63 s > at <unknown source file>:<unknown line>
  1760. 232.63 s > 7: <gammalooprs[1b273202b0029755]::integrands::process::amplitude::AmplitudeIntegrand>::test_ir<unknown>
  1761. 232.63 s > at <unknown source file>:<unknown line>
  1762. 232.63 s > 8: <gammaloop_api[9fdde70dfc7501ea]::commands::profile::Profile>::run<unknown>
  1763. 232.63 s > at <unknown source file>:<unknown line>
  1764. 232.63 s > 9: test_runs[928b8788563090d0]::profile_bulk::box_4e_bulk_profile_passes<unknown>
  1765. 232.63 s > at <unknown source file>:<unknown line>
  1766. 232.63 s > 10: <test_runs[928b8788563090d0]::profile_bulk::box_4e_bulk_profile_passes::{closure#0} as core[8c5ac2f034688f9a]::ops::function::FnOnce<()>>::call_once<unknown>
  1767. 232.63 s > at <unknown source file>:<unknown line>
  1768. 232.63 s > 11: test[7974841f8dbd3561]::__rust_begin_short_backtrace::<core[8c5ac2f034688f9a]::result::Result<(), alloc[93e694a8365d93dd]::string::String>, fn() -> core[8c5ac2f034688f9a]::result::Result<(), alloc[93e694a8365d93dd]::string::String>><unknown>
  1769. 232.63 s > at <unknown source file>:<unknown line>
  1770. 232.63 s > 12: test[7974841f8dbd3561]::run_test::{closure#0}<unknown>
  1771. 232.63 s > at <unknown source file>:<unknown line>
  1772. 232.63 s > 13: std[5167731717db2e51]::sys::backtrace::__rust_begin_short_backtrace::<test[7974841f8dbd3561]::run_test::{closure#1}, ()><unknown>
  1773. 232.63 s > at <unknown source file>:<unknown line>
  1774. 232.63 s > 14: <std[5167731717db2e51]::thread::lifecycle::spawn_unchecked<test[7974841f8dbd3561]::run_test::{closure#1}, ()>::{closure#1} as core[8c5ac2f034688f9a]::ops::function::FnOnce<()>>::call_once::{shim:vtable#0}<unknown>
  1775. 232.63 s > at <unknown source file>:<unknown line>
  1776. 232.63 s > 15: <std[5167731717db2e51]::sys::thread::unix::Thread>::new::thread_start<unknown>
  1777. 232.63 s > at <unknown source file>:<unknown line>
  1778. 232.63 s > 16: start_thread<unknown>
  1779. 232.63 s > at <unknown source file>:<unknown line>
  1780. 232.63 s > 17: __clone3<unknown>
  1781. 232.63 s > at <unknown source file>:<unknown line>
  1782. 232.63 s >
  1783. 232.63 s > Run with COLORBT_SHOW_HIDDEN=1 environment variable to disable frame filtering.
  1784. 232.63 s > Run with RUST_BACKTRACE=full to include source snippets.
  1785. 232.63 s > Warning: SpanTrace capture is Unsupported.
  1786. 232.63 s > Ensure that you've setup a tracing-error ErrorLayer and the semver versions are compatible
  1787. 232.63 s >
  1788. 232.63 s > 5. gammaloop-integration-tests::test_runs::profile_bulk::massless_triangle_bulk_profile_passes
  1789. 232.63 s > failure: test failure with exit code 101
  1790. 232.63 s > Error:
  1791. 232.63 s > 0: IR profiling requested arbitrary precision but received a quad-precision result
  1792. 232.63 s >
  1793. 232.63 s > Location:
  1794. 232.63 s > crates/gammalooprs/src/integrands/process/ir.rs:2123
  1795. 232.63 s >
  1796. 232.63 s > ━━━━━━━━━━━━━━━━━━━━━━━━━━━━━━━━━━ BACKTRACE ━━━━━━━━━━━━━━━━━━━━━━━━━━━━━━━━━━━
  1797. 232.63 s > 1: <color_eyre[bb06c27fa12d52c3]::config::EyreHook>::into_eyre_hook::{closure#0}<unknown>
  1798. 232.63 s > at <unknown source file>:<unknown line>
  1799. 232.63 s > 2: eyre[9f660d63ab6a72c5]::capture_handler<unknown>
  1800. 232.63 s > at <unknown source file>:<unknown line>
  1801. 232.63 s > 3: eyre[9f660d63ab6a72c5]::private::format_err<unknown>
  1802. 232.63 s > at <unknown source file>:<unknown line>
  1803. 232.63 s > 4: gammalooprs[1b273202b0029755]::integrands::process::ir::evaluate_profile_momentum_point_arb::<gammalooprs[1b273202b0029755]::integrands::process::amplitude::AmplitudeIntegrand><unknown>
  1804. 232.63 s > at <unknown source file>:<unknown line>
  1805. 232.63 s > 5: <gammalooprs[1b273202b0029755]::integrands::process::amplitude::AmplitudeIntegrand>::test_single_ir_limit_impl<unknown>
  1806. 232.63 s > at <unknown source file>:<unknown line>
  1807. 232.63 s > 6: gammalooprs[1b273202b0029755]::integrands::process::ir::run_ir_profile::<gammalooprs[1b273202b0029755]::integrands::process::amplitude::AmplitudeIntegrand, <gammalooprs[1b273202b0029755]::integrands::process::amplitude::AmplitudeIntegrand>::enumerate_ir_limits, <gammalooprs[1b273202b0029755]::integrands::process::amplitude::AmplitudeIntegrand>::graph_cut_definitions, <gammalooprs[1b273202b0029755]::integrands::process::amplitude::AmplitudeIntegrand>::test_single_ir_limit_impl><unknown>
  1808. 232.63 s > at <unknown source file>:<unknown line>
  1809. 232.63 s > 7: <gammalooprs[1b273202b0029755]::integrands::process::amplitude::AmplitudeIntegrand>::test_ir<unknown>
  1810. 232.63 s > at <unknown source file>:<unknown line>
  1811. 232.63 s > 8: <gammaloop_api[9fdde70dfc7501ea]::commands::profile::Profile>::run<unknown>
  1812. 232.63 s > at <unknown source file>:<unknown line>
  1813. 232.63 s > 9: test_runs[928b8788563090d0]::profile_bulk::massless_triangle_bulk_profile_passes<unknown>
  1814. 232.63 s > at <unknown source file>:<unknown line>
  1815. 232.63 s > 10: <test_runs[928b8788563090d0]::profile_bulk::massless_triangle_bulk_profile_passes::{closure#0} as core[8c5ac2f034688f9a]::ops::function::FnOnce<()>>::call_once<unknown>
  1816. 232.63 s > at <unknown source file>:<unknown line>
  1817. 232.63 s > 11: test[7974841f8dbd3561]::__rust_begin_short_backtrace::<core[8c5ac2f034688f9a]::result::Result<(), alloc[93e694a8365d93dd]::string::String>, fn() -> core[8c5ac2f034688f9a]::result::Result<(), alloc[93e694a8365d93dd]::string::String>><unknown>
  1818. 232.63 s > at <unknown source file>:<unknown line>
  1819. 232.63 s > 12: test[7974841f8dbd3561]::run_test::{closure#0}<unknown>
  1820. 232.63 s > at <unknown source file>:<unknown line>
  1821. 232.63 s > 13: std[5167731717db2e51]::sys::backtrace::__rust_begin_short_backtrace::<test[7974841f8dbd3561]::run_test::{closure#1}, ()><unknown>
  1822. 232.63 s > at <unknown source file>:<unknown line>
  1823. 232.63 s > 14: <std[5167731717db2e51]::thread::lifecycle::spawn_unchecked<test[7974841f8dbd3561]::run_test::{closure#1}, ()>::{closure#1} as core[8c5ac2f034688f9a]::ops::function::FnOnce<()>>::call_once::{shim:vtable#0}<unknown>
  1824. 232.63 s > at <unknown source file>:<unknown line>
  1825. 232.63 s > 15: <std[5167731717db2e51]::sys::thread::unix::Thread>::new::thread_start<unknown>
  1826. 232.63 s > at <unknown source file>:<unknown line>
  1827. 232.63 s > 16: start_thread<unknown>
  1828. 232.63 s > at <unknown source file>:<unknown line>
  1829. 232.63 s > 17: __clone3<unknown>
  1830. 232.63 s > at <unknown source file>:<unknown line>
  1831. 232.63 s >
  1832. 232.63 s > Run with COLORBT_SHOW_HIDDEN=1 environment variable to disable frame filtering.
  1833. 232.63 s > Run with RUST_BACKTRACE=full to include source snippets.
  1834. 232.63 s > Warning: SpanTrace capture is Unsupported.
  1835. 232.63 s > Ensure that you've setup a tracing-error ErrorLayer and the semver versions are compatible
  1836. 232.63 s > system-out
  1837. 232.63 s > running 1 test
  1838. 232.63 s > test profile_bulk::massless_triangle_bulk_profile_passes ... FAILED
  1839. 232.63 s >
  1840. 232.63 s > failures:
  1841. 232.63 s >
  1842. 232.63 s > failures:
  1843. 232.63 s > profile_bulk::massless_triangle_bulk_profile_passes
  1844. 232.63 s >
  1845. 232.63 s > test result: FAILED. 0 passed; 1 failed; 0 ignored; 0 measured; 82 filtered out; finished in 0.84s
  1846. 232.63 s > system-err
  1847. 232.63 s > [2026-09-02 14:26:13.645] @gammaloop_api::se... INFO : Running command import model scalars
  1848. 232.63 s > [2026-09-02 14:26:13.645] @import::model INFO : Loading built-in JSON model scalars-default
  1849. 232.63 s > [2026-09-02 14:26:13.667] @gammalooprs::model INFO : The following 2 external parameters were forced to zero by the restriction card:
  1850. 232.63 s > width_scalar_1, width_scalar_2
  1851. 232.63 s > [2026-09-02 14:26:13.678] @gammaloop_api::se... INFO : Running command import graphs ./tests/resources/graphs/massless_triangle.dot
  1852. 232.63 s > [2026-09-02 14:26:13.678] @commands::import INFO : Loading graphs from '/build/source/tests/resources/graphs/massless_triangle.dot'
  1853. 232.63 s > [2026-09-02 14:26:13.698] @gammaloop_api::se... INFO : Running command generate
  1854. 232.63 s > [2026-09-02 14:26:14.195] @commands::generate INFO :
  1855. 232.63 s > Integrand generation summary
  1856. 232.63 s > peak RAM 66.48 MiB | cores 1
  1857. 232.63 s > ╭───────────┬─────────────────────┬─────────┬────────────┬────────────┬────────────────┬─────────────╮
  1858. 232.63 s > │ integrand │ graph │ # evals │ expr build │ spenso │ symbolica eval │ compile │
  1859. 232.63 s > ├───────────┼─────────────────────┼─────────┼────────────┼────────────┼────────────────┼─────────────┤
  1860. 232.63 s > │ default │ massless_triangle_0 │ 9 │ 70ms (45%) │ 3ms (2.5%) │ 81ms (52%) │ 0ms (0.00%) │
  1861. 232.63 s > ├───────────┼─────────────────────┼─────────┼────────────┼────────────┼────────────────┼─────────────┤
  1862. 232.63 s > │ Total │ │ 9 │ 70ms (45%) │ 3ms (2.5%) │ 81ms (52%) │ 0ms (0.00%) │
  1863. 232.63 s > ╰───────────┴─────────────────────┴─────────┴────────────┴────────────┴────────────────┴─────────────╯
  1864. 232.63 s > [2026-09-02 14:26:14.197] @process::amplitude INFO : Input is above threshold: 2 existing threshold E-surfaces across 1/1 graph groups
  1865. 232.63 s > [2026-09-02 14:26:14.210] @process::amplitude INFO : overlap structure of group 0: [2: [0(1,5), 1(1,3)]]
  1866. 232.63 s > Error:
  1867. 232.63 s > 0: IR profiling requested arbitrary precision but received a quad-precision result
  1868. 232.63 s >
  1869. 232.63 s > Location:
  1870. 232.63 s > crates/gammalooprs/src/integrands/process/ir.rs:2123
  1871. 232.63 s >
  1872. 232.63 s > ━━━━━━━━━━━━━━━━━━━━━━━━━━━━━━━━━━ BACKTRACE ━━━━━━━━━━━━━━━━━━━━━━━━━━━━━━━━━━━
  1873. 232.63 s > 1: <color_eyre[bb06c27fa12d52c3]::config::EyreHook>::into_eyre_hook::{closure#0}<unknown>
  1874. 232.63 s > at <unknown source file>:<unknown line>
  1875. 232.63 s > 2: eyre[9f660d63ab6a72c5]::capture_handler<unknown>
  1876. 232.63 s > at <unknown source file>:<unknown line>
  1877. 232.63 s > 3: eyre[9f660d63ab6a72c5]::private::format_err<unknown>
  1878. 232.63 s > at <unknown source file>:<unknown line>
  1879. 232.63 s > 4: gammalooprs[1b273202b0029755]::integrands::process::ir::evaluate_profile_momentum_point_arb::<gammalooprs[1b273202b0029755]::integrands::process::amplitude::AmplitudeIntegrand><unknown>
  1880. 232.63 s > at <unknown source file>:<unknown line>
  1881. 232.63 s > 5: <gammalooprs[1b273202b0029755]::integrands::process::amplitude::AmplitudeIntegrand>::test_single_ir_limit_impl<unknown>
  1882. 232.63 s > at <unknown source file>:<unknown line>
  1883. 232.63 s > 6: gammalooprs[1b273202b0029755]::integrands::process::ir::run_ir_profile::<gammalooprs[1b273202b0029755]::integrands::process::amplitude::AmplitudeIntegrand, <gammalooprs[1b273202b0029755]::integrands::process::amplitude::AmplitudeIntegrand>::enumerate_ir_limits, <gammalooprs[1b273202b0029755]::integrands::process::amplitude::AmplitudeIntegrand>::graph_cut_definitions, <gammalooprs[1b273202b0029755]::integrands::process::amplitude::AmplitudeIntegrand>::test_single_ir_limit_impl><unknown>
  1884. 232.63 s > at <unknown source file>:<unknown line>
  1885. 232.63 s > 7: <gammalooprs[1b273202b0029755]::integrands::process::amplitude::AmplitudeIntegrand>::test_ir<unknown>
  1886. 232.63 s > at <unknown source file>:<unknown line>
  1887. 232.63 s > 8: <gammaloop_api[9fdde70dfc7501ea]::commands::profile::Profile>::run<unknown>
  1888. 232.63 s > at <unknown source file>:<unknown line>
  1889. 232.63 s > 9: test_runs[928b8788563090d0]::profile_bulk::massless_triangle_bulk_profile_passes<unknown>
  1890. 232.63 s > at <unknown source file>:<unknown line>
  1891. 232.63 s > 10: <test_runs[928b8788563090d0]::profile_bulk::massless_triangle_bulk_profile_passes::{closure#0} as core[8c5ac2f034688f9a]::ops::function::FnOnce<()>>::call_once<unknown>
  1892. 232.63 s > at <unknown source file>:<unknown line>
  1893. 232.63 s > 11: test[7974841f8dbd3561]::__rust_begin_short_backtrace::<core[8c5ac2f034688f9a]::result::Result<(), alloc[93e694a8365d93dd]::string::String>, fn() -> core[8c5ac2f034688f9a]::result::Result<(), alloc[93e694a8365d93dd]::string::String>><unknown>
  1894. 232.63 s > at <unknown source file>:<unknown line>
  1895. 232.63 s > 12: test[7974841f8dbd3561]::run_test::{closure#0}<unknown>
  1896. 232.63 s > at <unknown source file>:<unknown line>
  1897. 232.63 s > 13: std[5167731717db2e51]::sys::backtrace::__rust_begin_short_backtrace::<test[7974841f8dbd3561]::run_test::{closure#1}, ()><unknown>
  1898. 232.63 s > at <unknown source file>:<unknown line>
  1899. 232.63 s > 14: <std[5167731717db2e51]::thread::lifecycle::spawn_unchecked<test[7974841f8dbd3561]::run_test::{closure#1}, ()>::{closure#1} as core[8c5ac2f034688f9a]::ops::function::FnOnce<()>>::call_once::{shim:vtable#0}<unknown>
  1900. 232.63 s > at <unknown source file>:<unknown line>
  1901. 232.63 s > 15: <std[5167731717db2e51]::sys::thread::unix::Thread>::new::thread_start<unknown>
  1902. 232.63 s > at <unknown source file>:<unknown line>
  1903. 232.63 s > 16: start_thread<unknown>
  1904. 232.63 s > at <unknown source file>:<unknown line>
  1905. 232.63 s > 17: __clone3<unknown>
  1906. 232.63 s > at <unknown source file>:<unknown line>
  1907. 232.63 s >
  1908. 232.63 s > Run with COLORBT_SHOW_HIDDEN=1 environment variable to disable frame filtering.
  1909. 232.63 s > Run with RUST_BACKTRACE=full to include source snippets.
  1910. 232.63 s > Warning: SpanTrace capture is Unsupported.
  1911. 232.63 s > Ensure that you've setup a tracing-error ErrorLayer and the semver versions are compatible
  1912. 232.63 s >
  1913. 232.63 s > 6. gammaloop-integration-tests::test_runs::profile_bulk::scalar_self_energy_amp_bulk_profile_passes
  1914. 232.63 s > failure: test failure with exit code 101
  1915. 232.63 s > Error:
  1916. 232.63 s > 0: IR profiling requested arbitrary precision but received a quad-precision result
  1917. 232.63 s >
  1918. 232.63 s > Location:
  1919. 232.63 s > crates/gammalooprs/src/integrands/process/ir.rs:2123
  1920. 232.63 s >
  1921. 232.63 s > ━━━━━━━━━━━━━━━━━━━━━━━━━━━━━━━━━━ BACKTRACE ━━━━━━━━━━━━━━━━━━━━━━━━━━━━━━━━━━━
  1922. 232.63 s > 1: <color_eyre[bb06c27fa12d52c3]::config::EyreHook>::into_eyre_hook::{closure#0}<unknown>
  1923. 232.63 s > at <unknown source file>:<unknown line>
  1924. 232.63 s > 2: eyre[9f660d63ab6a72c5]::capture_handler<unknown>
  1925. 232.63 s > at <unknown source file>:<unknown line>
  1926. 232.63 s > 3: eyre[9f660d63ab6a72c5]::private::format_err<unknown>
  1927. 232.63 s > at <unknown source file>:<unknown line>
  1928. 232.63 s > 4: gammalooprs[1b273202b0029755]::integrands::process::ir::evaluate_profile_momentum_point_arb::<gammalooprs[1b273202b0029755]::integrands::process::amplitude::AmplitudeIntegrand><unknown>
  1929. 232.63 s > at <unknown source file>:<unknown line>
  1930. 232.63 s > 5: <gammalooprs[1b273202b0029755]::integrands::process::amplitude::AmplitudeIntegrand>::test_single_ir_limit_impl<unknown>
  1931. 232.63 s > at <unknown source file>:<unknown line>
  1932. 232.63 s > 6: gammalooprs[1b273202b0029755]::integrands::process::ir::run_ir_profile::<gammalooprs[1b273202b0029755]::integrands::process::amplitude::AmplitudeIntegrand, <gammalooprs[1b273202b0029755]::integrands::process::amplitude::AmplitudeIntegrand>::enumerate_ir_limits, <gammalooprs[1b273202b0029755]::integrands::process::amplitude::AmplitudeIntegrand>::graph_cut_definitions, <gammalooprs[1b273202b0029755]::integrands::process::amplitude::AmplitudeIntegrand>::test_single_ir_limit_impl><unknown>
  1933. 232.63 s > at <unknown source file>:<unknown line>
  1934. 232.63 s > 7: <gammalooprs[1b273202b0029755]::integrands::process::amplitude::AmplitudeIntegrand>::test_ir<unknown>
  1935. 232.63 s > at <unknown source file>:<unknown line>
  1936. 232.63 s > 8: <gammaloop_api[9fdde70dfc7501ea]::commands::profile::Profile>::run<unknown>
  1937. 232.63 s > at <unknown source file>:<unknown line>
  1938. 232.63 s > 9: test_runs[928b8788563090d0]::profile_bulk::scalar_self_energy_amp_bulk_profile_passes<unknown>
  1939. 232.63 s > at <unknown source file>:<unknown line>
  1940. 232.63 s > 10: <test_runs[928b8788563090d0]::profile_bulk::scalar_self_energy_amp_bulk_profile_passes::{closure#0} as core[8c5ac2f034688f9a]::ops::function::FnOnce<()>>::call_once<unknown>
  1941. 232.63 s > at <unknown source file>:<unknown line>
  1942. 232.63 s > 11: test[7974841f8dbd3561]::__rust_begin_short_backtrace::<core[8c5ac2f034688f9a]::result::Result<(), alloc[93e694a8365d93dd]::string::String>, fn() -> core[8c5ac2f034688f9a]::result::Result<(), alloc[93e694a8365d93dd]::string::String>><unknown>
  1943. 232.63 s > at <unknown source file>:<unknown line>
  1944. 232.63 s > 12: test[7974841f8dbd3561]::run_test::{closure#0}<unknown>
  1945. 232.63 s > at <unknown source file>:<unknown line>
  1946. 232.63 s > 13: std[5167731717db2e51]::sys::backtrace::__rust_begin_short_backtrace::<test[7974841f8dbd3561]::run_test::{closure#1}, ()><unknown>
  1947. 232.63 s > at <unknown source file>:<unknown line>
  1948. 232.63 s > 14: <std[5167731717db2e51]::thread::lifecycle::spawn_unchecked<test[7974841f8dbd3561]::run_test::{closure#1}, ()>::{closure#1} as core[8c5ac2f034688f9a]::ops::function::FnOnce<()>>::call_once::{shim:vtable#0}<unknown>
  1949. 232.63 s > at <unknown source file>:<unknown line>
  1950. 232.63 s > 15: <std[5167731717db2e51]::sys::thread::unix::Thread>::new::thread_start<unknown>
  1951. 232.63 s > at <unknown source file>:<unknown line>
  1952. 232.63 s > 16: start_thread<unknown>
  1953. 232.63 s > at <unknown source file>:<unknown line>
  1954. 232.63 s > 17: __clone3<unknown>
  1955. 232.63 s > at <unknown source file>:<unknown line>
  1956. 232.63 s >
  1957. 232.63 s > Run with COLORBT_SHOW_HIDDEN=1 environment variable to disable frame filtering.
  1958. 232.63 s > Run with RUST_BACKTRACE=full to include source snippets.
  1959. 232.63 s > Warning: SpanTrace capture is Unsupported.
  1960. 232.63 s > Ensure that you've setup a tracing-error ErrorLayer and the semver versions are compatible
  1961. 232.63 s > system-out
  1962. 232.63 s > running 1 test
  1963. 232.63 s > test profile_bulk::scalar_self_energy_amp_bulk_profile_passes ... FAILED
  1964. 232.63 s >
  1965. 232.63 s > failures:
  1966. 232.63 s >
  1967. 232.63 s > failures:
  1968. 232.63 s > profile_bulk::scalar_self_energy_amp_bulk_profile_passes
  1969. 232.63 s >
  1970. 232.63 s > test result: FAILED. 0 passed; 1 failed; 0 ignored; 0 measured; 82 filtered out; finished in 1.78s
  1971. 232.63 s > system-err
  1972. 232.63 s > [2026-09-02 14:26:14.139] @gammaloop_api::se... INFO : Running command import model ./assets/models/json/scalars/scalars.json
  1973. 232.63 s > [2026-09-02 14:26:14.139] @import::model INFO : Loading JSON model scalars-default from /build/source/assets/models/json/scalars/scalars
  1974. 232.63 s > [2026-09-02 14:26:14.148] @gammalooprs::model INFO : The following 2 external parameters were forced to zero by the restriction card:
  1975. 232.63 s > width_scalar_1, width_scalar_2
  1976. 232.63 s > [2026-09-02 14:26:14.153] @gammaloop_api::se... INFO : Running command import graphs ./tests/resources/graphs/scalar_self_energy_amp.dot
  1977. 232.63 s > [2026-09-02 14:26:14.153] @commands::import INFO : Loading graphs from '/build/source/tests/resources/graphs/scalar_self_energy_amp.dot'
  1978. 232.63 s > [2026-09-02 14:26:14.165] @gammaloop_api::se... INFO : Running command generate
  1979. 232.63 s > [2026-09-02 14:26:14.929] @commands::generate INFO :
  1980. 232.63 s > Integrand generation summary
  1981. 232.63 s > peak RAM 71.03 MiB | cores 1
  1982. 232.63 s > ╭───────────┬────────────────────────┬─────────┬─────────────┬─────────────┬────────────────┬─────────────╮
  1983. 232.63 s > │ integrand │ graph │ # evals │ expr build │ spenso │ symbolica eval │ compile │
  1984. 232.63 s > ├───────────┼────────────────────────┼─────────┼─────────────┼─────────────┼────────────────┼─────────────┤
  1985. 232.63 s > │ default │ scalar_self_energy_amp │ 6 │ 593ms (82%) │ 28ms (4.0%) │ 97ms (14%) │ 0ms (0.00%) │
  1986. 232.63 s > ├───────────┼────────────────────────┼─────────┼─────────────┼─────────────┼────────────────┼─────────────┤
  1987. 232.63 s > │ Total │ │ 6 │ 593ms (82%) │ 28ms (4.0%) │ 97ms (14%) │ 0ms (0.00%) │
  1988. 232.63 s > ╰───────────┴────────────────────────┴─────────┴─────────────┴─────────────┴────────────────┴─────────────╯
  1989. 232.63 s > [2026-09-02 14:26:14.990] @process::amplitude INFO : Input is above threshold: 2 existing threshold E-surfaces across 1/1 graph groups
  1990. 232.63 s > [2026-09-02 14:26:14.990] @process::amplitude INFO : overlap structure of group 0: [2: [2(1,5), 4(2,3,5)]]
  1991. 232.63 s > Error:
  1992. 232.63 s > 0: IR profiling requested arbitrary precision but received a quad-precision result
  1993. 232.63 s >
  1994. 232.63 s > Location:
  1995. 232.63 s > crates/gammalooprs/src/integrands/process/ir.rs:2123
  1996. 232.63 s >
  1997. 232.63 s > ━━━━━━━━━━━━━━━━━━━━━━━━━━━━━━━━━━ BACKTRACE ━━━━━━━━━━━━━━━━━━━━━━━━━━━━━━━━━━━
  1998. 232.63 s > 1: <color_eyre[bb06c27fa12d52c3]::config::EyreHook>::into_eyre_hook::{closure#0}<unknown>
  1999. 232.63 s > at <unknown source file>:<unknown line>
  2000. 232.63 s > 2: eyre[9f660d63ab6a72c5]::capture_handler<unknown>
  2001. 232.63 s > at <unknown source file>:<unknown line>
  2002. 232.63 s > 3: eyre[9f660d63ab6a72c5]::private::format_err<unknown>
  2003. 232.63 s > at <unknown source file>:<unknown line>
  2004. 232.63 s > 4: gammalooprs[1b273202b0029755]::integrands::process::ir::evaluate_profile_momentum_point_arb::<gammalooprs[1b273202b0029755]::integrands::process::amplitude::AmplitudeIntegrand><unknown>
  2005. 232.63 s > at <unknown source file>:<unknown line>
  2006. 232.63 s > 5: <gammalooprs[1b273202b0029755]::integrands::process::amplitude::AmplitudeIntegrand>::test_single_ir_limit_impl<unknown>
  2007. 232.63 s > at <unknown source file>:<unknown line>
  2008. 232.63 s > 6: gammalooprs[1b273202b0029755]::integrands::process::ir::run_ir_profile::<gammalooprs[1b273202b0029755]::integrands::process::amplitude::AmplitudeIntegrand, <gammalooprs[1b273202b0029755]::integrands::process::amplitude::AmplitudeIntegrand>::enumerate_ir_limits, <gammalooprs[1b273202b0029755]::integrands::process::amplitude::AmplitudeIntegrand>::graph_cut_definitions, <gammalooprs[1b273202b0029755]::integrands::process::amplitude::AmplitudeIntegrand>::test_single_ir_limit_impl><unknown>
  2009. 232.63 s > at <unknown source file>:<unknown line>
  2010. 232.63 s > 7: <gammalooprs[1b273202b0029755]::integrands::process::amplitude::AmplitudeIntegrand>::test_ir<unknown>
  2011. 232.63 s > at <unknown source file>:<unknown line>
  2012. 232.63 s > 8: <gammaloop_api[9fdde70dfc7501ea]::commands::profile::Profile>::run<unknown>
  2013. 232.63 s > at <unknown source file>:<unknown line>
  2014. 232.63 s > 9: test_runs[928b8788563090d0]::profile_bulk::scalar_self_energy_amp_bulk_profile_passes<unknown>
  2015. 232.63 s > at <unknown source file>:<unknown line>
  2016. 232.63 s > 10: <test_runs[928b8788563090d0]::profile_bulk::scalar_self_energy_amp_bulk_profile_passes::{closure#0} as core[8c5ac2f034688f9a]::ops::function::FnOnce<()>>::call_once<unknown>
  2017. 232.63 s > at <unknown source file>:<unknown line>
  2018. 232.63 s > 11: test[7974841f8dbd3561]::__rust_begin_short_backtrace::<core[8c5ac2f034688f9a]::result::Result<(), alloc[93e694a8365d93dd]::string::String>, fn() -> core[8c5ac2f034688f9a]::result::Result<(), alloc[93e694a8365d93dd]::string::String>><unknown>
  2019. 232.63 s > at <unknown source file>:<unknown line>
  2020. 232.63 s > 12: test[7974841f8dbd3561]::run_test::{closure#0}<unknown>
  2021. 232.63 s > at <unknown source file>:<unknown line>
  2022. 232.63 s > 13: std[5167731717db2e51]::sys::backtrace::__rust_begin_short_backtrace::<test[7974841f8dbd3561]::run_test::{closure#1}, ()><unknown>
  2023. 232.63 s > at <unknown source file>:<unknown line>
  2024. 232.63 s > 14: <std[5167731717db2e51]::thread::lifecycle::spawn_unchecked<test[7974841f8dbd3561]::run_test::{closure#1}, ()>::{closure#1} as core[8c5ac2f034688f9a]::ops::function::FnOnce<()>>::call_once::{shim:vtable#0}<unknown>
  2025. 232.63 s > at <unknown source file>:<unknown line>
  2026. 232.63 s > 15: <std[5167731717db2e51]::sys::thread::unix::Thread>::new::thread_start<unknown>
  2027. 232.63 s > at <unknown source file>:<unknown line>
  2028. 232.63 s > 16: start_thread<unknown>
  2029. 232.63 s > at <unknown source file>:<unknown line>
  2030. 232.63 s > 17: __clone3<unknown>
  2031. 232.63 s > at <unknown source file>:<unknown line>
  2032. 232.63 s >
  2033. 232.63 s > Run with COLORBT_SHOW_HIDDEN=1 environment variable to disable frame filtering.
  2034. 232.63 s > Run with RUST_BACKTRACE=full to include source snippets.
  2035. 232.63 s > Warning: SpanTrace capture is Unsupported.
  2036. 232.63 s > Ensure that you've setup a tracing-error ErrorLayer and the semver versions are compatible
  2037. 232.63 s >
  2038. 232.63 s > 7. gammaloop-integration-tests::uv::dod2_bubble_uv
  2039. 232.63 s > failure: test failure with exit code 101
  2040. 232.63 s > system-out
  2041. 232.63 s > running 1 test
  2042. 232.63 s > test dod2_bubble_uv has been running for over 60 seconds
  2043. 232.63 s > +-------------+-----------------+---------+--------+----------+-----------------------------------------------------------------------------------------------------------------------+-------+
  2044. 232.63 s > | case | check | graph | status | sigma | threshold | error |
  2045. 232.63 s > +-------------+-----------------+---------+--------+----------+-----------------------------------------------------------------------------------------------------------------------+-------+
  2046. 232.63 s > | dod2_bubble | uv_profile | - | FAIL | - | - | - |
  2047. 232.63 s > +-------------+-----------------+---------+--------+----------+-----------------------------------------------------------------------------------------------------------------------+-------+
  2048. 232.63 s > | dod2_bubble | m_uv.inspect | inspect | pass | - | best inspect relative delta 1.000e0 >= 1000*accuracy 1.000e-7 (accuracy=1.000e-10, exponent=+8.0, seed=0, probes=10) | - |
  2049. 232.63 s > +-------------+-----------------+---------+--------+----------+-----------------------------------------------------------------------------------------------------------------------+-------+
  2050. 232.63 s > | dod2_bubble | m_uv.integrated | GL0 | pass | 0.0sigma | compatible within 2sigma | - |
  2051. 232.63 s > +-------------+-----------------+---------+--------+----------+-----------------------------------------------------------------------------------------------------------------------+-------+
  2052. 232.63 s > | dod2_bubble | rls.inspect | inspect | pass | - | best inspect relative delta 2.822e-3 >= 1000*accuracy 1.000e-7 (accuracy=1.000e-10, exponent=+2.0, seed=1, probes=10) | - |
  2053. 232.63 s > +-------------+-----------------+---------+--------+----------+-----------------------------------------------------------------------------------------------------------------------+-------+
  2054. 232.63 s > | dod2_bubble | rls.integrated | GL0 | pass | 0.0sigma | compatible within 2sigma | - |
  2055. 232.63 s > +-------------+-----------------+---------+--------+----------+-----------------------------------------------------------------------------------------------------------------------+-------+
  2056. 232.63 s > | dod2_bubble | mu_r.inspect | inspect | pass | - | best inspect relative delta 6.951e-1 >= 1000*accuracy 1.000e-7 (accuracy=1.000e-10, exponent=+0.0, seed=0, probes=10) | - |
  2057. 232.63 s > +-------------+-----------------+---------+--------+----------+-----------------------------------------------------------------------------------------------------------------------+-------+
  2058. 232.63 s > | dod2_bubble | target | - | pass | - | 2sigma | - |
  2059. 232.63 s > +-------------+-----------------+---------+--------+----------+-----------------------------------------------------------------------------------------------------------------------+-------+
  2060. 232.63 s > test dod2_bubble_uv ... FAILED
  2061. 232.63 s >
  2062. 232.63 s > failures:
  2063. 232.63 s >
  2064. 232.63 s > failures:
  2065. 232.63 s > dod2_bubble_uv
  2066. 232.63 s >
  2067. 232.63 s > test result: FAILED. 0 passed; 1 failed; 0 ignored; 0 measured; 24 filtered out; finished in 66.65s
  2068. 232.63 s > system-err
  2069. 232.63 s > [2026-09-02 14:26:20.484] @gammaloop_api::se... INFO : Running command run generate
  2070. 232.63 s > [2026-09-02 14:26:20.484] @gammaloop_api::se... INFO : Starting command block generate
  2071. 232.63 s > [2026-09-02 14:26:20.485] @gammaloop_api::se... INFO : Running command import model scalars-default.json
  2072. 232.63 s > [2026-09-02 14:26:20.485] @import::model INFO : Loading built-in JSON model scalars-default
  2073. 232.63 s > [2026-09-02 14:26:20.492] @gammalooprs::model INFO : The following 2 external parameters were forced to zero by the restriction card:
  2074. 232.63 s > width_scalar_1, width_scalar_2
  2075. 232.63 s > [2026-09-02 14:26:20.496] @gammaloop_api::se... INFO : Running command remove processes
  2076. 232.63 s > [2026-09-02 14:26:20.496] @gammaloop_api::se... INFO : Running command set global kv global.generation.uv.generate_integrated=true
  2077. 232.63 s > [2026-09-02 14:26:20.497] @gammaloop_api::se... INFO : Running command import graphs ./tests/resources/graphs/scalar/dod2_bubble.dot -p bubble_dod2 -i scalar_bubble_below_thres
  2078. 232.63 s > [2026-09-02 14:26:20.497] @commands::import INFO : Loading graphs from '/build/source/tests/resources/graphs/scalar/dod2_bubble.dot'
  2079. 232.63 s > [2026-09-02 14:26:20.503] @gammaloop_api::se... INFO : Running command generate existing -p bubble_dod2 -i scalar_bubble_below_thres
  2080. 232.63 s > [2026-09-02 14:26:20.507] @approx::local_4d [{#uv, #inspect, #integrated}] DEBUG : Rescaled momenta expanded
  2081. 232.63 s > field value
  2082. 232.63 s > res n-terms: 1, byte size: 3,expr:
  2083. 232.63 s > 1
  2084. 232.63 s > [2026-09-02 14:26:20.513] @approx::local_4d [{#uv, #inspect, #integrated}] DEBUG : Rescaled momenta expanded
  2085. 232.63 s > field value
  2086. 232.63 s > res n-terms: 1, byte size: 585,expr:
  2087. 232.63 s > -SCALAR_COUPLING²·q₀(αᵉ².¹)·q₀(αᵉ³.¹)·q₂(αᵉ².¹)·q₂(αᵉ³.¹)
  2088. 232.63 s > /(t²·denom(3,-q₀-q₂/t,mass_scalar_2²,-mass_scalar_2²+2·(q₀.q₂)/t+(q₂.q₂)/t²+(q₀.q₀))
  2089. 232.63 s > ·denom(2,q₂/t,mass_scalar_2²,-mass_scalar_2²+(q₂.q₂)/t²))
  2090. 232.63 s > [2026-09-02 14:26:20.521] @approx::final_integrand[{#generation, #profile, #uv, #graph, #summary}] DEBUG : Computed global numerator
  2091. 232.63 s > field value
  2092. 232.63 s > global_num n-terms: 1, byte size: 4,expr:
  2093. 232.63 s > 1/2
  2094. 232.63 s > span build_3d{span_context=true graph=GL0 current=subgraph=0, topo_order=0, dod=0}
  2095. 232.63 s > [2026-09-02 14:26:20.527] @uv::approx [{#generation, #uv, #fourd}] DEBUG : Computing 4D
  2096. 232.63 s > field value
  2097. 232.63 s > simple subgraph(S_11,S_y)*Approx(subgraph(S_y,0)) of GL0
  2098. 232.63 s > span compute_4d{span_context=true graph=GL0 current=subgraph=y, topo_order=1, dod=2 given=subgraph=0, topo_order=0, dod=0 reduced=SubSet { set: BitVec<usize, bitvec::order::Lsb0> { addr: 0x7fffec027530, head: 000000, bits: 6, capacity: 64 } [0, 0, 1, 1, 1, 1], id: PhantomData<linnet::half_edge::involution::Hedge> }}
  2099. 232.63 s > [2026-09-02 14:26:20.528] @approx::local_4d [{#uv, #algebra, #integrated, #start}] DEBUG :
  2100. 232.63 s > field value
  2101. 232.63 s > integrand n-terms: 1, byte size: 409,expr:
  2102. 232.63 s > SCALAR_COUPLING²·(q₀(αᵉ³.¹)+q₃(αᵉ³.¹))·q₀(αᵉ².¹)·q₀(αᵉ³.¹)·q₂(αᵉ².¹)
  2103. 232.63 s > /(denom(2,q₂,mass_scalar_2²,-mass_scalar_2²+(q₂.q₂))·denom(3,q₃,mass_scalar_2²,-mass_scalar_2²+(q₃.q₃)))
  2104. 232.63 s > reduced y
  2105. 232.63 s > span grow{span_context=true current=subgraph=y, topo_order=1, dod=2 given=subgraph=0, topo_order=0, dod=0}
  2106. 232.63 s > [2026-09-02 14:26:20.528] @approx::local_4d [{#uv, #inspect, #integrated}] DEBUG : Rescaled momenta expanded
  2107. 232.63 s > field value
  2108. 232.63 s > res n-terms: 1, byte size: 585,expr:
  2109. 232.63 s > -SCALAR_COUPLING²·q₀(αᵉ².¹)·q₀(αᵉ³.¹)·q₂(αᵉ².¹)·q₂(αᵉ³.¹)
  2110. 232.63 s > /(t²·denom(3,-q₀-q₂/t,mass_scalar_2²,-mass_scalar_2²+2·(q₀.q₂)/t+(q₂.q₂)/t²+(q₀.q₀))
  2111. 232.63 s > ·denom(2,q₂/t,mass_scalar_2²,-mass_scalar_2²+(q₂.q₂)/t²))
  2112. 232.63 s > span t{span_context=true current=subgraph=y, topo_order=1, dod=2 given=subgraph=0, topo_order=0, dod=0}
  2113. 232.63 s > [2026-09-02 14:26:20.529] @approx::local_4d [{#uv, #integrated, #rescaled}] DEBUG : Rescaled expanded
  2114. 232.63 s > field value
  2115. 232.63 s > n_loops 1
  2116. 232.63 s > res n-terms: 1, byte size: 707,expr:
  2117. 232.63 s > -SCALAR_COUPLING²·q₀(αᵉ².¹)·q₀(αᵉ³.¹)·q₂(αᵉ².¹)·q₂(αᵉ³.¹)
  2118. 232.63 s > /(t²·denom(3,-q₂,mUVexp²+t²·mass_scalar_2²,-mUV²+t²·(-mass_scalar_2²+2·(q₀.q₂)/t+(q₂.q₂)/t²+(q₀.q₀))+t²·mUVexp²)
  2119. 232.63 s > ·denom(2,q₂,mUVexp²+t²·mass_scalar_2²,-mUV²+t²·(-mass_scalar_2²+(q₂.q₂)/t²)+t²·mUVexp²))
  2120. 232.63 s > span t{span_context=true current=subgraph=y, topo_order=1, dod=2 given=subgraph=0, topo_order=0, dod=0}
  2121. 232.63 s > [2026-09-02 14:26:20.535] @approx::local_4d [{#uv, #integrated, #series}] DEBUG : Series expanded
  2122. 232.63 s > field value
  2123. 232.63 s > res n-terms: 3, byte size: 1896,expr:
  2124. 232.63 s > (1/2·SCALAR_COUPLING²·(2·mUVexp²-2·mass_scalar_2²)/(denom(2,q₂,mUVexp²,-mUV²+(q₂.q₂))²·denom(3,-q₂,mUVexp²,-mUV²+(q₂.q₂)))
  2125. 232.63 s > -SCALAR_COUPLING²
  2126. 232.63 s > ·(-1/2·(2·mUVexp²-2·mass_scalar_2²+2·(q₀.q₀))/denom(3,-q₂,mUVexp²,-mUV²+(q₂.q₂))
  2127. 232.63 s > +4·(q₀.q₂)²/denom(3,-q₂,mUVexp²,-mUV²+(q₂.q₂))²
  2128. 232.63 s > )/(denom(2,q₂,mUVexp²,-mUV²+(q₂.q₂))·denom(3,-q₂,mUVexp²,-mUV²+(q₂.q₂)))
  2129. 232.63 s > )·q₀(αᵉ².¹)·q₀(αᵉ³.¹)·q₂(αᵉ².¹)·q₂(αᵉ³.¹)
  2130. 232.63 s > +2·SCALAR_COUPLING²·(q₀.q₂)·q₀(αᵉ².¹)·q₀(αᵉ³.¹)·q₂(αᵉ².¹)·q₂(αᵉ³.¹)
  2131. 232.63 s > /(t·denom(2,q₂,mUVexp²,-mUV²+(q₂.q₂))·denom(3,-q₂,mUVexp²,-mUV²+(q₂.q₂))²)
  2132. 232.63 s > -SCALAR_COUPLING²·q₀(αᵉ².¹)·q₀(αᵉ³.¹)·q₂(αᵉ².¹)·q₂(αᵉ³.¹)
  2133. 232.63 s > /(t²·denom(2,q₂,mUVexp²,-mUV²+(q₂.q₂))·denom(3,-q₂,mUVexp²,-mUV²+(q₂.q₂)))
  2134. 232.63 s > span t{span_context=true current=subgraph=y, topo_order=1, dod=2 given=subgraph=0, topo_order=0, dod=0}
  2135. 232.63 s > [2026-09-02 14:26:20.537] @approx::local_4d [{#uv, #integrated, #series}] DEBUG : Evaluated at t = 1
  2136. 232.63 s > field value
  2137. 232.63 s > res n-terms: 3, byte size: 1880,expr:
  2138. 232.63 s > (1/2·SCALAR_COUPLING²·(2·mUVexp²-2·mass_scalar_2²)/(denom(2,q₂,mUVexp²,-mUV²+(q₂.q₂))²·denom(3,-q₂,mUVexp²,-mUV²+(q₂.q₂)))
  2139. 232.63 s > -SCALAR_COUPLING²
  2140. 232.63 s > ·(-1/2·(2·mUVexp²-2·mass_scalar_2²+2·(q₀.q₀))/denom(3,-q₂,mUVexp²,-mUV²+(q₂.q₂))
  2141. 232.63 s > +4·(q₀.q₂)²/denom(3,-q₂,mUVexp²,-mUV²+(q₂.q₂))²
  2142. 232.63 s > )/(denom(2,q₂,mUVexp²,-mUV²+(q₂.q₂))·denom(3,-q₂,mUVexp²,-mUV²+(q₂.q₂)))
  2143. 232.63 s > )·q₀(αᵉ².¹)·q₀(αᵉ³.¹)·q₂(αᵉ².¹)·q₂(αᵉ³.¹)
  2144. 232.63 s > -SCALAR_COUPLING²·q₀(αᵉ².¹)·q₀(αᵉ³.¹)·q₂(αᵉ².¹)·q₂(αᵉ³.¹)
  2145. 232.63 s > /(denom(2,q₂,mUVexp²,-mUV²+(q₂.q₂))·denom(3,-q₂,mUVexp²,-mUV²+(q₂.q₂)))
  2146. 232.63 s > +2·SCALAR_COUPLING²·(q₀.q₂)·q₀(αᵉ².¹)·q₀(αᵉ³.¹)·q₂(αᵉ².¹)·q₂(αᵉ³.¹)
  2147. 232.63 s > /(denom(2,q₂,mUVexp²,-mUV²+(q₂.q₂))·denom(3,-q₂,mUVexp²,-mUV²+(q₂.q₂))²)
  2148. 232.63 s > span t{span_context=true current=subgraph=y, topo_order=1, dod=2 given=subgraph=0, topo_order=0, dod=0}
  2149. 232.63 s > [2026-09-02 14:26:20.539] @approx::local_4d [{#uv, #collect, #integrated}] DEBUG : After gamma chain collection
  2150. 232.63 s > field value
  2151. 232.63 s > expr n-terms: 3, byte size: 1880,expr:
  2152. 232.63 s > (1/2·SCALAR_COUPLING²·(2·mUVexp²-2·mass_scalar_2²)/(denom(2,q₂,mUVexp²,-mUV²+(q₂.q₂))²·denom(3,-q₂,mUVexp²,-mUV²+(q₂.q₂)))
  2153. 232.63 s > -SCALAR_COUPLING²
  2154. 232.63 s > ·(-1/2·(2·mUVexp²-2·mass_scalar_2²+2·(q₀.q₀))/denom(3,-q₂,mUVexp²,-mUV²+(q₂.q₂))
  2155. 232.63 s > +4·(q₀.q₂)²/denom(3,-q₂,mUVexp²,-mUV²+(q₂.q₂))²
  2156. 232.63 s > )/(denom(2,q₂,mUVexp²,-mUV²+(q₂.q₂))·denom(3,-q₂,mUVexp²,-mUV²+(q₂.q₂)))
  2157. 232.63 s > )·q₀(αᵉ².¹)·q₀(αᵉ³.¹)·q₂(αᵉ².¹)·q₂(αᵉ³.¹)
  2158. 232.63 s > -SCALAR_COUPLING²·q₀(αᵉ².¹)·q₀(αᵉ³.¹)·q₂(αᵉ².¹)·q₂(αᵉ³.¹)
  2159. 232.63 s > /(denom(2,q₂,mUVexp²,-mUV²+(q₂.q₂))·denom(3,-q₂,mUVexp²,-mUV²+(q₂.q₂)))
  2160. 232.63 s > +2·SCALAR_COUPLING²·(q₀.q₂)·q₀(αᵉ².¹)·q₀(αᵉ³.¹)·q₂(αᵉ².¹)·q₂(αᵉ³.¹)
  2161. 232.63 s > /(denom(2,q₂,mUVexp²,-mUV²+(q₂.q₂))·denom(3,-q₂,mUVexp²,-mUV²+(q₂.q₂))²)
  2162. 232.63 s > span t{span_context=true current=subgraph=y, topo_order=1, dod=2 given=subgraph=0, topo_order=0, dod=0}
  2163. 232.63 s > [2026-09-02 14:26:20.546] @approx::local_4d [{#profile, #uv, #collect, #integrated, #start, #trace}] DEBUG : After gamma schoonschip
  2164. 232.63 s > field value
  2165. 232.63 s > expr n-terms: 3, byte size: 1631,expr:
  2166. 232.63 s > (1/2·SCALAR_COUPLING²·(2·mUVexp²-2·mass_scalar_2²)/(denom(2,q₂,mUVexp²,-mUV²+(q₂.q₂))²·denom(3,-q₂,mUVexp²,-mUV²+(q₂.q₂)))
  2167. 232.63 s > -SCALAR_COUPLING²
  2168. 232.63 s > ·(-1/2·(2·mUVexp²-2·mass_scalar_2²+2·(q₀.q₀))/denom(3,-q₂,mUVexp²,-mUV²+(q₂.q₂))
  2169. 232.63 s > +4·(q₀.q₂)²/denom(3,-q₂,mUVexp²,-mUV²+(q₂.q₂))²
  2170. 232.63 s > )/(denom(2,q₂,mUVexp²,-mUV²+(q₂.q₂))·denom(3,-q₂,mUVexp²,-mUV²+(q₂.q₂)))
  2171. 232.63 s > )·(q₀.q₂)²
  2172. 232.63 s > -SCALAR_COUPLING²·(q₀.q₂)²/(denom(2,q₂,mUVexp²,-mUV²+(q₂.q₂))·denom(3,-q₂,mUVexp²,-mUV²+(q₂.q₂)))
  2173. 232.63 s > +2·SCALAR_COUPLING²·(q₀.q₂)·(q₀.q₂)²
  2174. 232.63 s > /(denom(2,q₂,mUVexp²,-mUV²+(q₂.q₂))·denom(3,-q₂,mUVexp²,-mUV²+(q₂.q₂))²)
  2175. 232.63 s > span t{span_context=true current=subgraph=y, topo_order=1, dod=2 given=subgraph=0, topo_order=0, dod=0}
  2176. 232.63 s > [2026-09-02 14:26:20.555] @approx::local_4d [{#profile, #uv, #collect, #integrated, #start, #trace}] DEBUG : After gamma collection
  2177. 232.63 s > field value
  2178. 232.63 s > expr n-terms: 1, byte size: 1347,expr:
  2179. 232.63 s > SCALAR_COUPLING²
  2180. 232.63 s > ·(-denom(2,q₂,mUVexp²,-mUV²+(q₂.q₂))·denom(3,-q₂,mUVexp²,-mUV²+(q₂.q₂))²
  2181. 232.63 s > +1/2·(2·mUVexp²-2·mass_scalar_2²)·denom(3,-q₂,mUVexp²,-mUV²+(q₂.q₂))²
  2182. 232.63 s > -(-1/2·(2·mUVexp²-2·mass_scalar_2²+2·(q₀.q₀))·denom(3,-q₂,mUVexp²,-mUV²+(q₂.q₂))+4·(q₀.q₂)²)
  2183. 232.63 s > ·denom(2,q₂,mUVexp²,-mUV²+(q₂.q₂))
  2184. 232.63 s > +2·(q₀.q₂)·denom(2,q₂,mUVexp²,-mUV²+(q₂.q₂))·denom(3,-q₂,mUVexp²,-mUV²+(q₂.q₂))
  2185. 232.63 s > )·(q₀.q₂)²/(denom(2,q₂,mUVexp²,-mUV²+(q₂.q₂))²·denom(3,-q₂,mUVexp²,-mUV²+(q₂.q₂))³)
  2186. 232.63 s > span t{span_context=true current=subgraph=y, topo_order=1, dod=2 given=subgraph=0, topo_order=0, dod=0}
  2187. 232.63 s > [2026-09-02 14:26:20.560] @approx::local_4d [{#profile, #uv, #gamma, #integrated, #start, #trace, #vakint}] DEBUG : After gamma simplification
  2188. 232.63 s > ... omitted 3263 more lines; see full nextest output above
  2189. 232.63 s >
  2190. 232.63 s > 8. gammaloop-integration-tests::uv::sunrise_scalar_1_uv
  2191. 232.63 s > failure: test failure with exit code 101
  2192. 232.63 s > system-out
  2193. 232.63 s > running 1 test
  2194. 232.63 s > test sunrise_scalar_1_uv has been running for over 60 seconds
  2195. 232.63 s > +------------------+------------------------+--------------+--------+----------+----------------------------------------------------------------------------------------------------------------------+-------+
  2196. 232.63 s > | case | check | graph | status | sigma | threshold | error |
  2197. 232.63 s > +------------------+------------------------+--------------+--------+----------+----------------------------------------------------------------------------------------------------------------------+-------+
  2198. 232.63 s > | sunrise_scalar_1 | uv_profile | - | FAIL | - | - | - |
  2199. 232.63 s > +------------------+------------------------+--------------+--------+----------+----------------------------------------------------------------------------------------------------------------------+-------+
  2200. 232.63 s > | sunrise_scalar_1 | m_uv.inspect | inspect | pass | - | best inspect relative delta 1.624e0 >= 1000*accuracy 1.000e-3 (accuracy=1.000e-6, exponent=+1.0, seed=1, probes=10) | - |
  2201. 232.63 s > +------------------+------------------------+--------------+--------+----------+----------------------------------------------------------------------------------------------------------------------+-------+
  2202. 232.63 s > | sunrise_scalar_1 | m_uv.integrated | sunrise | pass | 0.1sigma | compatible within 2sigma | - |
  2203. 232.63 s > +------------------+------------------------+--------------+--------+----------+----------------------------------------------------------------------------------------------------------------------+-------+
  2204. 232.63 s > | sunrise_scalar_1 | rls.inspect | inspect | pass | - | best inspect relative delta 8.682e-1 >= 1000*accuracy 1.000e-3 (accuracy=1.000e-6, exponent=+1.0, seed=1, probes=10) | - |
  2205. 232.63 s > +------------------+------------------------+--------------+--------+----------+----------------------------------------------------------------------------------------------------------------------+-------+
  2206. 232.63 s > | sunrise_scalar_1 | rls.integrated | sunrise | pass | 0.0sigma | compatible within 2sigma | - |
  2207. 232.63 s > +------------------+------------------------+--------------+--------+----------+----------------------------------------------------------------------------------------------------------------------+-------+
  2208. 232.63 s > | sunrise_scalar_1 | mu_r.inspect | inspect | pass | - | best inspect relative delta 1.752e0 >= 1000*accuracy 1.000e-3 (accuracy=1.000e-6, exponent=+1.0, seed=1, probes=10) | - |
  2209. 232.63 s > +------------------+------------------------+--------------+--------+----------+----------------------------------------------------------------------------------------------------------------------+-------+
  2210. 232.63 s > | sunrise_scalar_1 | integrated.relerr | integrated | pass | - | relative error 9.20% <= 10.00% | - |
  2211. 232.63 s > +------------------+------------------------+--------------+--------+----------+----------------------------------------------------------------------------------------------------------------------+-------+
  2212. 232.63 s > | sunrise_scalar_1 | m_uv.integrated.relerr | m_uv-shifted | pass | - | relative error 5.89% <= 10.00% | - |
  2213. 232.63 s > +------------------+------------------------+--------------+--------+----------+----------------------------------------------------------------------------------------------------------------------+-------+
  2214. 232.63 s > | sunrise_scalar_1 | target | - | pass | - | 2sigma | - |
  2215. 232.63 s > +------------------+------------------------+--------------+--------+----------+----------------------------------------------------------------------------------------------------------------------+-------+
  2216. 232.63 s > test sunrise_scalar_1_uv ... FAILED
  2217. 232.63 s >
  2218. 232.63 s > failures:
  2219. 232.63 s >
  2220. 232.63 s > failures:
  2221. 232.63 s > sunrise_scalar_1_uv
  2222. 232.63 s >
  2223. 232.63 s > test result: FAILED. 0 passed; 1 failed; 0 ignored; 0 measured; 24 filtered out; finished in 125.43s
  2224. 232.63 s > system-err
  2225. 232.63 s > [2026-09-02 14:26:31.719] @gammaloop_api::se... INFO : Running command run generate
  2226. 232.63 s > [2026-09-02 14:26:31.719] @gammaloop_api::se... INFO : Starting command block generate
  2227. 232.63 s > [2026-09-02 14:26:31.720] @gammaloop_api::se... INFO : Running command import model scalars-default.json
  2228. 232.63 s > [2026-09-02 14:26:31.720] @import::model INFO : Loading built-in JSON model scalars-default
  2229. 232.63 s > [2026-09-02 14:26:31.724] @gammalooprs::model INFO : The following 2 external parameters were forced to zero by the restriction card:
  2230. 232.63 s > width_scalar_1, width_scalar_2
  2231. 232.63 s > [2026-09-02 14:26:31.724] @gammaloop_api::se... INFO : Running command remove processes
  2232. 232.63 s > [2026-09-02 14:26:31.724] @gammaloop_api::se... INFO : Running command set global kv global.generation.uv.generate_integrated=true
  2233. 232.63 s > [2026-09-02 14:26:31.725] @gammaloop_api::se... INFO : Running command import graphs ./tests/resources/graphs/scalar_sunrise.dot -p sunrise_scalar_1 -i scalar_sunrise
  2234. 232.63 s > [2026-09-02 14:26:31.725] @commands::import INFO : Loading graphs from '/build/source/tests/resources/graphs/scalar_sunrise.dot'
  2235. 232.63 s > [2026-09-02 14:26:31.734] @gammaloop_api::se... INFO : Running command generate existing -p sunrise_scalar_1 -i scalar_sunrise
  2236. 232.63 s > [2026-09-02 14:26:31.736] @approx::local_4d [{#uv, #inspect, #integrated}] DEBUG : Rescaled momenta expanded
  2237. 232.63 s > field value
  2238. 232.63 s > res n-terms: 1, byte size: 3,expr:
  2239. 232.63 s > 1
  2240. 232.63 s > [2026-09-02 14:26:31.740] @approx::local_4d [{#uv, #inspect, #integrated}] DEBUG : Rescaled momenta expanded
  2241. 232.63 s > field value
  2242. 232.63 s > res n-terms: 1, byte size: 611,expr:
  2243. 232.63 s > 1/(denom(0,q₀/t,mass_scalar_1²,-mass_scalar_1²+(q₀.q₀)/t²)
  2244. 232.63 s > ·denom(2,-q₁+q₃-q₀/t,mass_scalar_1²,
  2245. 232.63 s > -mass_scalar_1²+2·(q₀.q₁)/t-2·(q₀.q₃)/t+(q₀.q₀)/t²+(q₁.q₁)
  2246. 232.63 s > -2·(q₁.q₃)+(q₃.q₃)
  2247. 232.63 s > ))
  2248. 232.63 s > [2026-09-02 14:26:31.742] @approx::local_4d [{#uv, #inspect, #integrated}] DEBUG : Rescaled momenta expanded
  2249. 232.63 s > field value
  2250. 232.63 s > res n-terms: 1, byte size: 611,expr:
  2251. 232.63 s > 1/(denom(0,q₀/t,mass_scalar_1²,-mass_scalar_1²+(q₀.q₀)/t²)
  2252. 232.63 s > ·denom(1,-q₂+q₃-q₀/t,mass_scalar_1²,
  2253. 232.63 s > -mass_scalar_1²+2·(q₀.q₂)/t-2·(q₀.q₃)/t+(q₀.q₀)/t²+(q₂.q₂)
  2254. 232.63 s > -2·(q₂.q₃)+(q₃.q₃)
  2255. 232.63 s > ))
  2256. 232.63 s > [2026-09-02 14:26:31.745] @approx::local_4d [{#uv, #inspect, #integrated}] DEBUG : Rescaled momenta expanded
  2257. 232.63 s > field value
  2258. 232.63 s > res n-terms: 1, byte size: 611,expr:
  2259. 232.63 s > 1/(denom(1,q₁/t,mass_scalar_1²,-mass_scalar_1²+(q₁.q₁)/t²)
  2260. 232.63 s > ·denom(2,-q₀+q₃-q₁/t,mass_scalar_1²,
  2261. 232.63 s > -mass_scalar_1²+2·(q₀.q₁)/t-2·(q₁.q₃)/t+(q₁.q₁)/t²+(q₀.q₀)
  2262. 232.63 s > -2·(q₀.q₃)+(q₃.q₃)
  2263. 232.63 s > ))
  2264. 232.63 s > [2026-09-02 14:26:31.747] @approx::local_4d [{#uv, #inspect, #integrated}] DEBUG : Rescaled momenta expanded
  2265. 232.63 s > field value
  2266. 232.63 s > res n-terms: 1, byte size: 777,expr:
  2267. 232.63 s > 1/(denom(0,q₀/t,mass_scalar_1²,-mass_scalar_1²+(q₀.q₀)/t²)·denom(1,q₁/t,mass_scalar_1²,-mass_scalar_1²+(q₁.q₁)/t²)
  2268. 232.63 s > ·denom(2,q₄-q₀/t-q₁/t,mass_scalar_1²,
  2269. 232.63 s > -mass_scalar_1²-2·(q₀.q₄)/t-2·(q₁.q₄)/t+(q₀.q₀)/t²+2·(q₀.q₁)/t²
  2270. 232.63 s > +(q₁.q₁)/t²+(q₄.q₄)
  2271. 232.63 s > ))
  2272. 232.63 s > [2026-09-02 14:26:31.757] @approx::final_integrand[{#generation, #profile, #uv, #graph, #summary}] DEBUG : Computed global numerator
  2273. 232.63 s > field value
  2274. 232.63 s > global_num n-terms: 1, byte size: 3,expr:
  2275. 232.63 s > 1
  2276. 232.63 s > span build_3d{span_context=true graph=sunrise current=subgraph=0, topo_order=0, dod=0}
  2277. 232.63 s > [2026-09-02 14:26:31.775] @uv::approx [{#generation, #uv, #fourd}] DEBUG : Computing 4D
  2278. 232.63 s > field value
  2279. 232.63 s > simple subgraph(S_47,S_3I)*Approx(subgraph(S_3I,0)) of sunrise
  2280. 232.63 s > span compute_4d{span_context=true graph=sunrise current=subgraph=3I, topo_order=1, dod=0 given=subgraph=0, topo_order=0, dod=0 reduced=SubSet { set: BitVec<usize, bitvec::order::Lsb0> { addr: 0x7fffec01a280, head: 000000, bits: 8, capacity: 64 } [0, 0, 1, 1, 0, 0, 1, 1], id: PhantomData<linnet::half_edge::involution::Hedge> }}
  2281. 232.63 s > [2026-09-02 14:26:31.780] @approx::local_4d [{#uv, #algebra, #integrated, #start}] DEBUG :
  2282. 232.63 s > field value
  2283. 232.63 s > integrand n-terms: 1, byte size: 217,expr:
  2284. 232.63 s > 1/(denom(0,q₀,mass_scalar_1²,-mass_scalar_1²+(q₀.q₀))·denom(2,q₂,mass_scalar_1²,-mass_scalar_1²+(q₂.q₂)))
  2285. 232.63 s > reduced 3I
  2286. 232.63 s > span grow{span_context=true current=subgraph=3I, topo_order=1, dod=0 given=subgraph=0, topo_order=0, dod=0}
  2287. 232.63 s > [2026-09-02 14:26:31.780] @approx::local_4d [{#uv, #inspect, #integrated}] DEBUG : Rescaled momenta expanded
  2288. 232.63 s > field value
  2289. 232.63 s > res n-terms: 1, byte size: 611,expr:
  2290. 232.63 s > 1/(denom(0,q₀/t,mass_scalar_1²,-mass_scalar_1²+(q₀.q₀)/t²)
  2291. 232.63 s > ·denom(2,-q₁+q₃-q₀/t,mass_scalar_1²,
  2292. 232.63 s > -mass_scalar_1²+2·(q₀.q₁)/t-2·(q₀.q₃)/t+(q₀.q₀)/t²+(q₁.q₁)
  2293. 232.63 s > -2·(q₁.q₃)+(q₃.q₃)
  2294. 232.63 s > ))
  2295. 232.63 s > span t{span_context=true current=subgraph=3I, topo_order=1, dod=0 given=subgraph=0, topo_order=0, dod=0}
  2296. 232.63 s > [2026-09-02 14:26:31.793] @approx::local_4d [{#uv, #integrated, #rescaled}] DEBUG : Rescaled expanded
  2297. 232.63 s > field value
  2298. 232.63 s > n_loops 1
  2299. 232.63 s > res n-terms: 1, byte size: 723,expr:
  2300. 232.63 s > 1/(denom(0,q₀,mUVexp²+t²·mass_scalar_1²,-mUV²+t²·(-mass_scalar_1²+(q₀.q₀)/t²)+t²·mUVexp²)
  2301. 232.63 s > ·denom(2,-q₀,mUVexp²+t²·mass_scalar_1²,
  2302. 232.63 s > -mUV²
  2303. 232.63 s > +t²
  2304. 232.63 s > ·(-mass_scalar_1²+2·(q₀.q₁)/t-2·(q₀.q₃)/t+(q₀.q₀)/t²+(q₁.q₁)
  2305. 232.63 s > -2·(q₁.q₃)+(q₃.q₃)
  2306. 232.63 s > )
  2307. 232.63 s > +t²·mUVexp²
  2308. 232.63 s > ))
  2309. 232.63 s > span t{span_context=true current=subgraph=3I, topo_order=1, dod=0 given=subgraph=0, topo_order=0, dod=0}
  2310. 232.63 s > [2026-09-02 14:26:31.793] @approx::local_4d [{#uv, #integrated, #series}] DEBUG : Series expanded
  2311. 232.63 s > field value
  2312. 232.63 s > res n-terms: 1, byte size: 223,expr:
  2313. 232.63 s > 1/(denom(0,q₀,mUVexp²,-mUV²+(q₀.q₀))·denom(2,-q₀,mUVexp²,-mUV²+(q₀.q₀)))
  2314. 232.63 s > span t{span_context=true current=subgraph=3I, topo_order=1, dod=0 given=subgraph=0, topo_order=0, dod=0}
  2315. 232.63 s > [2026-09-02 14:26:31.793] @approx::local_4d [{#uv, #integrated, #series}] DEBUG : Evaluated at t = 1
  2316. 232.63 s > field value
  2317. 232.63 s > res n-terms: 1, byte size: 223,expr:
  2318. 232.63 s > 1/(denom(0,q₀,mUVexp²,-mUV²+(q₀.q₀))·denom(2,-q₀,mUVexp²,-mUV²+(q₀.q₀)))
  2319. 232.63 s > span t{span_context=true current=subgraph=3I, topo_order=1, dod=0 given=subgraph=0, topo_order=0, dod=0}
  2320. 232.63 s > [2026-09-02 14:26:31.797] @approx::local_4d [{#uv, #collect, #integrated}] DEBUG : After gamma chain collection
  2321. 232.63 s > field value
  2322. 232.63 s > expr n-terms: 1, byte size: 223,expr:
  2323. 232.63 s > 1/(denom(0,q₀,mUVexp²,-mUV²+(q₀.q₀))·denom(2,-q₀,mUVexp²,-mUV²+(q₀.q₀)))
  2324. 232.63 s > span t{span_context=true current=subgraph=3I, topo_order=1, dod=0 given=subgraph=0, topo_order=0, dod=0}
  2325. 232.63 s > [2026-09-02 14:26:31.797] @approx::local_4d [{#profile, #uv, #collect, #integrated, #start, #trace}] DEBUG : After gamma schoonschip
  2326. 232.63 s > field value
  2327. 232.63 s > expr n-terms: 1, byte size: 223,expr:
  2328. 232.63 s > 1/(denom(0,q₀,mUVexp²,-mUV²+(q₀.q₀))·denom(2,-q₀,mUVexp²,-mUV²+(q₀.q₀)))
  2329. 232.63 s > span t{span_context=true current=subgraph=3I, topo_order=1, dod=0 given=subgraph=0, topo_order=0, dod=0}
  2330. 232.63 s > [2026-09-02 14:26:31.798] @approx::local_4d [{#profile, #uv, #collect, #integrated, #start, #trace}] DEBUG : After gamma collection
  2331. 232.63 s > field value
  2332. 232.63 s > expr n-terms: 1, byte size: 223,expr:
  2333. 232.63 s > 1/(denom(0,q₀,mUVexp²,-mUV²+(q₀.q₀))·denom(2,-q₀,mUVexp²,-mUV²+(q₀.q₀)))
  2334. 232.63 s > span t{span_context=true current=subgraph=3I, topo_order=1, dod=0 given=subgraph=0, topo_order=0, dod=0}
  2335. 232.63 s > [2026-09-02 14:26:31.798] @approx::local_4d [{#profile, #uv, #gamma, #integrated, #start, #trace, #vakint}] DEBUG : After gamma simplification
  2336. 232.63 s > field value
  2337. 232.63 s > expr n-terms: 1, byte size: 223,expr:
  2338. 232.63 s > 1/(denom(0,q₀,mUVexp²,-mUV²+(q₀.q₀))·denom(2,-q₀,mUVexp²,-mUV²+(q₀.q₀)))
  2339. 232.63 s > span t{span_context=true current=subgraph=3I, topo_order=1, dod=0 given=subgraph=0, topo_order=0, dod=0}
  2340. 232.63 s > [2026-09-02 14:26:31.801] @approx::local_4d [{#profile, #uv, #integrated, #schoonschip, #start, #trace, #vakint}] DEBUG : After Schoonschip net
  2341. 232.63 s > field value
  2342. 232.63 s > expr n-terms: 1, byte size: 223,expr:
  2343. 232.63 s > 1/(denom(0,q₀,mUVexp²,-mUV²+(q₀.q₀))·denom(2,-q₀,mUVexp²,-mUV²+(q₀.q₀)))
  2344. 232.63 s > ... omitted 20090 more lines; see full nextest output above
  2345. 232.63 s >
  2346. 232.63 s > 9. gammaloop-integration-tests::uv::se1l_uv
  2347. 232.63 s > failure: test failure with exit code 101
  2348. 232.63 s > system-out
  2349. 232.63 s > running 1 test
  2350. 232.63 s > test se1l_uv has been running for over 60 seconds
  2351. 232.63 s > +------+-----------------+---------+--------+----------+-----------------------------------------------------------------------------------------------------------------------+-------+
  2352. 232.63 s > | case | check | graph | status | sigma | threshold | error |
  2353. 232.63 s > +------+-----------------+---------+--------+----------+-----------------------------------------------------------------------------------------------------------------------+-------+
  2354. 232.63 s > | se1l | uv_profile | - | FAIL | - | - | - |
  2355. 232.63 s > +------+-----------------+---------+--------+----------+-----------------------------------------------------------------------------------------------------------------------+-------+
  2356. 232.63 s > | se1l | m_uv.inspect | inspect | pass | - | best inspect relative delta 1.097e-1 >= 1000*accuracy 1.000e-7 (accuracy=1.000e-10, exponent=+2.0, seed=1, probes=10) | - |
  2357. 232.63 s > +------+-----------------+---------+--------+----------+-----------------------------------------------------------------------------------------------------------------------+-------+
  2358. 232.63 s > | se1l | m_uv.integrated | se1l | pass | 0.1sigma | compatible within 2sigma | - |
  2359. 232.63 s > +------+-----------------+---------+--------+----------+-----------------------------------------------------------------------------------------------------------------------+-------+
  2360. 232.63 s > | se1l | rls.inspect | inspect | pass | - | best inspect relative delta 4.499e-2 >= 1000*accuracy 1.000e-7 (accuracy=1.000e-10, exponent=+2.0, seed=1, probes=10) | - |
  2361. 232.63 s > +------+-----------------+---------+--------+----------+-----------------------------------------------------------------------------------------------------------------------+-------+
  2362. 232.63 s > | se1l | rls.integrated | se1l | pass | 0.0sigma | compatible within 2sigma | - |
  2363. 232.63 s > +------+-----------------+---------+--------+----------+-----------------------------------------------------------------------------------------------------------------------+-------+
  2364. 232.63 s > | se1l | mu_r.inspect | inspect | pass | - | best inspect relative delta 1.424e-1 >= 1000*accuracy 1.000e-7 (accuracy=1.000e-10, exponent=+2.0, seed=1, probes=10) | - |
  2365. 232.63 s > +------+-----------------+---------+--------+----------+-----------------------------------------------------------------------------------------------------------------------+-------+
  2366. 232.63 s > | se1l | target | - | pass | - | 2sigma | - |
  2367. 232.63 s > +------+-----------------+---------+--------+----------+-----------------------------------------------------------------------------------------------------------------------+-------+
  2368. 232.63 s > test se1l_uv ... FAILED
  2369. 232.63 s >
  2370. 232.63 s > failures:
  2371. 232.63 s >
  2372. 232.63 s > failures:
  2373. 232.63 s > se1l_uv
  2374. 232.63 s >
  2375. 232.63 s > test result: FAILED. 0 passed; 1 failed; 0 ignored; 0 measured; 24 filtered out; finished in 135.84s
  2376. 232.63 s > system-err
  2377. 232.63 s > [2026-09-02 14:26:30.857] @gammaloop_api::se... INFO : Running command run generate
  2378. 232.63 s > [2026-09-02 14:26:30.857] @gammaloop_api::se... INFO : Starting command block generate
  2379. 232.63 s > [2026-09-02 14:26:30.857] @gammaloop_api::se... INFO : Running command import model sm-default
  2380. 232.63 s > [2026-09-02 14:26:30.857] @import::model INFO : Loading built-in JSON model sm-default
  2381. 232.63 s > [2026-09-02 14:26:30.937] @gammalooprs::model INFO : The following 11 external parameters were forced to zero by the restriction card:
  2382. 232.63 s > lamWS, AWS, rhoWS, etaWS, ymc, yme, ymm, MC, Me, MM, WTau
  2383. 232.63 s > [2026-09-02 14:26:30.937] @gammalooprs::model INFO : The following 34 vertex rules were removed by the restriction card:
  2384. 232.63 s > V_82 -> (c~, d, G+) | V_83 -> (t~, d, G+) | V_84 -> (c~, s, G+) | V_85 -> (t~, s, G+) | V_86 -> (u~, b, G+) | V_87 -> (c~, b, G+) | V_90 -> (c~, d, W+) | V_91 -> (t~, d, W+) | V_92 -> (u~, s, W+) | V_94 -> (t~, s, W+) | V_95 -> (u~, b, W+) | V_96 -> (c~, b, W+) | V_101 -> (e+, e-, G0) | V_102 -> (mu+, mu-, G0) | V_104 -> (e+, e-, H) | V_105 -> (mu+, mu-, H) | V_110 -> (ve~, e-, G+) | V_111 -> (vm~, mu-, G+) | V_116 -> (b~, u, G-) | V_117 -> (d~, c, G-) | V_118 -> (s~, c, G-) | V_119 -> (b~, c, G-) | V_120 -> (d~, t, G-) | V_121 -> (s~, t, G-) | V_124 -> (s~, u, W-) | V_125 -> (b~, u, W-) | V_126 -> (d~, c, W-) | V_128 -> (b~, c, W-) | V_129 -> (d~, t, W-) | V_130 -> (s~, t, W-) | V_138 -> (c~, c, G0) | V_140 -> (c~, c, H) | V_145 -> (e+, ve, G-) | V_146 -> (mu+, vm, G-)
  2385. 232.63 s > [2026-09-02 14:26:30.938] @gammalooprs::model INFO : The following 36 couplings were removed by the restriction card:
  2386. 232.63 s > GC_13, GC_14, GC_16, GC_17, GC_18, GC_19, GC_20, GC_22, GC_23, GC_24, GC_25, GC_26, GC_28, GC_29, GC_42, GC_43, GC_44, GC_46, GC_47, GC_48, GC_84, GC_85, GC_86, GC_87, GC_88, GC_89, GC_90, GC_91, GC_92, GC_93, GC_101, GC_102, GC_103, GC_105, GC_106, GC_107
  2387. 232.63 s > [2026-09-02 14:26:30.939] @gammaloop_api::se... INFO : Running command remove processes
  2388. 232.63 s > [2026-09-02 14:26:30.939] @gammaloop_api::se... INFO : Running command set global kv global.generation.uv.generate_integrated=true
  2389. 232.63 s > [2026-09-02 14:26:30.940] @gammaloop_api::se... INFO : Running command import graphs ./tests/resources/graphs/uv_tests/se1l.dot -p se1l -i se1l
  2390. 232.63 s > [2026-09-02 14:26:30.940] @commands::import INFO : Loading graphs from '/build/source/tests/resources/graphs/uv_tests/se1l.dot'
  2391. 232.63 s > [2026-09-02 14:26:30.945] @gammaloop_api::se... INFO : Running command generate existing -p se1l -i se1l
  2392. 232.63 s > [2026-09-02 14:26:32.607] @commands::generate INFO :
  2393. 232.63 s > Integrand generation summary
  2394. 232.63 s > peak RAM 90.07 MiB | cores 1
  2395. 232.63 s > ╭───────────┬───────┬─────────┬─────────────┬─────────────┬────────────────┬─────────────╮
  2396. 232.63 s > │ integrand │ graph │ # evals │ expr build │ spenso │ symbolica eval │ compile │
  2397. 232.63 s > ├───────────┼───────┼─────────┼─────────────┼─────────────┼────────────────┼─────────────┤
  2398. 232.63 s > │ se1l │ se1l │ 5 │ 1.39s (88%) │ 46ms (3.0%) │ 140ms (8.9%) │ 0ms (0.00%) │
  2399. 232.63 s > ├───────────┼───────┼─────────┼─────────────┼─────────────┼────────────────┼─────────────┤
  2400. 232.63 s > │ Total │ │ 5 │ 1.39s (88%) │ 46ms (3.0%) │ 140ms (8.9%) │ 0ms (0.00%) │
  2401. 232.63 s > ╰───────────┴───────┴─────────┴─────────────┴─────────────┴────────────────┴─────────────╯
  2402. 232.63 s > [2026-09-02 14:26:32.616] @gammaloop_api::se... INFO : Running command set process -p se1l -i se1l kv general.m_uv=0.2
  2403. 232.63 s > [2026-09-02 14:26:32.626] @gammaloop_api::se... INFO : Running command set process -p se1l -i se1l kv general.mu_r=0.2
  2404. 232.63 s > [2026-09-02 14:26:32.631] @gammaloop_api::se... INFO : Running command set process -p se1l -i se1l kv general.renormalization_localization_scale=0.2
  2405. 232.63 s > [2026-09-02 14:26:32.633] @gammaloop_api::se... INFO : Running command duplicate integrand -p se1l -i se1l --output_process_name se1l --output_integrand_name se1l_muv_shifted
  2406. 232.63 s > [2026-09-02 14:26:32.635] @gammaloop_api::se... INFO : Running command set process -p se1l -i se1l_muv_shifted kv general.m_uv=0.5
  2407. 232.63 s > [2026-09-02 14:26:32.637] @gammaloop_api::se... INFO : Running command duplicate integrand -p se1l -i se1l --output_process_name se1l --output_integrand_name se1l_rls_shifted
  2408. 232.63 s > [2026-09-02 14:26:32.641] @gammaloop_api::se... INFO : Running command set process -p se1l -i se1l_rls_shifted kv general.renormalization_localization_scale=1
  2409. 232.63 s > [2026-09-02 14:26:32.643] @gammaloop_api::se... INFO : Running command duplicate integrand -p se1l -i se1l --output_process_name se1l --output_integrand_name se1l_mur_shifted
  2410. 232.63 s > [2026-09-02 14:26:32.647] @gammaloop_api::se... INFO : Running command set process -p se1l -i se1l_mur_shifted kv general.mu_r=0.8
  2411. 232.63 s > [2026-09-02 14:26:32.657] @process::amplitude WARNING : External state 0 ('g', PDG 21, helicity +) is off shell: p^2 = +2.5e5, expected m^2 = +0e0 (|Δ| = +2.5e5). Fixed-helicity spinor/vector/tensor external states may be ill-defined at this kinematic point.
  2412. 232.63 s > field value
  2413. 232.63 s > span warm_up{integrand.name=se1l}
  2414. 232.63 s > [2026-09-02 14:26:32.657] @process::amplitude WARNING : External state 1 ('g', PDG 21, helicity -) is off shell: p^2 = +2.5e5, expected m^2 = +0e0 (|Δ| = +2.5e5). Fixed-helicity spinor/vector/tensor external states may be ill-defined at this kinematic point.
  2415. 232.63 s > field value
  2416. 232.63 s > span warm_up{integrand.name=se1l}
  2417. 232.63 s > [2026-09-02 14:26:32.657] @process::amplitude INFO : Input is above threshold: 1 existing threshold E-surfaces across 1/1 graph groups
  2418. 232.63 s > field value
  2419. 232.63 s > existing_esurfaces 1
  2420. 232.63 s > group_count 1
  2421. 232.63 s > groups_above_threshold 1
  2422. 232.63 s > integrand se1l
  2423. 232.63 s > span warm_up{integrand.name=se1l}
  2424. 232.63 s > threshold_status above threshold
  2425. 232.63 s > [2026-09-02 14:26:32.658] @process::amplitude INFO : overlap structure of group 0: [1: [0(2,3)]]
  2426. 232.63 s > field value
  2427. 232.63 s > span warm_up{integrand.name=se1l}
  2428. 232.63 s > [2026-09-02 14:26:33.269] @commands::profile INFO :
  2429. 232.63 s > ╭───────┬──────┬──────────┬───────┬─────┬──────────┬───────────╮
  2430. 232.63 s > │ fixed │ → ∞ │ slope │ r2 │ DOD │ bare DOD │ inspect │
  2431. 232.63 s > ├───────┼──────┼──────────┼───────┼─────┼──────────┼───────────┤
  2432. 232.63 s > │ {} │ {e3} │ 1.639236 │ 0.904 │ 2 │ 2 │ arb retry │
  2433. 232.63 s > │ {} │ {e2} │ 1.698834 │ 0.902 │ 2 │ 2 │ arb retry │
  2434. 232.63 s > ╰───────┴──────┴──────────┴───────┴─────┴──────────┴───────────╯
  2435. 232.63 s > [2026-09-02 14:26:33.269] @commands::profile INFO :
  2436. 232.63 s > ╭───────┬──────┬─────────────┬──────────┬───────┬─────┬──────────┬───────────╮
  2437. 232.63 s > │ fixed │ → ∞ │ orientation │ slope │ r2 │ DOD │ bare DOD │ inspect │
  2438. 232.63 s > ├───────┼──────┼─────────────┼──────────┼───────┼─────┼──────────┼───────────┤
  2439. 232.63 s > │ {} │ {e3} │ 00-+ │ 0.343429 │ 0.145 │ 0 │ 2 │ arb retry │
  2440. 232.63 s > │ {} │ {e3} │ 00+- │ 0.342577 │ 0.135 │ 0 │ 2 │ arb retry │
  2441. 232.63 s > │ {} │ {e2} │ 00-+ │ 0.385975 │ 0.161 │ 0 │ 2 │ arb retry │
  2442. 232.63 s > │ {} │ {e2} │ 00+- │ 0.384920 │ 0.192 │ 0 │ 2 │ arb retry │
  2443. 232.63 s > ╰───────┴──────┴─────────────┴──────────┴───────┴─────┴──────────┴───────────╯
  2444. 232.63 s > [2026-09-02 14:26:33.271] @gammaloop_api::se... INFO : Running command set process kv integrator.target_relative_accuracy=0.001 integrator.n_increase=0 integrator.n_start=50000 integrator.n_max=400000 integrator.seed=1337
  2445. 232.63 s > [2026-09-02 14:26:33.272] @commands::integrate INFO : Created workspace directory at /build/source/tests/artifacts/se1l/integration_workspace_se1l
  2446. 232.63 s > [2026-09-02 14:26:33.301] @commands::integrate INFO : No integration state found, starting new integration
  2447. 232.63 s > [2026-09-02 14:26:33.301] @commands::integrate INFO : Gammaloop now integrates se1l@se1l, se1l@se1l_muv_shifted, se1l@se1l_rls_shifted
  2448. 232.63 s > [2026-09-02 14:26:33.302] @process::amplitude WARNING : External state 0 ('g', PDG 21, helicity +) is off shell: p^2 = +2.5e5, expected m^2 = +0e0 (|Δ| = +2.5e5). Fixed-helicity spinor/vector/tensor external states may be ill-defined at this kinematic point.
  2449. 232.63 s > field value
  2450. 232.63 s > span warm_up{integrand.name=se1l}
  2451. 232.63 s > [2026-09-02 14:26:33.302] @process::amplitude WARNING : External state 1 ('g', PDG 21, helicity -) is off shell: p^2 = +2.5e5, expected m^2 = +0e0 (|Δ| = +2.5e5). Fixed-helicity spinor/vector/tensor external states may be ill-defined at this kinematic point.
  2452. 232.63 s > field value
  2453. 232.63 s > span warm_up{integrand.name=se1l}
  2454. 232.63 s > [2026-09-02 14:26:33.303] @process::amplitude INFO : Input is above threshold: 1 existing threshold E-surfaces across 1/1 graph groups
  2455. 232.63 s > field value
  2456. 232.63 s > existing_esurfaces 1
  2457. 232.63 s > group_count 1
  2458. 232.63 s > groups_above_threshold 1
  2459. 232.63 s > integrand se1l
  2460. 232.63 s > span warm_up{integrand.name=se1l}
  2461. 232.63 s > threshold_status above threshold
  2462. 232.63 s > [2026-09-02 14:26:33.303] @process::amplitude INFO : overlap structure of group 0: [1: [0(2,3)]]
  2463. 232.63 s > field value
  2464. 232.63 s > span warm_up{integrand.name=se1l}
  2465. 232.63 s > [2026-09-02 14:26:33.304] @process::amplitude WARNING : External state 0 ('g', PDG 21, helicity +) is off shell: p^2 = +2.5e5, expected m^2 = +0e0 (|Δ| = +2.5e5). Fixed-helicity spinor/vector/tensor external states may be ill-defined at this kinematic point.
  2466. 232.63 s > field value
  2467. 232.63 s > span warm_up{integrand.name=se1l_muv_shifted}
  2468. 232.63 s > [2026-09-02 14:26:33.305] @process::amplitude WARNING : External state 1 ('g', PDG 21, helicity -) is off shell: p^2 = +2.5e5, expected m^2 = +0e0 (|Δ| = +2.5e5). Fixed-helicity spinor/vector/tensor external states may be ill-defined at this kinematic point.
  2469. 232.63 s > field value
  2470. 232.63 s > span warm_up{integrand.name=se1l_muv_shifted}
  2471. 232.63 s > [2026-09-02 14:26:33.305] @process::amplitude INFO : Input is above threshold: 1 existing threshold E-surfaces across 1/1 graph groups
  2472. 232.63 s > field value
  2473. 232.63 s > existing_esurfaces 1
  2474. 232.63 s > group_count 1
  2475. 232.63 s > groups_above_threshold 1
  2476. 232.63 s > integrand se1l_muv_shifted
  2477. 232.63 s > span warm_up{integrand.name=se1l_muv_shifted}
  2478. 232.63 s > threshold_status above threshold
  2479. 232.63 s > [2026-09-02 14:26:33.305] @process::amplitude INFO : overlap structure of group 0: [1: [0(2,3)]]
  2480. 232.63 s > field value
  2481. 232.63 s > span warm_up{integrand.name=se1l_muv_shifted}
  2482. 232.63 s > [2026-09-02 14:26:33.307] @process::amplitude WARNING : External state 0 ('g', PDG 21, helicity +) is off shell: p^2 = +2.5e5, expected m^2 = +0e0 (|Δ| = +2.5e5). Fixed-helicity spinor/vector/tensor external states may be ill-defined at this kinematic point.
  2483. 232.63 s > field value
  2484. 232.63 s > span warm_up{integrand.name=se1l_rls_shifted}
  2485. 232.63 s > [2026-09-02 14:26:33.308] @process::amplitude WARNING : External state 1 ('g', PDG 21, helicity -) is off shell: p^2 = +2.5e5, expected m^2 = +0e0 (|Δ| = +2.5e5). Fixed-helicity spinor/vector/tensor external states may be ill-defined at this kinematic point.
  2486. 232.63 s > field value
  2487. 232.63 s > span warm_up{integrand.name=se1l_rls_shifted}
  2488. 232.63 s > [2026-09-02 14:26:33.308] @process::amplitude INFO : Input is above threshold: 1 existing threshold E-surfaces across 1/1 graph groups
  2489. 232.63 s > field value
  2490. 232.63 s > existing_esurfaces 1
  2491. 232.63 s > group_count 1
  2492. 232.63 s > groups_above_threshold 1
  2493. 232.63 s > integrand se1l_rls_shifted
  2494. 232.63 s > span warm_up{integrand.name=se1l_rls_shifted}
  2495. 232.63 s > threshold_status above threshold
  2496. 232.63 s > ... omitted 1410 more lines; see full nextest output above
  2497. 232.63 s > =========================================
  2498. 232.63 s For full logs, run:
  2499. 232.63 s nix log /nix/store/zpyfjihmv7i6ghxwmb5sjv51y6brg4wy-gammaloop-nextest-integration.drv
  2500. 232.76 s [0 built (1 failed), 0.0Run failed.