test packages.x86_64-linux.nix-ci-check-gammaloop-nextest-integration

Reproduce this run
Original Run
  1. 217.53 s gammaloop-nextest-integration> | dod2_bubble | rls.integrated | GL0 | pass | 0.0sigma | compatible within 2sigma | - |
  2. 217.53 s gammaloop-nextest-integration> +-------------+-----------------+---------+--------+----------+-----------------------------------------------------------------------------------------------------------------------+-------+
  3. 217.53 s gammaloop-nextest-integration> | dod2_bubble | mu_r.inspect | inspect | pass | - | best inspect relative delta 6.951e-1 >= 1000*accuracy 1.000e-7 (accuracy=1.000e-10, exponent=+0.0, seed=0, probes=10) | - |
  4. 217.53 s gammaloop-nextest-integration> +-------------+-----------------+---------+--------+----------+-----------------------------------------------------------------------------------------------------------------------+-------+
  5. 217.53 s gammaloop-nextest-integration> | dod2_bubble | target | - | pass | - | 2sigma | - |
  6. 217.53 s gammaloop-nextest-integration> +-------------+-----------------+---------+--------+----------+-----------------------------------------------------------------------------------------------------------------------+-------+
  7. 217.53 s gammaloop-nextest-integration> test dod2_bubble_uv ... FAILED
  8. 217.53 s gammaloop-nextest-integration>
  9. 217.53 s gammaloop-nextest-integration> failures:
  10. 217.53 s gammaloop-nextest-integration>
  11. 217.53 s gammaloop-nextest-integration> failures:
  12. 217.53 s gammaloop-nextest-integration> dod2_bubble_uv
  13. 217.53 s gammaloop-nextest-integration>
  14. 217.53 s gammaloop-nextest-integration> test result: FAILED. 0 passed; 1 failed; 0 ignored; 0 measured; 24 filtered out; finished in 55.87s
  15. 217.53 s gammaloop-nextest-integration> system-err
  16. 217.53 s gammaloop-nextest-integration> [2026-09-02 14:31:44.398] @gammaloop_api::se... INFO : Running command run generate
  17. 217.53 s gammaloop-nextest-integration> [2026-09-02 14:31:44.398] @gammaloop_api::se... INFO : Starting command block generate
  18. 217.53 s gammaloop-nextest-integration> [2026-09-02 14:31:44.398] @gammaloop_api::se... INFO : Running command import model scalars-default.json
  19. 217.53 s gammaloop-nextest-integration> [2026-09-02 14:31:44.398] @import::model INFO : Loading built-in JSON model scalars-default
  20. 217.53 s gammaloop-nextest-integration> [2026-09-02 14:31:44.405] @gammalooprs::model INFO : The following 2 external parameters were forced to zero by the restriction card:
  21. 217.53 s gammaloop-nextest-integration> width_scalar_1, width_scalar_2
  22. 217.53 s gammaloop-nextest-integration> [2026-09-02 14:31:44.406] @gammaloop_api::se... INFO : Running command remove processes
  23. 217.53 s gammaloop-nextest-integration> [2026-09-02 14:31:44.406] @gammaloop_api::se... INFO : Running command set global kv global.generation.uv.generate_integrated=true
  24. 217.53 s gammaloop-nextest-integration> [2026-09-02 14:31:44.407] @gammaloop_api::se... INFO : Running command import graphs ./tests/resources/graphs/scalar/dod2_bubble.dot -p bubble_dod2 -i scalar_bubble_below_thres
  25. 217.53 s gammaloop-nextest-integration> [2026-09-02 14:31:44.407] @commands::import INFO : Loading graphs from '/build/source/tests/resources/graphs/scalar/dod2_bubble.dot'
  26. 217.53 s gammaloop-nextest-integration> [2026-09-02 14:31:44.411] @gammaloop_api::se... INFO : Running command generate existing -p bubble_dod2 -i scalar_bubble_below_thres
  27. 217.53 s gammaloop-nextest-integration> [2026-09-02 14:31:44.413] @approx::local_4d [{#uv, #inspect, #integrated}] DEBUG : Rescaled momenta expanded
  28. 217.53 s gammaloop-nextest-integration> field value
  29. 217.53 s gammaloop-nextest-integration> res n-terms: 1, byte size: 585,expr:
  30. 217.53 s gammaloop-nextest-integration> -SCALAR_COUPLING²·q₀(αᵉ².¹)·q₀(αᵉ³.¹)·q₂(αᵉ².¹)·q₂(αᵉ³.¹)
  31. 217.53 s gammaloop-nextest-integration> /(t²·denom(3,-q₀-q₂/t,mass_scalar_2²,-mass_scalar_2²+2·(q₀.q₂)/t+(q₂.q₂)/t²+(q₀.q₀))
  32. 217.53 s gammaloop-nextest-integration> ·denom(2,q₂/t,mass_scalar_2²,-mass_scalar_2²+(q₂.q₂)/t²))
  33. 217.53 s gammaloop-nextest-integration> [2026-09-02 14:31:44.419] @approx::local_4d [{#uv, #inspect, #integrated}] DEBUG : Rescaled momenta expanded
  34. 217.53 s gammaloop-nextest-integration> field value
  35. 217.53 s gammaloop-nextest-integration> res n-terms: 1, byte size: 3,expr:
  36. 217.53 s gammaloop-nextest-integration> 1
  37. 217.53 s gammaloop-nextest-integration> [2026-09-02 14:31:44.420] @approx::final_integrand[{#generation, #profile, #uv, #graph, #summary}] DEBUG : Computed global numerator
  38. 217.53 s gammaloop-nextest-integration> field value
  39. 217.53 s gammaloop-nextest-integration> global_num n-terms: 1, byte size: 4,expr:
  40. 217.53 s gammaloop-nextest-integration> 1/2
  41. 217.53 s gammaloop-nextest-integration> span build_3d{span_context=true graph=GL0 current=subgraph=0, topo_order=0, dod=0}
  42. 217.53 s gammaloop-nextest-integration> [2026-09-02 14:31:44.423] @uv::approx [{#generation, #uv, #fourd}] DEBUG : Computing 4D
  43. 217.53 s gammaloop-nextest-integration> field value
  44. 217.53 s gammaloop-nextest-integration> simple subgraph(S_11,S_y)*Approx(subgraph(S_y,0)) of GL0
  45. 217.53 s gammaloop-nextest-integration> span compute_4d{span_context=true graph=GL0 current=subgraph=y, topo_order=1, dod=2 given=subgraph=0, topo_order=0, dod=0 reduced=SubSet { set: BitVec<usize, bitvec::order::Lsb0> { addr: 0x7fffec017290, head: 000000, bits: 6, capacity: 64 } [0, 0, 1, 1, 1, 1], id: PhantomData<linnet::half_edge::involution::Hedge> }}
  46. 217.53 s gammaloop-nextest-integration> [2026-09-02 14:31:44.424] @approx::local_4d [{#uv, #algebra, #integrated, #start}] DEBUG :
  47. 217.53 s gammaloop-nextest-integration> field value
  48. 217.54 s gammaloop-nextest-integration> integrand n-terms: 1, byte size: 409,expr:
  49. 217.54 s gammaloop-nextest-integration> SCALAR_COUPLING²·(q₀(αᵉ³.¹)+q₃(αᵉ³.¹))·q₀(αᵉ².¹)·q₀(αᵉ³.¹)·q₂(αᵉ².¹)
  50. 217.54 s gammaloop-nextest-integration> /(denom(2,q₂,mass_scalar_2²,-mass_scalar_2²+(q₂.q₂))·denom(3,q₃,mass_scalar_2²,-mass_scalar_2²+(q₃.q₃)))
  51. 217.54 s gammaloop-nextest-integration> reduced y
  52. 217.54 s gammaloop-nextest-integration> span grow{span_context=true current=subgraph=y, topo_order=1, dod=2 given=subgraph=0, topo_order=0, dod=0}
  53. 217.54 s gammaloop-nextest-integration> [2026-09-02 14:31:44.424] @approx::local_4d [{#uv, #inspect, #integrated}] DEBUG : Rescaled momenta expanded
  54. 217.54 s gammaloop-nextest-integration> field value
  55. 217.54 s gammaloop-nextest-integration> res n-terms: 1, byte size: 585,expr:
  56. 217.54 s gammaloop-nextest-integration> -SCALAR_COUPLING²·q₀(αᵉ².¹)·q₀(αᵉ³.¹)·q₂(αᵉ².¹)·q₂(αᵉ³.¹)
  57. 217.54 s gammaloop-nextest-integration> /(t²·denom(3,-q₀-q₂/t,mass_scalar_2²,-mass_scalar_2²+2·(q₀.q₂)/t+(q₂.q₂)/t²+(q₀.q₀))
  58. 217.54 s gammaloop-nextest-integration> ·denom(2,q₂/t,mass_scalar_2²,-mass_scalar_2²+(q₂.q₂)/t²))
  59. 217.54 s gammaloop-nextest-integration> span t{span_context=true current=subgraph=y, topo_order=1, dod=2 given=subgraph=0, topo_order=0, dod=0}
  60. 217.54 s gammaloop-nextest-integration> [2026-09-02 14:31:44.424] @approx::local_4d [{#uv, #integrated, #rescaled}] DEBUG : Rescaled expanded
  61. 217.54 s gammaloop-nextest-integration> field value
  62. 217.54 s gammaloop-nextest-integration> n_loops 1
  63. 217.54 s gammaloop-nextest-integration> res n-terms: 1, byte size: 707,expr:
  64. 217.54 s gammaloop-nextest-integration> -SCALAR_COUPLING²·q₀(αᵉ².¹)·q₀(αᵉ³.¹)·q₂(αᵉ².¹)·q₂(αᵉ³.¹)
  65. 217.54 s gammaloop-nextest-integration> /(t²·denom(3,-q₂,mUVexp²+t²·mass_scalar_2²,-mUV²+t²·(-mass_scalar_2²+2·(q₀.q₂)/t+(q₂.q₂)/t²+(q₀.q₀))+t²·mUVexp²)
  66. 217.54 s gammaloop-nextest-integration> ·denom(2,q₂,mUVexp²+t²·mass_scalar_2²,-mUV²+t²·(-mass_scalar_2²+(q₂.q₂)/t²)+t²·mUVexp²))
  67. 217.54 s gammaloop-nextest-integration> span t{span_context=true current=subgraph=y, topo_order=1, dod=2 given=subgraph=0, topo_order=0, dod=0}
  68. 217.54 s gammaloop-nextest-integration> [2026-09-02 14:31:44.426] @approx::local_4d [{#uv, #integrated, #series}] DEBUG : Series expanded
  69. 217.54 s gammaloop-nextest-integration> field value
  70. 217.54 s gammaloop-nextest-integration> res n-terms: 3, byte size: 1896,expr:
  71. 217.54 s gammaloop-nextest-integration> (1/2·SCALAR_COUPLING²·(2·mUVexp²-2·mass_scalar_2²)/(denom(2,q₂,mUVexp²,-mUV²+(q₂.q₂))²·denom(3,-q₂,mUVexp²,-mUV²+(q₂.q₂)))
  72. 217.54 s gammaloop-nextest-integration> -SCALAR_COUPLING²
  73. 217.54 s gammaloop-nextest-integration> ·(-1/2·(2·mUVexp²-2·mass_scalar_2²+2·(q₀.q₀))/denom(3,-q₂,mUVexp²,-mUV²+(q₂.q₂))
  74. 217.54 s gammaloop-nextest-integration> +4·(q₀.q₂)²/denom(3,-q₂,mUVexp²,-mUV²+(q₂.q₂))²
  75. 217.54 s gammaloop-nextest-integration> )/(denom(2,q₂,mUVexp²,-mUV²+(q₂.q₂))·denom(3,-q₂,mUVexp²,-mUV²+(q₂.q₂)))
  76. 217.54 s gammaloop-nextest-integration> )·q₀(αᵉ².¹)·q₀(αᵉ³.¹)·q₂(αᵉ².¹)·q₂(αᵉ³.¹)
  77. 217.54 s gammaloop-nextest-integration> +2·SCALAR_COUPLING²·(q₀.q₂)·q₀(αᵉ².¹)·q₀(αᵉ³.¹)·q₂(αᵉ².¹)·q₂(αᵉ³.¹)
  78. 217.54 s gammaloop-nextest-integration> /(t·denom(2,q₂,mUVexp²,-mUV²+(q₂.q₂))·denom(3,-q₂,mUVexp²,-mUV²+(q₂.q₂))²)
  79. 217.54 s gammaloop-nextest-integration> -SCALAR_COUPLING²·q₀(αᵉ².¹)·q₀(αᵉ³.¹)·q₂(αᵉ².¹)·q₂(αᵉ³.¹)
  80. 217.54 s gammaloop-nextest-integration> /(t²·denom(2,q₂,mUVexp²,-mUV²+(q₂.q₂))·denom(3,-q₂,mUVexp²,-mUV²+(q₂.q₂)))
  81. 217.54 s gammaloop-nextest-integration> span t{span_context=true current=subgraph=y, topo_order=1, dod=2 given=subgraph=0, topo_order=0, dod=0}
  82. 217.54 s gammaloop-nextest-integration> [2026-09-02 14:31:44.426] @approx::local_4d [{#uv, #integrated, #series}] DEBUG : Evaluated at t = 1
  83. 217.54 s gammaloop-nextest-integration> field value
  84. 217.54 s gammaloop-nextest-integration> res n-terms: 3, byte size: 1880,expr:
  85. 217.54 s gammaloop-nextest-integration> (1/2·SCALAR_COUPLING²·(2·mUVexp²-2·mass_scalar_2²)/(denom(2,q₂,mUVexp²,-mUV²+(q₂.q₂))²·denom(3,-q₂,mUVexp²,-mUV²+(q₂.q₂)))
  86. 217.54 s gammaloop-nextest-integration> -SCALAR_COUPLING²
  87. 217.54 s gammaloop-nextest-integration> ·(-1/2·(2·mUVexp²-2·mass_scalar_2²+2·(q₀.q₀))/denom(3,-q₂,mUVexp²,-mUV²+(q₂.q₂))
  88. 217.54 s gammaloop-nextest-integration> +4·(q₀.q₂)²/denom(3,-q₂,mUVexp²,-mUV²+(q₂.q₂))²
  89. 217.54 s gammaloop-nextest-integration> )/(denom(2,q₂,mUVexp²,-mUV²+(q₂.q₂))·denom(3,-q₂,mUVexp²,-mUV²+(q₂.q₂)))
  90. 217.54 s gammaloop-nextest-integration> )·q₀(αᵉ².¹)·q₀(αᵉ³.¹)·q₂(αᵉ².¹)·q₂(αᵉ³.¹)
  91. 217.54 s gammaloop-nextest-integration> -SCALAR_COUPLING²·q₀(αᵉ².¹)·q₀(αᵉ³.¹)·q₂(αᵉ².¹)·q₂(αᵉ³.¹)
  92. 217.54 s gammaloop-nextest-integration> /(denom(2,q₂,mUVexp²,-mUV²+(q₂.q₂))·denom(3,-q₂,mUVexp²,-mUV²+(q₂.q₂)))
  93. 217.54 s gammaloop-nextest-integration> +2·SCALAR_COUPLING²·(q₀.q₂)·q₀(αᵉ².¹)·q₀(αᵉ³.¹)·q₂(αᵉ².¹)·q₂(αᵉ³.¹)
  94. 217.54 s gammaloop-nextest-integration> /(denom(2,q₂,mUVexp²,-mUV²+(q₂.q₂))·denom(3,-q₂,mUVexp²,-mUV²+(q₂.q₂))²)
  95. 217.54 s gammaloop-nextest-integration> span t{span_context=true current=subgraph=y, topo_order=1, dod=2 given=subgraph=0, topo_order=0, dod=0}
  96. 217.54 s gammaloop-nextest-integration> [2026-09-02 14:31:44.428] @approx::local_4d [{#uv, #collect, #integrated}] DEBUG : After gamma chain collection
  97. 217.54 s gammaloop-nextest-integration> field value
  98. 217.54 s gammaloop-nextest-integration> expr n-terms: 3, byte size: 1880,expr:
  99. 217.54 s gammaloop-nextest-integration> (1/2·SCALAR_COUPLING²·(2·mUVexp²-2·mass_scalar_2²)/(denom(2,q₂,mUVexp²,-mUV²+(q₂.q₂))²·denom(3,-q₂,mUVexp²,-mUV²+(q₂.q₂)))
  100. 217.54 s gammaloop-nextest-integration> -SCALAR_COUPLING²
  101. 217.54 s gammaloop-nextest-integration> ·(-1/2·(2·mUVexp²-2·mass_scalar_2²+2·(q₀.q₀))/denom(3,-q₂,mUVexp²,-mUV²+(q₂.q₂))
  102. 217.54 s gammaloop-nextest-integration> +4·(q₀.q₂)²/denom(3,-q₂,mUVexp²,-mUV²+(q₂.q₂))²
  103. 217.54 s gammaloop-nextest-integration> )/(denom(2,q₂,mUVexp²,-mUV²+(q₂.q₂))·denom(3,-q₂,mUVexp²,-mUV²+(q₂.q₂)))
  104. 217.54 s gammaloop-nextest-integration> )·q₀(αᵉ².¹)·q₀(αᵉ³.¹)·q₂(αᵉ².¹)·q₂(αᵉ³.¹)
  105. 217.54 s gammaloop-nextest-integration> -SCALAR_COUPLING²·q₀(αᵉ².¹)·q₀(αᵉ³.¹)·q₂(αᵉ².¹)·q₂(αᵉ³.¹)
  106. 217.54 s gammaloop-nextest-integration> /(denom(2,q₂,mUVexp²,-mUV²+(q₂.q₂))·denom(3,-q₂,mUVexp²,-mUV²+(q₂.q₂)))
  107. 217.54 s gammaloop-nextest-integration> +2·SCALAR_COUPLING²·(q₀.q₂)·q₀(αᵉ².¹)·q₀(αᵉ³.¹)·q₂(αᵉ².¹)·q₂(αᵉ³.¹)
  108. 217.54 s gammaloop-nextest-integration> /(denom(2,q₂,mUVexp²,-mUV²+(q₂.q₂))·denom(3,-q₂,mUVexp²,-mUV²+(q₂.q₂))²)
  109. 217.54 s gammaloop-nextest-integration> span t{span_context=true current=subgraph=y, topo_order=1, dod=2 given=subgraph=0, topo_order=0, dod=0}
  110. 217.54 s gammaloop-nextest-integration> [2026-09-02 14:31:44.430] @approx::local_4d [{#profile, #uv, #collect, #integrated, #start, #trace}] DEBUG : After gamma schoonschip
  111. 217.54 s gammaloop-nextest-integration> field value
  112. 217.54 s gammaloop-nextest-integration> expr n-terms: 3, byte size: 1631,expr:
  113. 217.54 s gammaloop-nextest-integration> (1/2·SCALAR_COUPLING²·(2·mUVexp²-2·mass_scalar_2²)/(denom(2,q₂,mUVexp²,-mUV²+(q₂.q₂))²·denom(3,-q₂,mUVexp²,-mUV²+(q₂.q₂)))
  114. 217.54 s gammaloop-nextest-integration> -SCALAR_COUPLING²
  115. 217.54 s gammaloop-nextest-integration> ·(-1/2·(2·mUVexp²-2·mass_scalar_2²+2·(q₀.q₀))/denom(3,-q₂,mUVexp²,-mUV²+(q₂.q₂))
  116. 217.54 s gammaloop-nextest-integration> +4·(q₀.q₂)²/denom(3,-q₂,mUVexp²,-mUV²+(q₂.q₂))²
  117. 217.54 s gammaloop-nextest-integration> )/(denom(2,q₂,mUVexp²,-mUV²+(q₂.q₂))·denom(3,-q₂,mUVexp²,-mUV²+(q₂.q₂)))
  118. 217.54 s gammaloop-nextest-integration> )·(q₀.q₂)²
  119. 217.54 s gammaloop-nextest-integration> -SCALAR_COUPLING²·(q₀.q₂)²/(denom(2,q₂,mUVexp²,-mUV²+(q₂.q₂))·denom(3,-q₂,mUVexp²,-mUV²+(q₂.q₂)))
  120. 217.54 s gammaloop-nextest-integration> +2·SCALAR_COUPLING²·(q₀.q₂)·(q₀.q₂)²
  121. 217.54 s gammaloop-nextest-integration> /(denom(2,q₂,mUVexp²,-mUV²+(q₂.q₂))·denom(3,-q₂,mUVexp²,-mUV²+(q₂.q₂))²)
  122. 217.54 s gammaloop-nextest-integration> span t{span_context=true current=subgraph=y, topo_order=1, dod=2 given=subgraph=0, topo_order=0, dod=0}
  123. 217.54 s gammaloop-nextest-integration> [2026-09-02 14:31:44.433] @approx::local_4d [{#profile, #uv, #collect, #integrated, #start, #trace}] DEBUG : After gamma collection
  124. 217.54 s gammaloop-nextest-integration> field value
  125. 217.54 s gammaloop-nextest-integration> expr n-terms: 1, byte size: 1347,expr:
  126. 217.54 s gammaloop-nextest-integration> SCALAR_COUPLING²
  127. 217.54 s gammaloop-nextest-integration> ·(-denom(2,q₂,mUVexp²,-mUV²+(q₂.q₂))·denom(3,-q₂,mUVexp²,-mUV²+(q₂.q₂))²
  128. 217.54 s gammaloop-nextest-integration> +1/2·(2·mUVexp²-2·mass_scalar_2²)·denom(3,-q₂,mUVexp²,-mUV²+(q₂.q₂))²
  129. 217.54 s gammaloop-nextest-integration> -(-1/2·(2·mUVexp²-2·mass_scalar_2²+2·(q₀.q₀))·denom(3,-q₂,mUVexp²,-mUV²+(q₂.q₂))+4·(q₀.q₂)²)
  130. 217.54 s gammaloop-nextest-integration> ·denom(2,q₂,mUVexp²,-mUV²+(q₂.q₂))
  131. 217.54 s gammaloop-nextest-integration> +2·(q₀.q₂)·denom(2,q₂,mUVexp²,-mUV²+(q₂.q₂))·denom(3,-q₂,mUVexp²,-mUV²+(q₂.q₂))
  132. 217.54 s gammaloop-nextest-integration> )·(q₀.q₂)²/(denom(2,q₂,mUVexp²,-mUV²+(q₂.q₂))²·denom(3,-q₂,mUVexp²,-mUV²+(q₂.q₂))³)
  133. 217.54 s gammaloop-nextest-integration> span t{span_context=true current=subgraph=y, topo_order=1, dod=2 given=subgraph=0, topo_order=0, dod=0}
  134. 217.54 s gammaloop-nextest-integration> [2026-09-02 14:31:44.434] @approx::local_4d [{#profile, #uv, #gamma, #integrated, #start, #trace, #vakint}] DEBUG : After gamma simplification
  135. 217.54 s gammaloop-nextest-integration> ... omitted 3263 more lines; see full nextest output above
  136. 217.54 s gammaloop-nextest-integration>
  137. 217.54 s gammaloop-nextest-integration> 8. gammaloop-integration-tests::uv::sunrise_scalar_1_uv
  138. 217.65 s gammaloop-nextest-integration> failure: test failure with exit code 101
  139. 217.65 s gammaloop-nextest-integration> system-out
  140. 217.65 s gammaloop-nextest-integration> running 1 test
  141. 217.65 s gammaloop-nextest-integration> test sunrise_scalar_1_uv has been running for over 60 seconds
  142. 217.65 s gammaloop-nextest-integration> +------------------+------------------------+--------------+--------+----------+----------------------------------------------------------------------------------------------------------------------+-------+
  143. 217.65 s gammaloop-nextest-integration> | case | check | graph | status | sigma | threshold | error |
  144. 217.65 s gammaloop-nextest-integration> +------------------+------------------------+--------------+--------+----------+----------------------------------------------------------------------------------------------------------------------+-------+
  145. 217.65 s gammaloop-nextest-integration> | sunrise_scalar_1 | uv_profile | - | FAIL | - | - | - |
  146. 217.65 s gammaloop-nextest-integration> +------------------+------------------------+--------------+--------+----------+----------------------------------------------------------------------------------------------------------------------+-------+
  147. 217.65 s gammaloop-nextest-integration> | sunrise_scalar_1 | m_uv.inspect | inspect | pass | - | best inspect relative delta 1.624e0 >= 1000*accuracy 1.000e-3 (accuracy=1.000e-6, exponent=+1.0, seed=1, probes=10) | - |
  148. 217.65 s gammaloop-nextest-integration> +------------------+------------------------+--------------+--------+----------+----------------------------------------------------------------------------------------------------------------------+-------+
  149. 217.65 s gammaloop-nextest-integration> | sunrise_scalar_1 | m_uv.integrated | sunrise | pass | 0.1sigma | compatible within 2sigma | - |
  150. 217.65 s gammaloop-nextest-integration> +------------------+------------------------+--------------+--------+----------+----------------------------------------------------------------------------------------------------------------------+-------+
  151. 217.65 s gammaloop-nextest-integration> | sunrise_scalar_1 | rls.inspect | inspect | pass | - | best inspect relative delta 8.682e-1 >= 1000*accuracy 1.000e-3 (accuracy=1.000e-6, exponent=+1.0, seed=1, probes=10) | - |
  152. 217.65 s gammaloop-nextest-integration> +------------------+------------------------+--------------+--------+----------+----------------------------------------------------------------------------------------------------------------------+-------+
  153. 217.65 s gammaloop-nextest-integration> | sunrise_scalar_1 | rls.integrated | sunrise | pass | 0.0sigma | compatible within 2sigma | - |
  154. 217.65 s gammaloop-nextest-integration> +------------------+------------------------+--------------+--------+----------+----------------------------------------------------------------------------------------------------------------------+-------+
  155. 217.65 s gammaloop-nextest-integration> | sunrise_scalar_1 | mu_r.inspect | inspect | pass | - | best inspect relative delta 1.752e0 >= 1000*accuracy 1.000e-3 (accuracy=1.000e-6, exponent=+1.0, seed=1, probes=10) | - |
  156. 217.65 s gammaloop-nextest-integration> +------------------+------------------------+--------------+--------+----------+----------------------------------------------------------------------------------------------------------------------+-------+
  157. 217.65 s gammaloop-nextest-integration> | sunrise_scalar_1 | integrated.relerr | integrated | pass | - | relative error 9.20% <= 10.00% | - |
  158. 217.65 s gammaloop-nextest-integration> +------------------+------------------------+--------------+--------+----------+----------------------------------------------------------------------------------------------------------------------+-------+
  159. 217.65 s gammaloop-nextest-integration> | sunrise_scalar_1 | m_uv.integrated.relerr | m_uv-shifted | pass | - | relative error 5.89% <= 10.00% | - |
  160. 217.65 s gammaloop-nextest-integration> +------------------+------------------------+--------------+--------+----------+----------------------------------------------------------------------------------------------------------------------+-------+
  161. 217.65 s gammaloop-nextest-integration> | sunrise_scalar_1 | target | - | pass | - | 2sigma | - |
  162. 217.65 s gammaloop-nextest-integration> +------------------+------------------------+--------------+--------+----------+----------------------------------------------------------------------------------------------------------------------+-------+
  163. 217.65 s gammaloop-nextest-integration> test sunrise_scalar_1_uv ... FAILED
  164. 217.65 s gammaloop-nextest-integration>
  165. 217.65 s gammaloop-nextest-integration> failures:
  166. 217.65 s gammaloop-nextest-integration>
  167. 217.65 s gammaloop-nextest-integration> failures:
  168. 217.65 s gammaloop-nextest-integration> sunrise_scalar_1_uv
  169. 217.65 s gammaloop-nextest-integration>
  170. 217.65 s gammaloop-nextest-integration> test result: FAILED. 0 passed; 1 failed; 0 ignored; 0 measured; 24 filtered out; finished in 148.36s
  171. 217.65 s gammaloop-nextest-integration> system-err
  172. 217.65 s gammaloop-nextest-integration> [2026-09-02 14:31:52.531] @gammaloop_api::se... INFO : Running command run generate
  173. 217.65 s gammaloop-nextest-integration> [2026-09-02 14:31:52.531] @gammaloop_api::se... INFO : Starting command block generate
  174. 217.65 s gammaloop-nextest-integration> [2026-09-02 14:31:52.531] @gammaloop_api::se... INFO : Running command import model scalars-default.json
  175. 217.65 s gammaloop-nextest-integration> [2026-09-02 14:31:52.531] @import::model INFO : Loading built-in JSON model scalars-default
  176. 217.65 s gammaloop-nextest-integration> [2026-09-02 14:31:52.544] @gammalooprs::model INFO : The following 2 external parameters were forced to zero by the restriction card:
  177. 217.65 s gammaloop-nextest-integration> width_scalar_1, width_scalar_2
  178. 217.65 s gammaloop-nextest-integration> [2026-09-02 14:31:52.545] @gammaloop_api::se... INFO : Running command remove processes
  179. 217.65 s gammaloop-nextest-integration> [2026-09-02 14:31:52.547] @gammaloop_api::se... INFO : Running command set global kv global.generation.uv.generate_integrated=true
  180. 217.65 s gammaloop-nextest-integration> [2026-09-02 14:31:52.549] @gammaloop_api::se... INFO : Running command import graphs ./tests/resources/graphs/scalar_sunrise.dot -p sunrise_scalar_1 -i scalar_sunrise
  181. 217.65 s gammaloop-nextest-integration> [2026-09-02 14:31:52.549] @commands::import INFO : Loading graphs from '/build/source/tests/resources/graphs/scalar_sunrise.dot'
  182. 217.65 s gammaloop-nextest-integration> [2026-09-02 14:31:52.563] @gammaloop_api::se... INFO : Running command generate existing -p sunrise_scalar_1 -i scalar_sunrise
  183. 217.65 s gammaloop-nextest-integration> [2026-09-02 14:31:52.564] @approx::local_4d [{#uv, #inspect, #integrated}] DEBUG : Rescaled momenta expanded
  184. 217.65 s gammaloop-nextest-integration> field value
  185. 217.65 s gammaloop-nextest-integration> res n-terms: 1, byte size: 3,expr:
  186. 217.65 s gammaloop-nextest-integration> 1
  187. 217.65 s gammaloop-nextest-integration> [2026-09-02 14:31:52.568] @approx::local_4d [{#uv, #inspect, #integrated}] DEBUG : Rescaled momenta expanded
  188. 217.65 s gammaloop-nextest-integration> field value
  189. 217.65 s gammaloop-nextest-integration> res n-terms: 1, byte size: 611,expr:
  190. 217.65 s gammaloop-nextest-integration> 1/(denom(1,q₁/t,mass_scalar_1²,-mass_scalar_1²+(q₁.q₁)/t²)
  191. 217.65 s gammaloop-nextest-integration> ·denom(2,-q₀+q₃-q₁/t,mass_scalar_1²,
  192. 217.65 s gammaloop-nextest-integration> -mass_scalar_1²+2·(q₀.q₁)/t-2·(q₁.q₃)/t+(q₁.q₁)/t²+(q₀.q₀)
  193. 217.65 s gammaloop-nextest-integration> -2·(q₀.q₃)+(q₃.q₃)
  194. 217.65 s gammaloop-nextest-integration> ))
  195. 217.65 s gammaloop-nextest-integration> [2026-09-02 14:31:52.570] @approx::local_4d [{#uv, #inspect, #integrated}] DEBUG : Rescaled momenta expanded
  196. 217.65 s gammaloop-nextest-integration> field value
  197. 217.65 s gammaloop-nextest-integration> res n-terms: 1, byte size: 777,expr:
  198. 217.65 s gammaloop-nextest-integration> 1/(denom(0,q₀/t,mass_scalar_1²,-mass_scalar_1²+(q₀.q₀)/t²)·denom(1,q₁/t,mass_scalar_1²,-mass_scalar_1²+(q₁.q₁)/t²)
  199. 217.65 s gammaloop-nextest-integration> ·denom(2,q₄-q₀/t-q₁/t,mass_scalar_1²,
  200. 217.65 s gammaloop-nextest-integration> -mass_scalar_1²-2·(q₀.q₄)/t-2·(q₁.q₄)/t+(q₀.q₀)/t²+2·(q₀.q₁)/t²
  201. 217.65 s gammaloop-nextest-integration> +(q₁.q₁)/t²+(q₄.q₄)
  202. 217.65 s gammaloop-nextest-integration> ))
  203. 217.66 s gammaloop-nextest-integration> [2026-09-02 14:31:52.584] @approx::local_4d [{#uv, #inspect, #integrated}] DEBUG : Rescaled momenta expanded
  204. 217.66 s gammaloop-nextest-integration> field value
  205. 217.66 s gammaloop-nextest-integration> res n-terms: 1, byte size: 611,expr:
  206. 217.66 s gammaloop-nextest-integration> 1/(denom(0,q₀/t,mass_scalar_1²,-mass_scalar_1²+(q₀.q₀)/t²)
  207. 217.66 s gammaloop-nextest-integration> ·denom(2,-q₁+q₃-q₀/t,mass_scalar_1²,
  208. 217.66 s gammaloop-nextest-integration> -mass_scalar_1²+2·(q₀.q₁)/t-2·(q₀.q₃)/t+(q₀.q₀)/t²+(q₁.q₁)
  209. 217.66 s gammaloop-nextest-integration> -2·(q₁.q₃)+(q₃.q₃)
  210. 217.66 s gammaloop-nextest-integration> ))
  211. 217.66 s gammaloop-nextest-integration> [2026-09-02 14:31:52.586] @approx::local_4d [{#uv, #inspect, #integrated}] DEBUG : Rescaled momenta expanded
  212. 217.66 s gammaloop-nextest-integration> field value
  213. 217.66 s gammaloop-nextest-integration> res n-terms: 1, byte size: 611,expr:
  214. 217.66 s gammaloop-nextest-integration> 1/(denom(0,q₀/t,mass_scalar_1²,-mass_scalar_1²+(q₀.q₀)/t²)
  215. 217.66 s gammaloop-nextest-integration> ·denom(1,-q₂+q₃-q₀/t,mass_scalar_1²,
  216. 217.66 s gammaloop-nextest-integration> -mass_scalar_1²+2·(q₀.q₂)/t-2·(q₀.q₃)/t+(q₀.q₀)/t²+(q₂.q₂)
  217. 217.66 s gammaloop-nextest-integration> -2·(q₂.q₃)+(q₃.q₃)
  218. 217.66 s gammaloop-nextest-integration> ))
  219. 217.66 s gammaloop-nextest-integration> [2026-09-02 14:31:52.590] @approx::final_integrand[{#generation, #profile, #uv, #graph, #summary}] DEBUG : Computed global numerator
  220. 217.66 s gammaloop-nextest-integration> field value
  221. 217.66 s gammaloop-nextest-integration> global_num n-terms: 1, byte size: 3,expr:
  222. 217.66 s gammaloop-nextest-integration> 1
  223. 217.66 s gammaloop-nextest-integration> span build_3d{span_context=true graph=sunrise current=subgraph=0, topo_order=0, dod=0}
  224. 217.66 s gammaloop-nextest-integration> [2026-09-02 14:31:52.593] @uv::approx [{#generation, #uv, #fourd}] DEBUG : Computing 4D
  225. 217.66 s gammaloop-nextest-integration> field value
  226. 217.66 s gammaloop-nextest-integration> simple subgraph(S_47,S_3s)*Approx(subgraph(S_3s,0)) of sunrise
  227. 217.66 s gammaloop-nextest-integration> span compute_4d{span_context=true graph=sunrise current=subgraph=3s, topo_order=1, dod=0 given=subgraph=0, topo_order=0, dod=0 reduced=SubSet { set: BitVec<usize, bitvec::order::Lsb0> { addr: 0x7fffec011050, head: 000000, bits: 8, capacity: 64 } [0, 0, 0, 0, 1, 1, 1, 1], id: PhantomData<linnet::half_edge::involution::Hedge> }}
  228. 217.66 s gammaloop-nextest-integration> [2026-09-02 14:31:52.599] @approx::local_4d [{#uv, #algebra, #integrated, #start}] DEBUG :
  229. 217.66 s gammaloop-nextest-integration> field value
  230. 217.66 s gammaloop-nextest-integration> integrand n-terms: 1, byte size: 217,expr:
  231. 217.66 s gammaloop-nextest-integration> 1/(denom(1,q₁,mass_scalar_1²,-mass_scalar_1²+(q₁.q₁))·denom(2,q₂,mass_scalar_1²,-mass_scalar_1²+(q₂.q₂)))
  232. 217.66 s gammaloop-nextest-integration> reduced 3s
  233. 217.66 s gammaloop-nextest-integration> span grow{span_context=true current=subgraph=3s, topo_order=1, dod=0 given=subgraph=0, topo_order=0, dod=0}
  234. 217.66 s gammaloop-nextest-integration> [2026-09-02 14:31:52.599] @approx::local_4d [{#uv, #inspect, #integrated}] DEBUG : Rescaled momenta expanded
  235. 217.66 s gammaloop-nextest-integration> field value
  236. 217.66 s gammaloop-nextest-integration> res n-terms: 1, byte size: 611,expr:
  237. 217.66 s gammaloop-nextest-integration> 1/(denom(1,q₁/t,mass_scalar_1²,-mass_scalar_1²+(q₁.q₁)/t²)
  238. 217.66 s gammaloop-nextest-integration> ·denom(2,-q₀+q₃-q₁/t,mass_scalar_1²,
  239. 217.66 s gammaloop-nextest-integration> -mass_scalar_1²+2·(q₀.q₁)/t-2·(q₁.q₃)/t+(q₁.q₁)/t²+(q₀.q₀)
  240. 217.66 s gammaloop-nextest-integration> -2·(q₀.q₃)+(q₃.q₃)
  241. 217.66 s gammaloop-nextest-integration> ))
  242. 217.66 s gammaloop-nextest-integration> span t{span_context=true current=subgraph=3s, topo_order=1, dod=0 given=subgraph=0, topo_order=0, dod=0}
  243. 217.66 s gammaloop-nextest-integration> [2026-09-02 14:31:52.600] @approx::local_4d [{#uv, #integrated, #rescaled}] DEBUG : Rescaled expanded
  244. 217.66 s gammaloop-nextest-integration> field value
  245. 217.66 s gammaloop-nextest-integration> n_loops 1
  246. 217.66 s gammaloop-nextest-integration> res n-terms: 1, byte size: 723,expr:
  247. 217.66 s gammaloop-nextest-integration> 1/(denom(1,q₁,mUVexp²+t²·mass_scalar_1²,-mUV²+t²·(-mass_scalar_1²+(q₁.q₁)/t²)+t²·mUVexp²)
  248. 217.66 s gammaloop-nextest-integration> ·denom(2,-q₁,mUVexp²+t²·mass_scalar_1²,
  249. 217.66 s gammaloop-nextest-integration> -mUV²
  250. 217.66 s gammaloop-nextest-integration> +t²
  251. 217.66 s gammaloop-nextest-integration> ·(-mass_scalar_1²+2·(q₀.q₁)/t-2·(q₁.q₃)/t+(q₁.q₁)/t²+(q₀.q₀)
  252. 217.66 s gammaloop-nextest-integration> -2·(q₀.q₃)+(q₃.q₃)
  253. 217.66 s gammaloop-nextest-integration> )
  254. 217.66 s gammaloop-nextest-integration> +t²·mUVexp²
  255. 217.66 s gammaloop-nextest-integration> ))
  256. 217.66 s gammaloop-nextest-integration> span t{span_context=true current=subgraph=3s, topo_order=1, dod=0 given=subgraph=0, topo_order=0, dod=0}
  257. 217.66 s gammaloop-nextest-integration> [2026-09-02 14:31:52.605] @approx::local_4d [{#uv, #integrated, #series}] DEBUG : Series expanded
  258. 217.66 s gammaloop-nextest-integration> field value
  259. 217.66 s gammaloop-nextest-integration> res n-terms: 1, byte size: 223,expr:
  260. 217.66 s gammaloop-nextest-integration> 1/(denom(1,q₁,mUVexp²,-mUV²+(q₁.q₁))·denom(2,-q₁,mUVexp²,-mUV²+(q₁.q₁)))
  261. 217.66 s gammaloop-nextest-integration> span t{span_context=true current=subgraph=3s, topo_order=1, dod=0 given=subgraph=0, topo_order=0, dod=0}
  262. 217.66 s gammaloop-nextest-integration> [2026-09-02 14:31:52.605] @approx::local_4d [{#uv, #integrated, #series}] DEBUG : Evaluated at t = 1
  263. 217.66 s gammaloop-nextest-integration> field value
  264. 217.66 s gammaloop-nextest-integration> res n-terms: 1, byte size: 223,expr:
  265. 217.66 s gammaloop-nextest-integration> 1/(denom(1,q₁,mUVexp²,-mUV²+(q₁.q₁))·denom(2,-q₁,mUVexp²,-mUV²+(q₁.q₁)))
  266. 217.66 s gammaloop-nextest-integration> span t{span_context=true current=subgraph=3s, topo_order=1, dod=0 given=subgraph=0, topo_order=0, dod=0}
  267. 217.66 s gammaloop-nextest-integration> [2026-09-02 14:31:52.606] @approx::local_4d [{#uv, #collect, #integrated}] DEBUG : After gamma chain collection
  268. 217.66 s gammaloop-nextest-integration> field value
  269. 217.66 s gammaloop-nextest-integration> expr n-terms: 1, byte size: 223,expr:
  270. 217.66 s gammaloop-nextest-integration> 1/(denom(1,q₁,mUVexp²,-mUV²+(q₁.q₁))·denom(2,-q₁,mUVexp²,-mUV²+(q₁.q₁)))
  271. 217.66 s gammaloop-nextest-integration> span t{span_context=true current=subgraph=3s, topo_order=1, dod=0 given=subgraph=0, topo_order=0, dod=0}
  272. 217.66 s gammaloop-nextest-integration> [2026-09-02 14:31:52.607] @approx::local_4d [{#profile, #uv, #collect, #integrated, #start, #trace}] DEBUG : After gamma schoonschip
  273. 217.66 s gammaloop-nextest-integration> field value
  274. 217.66 s gammaloop-nextest-integration> expr n-terms: 1, byte size: 223,expr:
  275. 217.66 s gammaloop-nextest-integration> 1/(denom(1,q₁,mUVexp²,-mUV²+(q₁.q₁))·denom(2,-q₁,mUVexp²,-mUV²+(q₁.q₁)))
  276. 217.66 s gammaloop-nextest-integration> span t{span_context=true current=subgraph=3s, topo_order=1, dod=0 given=subgraph=0, topo_order=0, dod=0}
  277. 217.66 s gammaloop-nextest-integration> [2026-09-02 14:31:52.612] @approx::local_4d [{#profile, #uv, #collect, #integrated, #start, #trace}] DEBUG : After gamma collection
  278. 217.66 s gammaloop-nextest-integration> field value
  279. 217.66 s gammaloop-nextest-integration> expr n-terms: 1, byte size: 223,expr:
  280. 217.66 s gammaloop-nextest-integration> 1/(denom(1,q₁,mUVexp²,-mUV²+(q₁.q₁))·denom(2,-q₁,mUVexp²,-mUV²+(q₁.q₁)))
  281. 217.66 s gammaloop-nextest-integration> span t{span_context=true current=subgraph=3s, topo_order=1, dod=0 given=subgraph=0, topo_order=0, dod=0}
  282. 217.66 s gammaloop-nextest-integration> [2026-09-02 14:31:52.612] @approx::local_4d [{#profile, #uv, #gamma, #integrated, #start, #trace, #vakint}] DEBUG : After gamma simplification
  283. 217.66 s gammaloop-nextest-integration> field value
  284. 217.66 s gammaloop-nextest-integration> expr n-terms: 1, byte size: 223,expr:
  285. 217.66 s gammaloop-nextest-integration> 1/(denom(1,q₁,mUVexp²,-mUV²+(q₁.q₁))·denom(2,-q₁,mUVexp²,-mUV²+(q₁.q₁)))
  286. 217.66 s gammaloop-nextest-integration> span t{span_context=true current=subgraph=3s, topo_order=1, dod=0 given=subgraph=0, topo_order=0, dod=0}
  287. 217.66 s gammaloop-nextest-integration> [2026-09-02 14:31:52.614] @approx::local_4d [{#profile, #uv, #integrated, #schoonschip, #start, #trace, #vakint}] DEBUG : After Schoonschip net
  288. 217.66 s gammaloop-nextest-integration> field value
  289. 217.66 s gammaloop-nextest-integration> expr n-terms: 1, byte size: 223,expr:
  290. 217.66 s gammaloop-nextest-integration> 1/(denom(1,q₁,mUVexp²,-mUV²+(q₁.q₁))·denom(2,-q₁,mUVexp²,-mUV²+(q₁.q₁)))
  291. 217.66 s gammaloop-nextest-integration> ... omitted 20090 more lines; see full nextest output above
  292. 217.66 s gammaloop-nextest-integration>
  293. 217.66 s gammaloop-nextest-integration> 9. gammaloop-integration-tests::uv::se1l_uv
  294. 217.66 s gammaloop-nextest-integration> failure: test failure with exit code 101
  295. 217.66 s gammaloop-nextest-integration> system-out
  296. 217.66 s gammaloop-nextest-integration> running 1 test
  297. 217.66 s gammaloop-nextest-integration> test se1l_uv has been running for over 60 seconds
  298. 217.66 s gammaloop-nextest-integration> +------+-----------------+---------+--------+----------+-----------------------------------------------------------------------------------------------------------------------+-------+
  299. 217.66 s gammaloop-nextest-integration> | case | check | graph | status | sigma | threshold | error |
  300. 217.66 s gammaloop-nextest-integration> +------+-----------------+---------+--------+----------+-----------------------------------------------------------------------------------------------------------------------+-------+
  301. 217.66 s gammaloop-nextest-integration> | se1l | uv_profile | - | FAIL | - | - | - |
  302. 217.66 s gammaloop-nextest-integration> +------+-----------------+---------+--------+----------+-----------------------------------------------------------------------------------------------------------------------+-------+
  303. 217.66 s gammaloop-nextest-integration> | se1l | m_uv.inspect | inspect | pass | - | best inspect relative delta 1.097e-1 >= 1000*accuracy 1.000e-7 (accuracy=1.000e-10, exponent=+2.0, seed=1, probes=10) | - |
  304. 217.66 s gammaloop-nextest-integration> +------+-----------------+---------+--------+----------+-----------------------------------------------------------------------------------------------------------------------+-------+
  305. 217.66 s gammaloop-nextest-integration> | se1l | m_uv.integrated | se1l | pass | 0.1sigma | compatible within 2sigma | - |
  306. 217.66 s gammaloop-nextest-integration> +------+-----------------+---------+--------+----------+-----------------------------------------------------------------------------------------------------------------------+-------+
  307. 217.66 s gammaloop-nextest-integration> | se1l | rls.inspect | inspect | pass | - | best inspect relative delta 4.499e-2 >= 1000*accuracy 1.000e-7 (accuracy=1.000e-10, exponent=+2.0, seed=1, probes=10) | - |
  308. 217.66 s gammaloop-nextest-integration> +------+-----------------+---------+--------+----------+-----------------------------------------------------------------------------------------------------------------------+-------+
  309. 217.66 s gammaloop-nextest-integration> | se1l | rls.integrated | se1l | pass | 0.0sigma | compatible within 2sigma | - |
  310. 217.66 s gammaloop-nextest-integration> +------+-----------------+---------+--------+----------+-----------------------------------------------------------------------------------------------------------------------+-------+
  311. 217.66 s gammaloop-nextest-integration> | se1l | mu_r.inspect | inspect | pass | - | best inspect relative delta 1.424e-1 >= 1000*accuracy 1.000e-7 (accuracy=1.000e-10, exponent=+2.0, seed=1, probes=10) | - |
  312. 217.66 s gammaloop-nextest-integration> +------+-----------------+---------+--------+----------+-----------------------------------------------------------------------------------------------------------------------+-------+
  313. 217.66 s gammaloop-nextest-integration> | se1l | target | - | pass | - | 2sigma | - |
  314. 217.66 s gammaloop-nextest-integration> +------+-----------------+---------+--------+----------+-----------------------------------------------------------------------------------------------------------------------+-------+
  315. 217.66 s gammaloop-nextest-integration> test se1l_uv ... FAILED
  316. 217.66 s gammaloop-nextest-integration>
  317. 217.66 s gammaloop-nextest-integration> failures:
  318. 217.66 s gammaloop-nextest-integration>
  319. 217.66 s gammaloop-nextest-integration> failures:
  320. 217.66 s gammaloop-nextest-integration> se1l_uv
  321. 217.66 s gammaloop-nextest-integration>
  322. 217.66 s gammaloop-nextest-integration> test result: FAILED. 0 passed; 1 failed; 0 ignored; 0 measured; 24 filtered out; finished in 170.45s
  323. 217.66 s gammaloop-nextest-integration> system-err
  324. 217.66 s gammaloop-nextest-integration> [2026-09-02 14:31:50.513] @gammaloop_api::se... INFO : Running command run generate
  325. 217.66 s gammaloop-nextest-integration> [2026-09-02 14:31:50.513] @gammaloop_api::se... INFO : Starting command block generate
  326. 217.66 s gammaloop-nextest-integration> [2026-09-02 14:31:50.513] @gammaloop_api::se... INFO : Running command import model sm-default
  327. 217.66 s gammaloop-nextest-integration> [2026-09-02 14:31:50.513] @import::model INFO : Loading built-in JSON model sm-default
  328. 217.66 s gammaloop-nextest-integration> [2026-09-02 14:31:50.590] @gammalooprs::model INFO : The following 11 external parameters were forced to zero by the restriction card:
  329. 217.66 s gammaloop-nextest-integration> lamWS, AWS, rhoWS, etaWS, ymc, yme, ymm, MC, Me, MM, WTau
  330. 217.66 s gammaloop-nextest-integration> [2026-09-02 14:31:50.590] @gammalooprs::model INFO : The following 34 vertex rules were removed by the restriction card:
  331. 217.66 s gammaloop-nextest-integration> V_82 -> (c~, d, G+) | V_83 -> (t~, d, G+) | V_84 -> (c~, s, G+) | V_85 -> (t~, s, G+) | V_86 -> (u~, b, G+) | V_87 -> (c~, b, G+) | V_90 -> (c~, d, W+) | V_91 -> (t~, d, W+) | V_92 -> (u~, s, W+) | V_94 -> (t~, s, W+) | V_95 -> (u~, b, W+) | V_96 -> (c~, b, W+) | V_101 -> (e+, e-, G0) | V_102 -> (mu+, mu-, G0) | V_104 -> (e+, e-, H) | V_105 -> (mu+, mu-, H) | V_110 -> (ve~, e-, G+) | V_111 -> (vm~, mu-, G+) | V_116 -> (b~, u, G-) | V_117 -> (d~, c, G-) | V_118 -> (s~, c, G-) | V_119 -> (b~, c, G-) | V_120 -> (d~, t, G-) | V_121 -> (s~, t, G-) | V_124 -> (s~, u, W-) | V_125 -> (b~, u, W-) | V_126 -> (d~, c, W-) | V_128 -> (b~, c, W-) | V_129 -> (d~, t, W-) | V_130 -> (s~, t, W-) | V_138 -> (c~, c, G0) | V_140 -> (c~, c, H) | V_145 -> (e+, ve, G-) | V_146 -> (mu+, vm, G-)
  332. 217.66 s gammaloop-nextest-integration> [2026-09-02 14:31:50.590] @gammalooprs::model INFO : The following 36 couplings were removed by the restriction card:
  333. 217.66 s gammaloop-nextest-integration> GC_13, GC_14, GC_16, GC_17, GC_18, GC_19, GC_20, GC_22, GC_23, GC_24, GC_25, GC_26, GC_28, GC_29, GC_42, GC_43, GC_44, GC_46, GC_47, GC_48, GC_84, GC_85, GC_86, GC_87, GC_88, GC_89, GC_90, GC_91, GC_92, GC_93, GC_101, GC_102, GC_103, GC_105, GC_106, GC_107
  334. 217.66 s gammaloop-nextest-integration> [2026-09-02 14:31:50.591] @gammaloop_api::se... INFO : Running command remove processes
  335. 217.66 s gammaloop-nextest-integration> [2026-09-02 14:31:50.591] @gammaloop_api::se... INFO : Running command set global kv global.generation.uv.generate_integrated=true
  336. 217.66 s gammaloop-nextest-integration> [2026-09-02 14:31:50.592] @gammaloop_api::se... INFO : Running command import graphs ./tests/resources/graphs/uv_tests/se1l.dot -p se1l -i se1l
  337. 217.66 s gammaloop-nextest-integration> [2026-09-02 14:31:50.592] @commands::import INFO : Loading graphs from '/build/source/tests/resources/graphs/uv_tests/se1l.dot'
  338. 217.66 s gammaloop-nextest-integration> [2026-09-02 14:31:50.597] @gammaloop_api::se... INFO : Running command generate existing -p se1l -i se1l
  339. 217.66 s gammaloop-nextest-integration> [2026-09-02 14:31:52.091] @commands::generate INFO :
  340. 217.66 s gammaloop-nextest-integration> Integrand generation summary
  341. 217.66 s gammaloop-nextest-integration> peak RAM 90.25 MiB | cores 1
  342. 217.66 s gammaloop-nextest-integration> ╭───────────┬───────┬─────────┬─────────────┬─────────────┬────────────────┬─────────────╮
  343. 217.66 s gammaloop-nextest-integration> │ integrand │ graph │ # evals │ expr build │ spenso │ symbolica eval │ compile │
  344. 217.66 s gammaloop-nextest-integration> ├───────────┼───────┼─────────┼─────────────┼─────────────┼────────────────┼─────────────┤
  345. 217.66 s gammaloop-nextest-integration> │ se1l │ se1l │ 5 │ 1.24s (88%) │ 60ms (4.3%) │ 107ms (7.6%) │ 0ms (0.00%) │
  346. 217.66 s gammaloop-nextest-integration> ├───────────┼───────┼─────────┼─────────────┼─────────────┼────────────────┼─────────────┤
  347. 217.66 s gammaloop-nextest-integration> │ Total │ │ 5 │ 1.24s (88%) │ 60ms (4.3%) │ 107ms (7.6%) │ 0ms (0.00%) │
  348. 217.66 s gammaloop-nextest-integration> ╰───────────┴───────┴─────────┴─────────────┴─────────────┴────────────────┴─────────────╯
  349. 217.66 s gammaloop-nextest-integration> [2026-09-02 14:31:52.092] @gammaloop_api::se... INFO : Running command set process -p se1l -i se1l kv general.m_uv=0.2
  350. 217.66 s gammaloop-nextest-integration> [2026-09-02 14:31:52.093] @gammaloop_api::se... INFO : Running command set process -p se1l -i se1l kv general.mu_r=0.2
  351. 217.66 s gammaloop-nextest-integration> [2026-09-02 14:31:52.098] @gammaloop_api::se... INFO : Running command set process -p se1l -i se1l kv general.renormalization_localization_scale=0.2
  352. 217.66 s gammaloop-nextest-integration> [2026-09-02 14:31:52.099] @gammaloop_api::se... INFO : Running command duplicate integrand -p se1l -i se1l --output_process_name se1l --output_integrand_name se1l_muv_shifted
  353. 217.66 s gammaloop-nextest-integration> [2026-09-02 14:31:52.105] @gammaloop_api::se... INFO : Running command set process -p se1l -i se1l_muv_shifted kv general.m_uv=0.5
  354. 217.66 s gammaloop-nextest-integration> [2026-09-02 14:31:52.109] @gammaloop_api::se... INFO : Running command duplicate integrand -p se1l -i se1l --output_process_name se1l --output_integrand_name se1l_rls_shifted
  355. 217.66 s gammaloop-nextest-integration> [2026-09-02 14:31:52.116] @gammaloop_api::se... INFO : Running command set process -p se1l -i se1l_rls_shifted kv general.renormalization_localization_scale=1
  356. 217.66 s gammaloop-nextest-integration> [2026-09-02 14:31:52.117] @gammaloop_api::se... INFO : Running command duplicate integrand -p se1l -i se1l --output_process_name se1l --output_integrand_name se1l_mur_shifted
  357. 217.66 s gammaloop-nextest-integration> [2026-09-02 14:31:52.127] @gammaloop_api::se... INFO : Running command set process -p se1l -i se1l_mur_shifted kv general.mu_r=0.8
  358. 217.66 s gammaloop-nextest-integration> [2026-09-02 14:31:52.145] @process::amplitude WARNING : External state 0 ('g', PDG 21, helicity +) is off shell: p^2 = +2.5e5, expected m^2 = +0e0 (|Δ| = +2.5e5). Fixed-helicity spinor/vector/tensor external states may be ill-defined at this kinematic point.
  359. 217.66 s gammaloop-nextest-integration> field value
  360. 217.66 s gammaloop-nextest-integration> span warm_up{integrand.name=se1l}
  361. 217.66 s gammaloop-nextest-integration> [2026-09-02 14:31:52.145] @process::amplitude WARNING : External state 1 ('g', PDG 21, helicity -) is off shell: p^2 = +2.5e5, expected m^2 = +0e0 (|Δ| = +2.5e5). Fixed-helicity spinor/vector/tensor external states may be ill-defined at this kinematic point.
  362. 217.66 s gammaloop-nextest-integration> field value
  363. 217.66 s gammaloop-nextest-integration> span warm_up{integrand.name=se1l}
  364. 217.66 s gammaloop-nextest-integration> [2026-09-02 14:31:52.146] @process::amplitude INFO : Input is above threshold: 1 existing threshold E-surfaces across 1/1 graph groups
  365. 217.66 s gammaloop-nextest-integration> field value
  366. 217.66 s gammaloop-nextest-integration> existing_esurfaces 1
  367. 217.66 s gammaloop-nextest-integration> group_count 1
  368. 217.66 s gammaloop-nextest-integration> groups_above_threshold 1
  369. 217.66 s gammaloop-nextest-integration> integrand se1l
  370. 217.66 s gammaloop-nextest-integration> span warm_up{integrand.name=se1l}
  371. 217.66 s gammaloop-nextest-integration> threshold_status above threshold
  372. 217.66 s gammaloop-nextest-integration> [2026-09-02 14:31:52.146] @process::amplitude INFO : overlap structure of group 0: [1: [0(2,3)]]
  373. 217.66 s gammaloop-nextest-integration> field value
  374. 217.66 s gammaloop-nextest-integration> span warm_up{integrand.name=se1l}
  375. 217.66 s gammaloop-nextest-integration> [2026-09-02 14:31:52.641] @commands::profile INFO :
  376. 217.66 s gammaloop-nextest-integration> ╭───────┬──────┬──────────┬───────┬─────┬──────────┬───────────╮
  377. 217.66 s gammaloop-nextest-integration> │ fixed │ → ∞ │ slope │ r2 │ DOD │ bare DOD │ inspect │
  378. 217.66 s gammaloop-nextest-integration> ├───────┼──────┼──────────┼───────┼─────┼──────────┼───────────┤
  379. 217.66 s gammaloop-nextest-integration> │ {} │ {e3} │ 1.639236 │ 0.904 │ 2 │ 2 │ arb retry │
  380. 217.66 s gammaloop-nextest-integration> │ {} │ {e2} │ 1.698834 │ 0.902 │ 2 │ 2 │ arb retry │
  381. 217.66 s gammaloop-nextest-integration> ╰───────┴──────┴──────────┴───────┴─────┴──────────┴───────────╯
  382. 217.66 s gammaloop-nextest-integration> [2026-09-02 14:31:52.642] @commands::profile INFO :
  383. 217.66 s gammaloop-nextest-integration> ╭───────┬──────┬─────────────┬──────────┬───────┬─────┬──────────┬───────────╮
  384. 217.66 s gammaloop-nextest-integration> │ fixed │ → ∞ │ orientation │ slope │ r2 │ DOD │ bare DOD │ inspect │
  385. 217.66 s gammaloop-nextest-integration> ├───────┼──────┼─────────────┼──────────┼───────┼─────┼──────────┼───────────┤
  386. 217.66 s gammaloop-nextest-integration> │ {} │ {e3} │ 00-+ │ 0.343429 │ 0.145 │ 0 │ 2 │ arb retry │
  387. 217.66 s gammaloop-nextest-integration> │ {} │ {e3} │ 00+- │ 0.342577 │ 0.135 │ 0 │ 2 │ arb retry │
  388. 217.66 s gammaloop-nextest-integration> │ {} │ {e2} │ 00-+ │ 0.385975 │ 0.161 │ 0 │ 2 │ arb retry │
  389. 217.66 s gammaloop-nextest-integration> │ {} │ {e2} │ 00+- │ 0.384920 │ 0.192 │ 0 │ 2 │ arb retry │
  390. 217.66 s gammaloop-nextest-integration> ╰───────┴──────┴─────────────┴──────────┴───────┴─────┴──────────┴───────────╯
  391. 217.66 s gammaloop-nextest-integration> [2026-09-02 14:31:52.649] @gammaloop_api::se... INFO : Running command set process kv integrator.target_relative_accuracy=0.001 integrator.n_increase=0 integrator.n_start=50000 integrator.n_max=400000 integrator.seed=1337
  392. 217.66 s gammaloop-nextest-integration> [2026-09-02 14:31:52.651] @commands::integrate INFO : Created workspace directory at /build/source/tests/artifacts/se1l/integration_workspace_se1l
  393. 217.66 s gammaloop-nextest-integration> [2026-09-02 14:31:52.688] @commands::integrate INFO : No integration state found, starting new integration
  394. 217.66 s gammaloop-nextest-integration> [2026-09-02 14:31:52.688] @commands::integrate INFO : Gammaloop now integrates se1l@se1l, se1l@se1l_muv_shifted, se1l@se1l_rls_shifted
  395. 217.66 s gammaloop-nextest-integration> [2026-09-02 14:31:52.688] @process::amplitude WARNING : External state 0 ('g', PDG 21, helicity +) is off shell: p^2 = +2.5e5, expected m^2 = +0e0 (|Δ| = +2.5e5). Fixed-helicity spinor/vector/tensor external states may be ill-defined at this kinematic point.
  396. 217.66 s gammaloop-nextest-integration> field value
  397. 217.66 s gammaloop-nextest-integration> span warm_up{integrand.name=se1l}
  398. 217.66 s gammaloop-nextest-integration> [2026-09-02 14:31:52.688] @process::amplitude WARNING : External state 1 ('g', PDG 21, helicity -) is off shell: p^2 = +2.5e5, expected m^2 = +0e0 (|Δ| = +2.5e5). Fixed-helicity spinor/vector/tensor external states may be ill-defined at this kinematic point.
  399. 217.66 s gammaloop-nextest-integration> field value
  400. 217.66 s gammaloop-nextest-integration> span warm_up{integrand.name=se1l}
  401. 217.66 s gammaloop-nextest-integration> [2026-09-02 14:31:52.689] @process::amplitude INFO : Input is above threshold: 1 existing threshold E-surfaces across 1/1 graph groups
  402. 217.66 s gammaloop-nextest-integration> field value
  403. 217.66 s gammaloop-nextest-integration> existing_esurfaces 1
  404. 217.66 s gammaloop-nextest-integration> group_count 1
  405. 217.66 s gammaloop-nextest-integration> groups_above_threshold 1
  406. 217.66 s gammaloop-nextest-integration> integrand se1l
  407. 217.66 s gammaloop-nextest-integration> span warm_up{integrand.name=se1l}
  408. 217.66 s gammaloop-nextest-integration> threshold_status above threshold
  409. 217.66 s gammaloop-nextest-integration> [2026-09-02 14:31:52.689] @process::amplitude INFO : overlap structure of group 0: [1: [0(2,3)]]
  410. 217.66 s gammaloop-nextest-integration> field value
  411. 217.66 s gammaloop-nextest-integration> span warm_up{integrand.name=se1l}
  412. 217.66 s gammaloop-nextest-integration> [2026-09-02 14:31:52.690] @process::amplitude WARNING : External state 0 ('g', PDG 21, helicity +) is off shell: p^2 = +2.5e5, expected m^2 = +0e0 (|Δ| = +2.5e5). Fixed-helicity spinor/vector/tensor external states may be ill-defined at this kinematic point.
  413. 217.66 s gammaloop-nextest-integration> field value
  414. 217.66 s gammaloop-nextest-integration> span warm_up{integrand.name=se1l_muv_shifted}
  415. 217.66 s gammaloop-nextest-integration> [2026-09-02 14:31:52.690] @process::amplitude WARNING : External state 1 ('g', PDG 21, helicity -) is off shell: p^2 = +2.5e5, expected m^2 = +0e0 (|Δ| = +2.5e5). Fixed-helicity spinor/vector/tensor external states may be ill-defined at this kinematic point.
  416. 217.66 s gammaloop-nextest-integration> field value
  417. 217.66 s gammaloop-nextest-integration> span warm_up{integrand.name=se1l_muv_shifted}
  418. 217.66 s gammaloop-nextest-integration> [2026-09-02 14:31:52.691] @process::amplitude INFO : Input is above threshold: 1 existing threshold E-surfaces across 1/1 graph groups
  419. 217.66 s gammaloop-nextest-integration> field value
  420. 217.66 s gammaloop-nextest-integration> existing_esurfaces 1
  421. 217.66 s gammaloop-nextest-integration> group_count 1
  422. 217.66 s gammaloop-nextest-integration> groups_above_threshold 1
  423. 217.66 s gammaloop-nextest-integration> integrand se1l_muv_shifted
  424. 217.66 s gammaloop-nextest-integration> span warm_up{integrand.name=se1l_muv_shifted}
  425. 217.66 s gammaloop-nextest-integration> threshold_status above threshold
  426. 217.66 s gammaloop-nextest-integration> [2026-09-02 14:31:52.691] @process::amplitude INFO : overlap structure of group 0: [1: [0(2,3)]]
  427. 217.66 s gammaloop-nextest-integration> field value
  428. 217.66 s gammaloop-nextest-integration> span warm_up{integrand.name=se1l_muv_shifted}
  429. 217.66 s gammaloop-nextest-integration> [2026-09-02 14:31:52.694] @process::amplitude WARNING : External state 0 ('g', PDG 21, helicity +) is off shell: p^2 = +2.5e5, expected m^2 = +0e0 (|Δ| = +2.5e5). Fixed-helicity spinor/vector/tensor external states may be ill-defined at this kinematic point.
  430. 217.66 s gammaloop-nextest-integration> field value
  431. 217.66 s gammaloop-nextest-integration> span warm_up{integrand.name=se1l_rls_shifted}
  432. 217.66 s gammaloop-nextest-integration> [2026-09-02 14:31:52.694] @process::amplitude WARNING : External state 1 ('g', PDG 21, helicity -) is off shell: p^2 = +2.5e5, expected m^2 = +0e0 (|Δ| = +2.5e5). Fixed-helicity spinor/vector/tensor external states may be ill-defined at this kinematic point.
  433. 217.66 s gammaloop-nextest-integration> field value
  434. 217.66 s gammaloop-nextest-integration> span warm_up{integrand.name=se1l_rls_shifted}
  435. 217.66 s gammaloop-nextest-integration> [2026-09-02 14:31:52.694] @process::amplitude INFO : Input is above threshold: 1 existing threshold E-surfaces across 1/1 graph groups
  436. 217.66 s gammaloop-nextest-integration> field value
  437. 217.66 s gammaloop-nextest-integration> existing_esurfaces 1
  438. 217.66 s gammaloop-nextest-integration> group_count 1
  439. 217.66 s gammaloop-nextest-integration> groups_above_threshold 1
  440. 217.66 s gammaloop-nextest-integration> integrand se1l_rls_shifted
  441. 217.66 s gammaloop-nextest-integration> span warm_up{integrand.name=se1l_rls_shifted}
  442. 217.66 s gammaloop-nextest-integration> threshold_status above threshold
  443. 217.66 s gammaloop-nextest-integration> ... omitted 1410 more lines; see full nextest output above
  444. 217.66 s gammaloop-nextest-integration> =========================================
  445. 218.21 s error: Cannot build '/nix/store/zpyfjihmv7i6ghxwmb5sjv51y6brg4wy-gammaloop-nextest-integration.drv'.
  446. 218.21 s Reason: builder failed with exit code 100.
  447. 218.21 s Output paths:
  448. 218.21 s /nix/store/k1knsdpdly6yc14pxdqxjbszfxpz040p-gammaloop-nextest-integration
  449. 218.21 s Last 2048 log lines:
  450. 218.21 s > span warm_up{integrand.name=se1l_muv_shifted}
  451. 218.21 s > threshold_status above threshold
  452. 218.21 s > [2026-09-02 14:34:40.252] @process::amplitude INFO : overlap structure of group 0: [1: [0(2,3)]]
  453. 218.21 s > field value
  454. 218.21 s > span warm_up{integrand.name=se1l_muv_shifted}
  455. 218.21 s > [2026-09-02 14:34:40.272] @process::amplitude WARNING : External state 0 ('g', PDG 21, helicity +) is off shell: p^2 = +2.5e5, expected m^2 = +0e0 (|Δ| = +2.5e5). Fixed-helicity spinor/vector/tensor external states may be ill-defined at this kinematic point.
  456. 218.21 s > field value
  457. 218.21 s > span warm_up{integrand.name=se1l}
  458. 218.21 s > [2026-09-02 14:34:40.272] @process::amplitude WARNING : External state 1 ('g', PDG 21, helicity -) is off shell: p^2 = +2.5e5, expected m^2 = +0e0 (|Δ| = +2.5e5). Fixed-helicity spinor/vector/tensor external states may be ill-defined at this kinematic point.
  459. 218.21 s > field value
  460. 218.21 s > span warm_up{integrand.name=se1l}
  461. 218.21 s > [2026-09-02 14:34:40.273] @process::amplitude INFO : Input is above threshold: 1 existing threshold E-surfaces across 1/1 graph groups
  462. 218.21 s > field value
  463. 218.21 s > existing_esurfaces 1
  464. 218.21 s > group_count 1
  465. 218.21 s > groups_above_threshold 1
  466. 218.21 s > integrand se1l
  467. 218.21 s > span warm_up{integrand.name=se1l}
  468. 218.21 s > threshold_status above threshold
  469. 218.21 s > [2026-09-02 14:34:40.276] @process::amplitude INFO : overlap structure of group 0: [1: [0(2,3)]]
  470. 218.21 s > field value
  471. 218.21 s > span warm_up{integrand.name=se1l}
  472. 218.21 s > [2026-09-02 14:34:40.288] @process::amplitude WARNING : External state 0 ('g', PDG 21, helicity +) is off shell: p^2 = +2.5e5, expected m^2 = +0e0 (|Δ| = +2.5e5). Fixed-helicity spinor/vector/tensor external states may be ill-defined at this kinematic point.
  473. 218.21 s > field value
  474. 218.21 s > span warm_up{integrand.name=se1l_muv_shifted}
  475. 218.21 s > [2026-09-02 14:34:40.288] @process::amplitude WARNING : External state 1 ('g', PDG 21, helicity -) is off shell: p^2 = +2.5e5, expected m^2 = +0e0 (|Δ| = +2.5e5). Fixed-helicity spinor/vector/tensor external states may be ill-defined at this kinematic point.
  476. 218.21 s > field value
  477. 218.21 s > span warm_up{integrand.name=se1l_muv_shifted}
  478. 218.21 s > [2026-09-02 14:34:40.289] @process::amplitude INFO : Input is above threshold: 1 existing threshold E-surfaces across 1/1 graph groups
  479. 218.21 s > field value
  480. 218.21 s > existing_esurfaces 1
  481. 218.21 s > group_count 1
  482. 218.21 s > groups_above_threshold 1
  483. 218.21 s > integrand se1l_muv_shifted
  484. 218.21 s > span warm_up{integrand.name=se1l_muv_shifted}
  485. 218.21 s > threshold_status above threshold
  486. 218.21 s > [2026-09-02 14:34:40.289] @process::amplitude INFO : overlap structure of group 0: [1: [0(2,3)]]
  487. 218.21 s > field value
  488. 218.21 s > span warm_up{integrand.name=se1l_muv_shifted}
  489. 218.21 s > [2026-09-02 14:34:40.298] @process::amplitude WARNING : External state 0 ('g', PDG 21, helicity +) is off shell: p^2 = +2.5e5, expected m^2 = +0e0 (|Δ| = +2.5e5). Fixed-helicity spinor/vector/tensor external states may be ill-defined at this kinematic point.
  490. 218.21 s > field value
  491. 218.21 s > span warm_up{integrand.name=se1l}
  492. 218.21 s > [2026-09-02 14:34:40.298] @process::amplitude WARNING : External state 1 ('g', PDG 21, helicity -) is off shell: p^2 = +2.5e5, expected m^2 = +0e0 (|Δ| = +2.5e5). Fixed-helicity spinor/vector/tensor external states may be ill-defined at this kinematic point.
  493. 218.21 s > field value
  494. 218.21 s > span warm_up{integrand.name=se1l}
  495. 218.21 s > [2026-09-02 14:34:40.299] @process::amplitude INFO : Input is above threshold: 1 existing threshold E-surfaces across 1/1 graph groups
  496. 218.21 s > field value
  497. 218.21 s > existing_esurfaces 1
  498. 218.21 s > group_count 1
  499. 218.21 s > groups_above_threshold 1
  500. 218.21 s > integrand se1l
  501. 218.21 s > span warm_up{integrand.name=se1l}
  502. 218.21 s > threshold_status above threshold
  503. 218.21 s > [2026-09-02 14:34:40.299] @process::amplitude INFO : overlap structure of group 0: [1: [0(2,3)]]
  504. 218.21 s > field value
  505. 218.21 s > span warm_up{integrand.name=se1l}
  506. 218.21 s > [2026-09-02 14:34:40.312] @process::amplitude WARNING : External state 0 ('g', PDG 21, helicity +) is off shell: p^2 = +2.5e5, expected m^2 = +0e0 (|Δ| = +2.5e5). Fixed-helicity spinor/vector/tensor external states may be ill-defined at this kinematic point.
  507. 218.21 s > field value
  508. 218.21 s > span warm_up{integrand.name=se1l_muv_shifted}
  509. 218.21 s > [2026-09-02 14:34:40.312] @process::amplitude WARNING : External state 1 ('g', PDG 21, helicity -) is off shell: p^2 = +2.5e5, expected m^2 = +0e0 (|Δ| = +2.5e5). Fixed-helicity spinor/vector/tensor external states may be ill-defined at this kinematic point.
  510. 218.21 s > field value
  511. 218.21 s > span warm_up{integrand.name=se1l_muv_shifted}
  512. 218.21 s > [2026-09-02 14:34:40.313] @process::amplitude INFO : Input is above threshold: 1 existing threshold E-surfaces across 1/1 graph groups
  513. 218.21 s > field value
  514. 218.21 s > existing_esurfaces 1
  515. 218.21 s > group_count 1
  516. 218.21 s > groups_above_threshold 1
  517. 218.21 s > integrand se1l_muv_shifted
  518. 218.21 s > span warm_up{integrand.name=se1l_muv_shifted}
  519. 218.21 s > threshold_status above threshold
  520. 218.21 s > [2026-09-02 14:34:40.313] @process::amplitude INFO : overlap structure of group 0: [1: [0(2,3)]]
  521. 218.21 s > field value
  522. 218.21 s > span warm_up{integrand.name=se1l_muv_shifted}
  523. 218.21 s > [2026-09-02 14:34:40.337] @process::amplitude WARNING : External state 0 ('g', PDG 21, helicity +) is off shell: p^2 = +2.5e5, expected m^2 = +0e0 (|Δ| = +2.5e5). Fixed-helicity spinor/vector/tensor external states may be ill-defined at this kinematic point.
  524. 218.21 s > field value
  525. 218.21 s > span warm_up{integrand.name=se1l}
  526. 218.21 s > [2026-09-02 14:34:40.337] @process::amplitude WARNING : External state 1 ('g', PDG 21, helicity -) is off shell: p^2 = +2.5e5, expected m^2 = +0e0 (|Δ| = +2.5e5). Fixed-helicity spinor/vector/tensor external states may be ill-defined at this kinematic point.
  527. 218.21 s > field value
  528. 218.21 s > span warm_up{integrand.name=se1l}
  529. 218.21 s > [2026-09-02 14:34:40.337] @process::amplitude INFO : Input is above threshold: 1 existing threshold E-surfaces across 1/1 graph groups
  530. 218.21 s > field value
  531. 218.21 s > existing_esurfaces 1
  532. 218.21 s > group_count 1
  533. 218.21 s > groups_above_threshold 1
  534. 218.21 s > integrand se1l
  535. 218.21 s > span warm_up{integrand.name=se1l}
  536. 218.21 s > threshold_status above threshold
  537. 218.21 s > [2026-09-02 14:34:40.337] @process::amplitude INFO : overlap structure of group 0: [1: [0(2,3)]]
  538. 218.21 s > field value
  539. 218.21 s > span warm_up{integrand.name=se1l}
  540. 218.21 s > [2026-09-02 14:34:40.345] @process::amplitude WARNING : External state 0 ('g', PDG 21, helicity +) is off shell: p^2 = +2.5e5, expected m^2 = +0e0 (|Δ| = +2.5e5). Fixed-helicity spinor/vector/tensor external states may be ill-defined at this kinematic point.
  541. 218.21 s > field value
  542. 218.21 s > span warm_up{integrand.name=se1l_muv_shifted}
  543. 218.21 s > [2026-09-02 14:34:40.345] @process::amplitude WARNING : External state 1 ('g', PDG 21, helicity -) is off shell: p^2 = +2.5e5, expected m^2 = +0e0 (|Δ| = +2.5e5). Fixed-helicity spinor/vector/tensor external states may be ill-defined at this kinematic point.
  544. 218.21 s > field value
  545. 218.21 s > span warm_up{integrand.name=se1l_muv_shifted}
  546. 218.21 s > [2026-09-02 14:34:40.345] @process::amplitude INFO : Input is above threshold: 1 existing threshold E-surfaces across 1/1 graph groups
  547. 218.21 s > field value
  548. 218.21 s > existing_esurfaces 1
  549. 218.21 s > group_count 1
  550. 218.21 s > groups_above_threshold 1
  551. 218.21 s > integrand se1l_muv_shifted
  552. 218.21 s > span warm_up{integrand.name=se1l_muv_shifted}
  553. 218.21 s > threshold_status above threshold
  554. 218.21 s > [2026-09-02 14:34:40.345] @process::amplitude INFO : overlap structure of group 0: [1: [0(2,3)]]
  555. 218.21 s > field value
  556. 218.21 s > span warm_up{integrand.name=se1l_muv_shifted}
  557. 218.21 s > [2026-09-02 14:34:40.353] @process::amplitude WARNING : External state 0 ('g', PDG 21, helicity +) is off shell: p^2 = +2.5e5, expected m^2 = +0e0 (|Δ| = +2.5e5). Fixed-helicity spinor/vector/tensor external states may be ill-defined at this kinematic point.
  558. 218.21 s > field value
  559. 218.21 s > span warm_up{integrand.name=se1l}
  560. 218.21 s > [2026-09-02 14:34:40.353] @process::amplitude WARNING : External state 1 ('g', PDG 21, helicity -) is off shell: p^2 = +2.5e5, expected m^2 = +0e0 (|Δ| = +2.5e5). Fixed-helicity spinor/vector/tensor external states may be ill-defined at this kinematic point.
  561. 218.21 s > field value
  562. 218.21 s > span warm_up{integrand.name=se1l}
  563. 218.21 s > [2026-09-02 14:34:40.353] @process::amplitude INFO : Input is above threshold: 1 existing threshold E-surfaces across 1/1 graph groups
  564. 218.21 s > field value
  565. 218.21 s > existing_esurfaces 1
  566. 218.21 s > group_count 1
  567. 218.21 s > groups_above_threshold 1
  568. 218.21 s > integrand se1l
  569. 218.21 s > span warm_up{integrand.name=se1l}
  570. 218.21 s > threshold_status above threshold
  571. 218.21 s > [2026-09-02 14:34:40.353] @process::amplitude INFO : overlap structure of group 0: [1: [0(2,3)]]
  572. 218.21 s > field value
  573. 218.21 s > span warm_up{integrand.name=se1l}
  574. 218.21 s > [2026-09-02 14:34:40.361] @process::amplitude WARNING : External state 0 ('g', PDG 21, helicity +) is off shell: p^2 = +2.5e5, expected m^2 = +0e0 (|Δ| = +2.5e5). Fixed-helicity spinor/vector/tensor external states may be ill-defined at this kinematic point.
  575. 218.21 s > field value
  576. 218.21 s > span warm_up{integrand.name=se1l_rls_shifted}
  577. 218.21 s > [2026-09-02 14:34:40.362] @process::amplitude WARNING : External state 1 ('g', PDG 21, helicity -) is off shell: p^2 = +2.5e5, expected m^2 = +0e0 (|Δ| = +2.5e5). Fixed-helicity spinor/vector/tensor external states may be ill-defined at this kinematic point.
  578. 218.21 s > field value
  579. 218.21 s > span warm_up{integrand.name=se1l_rls_shifted}
  580. 218.21 s > [2026-09-02 14:34:40.362] @process::amplitude INFO : Input is above threshold: 1 existing threshold E-surfaces across 1/1 graph groups
  581. 218.21 s > field value
  582. 218.21 s > existing_esurfaces 1
  583. 218.21 s > group_count 1
  584. 218.21 s > groups_above_threshold 1
  585. 218.21 s > integrand se1l_rls_shifted
  586. 218.21 s > span warm_up{integrand.name=se1l_rls_shifted}
  587. 218.21 s > threshold_status above threshold
  588. 218.21 s > [2026-09-02 14:34:40.362] @process::amplitude INFO : overlap structure of group 0: [1: [0(2,3)]]
  589. 218.21 s > field value
  590. 218.21 s > span warm_up{integrand.name=se1l_rls_shifted}
  591. 218.21 s > [2026-09-02 14:34:40.370] @process::amplitude WARNING : External state 0 ('g', PDG 21, helicity +) is off shell: p^2 = +2.5e5, expected m^2 = +0e0 (|Δ| = +2.5e5). Fixed-helicity spinor/vector/tensor external states may be ill-defined at this kinematic point.
  592. 218.21 s > field value
  593. 218.21 s > span warm_up{integrand.name=se1l}
  594. 218.21 s > [2026-09-02 14:34:40.371] @process::amplitude WARNING : External state 1 ('g', PDG 21, helicity -) is off shell: p^2 = +2.5e5, expected m^2 = +0e0 (|Δ| = +2.5e5). Fixed-helicity spinor/vector/tensor external states may be ill-defined at this kinematic point.
  595. 218.21 s > field value
  596. 218.21 s > span warm_up{integrand.name=se1l}
  597. 218.21 s > [2026-09-02 14:34:40.371] @process::amplitude INFO : Input is above threshold: 1 existing threshold E-surfaces across 1/1 graph groups
  598. 218.21 s > field value
  599. 218.21 s > existing_esurfaces 1
  600. 218.21 s > group_count 1
  601. 218.21 s > groups_above_threshold 1
  602. 218.21 s > integrand se1l
  603. 218.21 s > span warm_up{integrand.name=se1l}
  604. 218.21 s > threshold_status above threshold
  605. 218.21 s > [2026-09-02 14:34:40.371] @process::amplitude INFO : overlap structure of group 0: [1: [0(2,3)]]
  606. 218.21 s > field value
  607. 218.21 s > span warm_up{integrand.name=se1l}
  608. 218.21 s > [2026-09-02 14:34:40.380] @process::amplitude WARNING : External state 0 ('g', PDG 21, helicity +) is off shell: p^2 = +2.5e5, expected m^2 = +0e0 (|Δ| = +2.5e5). Fixed-helicity spinor/vector/tensor external states may be ill-defined at this kinematic point.
  609. 218.21 s > field value
  610. 218.21 s > span warm_up{integrand.name=se1l_rls_shifted}
  611. 218.21 s > [2026-09-02 14:34:40.380] @process::amplitude WARNING : External state 1 ('g', PDG 21, helicity -) is off shell: p^2 = +2.5e5, expected m^2 = +0e0 (|Δ| = +2.5e5). Fixed-helicity spinor/vector/tensor external states may be ill-defined at this kinematic point.
  612. 218.21 s > field value
  613. 218.21 s > span warm_up{integrand.name=se1l_rls_shifted}
  614. 218.21 s > [2026-09-02 14:34:40.380] @process::amplitude INFO : Input is above threshold: 1 existing threshold E-surfaces across 1/1 graph groups
  615. 218.21 s > field value
  616. 218.21 s > existing_esurfaces 1
  617. 218.21 s > group_count 1
  618. 218.21 s > groups_above_threshold 1
  619. 218.21 s > integrand se1l_rls_shifted
  620. 218.21 s > span warm_up{integrand.name=se1l_rls_shifted}
  621. 218.21 s > threshold_status above threshold
  622. 218.21 s > [2026-09-02 14:34:40.381] @process::amplitude INFO : overlap structure of group 0: [1: [0(2,3)]]
  623. 218.21 s > field value
  624. 218.21 s > span warm_up{integrand.name=se1l_rls_shifted}
  625. 218.21 s > [2026-09-02 14:34:40.389] @process::amplitude WARNING : External state 0 ('g', PDG 21, helicity +) is off shell: p^2 = +2.5e5, expected m^2 = +0e0 (|Δ| = +2.5e5). Fixed-helicity spinor/vector/tensor external states may be ill-defined at this kinematic point.
  626. 218.21 s > field value
  627. 218.21 s > span warm_up{integrand.name=se1l}
  628. 218.21 s > [2026-09-02 14:34:40.389] @process::amplitude WARNING : External state 1 ('g', PDG 21, helicity -) is off shell: p^2 = +2.5e5, expected m^2 = +0e0 (|Δ| = +2.5e5). Fixed-helicity spinor/vector/tensor external states may be ill-defined at this kinematic point.
  629. 218.21 s > field value
  630. 218.21 s > span warm_up{integrand.name=se1l}
  631. 218.21 s > [2026-09-02 14:34:40.390] @process::amplitude INFO : Input is above threshold: 1 existing threshold E-surfaces across 1/1 graph groups
  632. 218.21 s > field value
  633. 218.21 s > existing_esurfaces 1
  634. 218.21 s > group_count 1
  635. 218.21 s > groups_above_threshold 1
  636. 218.21 s > integrand se1l
  637. 218.21 s > span warm_up{integrand.name=se1l}
  638. 218.21 s > threshold_status above threshold
  639. 218.21 s > [2026-09-02 14:34:40.390] @process::amplitude INFO : overlap structure of group 0: [1: [0(2,3)]]
  640. 218.21 s > field value
  641. 218.21 s > span warm_up{integrand.name=se1l}
  642. 218.21 s > [2026-09-02 14:34:40.398] @process::amplitude WARNING : External state 0 ('g', PDG 21, helicity +) is off shell: p^2 = +2.5e5, expected m^2 = +0e0 (|Δ| = +2.5e5). Fixed-helicity spinor/vector/tensor external states may be ill-defined at this kinematic point.
  643. 218.21 s > field value
  644. 218.21 s > span warm_up{integrand.name=se1l_rls_shifted}
  645. 218.21 s > [2026-09-02 14:34:40.398] @process::amplitude WARNING : External state 1 ('g', PDG 21, helicity -) is off shell: p^2 = +2.5e5, expected m^2 = +0e0 (|Δ| = +2.5e5). Fixed-helicity spinor/vector/tensor external states may be ill-defined at this kinematic point.
  646. 218.21 s > field value
  647. 218.21 s > span warm_up{integrand.name=se1l_rls_shifted}
  648. 218.21 s > [2026-09-02 14:34:40.399] @process::amplitude INFO : Input is above threshold: 1 existing threshold E-surfaces across 1/1 graph groups
  649. 218.21 s > field value
  650. 218.21 s > existing_esurfaces 1
  651. 218.21 s > group_count 1
  652. 218.21 s > groups_above_threshold 1
  653. 218.21 s > integrand se1l_rls_shifted
  654. 218.21 s > span warm_up{integrand.name=se1l_rls_shifted}
  655. 218.21 s > threshold_status above threshold
  656. 218.21 s > [2026-09-02 14:34:40.399] @process::amplitude INFO : overlap structure of group 0: [1: [0(2,3)]]
  657. 218.21 s > field value
  658. 218.21 s > span warm_up{integrand.name=se1l_rls_shifted}
  659. 218.21 s > [2026-09-02 14:34:40.408] @process::amplitude WARNING : External state 0 ('g', PDG 21, helicity +) is off shell: p^2 = +2.5e5, expected m^2 = +0e0 (|Δ| = +2.5e5). Fixed-helicity spinor/vector/tensor external states may be ill-defined at this kinematic point.
  660. 218.21 s > field value
  661. 218.21 s > span warm_up{integrand.name=se1l}
  662. 218.21 s > [2026-09-02 14:34:40.409] @process::amplitude WARNING : External state 1 ('g', PDG 21, helicity -) is off shell: p^2 = +2.5e5, expected m^2 = +0e0 (|Δ| = +2.5e5). Fixed-helicity spinor/vector/tensor external states may be ill-defined at this kinematic point.
  663. 218.21 s > field value
  664. 218.21 s > span warm_up{integrand.name=se1l}
  665. 218.21 s > [2026-09-02 14:34:40.409] @process::amplitude INFO : Input is above threshold: 1 existing threshold E-surfaces across 1/1 graph groups
  666. 218.21 s > field value
  667. 218.21 s > existing_esurfaces 1
  668. 218.21 s > group_count 1
  669. 218.21 s > groups_above_threshold 1
  670. 218.21 s > integrand se1l
  671. 218.21 s > span warm_up{integrand.name=se1l}
  672. 218.21 s > threshold_status above threshold
  673. 218.21 s > [2026-09-02 14:34:40.409] @process::amplitude INFO : overlap structure of group 0: [1: [0(2,3)]]
  674. 218.21 s > field value
  675. 218.21 s > span warm_up{integrand.name=se1l}
  676. 218.21 s > [2026-09-02 14:34:40.418] @process::amplitude WARNING : External state 0 ('g', PDG 21, helicity +) is off shell: p^2 = +2.5e5, expected m^2 = +0e0 (|Δ| = +2.5e5). Fixed-helicity spinor/vector/tensor external states may be ill-defined at this kinematic point.
  677. 218.21 s > field value
  678. 218.21 s > span warm_up{integrand.name=se1l_rls_shifted}
  679. 218.21 s > [2026-09-02 14:34:40.418] @process::amplitude WARNING : External state 1 ('g', PDG 21, helicity -) is off shell: p^2 = +2.5e5, expected m^2 = +0e0 (|Δ| = +2.5e5). Fixed-helicity spinor/vector/tensor external states may be ill-defined at this kinematic point.
  680. 218.21 s > field value
  681. 218.21 s > span warm_up{integrand.name=se1l_rls_shifted}
  682. 218.21 s > [2026-09-02 14:34:40.418] @process::amplitude INFO : Input is above threshold: 1 existing threshold E-surfaces across 1/1 graph groups
  683. 218.21 s > field value
  684. 218.21 s > existing_esurfaces 1
  685. 218.21 s > group_count 1
  686. 218.21 s > groups_above_threshold 1
  687. 218.21 s > integrand se1l_rls_shifted
  688. 218.21 s > span warm_up{integrand.name=se1l_rls_shifted}
  689. 218.21 s > threshold_status above threshold
  690. 218.21 s > [2026-09-02 14:34:40.418] @process::amplitude INFO : overlap structure of group 0: [1: [0(2,3)]]
  691. 218.21 s > field value
  692. 218.21 s > span warm_up{integrand.name=se1l_rls_shifted}
  693. 218.21 s > [2026-09-02 14:34:40.427] @process::amplitude WARNING : External state 0 ('g', PDG 21, helicity +) is off shell: p^2 = +2.5e5, expected m^2 = +0e0 (|Δ| = +2.5e5). Fixed-helicity spinor/vector/tensor external states may be ill-defined at this kinematic point.
  694. 218.21 s > field value
  695. 218.21 s > span warm_up{integrand.name=se1l}
  696. 218.21 s > [2026-09-02 14:34:40.427] @process::amplitude WARNING : External state 1 ('g', PDG 21, helicity -) is off shell: p^2 = +2.5e5, expected m^2 = +0e0 (|Δ| = +2.5e5). Fixed-helicity spinor/vector/tensor external states may be ill-defined at this kinematic point.
  697. 218.21 s > field value
  698. 218.21 s > span warm_up{integrand.name=se1l}
  699. 218.21 s > [2026-09-02 14:34:40.428] @process::amplitude INFO : Input is above threshold: 1 existing threshold E-surfaces across 1/1 graph groups
  700. 218.21 s > field value
  701. 218.21 s > existing_esurfaces 1
  702. 218.21 s > group_count 1
  703. 218.21 s > groups_above_threshold 1
  704. 218.21 s > integrand se1l
  705. 218.21 s > span warm_up{integrand.name=se1l}
  706. 218.21 s > threshold_status above threshold
  707. 218.21 s > [2026-09-02 14:34:40.428] @process::amplitude INFO : overlap structure of group 0: [1: [0(2,3)]]
  708. 218.21 s > field value
  709. 218.21 s > span warm_up{integrand.name=se1l}
  710. 218.21 s > [2026-09-02 14:34:40.436] @process::amplitude WARNING : External state 0 ('g', PDG 21, helicity +) is off shell: p^2 = +2.5e5, expected m^2 = +0e0 (|Δ| = +2.5e5). Fixed-helicity spinor/vector/tensor external states may be ill-defined at this kinematic point.
  711. 218.21 s > field value
  712. 218.21 s > span warm_up{integrand.name=se1l_rls_shifted}
  713. 218.21 s > [2026-09-02 14:34:40.436] @process::amplitude WARNING : External state 1 ('g', PDG 21, helicity -) is off shell: p^2 = +2.5e5, expected m^2 = +0e0 (|Δ| = +2.5e5). Fixed-helicity spinor/vector/tensor external states may be ill-defined at this kinematic point.
  714. 218.21 s > field value
  715. 218.21 s > span warm_up{integrand.name=se1l_rls_shifted}
  716. 218.21 s > [2026-09-02 14:34:40.437] @process::amplitude INFO : Input is above threshold: 1 existing threshold E-surfaces across 1/1 graph groups
  717. 218.21 s > field value
  718. 218.21 s > existing_esurfaces 1
  719. 218.21 s > group_count 1
  720. 218.21 s > groups_above_threshold 1
  721. 218.21 s > integrand se1l_rls_shifted
  722. 218.21 s > span warm_up{integrand.name=se1l_rls_shifted}
  723. 218.21 s > threshold_status above threshold
  724. 218.21 s > [2026-09-02 14:34:40.437] @process::amplitude INFO : overlap structure of group 0: [1: [0(2,3)]]
  725. 218.21 s > field value
  726. 218.21 s > span warm_up{integrand.name=se1l_rls_shifted}
  727. 218.21 s > [2026-09-02 14:34:40.446] @process::amplitude WARNING : External state 0 ('g', PDG 21, helicity +) is off shell: p^2 = +2.5e5, expected m^2 = +0e0 (|Δ| = +2.5e5). Fixed-helicity spinor/vector/tensor external states may be ill-defined at this kinematic point.
  728. 218.21 s > field value
  729. 218.21 s > span warm_up{integrand.name=se1l}
  730. 218.21 s > [2026-09-02 14:34:40.446] @process::amplitude WARNING : External state 1 ('g', PDG 21, helicity -) is off shell: p^2 = +2.5e5, expected m^2 = +0e0 (|Δ| = +2.5e5). Fixed-helicity spinor/vector/tensor external states may be ill-defined at this kinematic point.
  731. 218.21 s > field value
  732. 218.21 s > span warm_up{integrand.name=se1l}
  733. 218.21 s > [2026-09-02 14:34:40.447] @process::amplitude INFO : Input is above threshold: 1 existing threshold E-surfaces across 1/1 graph groups
  734. 218.21 s > field value
  735. 218.21 s > existing_esurfaces 1
  736. 218.21 s > group_count 1
  737. 218.21 s > groups_above_threshold 1
  738. 218.21 s > integrand se1l
  739. 218.21 s > span warm_up{integrand.name=se1l}
  740. 218.21 s > threshold_status above threshold
  741. 218.21 s > [2026-09-02 14:34:40.447] @process::amplitude INFO : overlap structure of group 0: [1: [0(2,3)]]
  742. 218.21 s > field value
  743. 218.21 s > span warm_up{integrand.name=se1l}
  744. 218.21 s > [2026-09-02 14:34:40.464] @process::amplitude WARNING : External state 0 ('g', PDG 21, helicity +) is off shell: p^2 = +2.5e5, expected m^2 = +0e0 (|Δ| = +2.5e5). Fixed-helicity spinor/vector/tensor external states may be ill-defined at this kinematic point.
  745. 218.21 s > field value
  746. 218.21 s > span warm_up{integrand.name=se1l_rls_shifted}
  747. 218.21 s > [2026-09-02 14:34:40.464] @process::amplitude WARNING : External state 1 ('g', PDG 21, helicity -) is off shell: p^2 = +2.5e5, expected m^2 = +0e0 (|Δ| = +2.5e5). Fixed-helicity spinor/vector/tensor external states may be ill-defined at this kinematic point.
  748. 218.21 s > field value
  749. 218.21 s > span warm_up{integrand.name=se1l_rls_shifted}
  750. 218.21 s > [2026-09-02 14:34:40.465] @process::amplitude INFO : Input is above threshold: 1 existing threshold E-surfaces across 1/1 graph groups
  751. 218.21 s > field value
  752. 218.21 s > existing_esurfaces 1
  753. 218.21 s > group_count 1
  754. 218.21 s > groups_above_threshold 1
  755. 218.21 s > integrand se1l_rls_shifted
  756. 218.21 s > span warm_up{integrand.name=se1l_rls_shifted}
  757. 218.21 s > threshold_status above threshold
  758. 218.21 s > [2026-09-02 14:34:40.465] @process::amplitude INFO : overlap structure of group 0: [1: [0(2,3)]]
  759. 218.21 s > field value
  760. 218.21 s > span warm_up{integrand.name=se1l_rls_shifted}
  761. 218.21 s > [2026-09-02 14:34:40.484] @process::amplitude WARNING : External state 0 ('g', PDG 21, helicity +) is off shell: p^2 = +2.5e5, expected m^2 = +0e0 (|Δ| = +2.5e5). Fixed-helicity spinor/vector/tensor external states may be ill-defined at this kinematic point.
  762. 218.21 s > field value
  763. 218.21 s > span warm_up{integrand.name=se1l}
  764. 218.21 s > [2026-09-02 14:34:40.484] @process::amplitude WARNING : External state 1 ('g', PDG 21, helicity -) is off shell: p^2 = +2.5e5, expected m^2 = +0e0 (|Δ| = +2.5e5). Fixed-helicity spinor/vector/tensor external states may be ill-defined at this kinematic point.
  765. 218.21 s > field value
  766. 218.21 s > span warm_up{integrand.name=se1l}
  767. 218.21 s > [2026-09-02 14:34:40.486] @process::amplitude INFO : Input is above threshold: 1 existing threshold E-surfaces across 1/1 graph groups
  768. 218.21 s > field value
  769. 218.21 s > existing_esurfaces 1
  770. 218.21 s > group_count 1
  771. 218.21 s > groups_above_threshold 1
  772. 218.21 s > integrand se1l
  773. 218.21 s > span warm_up{integrand.name=se1l}
  774. 218.21 s > threshold_status above threshold
  775. 218.21 s > [2026-09-02 14:34:40.486] @process::amplitude INFO : overlap structure of group 0: [1: [0(2,3)]]
  776. 218.21 s > field value
  777. 218.21 s > span warm_up{integrand.name=se1l}
  778. 218.21 s > [2026-09-02 14:34:40.505] @process::amplitude WARNING : External state 0 ('g', PDG 21, helicity +) is off shell: p^2 = +2.5e5, expected m^2 = +0e0 (|Δ| = +2.5e5). Fixed-helicity spinor/vector/tensor external states may be ill-defined at this kinematic point.
  779. 218.21 s > field value
  780. 218.21 s > span warm_up{integrand.name=se1l_rls_shifted}
  781. 218.21 s > [2026-09-02 14:34:40.505] @process::amplitude WARNING : External state 1 ('g', PDG 21, helicity -) is off shell: p^2 = +2.5e5, expected m^2 = +0e0 (|Δ| = +2.5e5). Fixed-helicity spinor/vector/tensor external states may be ill-defined at this kinematic point.
  782. 218.21 s > field value
  783. 218.21 s > span warm_up{integrand.name=se1l_rls_shifted}
  784. 218.21 s > [2026-09-02 14:34:40.505] @process::amplitude INFO : Input is above threshold: 1 existing threshold E-surfaces across 1/1 graph groups
  785. 218.21 s > field value
  786. 218.21 s > existing_esurfaces 1
  787. 218.21 s > group_count 1
  788. 218.21 s > groups_above_threshold 1
  789. 218.21 s > integrand se1l_rls_shifted
  790. 218.21 s > span warm_up{integrand.name=se1l_rls_shifted}
  791. 218.21 s > threshold_status above threshold
  792. 218.21 s > [2026-09-02 14:34:40.505] @process::amplitude INFO : overlap structure of group 0: [1: [0(2,3)]]
  793. 218.21 s > field value
  794. 218.21 s > span warm_up{integrand.name=se1l_rls_shifted}
  795. 218.21 s > [2026-09-02 14:34:40.514] @process::amplitude WARNING : External state 0 ('g', PDG 21, helicity +) is off shell: p^2 = +2.5e5, expected m^2 = +0e0 (|Δ| = +2.5e5). Fixed-helicity spinor/vector/tensor external states may be ill-defined at this kinematic point.
  796. 218.21 s > field value
  797. 218.21 s > span warm_up{integrand.name=se1l}
  798. 218.21 s > [2026-09-02 14:34:40.514] @process::amplitude WARNING : External state 1 ('g', PDG 21, helicity -) is off shell: p^2 = +2.5e5, expected m^2 = +0e0 (|Δ| = +2.5e5). Fixed-helicity spinor/vector/tensor external states may be ill-defined at this kinematic point.
  799. 218.21 s > field value
  800. 218.21 s > span warm_up{integrand.name=se1l}
  801. 218.21 s > [2026-09-02 14:34:40.514] @process::amplitude INFO : Input is above threshold: 1 existing threshold E-surfaces across 1/1 graph groups
  802. 218.21 s > field value
  803. 218.21 s > existing_esurfaces 1
  804. 218.21 s > group_count 1
  805. 218.21 s > groups_above_threshold 1
  806. 218.21 s > integrand se1l
  807. 218.21 s > span warm_up{integrand.name=se1l}
  808. 218.21 s > threshold_status above threshold
  809. 218.21 s > [2026-09-02 14:34:40.515] @process::amplitude INFO : overlap structure of group 0: [1: [0(2,3)]]
  810. 218.21 s > field value
  811. 218.21 s > span warm_up{integrand.name=se1l}
  812. 218.21 s > [2026-09-02 14:34:40.523] @process::amplitude WARNING : External state 0 ('g', PDG 21, helicity +) is off shell: p^2 = +2.5e5, expected m^2 = +0e0 (|Δ| = +2.5e5). Fixed-helicity spinor/vector/tensor external states may be ill-defined at this kinematic point.
  813. 218.21 s > field value
  814. 218.21 s > span warm_up{integrand.name=se1l_rls_shifted}
  815. 218.21 s > [2026-09-02 14:34:40.524] @process::amplitude WARNING : External state 1 ('g', PDG 21, helicity -) is off shell: p^2 = +2.5e5, expected m^2 = +0e0 (|Δ| = +2.5e5). Fixed-helicity spinor/vector/tensor external states may be ill-defined at this kinematic point.
  816. 218.21 s > field value
  817. 218.21 s > span warm_up{integrand.name=se1l_rls_shifted}
  818. 218.21 s > [2026-09-02 14:34:40.524] @process::amplitude INFO : Input is above threshold: 1 existing threshold E-surfaces across 1/1 graph groups
  819. 218.21 s > field value
  820. 218.21 s > existing_esurfaces 1
  821. 218.21 s > group_count 1
  822. 218.21 s > groups_above_threshold 1
  823. 218.21 s > integrand se1l_rls_shifted
  824. 218.21 s > span warm_up{integrand.name=se1l_rls_shifted}
  825. 218.21 s > threshold_status above threshold
  826. 218.21 s > [2026-09-02 14:34:40.524] @process::amplitude INFO : overlap structure of group 0: [1: [0(2,3)]]
  827. 218.21 s > field value
  828. 218.21 s > span warm_up{integrand.name=se1l_rls_shifted}
  829. 218.21 s > [2026-09-02 14:34:40.532] @process::amplitude WARNING : External state 0 ('g', PDG 21, helicity +) is off shell: p^2 = +2.5e5, expected m^2 = +0e0 (|Δ| = +2.5e5). Fixed-helicity spinor/vector/tensor external states may be ill-defined at this kinematic point.
  830. 218.21 s > field value
  831. 218.21 s > span warm_up{integrand.name=se1l}
  832. 218.21 s > [2026-09-02 14:34:40.532] @process::amplitude WARNING : External state 1 ('g', PDG 21, helicity -) is off shell: p^2 = +2.5e5, expected m^2 = +0e0 (|Δ| = +2.5e5). Fixed-helicity spinor/vector/tensor external states may be ill-defined at this kinematic point.
  833. 218.21 s > field value
  834. 218.21 s > span warm_up{integrand.name=se1l}
  835. 218.21 s > [2026-09-02 14:34:40.533] @process::amplitude INFO : Input is above threshold: 1 existing threshold E-surfaces across 1/1 graph groups
  836. 218.21 s > field value
  837. 218.21 s > existing_esurfaces 1
  838. 218.21 s > group_count 1
  839. 218.21 s > groups_above_threshold 1
  840. 218.21 s > integrand se1l
  841. 218.21 s > span warm_up{integrand.name=se1l}
  842. 218.21 s > threshold_status above threshold
  843. 218.21 s > [2026-09-02 14:34:40.533] @process::amplitude INFO : overlap structure of group 0: [1: [0(2,3)]]
  844. 218.21 s > field value
  845. 218.21 s > span warm_up{integrand.name=se1l}
  846. 218.21 s > [2026-09-02 14:34:40.541] @process::amplitude WARNING : External state 0 ('g', PDG 21, helicity +) is off shell: p^2 = +2.5e5, expected m^2 = +0e0 (|Δ| = +2.5e5). Fixed-helicity spinor/vector/tensor external states may be ill-defined at this kinematic point.
  847. 218.21 s > field value
  848. 218.21 s > span warm_up{integrand.name=se1l_rls_shifted}
  849. 218.21 s > [2026-09-02 14:34:40.541] @process::amplitude WARNING : External state 1 ('g', PDG 21, helicity -) is off shell: p^2 = +2.5e5, expected m^2 = +0e0 (|Δ| = +2.5e5). Fixed-helicity spinor/vector/tensor external states may be ill-defined at this kinematic point.
  850. 218.21 s > field value
  851. 218.21 s > span warm_up{integrand.name=se1l_rls_shifted}
  852. 218.21 s > [2026-09-02 14:34:40.542] @process::amplitude INFO : Input is above threshold: 1 existing threshold E-surfaces across 1/1 graph groups
  853. 218.21 s > field value
  854. 218.21 s > existing_esurfaces 1
  855. 218.21 s > group_count 1
  856. 218.21 s > groups_above_threshold 1
  857. 218.21 s > integrand se1l_rls_shifted
  858. 218.22 s > span warm_up{integrand.name=se1l_rls_shifted}
  859. 218.22 s > threshold_status above threshold
  860. 218.22 s > [2026-09-02 14:34:40.542] @process::amplitude INFO : overlap structure of group 0: [1: [0(2,3)]]
  861. 218.22 s > field value
  862. 218.22 s > span warm_up{integrand.name=se1l_rls_shifted}
  863. 218.22 s > [2026-09-02 14:34:40.550] @process::amplitude WARNING : External state 0 ('g', PDG 21, helicity +) is off shell: p^2 = +2.5e5, expected m^2 = +0e0 (|Δ| = +2.5e5). Fixed-helicity spinor/vector/tensor external states may be ill-defined at this kinematic point.
  864. 218.22 s > field value
  865. 218.22 s > span warm_up{integrand.name=se1l}
  866. 218.22 s > [2026-09-02 14:34:40.550] @process::amplitude WARNING : External state 1 ('g', PDG 21, helicity -) is off shell: p^2 = +2.5e5, expected m^2 = +0e0 (|Δ| = +2.5e5). Fixed-helicity spinor/vector/tensor external states may be ill-defined at this kinematic point.
  867. 218.22 s > field value
  868. 218.22 s > span warm_up{integrand.name=se1l}
  869. 218.22 s > [2026-09-02 14:34:40.551] @process::amplitude INFO : Input is above threshold: 1 existing threshold E-surfaces across 1/1 graph groups
  870. 218.22 s > field value
  871. 218.22 s > existing_esurfaces 1
  872. 218.22 s > group_count 1
  873. 218.22 s > groups_above_threshold 1
  874. 218.22 s > integrand se1l
  875. 218.22 s > span warm_up{integrand.name=se1l}
  876. 218.22 s > threshold_status above threshold
  877. 218.22 s > [2026-09-02 14:34:40.551] @process::amplitude INFO : overlap structure of group 0: [1: [0(2,3)]]
  878. 218.22 s > field value
  879. 218.22 s > span warm_up{integrand.name=se1l}
  880. 218.22 s > [2026-09-02 14:34:40.559] @process::amplitude WARNING : External state 0 ('g', PDG 21, helicity +) is off shell: p^2 = +2.5e5, expected m^2 = +0e0 (|Δ| = +2.5e5). Fixed-helicity spinor/vector/tensor external states may be ill-defined at this kinematic point.
  881. 218.22 s > field value
  882. 218.22 s > span warm_up{integrand.name=se1l_rls_shifted}
  883. 218.22 s > [2026-09-02 14:34:40.559] @process::amplitude WARNING : External state 1 ('g', PDG 21, helicity -) is off shell: p^2 = +2.5e5, expected m^2 = +0e0 (|Δ| = +2.5e5). Fixed-helicity spinor/vector/tensor external states may be ill-defined at this kinematic point.
  884. 218.22 s > field value
  885. 218.22 s > span warm_up{integrand.name=se1l_rls_shifted}
  886. 218.22 s > [2026-09-02 14:34:40.560] @process::amplitude INFO : Input is above threshold: 1 existing threshold E-surfaces across 1/1 graph groups
  887. 218.22 s > field value
  888. 218.22 s > existing_esurfaces 1
  889. 218.22 s > group_count 1
  890. 218.22 s > groups_above_threshold 1
  891. 218.22 s > integrand se1l_rls_shifted
  892. 218.22 s > span warm_up{integrand.name=se1l_rls_shifted}
  893. 218.22 s > threshold_status above threshold
  894. 218.22 s > [2026-09-02 14:34:40.560] @process::amplitude INFO : overlap structure of group 0: [1: [0(2,3)]]
  895. 218.22 s > field value
  896. 218.22 s > span warm_up{integrand.name=se1l_rls_shifted}
  897. 218.22 s > [2026-09-02 14:34:40.568] @process::amplitude WARNING : External state 0 ('g', PDG 21, helicity +) is off shell: p^2 = +2.5e5, expected m^2 = +0e0 (|Δ| = +2.5e5). Fixed-helicity spinor/vector/tensor external states may be ill-defined at this kinematic point.
  898. 218.22 s > field value
  899. 218.22 s > span warm_up{integrand.name=se1l}
  900. 218.22 s > [2026-09-02 14:34:40.569] @process::amplitude WARNING : External state 1 ('g', PDG 21, helicity -) is off shell: p^2 = +2.5e5, expected m^2 = +0e0 (|Δ| = +2.5e5). Fixed-helicity spinor/vector/tensor external states may be ill-defined at this kinematic point.
  901. 218.22 s > field value
  902. 218.22 s > span warm_up{integrand.name=se1l}
  903. 218.22 s > [2026-09-02 14:34:40.569] @process::amplitude INFO : Input is above threshold: 1 existing threshold E-surfaces across 1/1 graph groups
  904. 218.22 s > field value
  905. 218.22 s > existing_esurfaces 1
  906. 218.22 s > group_count 1
  907. 218.22 s > groups_above_threshold 1
  908. 218.22 s > integrand se1l
  909. 218.22 s > span warm_up{integrand.name=se1l}
  910. 218.22 s > threshold_status above threshold
  911. 218.22 s > [2026-09-02 14:34:40.569] @process::amplitude INFO : overlap structure of group 0: [1: [0(2,3)]]
  912. 218.22 s > field value
  913. 218.22 s > span warm_up{integrand.name=se1l}
  914. 218.22 s > [2026-09-02 14:34:40.578] @process::amplitude WARNING : External state 0 ('g', PDG 21, helicity +) is off shell: p^2 = +2.5e5, expected m^2 = +0e0 (|Δ| = +2.5e5). Fixed-helicity spinor/vector/tensor external states may be ill-defined at this kinematic point.
  915. 218.22 s > field value
  916. 218.22 s > span warm_up{integrand.name=se1l_mur_shifted}
  917. 218.22 s > [2026-09-02 14:34:40.578] @process::amplitude WARNING : External state 1 ('g', PDG 21, helicity -) is off shell: p^2 = +2.5e5, expected m^2 = +0e0 (|Δ| = +2.5e5). Fixed-helicity spinor/vector/tensor external states may be ill-defined at this kinematic point.
  918. 218.22 s > field value
  919. 218.22 s > span warm_up{integrand.name=se1l_mur_shifted}
  920. 218.22 s > [2026-09-02 14:34:40.578] @process::amplitude INFO : Input is above threshold: 1 existing threshold E-surfaces across 1/1 graph groups
  921. 218.22 s > field value
  922. 218.22 s > existing_esurfaces 1
  923. 218.22 s > group_count 1
  924. 218.22 s > groups_above_threshold 1
  925. 218.22 s > integrand se1l_mur_shifted
  926. 218.22 s > span warm_up{integrand.name=se1l_mur_shifted}
  927. 218.22 s > threshold_status above threshold
  928. 218.22 s > [2026-09-02 14:34:40.579] @process::amplitude INFO : overlap structure of group 0: [1: [0(2,3)]]
  929. 218.22 s > field value
  930. 218.22 s > span warm_up{integrand.name=se1l_mur_shifted}
  931. 218.22 s > [2026-09-02 14:34:40.587] @process::amplitude WARNING : External state 0 ('g', PDG 21, helicity +) is off shell: p^2 = +2.5e5, expected m^2 = +0e0 (|Δ| = +2.5e5). Fixed-helicity spinor/vector/tensor external states may be ill-defined at this kinematic point.
  932. 218.22 s > field value
  933. 218.22 s > span warm_up{integrand.name=se1l}
  934. 218.22 s > [2026-09-02 14:34:40.588] @process::amplitude WARNING : External state 1 ('g', PDG 21, helicity -) is off shell: p^2 = +2.5e5, expected m^2 = +0e0 (|Δ| = +2.5e5). Fixed-helicity spinor/vector/tensor external states may be ill-defined at this kinematic point.
  935. 218.22 s > field value
  936. 218.22 s > span warm_up{integrand.name=se1l}
  937. 218.22 s > [2026-09-02 14:34:40.588] @process::amplitude INFO : Input is above threshold: 1 existing threshold E-surfaces across 1/1 graph groups
  938. 218.22 s > field value
  939. 218.22 s > existing_esurfaces 1
  940. 218.22 s > group_count 1
  941. 218.22 s > groups_above_threshold 1
  942. 218.22 s > integrand se1l
  943. 218.22 s > span warm_up{integrand.name=se1l}
  944. 218.22 s > threshold_status above threshold
  945. 218.22 s > [2026-09-02 14:34:40.588] @process::amplitude INFO : overlap structure of group 0: [1: [0(2,3)]]
  946. 218.22 s > field value
  947. 218.22 s > span warm_up{integrand.name=se1l}
  948. 218.22 s > [2026-09-02 14:34:40.596] @process::amplitude WARNING : External state 0 ('g', PDG 21, helicity +) is off shell: p^2 = +2.5e5, expected m^2 = +0e0 (|Δ| = +2.5e5). Fixed-helicity spinor/vector/tensor external states may be ill-defined at this kinematic point.
  949. 218.22 s > field value
  950. 218.22 s > span warm_up{integrand.name=se1l_mur_shifted}
  951. 218.22 s > [2026-09-02 14:34:40.597] @process::amplitude WARNING : External state 1 ('g', PDG 21, helicity -) is off shell: p^2 = +2.5e5, expected m^2 = +0e0 (|Δ| = +2.5e5). Fixed-helicity spinor/vector/tensor external states may be ill-defined at this kinematic point.
  952. 218.22 s > field value
  953. 218.22 s > span warm_up{integrand.name=se1l_mur_shifted}
  954. 218.22 s > [2026-09-02 14:34:40.597] @process::amplitude INFO : Input is above threshold: 1 existing threshold E-surfaces across 1/1 graph groups
  955. 218.22 s > field value
  956. 218.22 s > existing_esurfaces 1
  957. 218.22 s > group_count 1
  958. 218.22 s > groups_above_threshold 1
  959. 218.22 s > integrand se1l_mur_shifted
  960. 218.22 s > span warm_up{integrand.name=se1l_mur_shifted}
  961. 218.22 s > threshold_status above threshold
  962. 218.22 s > [2026-09-02 14:34:40.597] @process::amplitude INFO : overlap structure of group 0: [1: [0(2,3)]]
  963. 218.22 s > field value
  964. 218.22 s > span warm_up{integrand.name=se1l_mur_shifted}
  965. 218.22 s > [2026-09-02 14:34:40.606] @process::amplitude WARNING : External state 0 ('g', PDG 21, helicity +) is off shell: p^2 = +2.5e5, expected m^2 = +0e0 (|Δ| = +2.5e5). Fixed-helicity spinor/vector/tensor external states may be ill-defined at this kinematic point.
  966. 218.22 s > field value
  967. 218.22 s > span warm_up{integrand.name=se1l}
  968. 218.22 s > [2026-09-02 14:34:40.607] @process::amplitude WARNING : External state 1 ('g', PDG 21, helicity -) is off shell: p^2 = +2.5e5, expected m^2 = +0e0 (|Δ| = +2.5e5). Fixed-helicity spinor/vector/tensor external states may be ill-defined at this kinematic point.
  969. 218.22 s > field value
  970. 218.22 s > span warm_up{integrand.name=se1l}
  971. 218.22 s > [2026-09-02 14:34:40.607] @process::amplitude INFO : Input is above threshold: 1 existing threshold E-surfaces across 1/1 graph groups
  972. 218.22 s > field value
  973. 218.22 s > existing_esurfaces 1
  974. 218.22 s > group_count 1
  975. 218.22 s > groups_above_threshold 1
  976. 218.22 s > integrand se1l
  977. 218.22 s > span warm_up{integrand.name=se1l}
  978. 218.22 s > threshold_status above threshold
  979. 218.22 s > [2026-09-02 14:34:40.607] @process::amplitude INFO : overlap structure of group 0: [1: [0(2,3)]]
  980. 218.22 s > field value
  981. 218.22 s > span warm_up{integrand.name=se1l}
  982. 218.22 s > [2026-09-02 14:34:40.616] @process::amplitude WARNING : External state 0 ('g', PDG 21, helicity +) is off shell: p^2 = +2.5e5, expected m^2 = +0e0 (|Δ| = +2.5e5). Fixed-helicity spinor/vector/tensor external states may be ill-defined at this kinematic point.
  983. 218.22 s > field value
  984. 218.22 s > span warm_up{integrand.name=se1l_mur_shifted}
  985. 218.22 s > [2026-09-02 14:34:40.616] @process::amplitude WARNING : External state 1 ('g', PDG 21, helicity -) is off shell: p^2 = +2.5e5, expected m^2 = +0e0 (|Δ| = +2.5e5). Fixed-helicity spinor/vector/tensor external states may be ill-defined at this kinematic point.
  986. 218.22 s > field value
  987. 218.22 s > span warm_up{integrand.name=se1l_mur_shifted}
  988. 218.22 s > [2026-09-02 14:34:40.617] @process::amplitude INFO : Input is above threshold: 1 existing threshold E-surfaces across 1/1 graph groups
  989. 218.22 s > field value
  990. 218.22 s > existing_esurfaces 1
  991. 218.22 s > group_count 1
  992. 218.22 s > groups_above_threshold 1
  993. 218.22 s > integrand se1l_mur_shifted
  994. 218.22 s > span warm_up{integrand.name=se1l_mur_shifted}
  995. 218.22 s > threshold_status above threshold
  996. 218.22 s > [2026-09-02 14:34:40.617] @process::amplitude INFO : overlap structure of group 0: [1: [0(2,3)]]
  997. 218.22 s > field value
  998. 218.22 s > span warm_up{integrand.name=se1l_mur_shifted}
  999. 218.22 s > [2026-09-02 14:34:40.626] @process::amplitude WARNING : External state 0 ('g', PDG 21, helicity +) is off shell: p^2 = +2.5e5, expected m^2 = +0e0 (|Δ| = +2.5e5). Fixed-helicity spinor/vector/tensor external states may be ill-defined at this kinematic point.
  1000. 218.22 s > field value
  1001. 218.22 s > span warm_up{integrand.name=se1l}
  1002. 218.22 s > [2026-09-02 14:34:40.626] @process::amplitude WARNING : External state 1 ('g', PDG 21, helicity -) is off shell: p^2 = +2.5e5, expected m^2 = +0e0 (|Δ| = +2.5e5). Fixed-helicity spinor/vector/tensor external states may be ill-defined at this kinematic point.
  1003. 218.22 s > field value
  1004. 218.22 s > span warm_up{integrand.name=se1l}
  1005. 218.22 s > [2026-09-02 14:34:40.626] @process::amplitude INFO : Input is above threshold: 1 existing threshold E-surfaces across 1/1 graph groups
  1006. 218.22 s > field value
  1007. 218.22 s > existing_esurfaces 1
  1008. 218.22 s > group_count 1
  1009. 218.22 s > groups_above_threshold 1
  1010. 218.22 s > integrand se1l
  1011. 218.22 s > span warm_up{integrand.name=se1l}
  1012. 218.22 s > threshold_status above threshold
  1013. 218.22 s > [2026-09-02 14:34:40.626] @process::amplitude INFO : overlap structure of group 0: [1: [0(2,3)]]
  1014. 218.22 s > field value
  1015. 218.22 s > span warm_up{integrand.name=se1l}
  1016. 218.22 s > [2026-09-02 14:34:40.635] @process::amplitude WARNING : External state 0 ('g', PDG 21, helicity +) is off shell: p^2 = +2.5e5, expected m^2 = +0e0 (|Δ| = +2.5e5). Fixed-helicity spinor/vector/tensor external states may be ill-defined at this kinematic point.
  1017. 218.22 s > field value
  1018. 218.22 s > span warm_up{integrand.name=se1l_mur_shifted}
  1019. 218.22 s > [2026-09-02 14:34:40.635] @process::amplitude WARNING : External state 1 ('g', PDG 21, helicity -) is off shell: p^2 = +2.5e5, expected m^2 = +0e0 (|Δ| = +2.5e5). Fixed-helicity spinor/vector/tensor external states may be ill-defined at this kinematic point.
  1020. 218.22 s > field value
  1021. 218.22 s > span warm_up{integrand.name=se1l_mur_shifted}
  1022. 218.22 s > [2026-09-02 14:34:40.636] @process::amplitude INFO : Input is above threshold: 1 existing threshold E-surfaces across 1/1 graph groups
  1023. 218.22 s > field value
  1024. 218.22 s > existing_esurfaces 1
  1025. 218.22 s > group_count 1
  1026. 218.22 s > groups_above_threshold 1
  1027. 218.22 s > integrand se1l_mur_shifted
  1028. 218.22 s > span warm_up{integrand.name=se1l_mur_shifted}
  1029. 218.22 s > threshold_status above threshold
  1030. 218.22 s > [2026-09-02 14:34:40.636] @process::amplitude INFO : overlap structure of group 0: [1: [0(2,3)]]
  1031. 218.22 s > field value
  1032. 218.22 s > span warm_up{integrand.name=se1l_mur_shifted}
  1033. 218.22 s > [2026-09-02 14:34:40.644] @process::amplitude WARNING : External state 0 ('g', PDG 21, helicity +) is off shell: p^2 = +2.5e5, expected m^2 = +0e0 (|Δ| = +2.5e5). Fixed-helicity spinor/vector/tensor external states may be ill-defined at this kinematic point.
  1034. 218.22 s > field value
  1035. 218.22 s > span warm_up{integrand.name=se1l}
  1036. 218.22 s > [2026-09-02 14:34:40.645] @process::amplitude WARNING : External state 1 ('g', PDG 21, helicity -) is off shell: p^2 = +2.5e5, expected m^2 = +0e0 (|Δ| = +2.5e5). Fixed-helicity spinor/vector/tensor external states may be ill-defined at this kinematic point.
  1037. 218.22 s > field value
  1038. 218.22 s > span warm_up{integrand.name=se1l}
  1039. 218.22 s > [2026-09-02 14:34:40.645] @process::amplitude INFO : Input is above threshold: 1 existing threshold E-surfaces across 1/1 graph groups
  1040. 218.22 s > field value
  1041. 218.22 s > existing_esurfaces 1
  1042. 218.22 s > group_count 1
  1043. 218.22 s > groups_above_threshold 1
  1044. 218.22 s > integrand se1l
  1045. 218.22 s > span warm_up{integrand.name=se1l}
  1046. 218.22 s > threshold_status above threshold
  1047. 218.22 s > [2026-09-02 14:34:40.645] @process::amplitude INFO : overlap structure of group 0: [1: [0(2,3)]]
  1048. 218.22 s > field value
  1049. 218.22 s > span warm_up{integrand.name=se1l}
  1050. 218.22 s > [2026-09-02 14:34:40.654] @process::amplitude WARNING : External state 0 ('g', PDG 21, helicity +) is off shell: p^2 = +2.5e5, expected m^2 = +0e0 (|Δ| = +2.5e5). Fixed-helicity spinor/vector/tensor external states may be ill-defined at this kinematic point.
  1051. 218.22 s > field value
  1052. 218.22 s > span warm_up{integrand.name=se1l_mur_shifted}
  1053. 218.22 s > [2026-09-02 14:34:40.654] @process::amplitude WARNING : External state 1 ('g', PDG 21, helicity -) is off shell: p^2 = +2.5e5, expected m^2 = +0e0 (|Δ| = +2.5e5). Fixed-helicity spinor/vector/tensor external states may be ill-defined at this kinematic point.
  1054. 218.22 s > field value
  1055. 218.22 s > span warm_up{integrand.name=se1l_mur_shifted}
  1056. 218.22 s > [2026-09-02 14:34:40.654] @process::amplitude INFO : Input is above threshold: 1 existing threshold E-surfaces across 1/1 graph groups
  1057. 218.22 s > field value
  1058. 218.22 s > existing_esurfaces 1
  1059. 218.22 s > group_count 1
  1060. 218.22 s > groups_above_threshold 1
  1061. 218.22 s > integrand se1l_mur_shifted
  1062. 218.22 s > span warm_up{integrand.name=se1l_mur_shifted}
  1063. 218.22 s > threshold_status above threshold
  1064. 218.22 s > [2026-09-02 14:34:40.655] @process::amplitude INFO : overlap structure of group 0: [1: [0(2,3)]]
  1065. 218.22 s > field value
  1066. 218.22 s > span warm_up{integrand.name=se1l_mur_shifted}
  1067. 218.22 s > [2026-09-02 14:34:40.663] @process::amplitude WARNING : External state 0 ('g', PDG 21, helicity +) is off shell: p^2 = +2.5e5, expected m^2 = +0e0 (|Δ| = +2.5e5). Fixed-helicity spinor/vector/tensor external states may be ill-defined at this kinematic point.
  1068. 218.22 s > field value
  1069. 218.22 s > span warm_up{integrand.name=se1l}
  1070. 218.22 s > [2026-09-02 14:34:40.664] @process::amplitude WARNING : External state 1 ('g', PDG 21, helicity -) is off shell: p^2 = +2.5e5, expected m^2 = +0e0 (|Δ| = +2.5e5). Fixed-helicity spinor/vector/tensor external states may be ill-defined at this kinematic point.
  1071. 218.22 s > field value
  1072. 218.22 s > span warm_up{integrand.name=se1l}
  1073. 218.22 s > [2026-09-02 14:34:40.664] @process::amplitude INFO : Input is above threshold: 1 existing threshold E-surfaces across 1/1 graph groups
  1074. 218.22 s > field value
  1075. 218.22 s > existing_esurfaces 1
  1076. 218.22 s > group_count 1
  1077. 218.22 s > groups_above_threshold 1
  1078. 218.22 s > integrand se1l
  1079. 218.22 s > span warm_up{integrand.name=se1l}
  1080. 218.22 s > threshold_status above threshold
  1081. 218.22 s > [2026-09-02 14:34:40.664] @process::amplitude INFO : overlap structure of group 0: [1: [0(2,3)]]
  1082. 218.22 s > field value
  1083. 218.22 s > span warm_up{integrand.name=se1l}
  1084. 218.22 s > [2026-09-02 14:34:40.673] @process::amplitude WARNING : External state 0 ('g', PDG 21, helicity +) is off shell: p^2 = +2.5e5, expected m^2 = +0e0 (|Δ| = +2.5e5). Fixed-helicity spinor/vector/tensor external states may be ill-defined at this kinematic point.
  1085. 218.22 s > field value
  1086. 218.22 s > span warm_up{integrand.name=se1l_mur_shifted}
  1087. 218.22 s > [2026-09-02 14:34:40.673] @process::amplitude WARNING : External state 1 ('g', PDG 21, helicity -) is off shell: p^2 = +2.5e5, expected m^2 = +0e0 (|Δ| = +2.5e5). Fixed-helicity spinor/vector/tensor external states may be ill-defined at this kinematic point.
  1088. 218.22 s > field value
  1089. 218.22 s > span warm_up{integrand.name=se1l_mur_shifted}
  1090. 218.22 s > [2026-09-02 14:34:40.674] @process::amplitude INFO : Input is above threshold: 1 existing threshold E-surfaces across 1/1 graph groups
  1091. 218.22 s > field value
  1092. 218.22 s > existing_esurfaces 1
  1093. 218.22 s > group_count 1
  1094. 218.22 s > groups_above_threshold 1
  1095. 218.22 s > integrand se1l_mur_shifted
  1096. 218.22 s > span warm_up{integrand.name=se1l_mur_shifted}
  1097. 218.22 s > threshold_status above threshold
  1098. 218.22 s > [2026-09-02 14:34:40.674] @process::amplitude INFO : overlap structure of group 0: [1: [0(2,3)]]
  1099. 218.22 s > field value
  1100. 218.22 s > span warm_up{integrand.name=se1l_mur_shifted}
  1101. 218.22 s > [2026-09-02 14:34:40.683] @process::amplitude WARNING : External state 0 ('g', PDG 21, helicity +) is off shell: p^2 = +2.5e5, expected m^2 = +0e0 (|Δ| = +2.5e5). Fixed-helicity spinor/vector/tensor external states may be ill-defined at this kinematic point.
  1102. 218.22 s > field value
  1103. 218.22 s > span warm_up{integrand.name=se1l}
  1104. 218.22 s > [2026-09-02 14:34:40.683] @process::amplitude WARNING : External state 1 ('g', PDG 21, helicity -) is off shell: p^2 = +2.5e5, expected m^2 = +0e0 (|Δ| = +2.5e5). Fixed-helicity spinor/vector/tensor external states may be ill-defined at this kinematic point.
  1105. 218.22 s > field value
  1106. 218.22 s > span warm_up{integrand.name=se1l}
  1107. 218.22 s > [2026-09-02 14:34:40.683] @process::amplitude INFO : Input is above threshold: 1 existing threshold E-surfaces across 1/1 graph groups
  1108. 218.22 s > field value
  1109. 218.22 s > existing_esurfaces 1
  1110. 218.22 s > group_count 1
  1111. 218.22 s > groups_above_threshold 1
  1112. 218.22 s > integrand se1l
  1113. 218.22 s > span warm_up{integrand.name=se1l}
  1114. 218.22 s > threshold_status above threshold
  1115. 218.22 s > [2026-09-02 14:34:40.684] @process::amplitude INFO : overlap structure of group 0: [1: [0(2,3)]]
  1116. 218.22 s > field value
  1117. 218.22 s > span warm_up{integrand.name=se1l}
  1118. 218.22 s > [2026-09-02 14:34:40.692] @process::amplitude WARNING : External state 0 ('g', PDG 21, helicity +) is off shell: p^2 = +2.5e5, expected m^2 = +0e0 (|Δ| = +2.5e5). Fixed-helicity spinor/vector/tensor external states may be ill-defined at this kinematic point.
  1119. 218.22 s > field value
  1120. 218.22 s > span warm_up{integrand.name=se1l_mur_shifted}
  1121. 218.22 s > [2026-09-02 14:34:40.692] @process::amplitude WARNING : External state 1 ('g', PDG 21, helicity -) is off shell: p^2 = +2.5e5, expected m^2 = +0e0 (|Δ| = +2.5e5). Fixed-helicity spinor/vector/tensor external states may be ill-defined at this kinematic point.
  1122. 218.22 s > field value
  1123. 218.22 s > span warm_up{integrand.name=se1l_mur_shifted}
  1124. 218.22 s > [2026-09-02 14:34:40.692] @process::amplitude INFO : Input is above threshold: 1 existing threshold E-surfaces across 1/1 graph groups
  1125. 218.22 s > field value
  1126. 218.22 s > existing_esurfaces 1
  1127. 218.22 s > group_count 1
  1128. 218.22 s > groups_above_threshold 1
  1129. 218.22 s > integrand se1l_mur_shifted
  1130. 218.22 s > span warm_up{integrand.name=se1l_mur_shifted}
  1131. 218.22 s > threshold_status above threshold
  1132. 218.22 s > [2026-09-02 14:34:40.693] @process::amplitude INFO : overlap structure of group 0: [1: [0(2,3)]]
  1133. 218.22 s > field value
  1134. 218.22 s > span warm_up{integrand.name=se1l_mur_shifted}
  1135. 218.22 s > [2026-09-02 14:34:40.701] @process::amplitude WARNING : External state 0 ('g', PDG 21, helicity +) is off shell: p^2 = +2.5e5, expected m^2 = +0e0 (|Δ| = +2.5e5). Fixed-helicity spinor/vector/tensor external states may be ill-defined at this kinematic point.
  1136. 218.22 s > field value
  1137. 218.22 s > span warm_up{integrand.name=se1l}
  1138. 218.22 s > [2026-09-02 14:34:40.701] @process::amplitude WARNING : External state 1 ('g', PDG 21, helicity -) is off shell: p^2 = +2.5e5, expected m^2 = +0e0 (|Δ| = +2.5e5). Fixed-helicity spinor/vector/tensor external states may be ill-defined at this kinematic point.
  1139. 218.22 s > field value
  1140. 218.22 s > span warm_up{integrand.name=se1l}
  1141. 218.22 s > [2026-09-02 14:34:40.702] @process::amplitude INFO : Input is above threshold: 1 existing threshold E-surfaces across 1/1 graph groups
  1142. 218.22 s > field value
  1143. 218.22 s > existing_esurfaces 1
  1144. 218.22 s > group_count 1
  1145. 218.22 s > groups_above_threshold 1
  1146. 218.22 s > integrand se1l
  1147. 218.22 s > span warm_up{integrand.name=se1l}
  1148. 218.22 s > threshold_status above threshold
  1149. 218.22 s > [2026-09-02 14:34:40.702] @process::amplitude INFO : overlap structure of group 0: [1: [0(2,3)]]
  1150. 218.22 s > field value
  1151. 218.22 s > span warm_up{integrand.name=se1l}
  1152. 218.22 s > [2026-09-02 14:34:40.710] @process::amplitude WARNING : External state 0 ('g', PDG 21, helicity +) is off shell: p^2 = +2.5e5, expected m^2 = +0e0 (|Δ| = +2.5e5). Fixed-helicity spinor/vector/tensor external states may be ill-defined at this kinematic point.
  1153. 218.22 s > field value
  1154. 218.22 s > span warm_up{integrand.name=se1l_mur_shifted}
  1155. 218.22 s > [2026-09-02 14:34:40.711] @process::amplitude WARNING : External state 1 ('g', PDG 21, helicity -) is off shell: p^2 = +2.5e5, expected m^2 = +0e0 (|Δ| = +2.5e5). Fixed-helicity spinor/vector/tensor external states may be ill-defined at this kinematic point.
  1156. 218.22 s > field value
  1157. 218.22 s > span warm_up{integrand.name=se1l_mur_shifted}
  1158. 218.22 s > [2026-09-02 14:34:40.711] @process::amplitude INFO : Input is above threshold: 1 existing threshold E-surfaces across 1/1 graph groups
  1159. 218.22 s > field value
  1160. 218.22 s > existing_esurfaces 1
  1161. 218.22 s > group_count 1
  1162. 218.22 s > groups_above_threshold 1
  1163. 218.22 s > integrand se1l_mur_shifted
  1164. 218.22 s > span warm_up{integrand.name=se1l_mur_shifted}
  1165. 218.22 s > threshold_status above threshold
  1166. 218.22 s > [2026-09-02 14:34:40.711] @process::amplitude INFO : overlap structure of group 0: [1: [0(2,3)]]
  1167. 218.22 s > field value
  1168. 218.22 s > span warm_up{integrand.name=se1l_mur_shifted}
  1169. 218.22 s > [2026-09-02 14:34:40.720] @process::amplitude WARNING : External state 0 ('g', PDG 21, helicity +) is off shell: p^2 = +2.5e5, expected m^2 = +0e0 (|Δ| = +2.5e5). Fixed-helicity spinor/vector/tensor external states may be ill-defined at this kinematic point.
  1170. 218.22 s > field value
  1171. 218.22 s > span warm_up{integrand.name=se1l}
  1172. 218.22 s > [2026-09-02 14:34:40.720] @process::amplitude WARNING : External state 1 ('g', PDG 21, helicity -) is off shell: p^2 = +2.5e5, expected m^2 = +0e0 (|Δ| = +2.5e5). Fixed-helicity spinor/vector/tensor external states may be ill-defined at this kinematic point.
  1173. 218.22 s > field value
  1174. 218.22 s > span warm_up{integrand.name=se1l}
  1175. 218.22 s > [2026-09-02 14:34:40.721] @process::amplitude INFO : Input is above threshold: 1 existing threshold E-surfaces across 1/1 graph groups
  1176. 218.22 s > field value
  1177. 218.22 s > existing_esurfaces 1
  1178. 218.22 s > group_count 1
  1179. 218.22 s > groups_above_threshold 1
  1180. 218.22 s > integrand se1l
  1181. 218.22 s > span warm_up{integrand.name=se1l}
  1182. 218.22 s > threshold_status above threshold
  1183. 218.22 s > [2026-09-02 14:34:40.721] @process::amplitude INFO : overlap structure of group 0: [1: [0(2,3)]]
  1184. 218.22 s > field value
  1185. 218.22 s > span warm_up{integrand.name=se1l}
  1186. 218.22 s > [2026-09-02 14:34:40.730] @process::amplitude WARNING : External state 0 ('g', PDG 21, helicity +) is off shell: p^2 = +2.5e5, expected m^2 = +0e0 (|Δ| = +2.5e5). Fixed-helicity spinor/vector/tensor external states may be ill-defined at this kinematic point.
  1187. 218.22 s > field value
  1188. 218.22 s > span warm_up{integrand.name=se1l_mur_shifted}
  1189. 218.22 s > [2026-09-02 14:34:40.730] @process::amplitude WARNING : External state 1 ('g', PDG 21, helicity -) is off shell: p^2 = +2.5e5, expected m^2 = +0e0 (|Δ| = +2.5e5). Fixed-helicity spinor/vector/tensor external states may be ill-defined at this kinematic point.
  1190. 218.22 s > field value
  1191. 218.22 s > span warm_up{integrand.name=se1l_mur_shifted}
  1192. 218.22 s > [2026-09-02 14:34:40.731] @process::amplitude INFO : Input is above threshold: 1 existing threshold E-surfaces across 1/1 graph groups
  1193. 218.22 s > field value
  1194. 218.22 s > existing_esurfaces 1
  1195. 218.22 s > group_count 1
  1196. 218.22 s > groups_above_threshold 1
  1197. 218.22 s > integrand se1l_mur_shifted
  1198. 218.22 s > span warm_up{integrand.name=se1l_mur_shifted}
  1199. 218.22 s > threshold_status above threshold
  1200. 218.22 s > [2026-09-02 14:34:40.731] @process::amplitude INFO : overlap structure of group 0: [1: [0(2,3)]]
  1201. 218.22 s > field value
  1202. 218.22 s > span warm_up{integrand.name=se1l_mur_shifted}
  1203. 218.22 s > [2026-09-02 14:34:40.740] @process::amplitude WARNING : External state 0 ('g', PDG 21, helicity +) is off shell: p^2 = +2.5e5, expected m^2 = +0e0 (|Δ| = +2.5e5). Fixed-helicity spinor/vector/tensor external states may be ill-defined at this kinematic point.
  1204. 218.22 s > field value
  1205. 218.22 s > span warm_up{integrand.name=se1l}
  1206. 218.22 s > [2026-09-02 14:34:40.740] @process::amplitude WARNING : External state 1 ('g', PDG 21, helicity -) is off shell: p^2 = +2.5e5, expected m^2 = +0e0 (|Δ| = +2.5e5). Fixed-helicity spinor/vector/tensor external states may be ill-defined at this kinematic point.
  1207. 218.22 s > field value
  1208. 218.22 s > span warm_up{integrand.name=se1l}
  1209. 218.22 s > [2026-09-02 14:34:40.740] @process::amplitude INFO : Input is above threshold: 1 existing threshold E-surfaces across 1/1 graph groups
  1210. 218.22 s > field value
  1211. 218.22 s > existing_esurfaces 1
  1212. 218.22 s > group_count 1
  1213. 218.22 s > groups_above_threshold 1
  1214. 218.22 s > integrand se1l
  1215. 218.22 s > span warm_up{integrand.name=se1l}
  1216. 218.22 s > threshold_status above threshold
  1217. 218.22 s > [2026-09-02 14:34:40.741] @process::amplitude INFO : overlap structure of group 0: [1: [0(2,3)]]
  1218. 218.22 s > field value
  1219. 218.22 s > span warm_up{integrand.name=se1l}
  1220. 218.22 s > [2026-09-02 14:34:40.750] @process::amplitude WARNING : External state 0 ('g', PDG 21, helicity +) is off shell: p^2 = +2.5e5, expected m^2 = +0e0 (|Δ| = +2.5e5). Fixed-helicity spinor/vector/tensor external states may be ill-defined at this kinematic point.
  1221. 218.22 s > field value
  1222. 218.22 s > span warm_up{integrand.name=se1l_mur_shifted}
  1223. 218.22 s > [2026-09-02 14:34:40.750] @process::amplitude WARNING : External state 1 ('g', PDG 21, helicity -) is off shell: p^2 = +2.5e5, expected m^2 = +0e0 (|Δ| = +2.5e5). Fixed-helicity spinor/vector/tensor external states may be ill-defined at this kinematic point.
  1224. 218.22 s > field value
  1225. 218.22 s > span warm_up{integrand.name=se1l_mur_shifted}
  1226. 218.22 s > [2026-09-02 14:34:40.751] @process::amplitude INFO : Input is above threshold: 1 existing threshold E-surfaces across 1/1 graph groups
  1227. 218.22 s > field value
  1228. 218.22 s > existing_esurfaces 1
  1229. 218.22 s > group_count 1
  1230. 218.22 s > groups_above_threshold 1
  1231. 218.22 s > integrand se1l_mur_shifted
  1232. 218.22 s > span warm_up{integrand.name=se1l_mur_shifted}
  1233. 218.22 s > threshold_status above threshold
  1234. 218.22 s > [2026-09-02 14:34:40.751] @process::amplitude INFO : overlap structure of group 0: [1: [0(2,3)]]
  1235. 218.22 s > field value
  1236. 218.22 s > span warm_up{integrand.name=se1l_mur_shifted}
  1237. 218.22 s > The application panicked (crashed).
  1238. 218.22 s > Message: Integrated UV case failed: se1l
  1239. 218.22 s > Location: tests/tests/uv.rs:1068
  1240. 218.22 s >
  1241. 218.22 s > ━━━━━━━━━━━━━━━━━━━━━━━━━━━━━━━━━━ BACKTRACE ━━━━━━━━━━━━━━━━━━━━━━━━━━━━━━━━━━━
  1242. 218.22 s > 1: <color_eyre[bb06c27fa12d52c3]::config::PanicHook>::panic_report<unknown>
  1243. 218.22 s > at <unknown source file>:<unknown line>
  1244. 218.22 s > 2: <color_eyre[bb06c27fa12d52c3]::config::PanicHook>::into_panic_hook::{closure#0}<unknown>
  1245. 218.22 s > at <unknown source file>:<unknown line>
  1246. 218.22 s > 3: std[5167731717db2e51]::panicking::panic_with_hook<unknown>
  1247. 218.22 s > at <unknown source file>:<unknown line>
  1248. 218.22 s > 4: std[5167731717db2e51]::panicking::panic_handler::{closure#0}<unknown>
  1249. 218.22 s > at <unknown source file>:<unknown line>
  1250. 218.22 s > 5: std[5167731717db2e51]::sys::backtrace::__rust_end_short_backtrace::<std[5167731717db2e51]::panicking::panic_handler::{closure#0}, !><unknown>
  1251. 218.22 s > at <unknown source file>:<unknown line>
  1252. 218.22 s > 6: __rustc[4b1ee1ef74718a7b]::rust_begin_unwind<unknown>
  1253. 218.22 s > at <unknown source file>:<unknown line>
  1254. 218.22 s > 7: core[8c5ac2f034688f9a]::panicking::panic_fmt<unknown>
  1255. 218.22 s > at <unknown source file>:<unknown line>
  1256. 218.22 s > 8: uv[654cd04bf7185af1]::run_single_integrated_uv_case<unknown>
  1257. 218.22 s > at <unknown source file>:<unknown line>
  1258. 218.22 s > 9: <uv[654cd04bf7185af1]::se1l_uv::{closure#0} as core[8c5ac2f034688f9a]::ops::function::FnOnce<()>>::call_once<unknown>
  1259. 218.22 s > at <unknown source file>:<unknown line>
  1260. 218.22 s > 10: test[7974841f8dbd3561]::__rust_begin_short_backtrace::<core[8c5ac2f034688f9a]::result::Result<(), alloc[93e694a8365d93dd]::string::String>, fn() -> core[8c5ac2f034688f9a]::result::Result<(), alloc[93e694a8365d93dd]::string::String>><unknown>
  1261. 218.22 s > at <unknown source file>:<unknown line>
  1262. 218.22 s > 11: test[7974841f8dbd3561]::run_test::{closure#0}<unknown>
  1263. 218.22 s > at <unknown source file>:<unknown line>
  1264. 218.22 s > 12: std[5167731717db2e51]::sys::backtrace::__rust_begin_short_backtrace::<test[7974841f8dbd3561]::run_test::{closure#1}, ()><unknown>
  1265. 218.22 s > at <unknown source file>:<unknown line>
  1266. 218.22 s > 13: <std[5167731717db2e51]::thread::lifecycle::spawn_unchecked<test[7974841f8dbd3561]::run_test::{closure#1}, ()>::{closure#1} as core[8c5ac2f034688f9a]::ops::function::FnOnce<()>>::call_once::{shim:vtable#0}<unknown>
  1267. 218.22 s > at <unknown source file>:<unknown line>
  1268. 218.22 s > 14: <std[5167731717db2e51]::sys::thread::unix::Thread>::new::thread_start<unknown>
  1269. 218.22 s > at <unknown source file>:<unknown line>
  1270. 218.22 s > 15: start_thread<unknown>
  1271. 218.22 s > at <unknown source file>:<unknown line>
  1272. 218.22 s > 16: __clone3<unknown>
  1273. 218.22 s > at <unknown source file>:<unknown line>
  1274. 218.22 s >
  1275. 218.22 s > Run with COLORBT_SHOW_HIDDEN=1 environment variable to disable frame filtering.
  1276. 218.22 s > Run with RUST_BACKTRACE=full to include source snippets.
  1277. 218.22 s >
  1278. 218.22 s > error: test run failed
  1279. 218.22 s >
  1280. 218.22 s > ========== nextest test summary ==========
  1281. 218.22 s > report: target/nextest/ci_gammaloop/junit.xml
  1282. 218.22 s > tests: 106, failures: 9, errors: 0
  1283. 218.22 s >
  1284. 218.22 s > 1. gammaloop-integration-tests::test_runs::approach::approach_momentum_space_reports_incomplete_triplet_cleanly
  1285. 218.22 s > failure: test failure with exit code 101
  1286. 218.22 s > system-out
  1287. 218.22 s > running 1 test
  1288. 218.22 s > test approach::approach_momentum_space_reports_incomplete_triplet_cleanly ... FAILED
  1289. 218.22 s >
  1290. 218.22 s > failures:
  1291. 218.22 s >
  1292. 218.22 s > failures:
  1293. 218.22 s > approach::approach_momentum_space_reports_incomplete_triplet_cleanly
  1294. 218.22 s >
  1295. 218.22 s > test result: FAILED. 0 passed; 1 failed; 0 ignored; 0 measured; 82 filtered out; finished in 0.82s
  1296. 218.22 s > system-err
  1297. 218.22 s > [2026-09-02 14:31:39.855] @gammaloop_api::se... INFO : Running command import model scalars-default.json
  1298. 218.22 s > [2026-09-02 14:31:39.855] @import::model INFO : Loading built-in JSON model scalars-default
  1299. 218.22 s > [2026-09-02 14:31:39.860] @gammalooprs::model INFO : The following 2 external parameters were forced to zero by the restriction card:
  1300. 218.22 s > width_scalar_1, width_scalar_2
  1301. 218.22 s > [2026-09-02 14:31:39.861] @gammaloop_api::se... INFO : Running command remove processes
  1302. 218.22 s > [2026-09-02 14:31:39.861] @gammaloop_api::se... INFO : Running command generate amp scalar_1 > scalar_0 scalar_0 [{1}] --allowed-vertex-interactions V_3_SCALAR_022 V_3_SCALAR_122 -p triangle -i scalar_tri
  1303. 218.22 s > [2026-09-02 14:31:39.862] @feyngen::diagram_... INFO : 0s | Δ=0s | Starting Feynman graph generation with Symbolica...
  1304. 218.22 s > [2026-09-02 14:31:39.862] @feyngen::diagram_... INFO : 0s | Δ=0s | Number of graphs resulting from Symbolica generation: 1
  1305. 218.22 s > [2026-09-02 14:31:39.863] @feyngen::diagram_... INFO : 0s | Δ=0s | Number of graphs retained after removal of vetoed topologies: 1
  1306. 218.22 s > [2026-09-02 14:31:39.863] @feyngen::diagram_... INFO : 0s | Δ=0s | Number of graphs after vertex info assignment: 1
  1307. 218.22 s > [2026-09-02 14:31:39.863] @feyngen::diagram_... INFO : 0s | Δ=0s | Number of graphs after all complete graphs filters are applied: 1
  1308. 218.22 s > [2026-09-02 14:31:39.863] @feyngen::diagram_... INFO : 0s | Δ=0s | Number of graphs after closed fermion chains analysis: 1
  1309. 218.22 s > [2026-09-02 14:31:39.863] @feyngen::diagram_... INFO : 0s | Δ=0s | Number of graphs after symmetrization of external states: 1
  1310. 218.22 s > [2026-09-02 14:31:39.863] @feyngen::diagram_... INFO : 0s | Δ=0s | Number of graphs after canonization of vertices, edges and flows (graph labels assigned here): 1
  1311. 218.22 s > [2026-09-02 14:31:39.869] @feyngen::diagram_... INFO : 0s | Δ=0s | Number of graphs after numerator-aware grouping with strategy 'up to a scalar rescaling': 1 (1 isomorphically unique graph, 0 color zero, 0 lorentz zero, 0 grouped and 0 cancellation)
  1312. 218.22 s > [2026-09-02 14:31:39.869] @feyngen::diagram_... INFO : ( Sum of the symmetry factors from each graph generated = 1 )
  1313. 218.22 s > [2026-09-02 14:31:39.869] @commands::generate INFO : Generated amplitude 1 graphs.
  1314. 218.22 s > [2026-09-02 14:31:39.917] @settings::runtime WARNING : No external kinematics were provided; using default-generated external momenta and helicities.
  1315. 218.22 s > [2026-09-02 14:31:39.991] @commands::generate INFO :
  1316. 218.22 s > Integrand generation summary
  1317. 218.22 s > peak RAM 66.57 MiB | cores 1
  1318. 218.22 s > ╭────────────┬───────┬─────────┬────────────┬────────────┬────────────────┬─────────────╮
  1319. 218.22 s > │ integrand │ graph │ # evals │ expr build │ spenso │ symbolica eval │ compile │
  1320. 218.22 s > ├────────────┼───────┼─────────┼────────────┼────────────┼────────────────┼─────────────┤
  1321. 218.22 s > │ scalar_tri │ GL0 │ 9 │ 31ms (72%) │ 3ms (7.1%) │ 9ms (21%) │ 0ms (0.00%) │
  1322. 218.22 s > ├────────────┼───────┼─────────┼────────────┼────────────┼────────────────┼─────────────┤
  1323. 218.22 s > │ Total │ │ 9 │ 31ms (72%) │ 3ms (7.1%) │ 9ms (21%) │ 0ms (0.00%) │
  1324. 218.22 s > ╰────────────┴───────┴─────────┴────────────┴────────────┴────────────────┴─────────────╯
  1325. 218.22 s > [2026-09-02 14:31:39.992] @gammaloop_api::se... INFO : Running command generate amp scalar_0 scalar_0 > scalar_0 scalar_0 [{1}] --allowed-vertex-interactions V_3_SCALAR_022 -p box -i scalar_box --select-graphs GL0
  1326. 218.22 s > [2026-09-02 14:31:39.993] @feyngen::diagram_... INFO : 0s | Δ=0s | Starting Feynman graph generation with Symbolica...
  1327. 218.22 s > [2026-09-02 14:31:39.993] @feyngen::diagram_... INFO : 0s | Δ=0s | Number of graphs resulting from Symbolica generation: 3
  1328. 218.22 s > [2026-09-02 14:31:39.994] @feyngen::diagram_... INFO : 0s | Δ=0s | Number of graphs retained after removal of vetoed topologies: 3
  1329. 218.22 s > [2026-09-02 14:31:39.997] @feyngen::diagram_... INFO : 0s | Δ=0s | Number of graphs after vertex info assignment: 3
  1330. 218.22 s > [2026-09-02 14:31:39.997] @feyngen::diagram_... INFO : 0s | Δ=0s | Number of graphs after all complete graphs filters are applied: 3
  1331. 218.22 s > [2026-09-02 14:31:39.997] @feyngen::diagram_... INFO : 0s | Δ=0s | Number of graphs after closed fermion chains analysis: 3
  1332. 218.22 s > [2026-09-02 14:31:39.997] @feyngen::diagram_... INFO : 0s | Δ=0s | Number of graphs after symmetrization of external states: 3
  1333. 218.22 s > [2026-09-02 14:31:40.001] @feyngen::diagram_... INFO : 0s | Δ=0s | Number of graphs after canonization of vertices, edges and flows (graph labels assigned here): 3
  1334. 218.22 s > [2026-09-02 14:31:40.013] @feyngen::diagram_... INFO : 0s | Δ=0s | Number of graphs after numerator-aware grouping with strategy 'up to a scalar rescaling': 1 (1 isomorphically unique graph, 0 color zero, 0 lorentz zero, 0 grouped and 0 cancellation)
  1335. 218.22 s > [2026-09-02 14:31:40.013] @feyngen::diagram_... INFO : ( Sum of the symmetry factors from each graph generated = 1 )
  1336. 218.22 s > [2026-09-02 14:31:40.013] @commands::generate INFO : Generated amplitude 1 graphs.
  1337. 218.22 s > [2026-09-02 14:31:40.164] @settings::runtime WARNING : No external kinematics were provided; using default-generated external momenta and helicities.
  1338. 218.22 s > [2026-09-02 14:31:40.231] @commands::generate INFO :
  1339. 218.22 s > Integrand generation summary
  1340. 218.22 s > peak RAM 69.30 MiB | cores 1
  1341. 218.22 s > ╭────────────┬───────┬─────────┬────────────┬─────────────┬────────────────┬─────────────╮
  1342. 218.22 s > │ integrand │ graph │ # evals │ expr build │ spenso │ symbolica eval │ compile │
  1343. 218.22 s > ├────────────┼───────┼─────────┼────────────┼─────────────┼────────────────┼─────────────┤
  1344. 218.22 s > │ scalar_box │ GL0 │ 13 │ 79ms (53%) │ 12ms (8.2%) │ 56ms (38%) │ 0ms (0.00%) │
  1345. 218.22 s > ├────────────┼───────┼─────────┼────────────┼─────────────┼────────────────┼─────────────┤
  1346. 218.22 s > │ Total │ │ 13 │ 79ms (53%) │ 12ms (8.2%) │ 56ms (38%) │ 0ms (0.00%) │
  1347. 218.22 s > ╰────────────┴───────┴─────────┴────────────┴─────────────┴────────────────┴─────────────╯
  1348. 218.22 s > [2026-09-02 14:31:40.232] @gammaloop_api::se... INFO : Running command generate
  1349. 218.22 s > [2026-09-02 14:31:40.352] @settings::runtime WARNING : No external kinematics were provided; using default-generated external momenta and helicities.
  1350. 218.22 s > [2026-09-02 14:31:40.392] @settings::runtime WARNING : No external kinematics were provided; using default-generated external momenta and helicities.
  1351. 218.22 s > [2026-09-02 14:31:40.447] @commands::generate INFO :
  1352. 218.22 s > Integrand generation summary
  1353. 218.22 s > peak RAM 70.79 MiB | cores 1
  1354. 218.22 s > ╭────────────┬───────┬─────────┬─────────────┬────────────┬────────────────┬─────────────╮
  1355. 218.22 s > │ integrand │ graph │ # evals │ expr build │ spenso │ symbolica eval │ compile │
  1356. 218.22 s > ├────────────┼───────┼─────────┼─────────────┼────────────┼────────────────┼─────────────┤
  1357. 218.22 s > │ scalar_tri │ GL0 │ 9 │ 37ms (82%) │ 1ms (4.0%) │ 6ms (14%) │ 0ms (0.00%) │
  1358. 218.22 s > │ scalar_box │ GL0 │ 13 │ 69ms (66%) │ 7ms (7.4%) │ 28ms (27%) │ 0ms (0.00%) │
  1359. 218.22 s > ├────────────┼───────┼─────────┼─────────────┼────────────┼────────────────┼─────────────┤
  1360. 218.22 s > │ Total │ │ 22 │ 106ms (71%) │ 9ms (6.4%) │ 34ms (23%) │ 0ms (0.00%) │
  1361. 218.22 s > ╰────────────┴───────┴─────────┴─────────────┴────────────┴────────────────┴─────────────╯
  1362. 218.22 s > [2026-09-02 14:31:40.447] @gammaloop_api::se... INFO : Running command set model mass_scalar_2=2.0
  1363. 218.22 s > [2026-09-02 14:31:40.448] @gammaloop_api::se... INFO : Running command set model mass_scalar_1=1.0
  1364. 218.22 s > [2026-09-02 14:31:40.449] @gammaloop_api::se... INFO : Running command set process -p triangle -i scalar_tri string '
  1365. 218.22 s > [kinematics.externals]
  1366. 218.22 s > type = "constant"
  1367. 218.22 s >
  1368. 218.22 s > [kinematics.externals.data]
  1369. 218.22 s > [...]
  1370. 218.22 s > [2026-09-02 14:31:40.450] @gammaloop_api::se... INFO : Running command set process -p box -i scalar_box string '
  1371. 218.22 s > [kinematics.externals]
  1372. 218.22 s > type = "constant"
  1373. 218.22 s >
  1374. 218.22 s > [kinematics.externals.data]
  1375. 218.22 s > [...]
  1376. 218.22 s > [2026-09-02 14:31:40.451] @gammaloop_api::se... INFO : Running command approach -x 1.0000000000000001e-1,2.0000000000000001e-1,2.9999999999999999e-1,4.0000000000000002e-1 --approach-axis 1.0000000000000000e-3,0.0000000000000000e0,0.0000000000000000e0,0.0000000000000000e0 --n-points 1 --n-cores 1 --output-results /build/source/tests/artifacts/scalar_box_invalid_momentum_approach/approach_momentum.json --momentum-space --graph-id 0
  1377. 218.22 s > The application panicked (crashed).
  1378. 218.22 s > Message: There are 2 processes available. Please specify a process.
  1379. 218.22 s > Location: tests/tests/test_runs/approach.rs:332
  1380. 218.22 s >
  1381. 218.22 s > ━━━━━━━━━━━━━━━━━━━━━━━━━━━━━━━━━━ BACKTRACE ━━━━━━━━━━━━━━━━━━━━━━━━━━━━━━━━━━━
  1382. 218.22 s > 1: <color_eyre[bb06c27fa12d52c3]::config::PanicHook>::panic_report<unknown>
  1383. 218.22 s > at <unknown source file>:<unknown line>
  1384. 218.22 s > 2: <color_eyre[bb06c27fa12d52c3]::config::PanicHook>::into_panic_hook::{closure#0}<unknown>
  1385. 218.22 s > at <unknown source file>:<unknown line>
  1386. 218.22 s > 3: std[5167731717db2e51]::panicking::panic_with_hook<unknown>
  1387. 218.22 s > at <unknown source file>:<unknown line>
  1388. 218.22 s > 4: std[5167731717db2e51]::panicking::panic_handler::{closure#0}<unknown>
  1389. 218.22 s > at <unknown source file>:<unknown line>
  1390. 218.22 s > 5: std[5167731717db2e51]::sys::backtrace::__rust_end_short_backtrace::<std[5167731717db2e51]::panicking::panic_handler::{closure#0}, !><unknown>
  1391. 218.22 s > at <unknown source file>:<unknown line>
  1392. 218.22 s > 6: __rustc[4b1ee1ef74718a7b]::rust_begin_unwind<unknown>
  1393. 218.22 s > at <unknown source file>:<unknown line>
  1394. 218.22 s > 7: core[8c5ac2f034688f9a]::panicking::panic_fmt<unknown>
  1395. 218.22 s > at <unknown source file>:<unknown line>
  1396. 218.22 s > 8: test_runs[928b8788563090d0]::approach::approach_momentum_space_reports_incomplete_triplet_cleanly<unknown>
  1397. 218.22 s > at <unknown source file>:<unknown line>
  1398. 218.22 s > 9: <test_runs[928b8788563090d0]::approach::approach_momentum_space_reports_incomplete_triplet_cleanly::{closure#0} as core[8c5ac2f034688f9a]::ops::function::FnOnce<()>>::call_once<unknown>
  1399. 218.22 s > at <unknown source file>:<unknown line>
  1400. 218.22 s > 10: test[7974841f8dbd3561]::__rust_begin_short_backtrace::<core[8c5ac2f034688f9a]::result::Result<(), alloc[93e694a8365d93dd]::string::String>, fn() -> core[8c5ac2f034688f9a]::result::Result<(), alloc[93e694a8365d93dd]::string::String>><unknown>
  1401. 218.22 s > at <unknown source file>:<unknown line>
  1402. 218.22 s > 11: test[7974841f8dbd3561]::run_test::{closure#0}<unknown>
  1403. 218.22 s > at <unknown source file>:<unknown line>
  1404. 218.22 s > 12: std[5167731717db2e51]::sys::backtrace::__rust_begin_short_backtrace::<test[7974841f8dbd3561]::run_test::{closure#1}, ()><unknown>
  1405. 218.22 s > at <unknown source file>:<unknown line>
  1406. 218.22 s > 13: <std[5167731717db2e51]::thread::lifecycle::spawn_unchecked<test[7974841f8dbd3561]::run_test::{closure#1}, ()>::{closure#1} as core[8c5ac2f034688f9a]::ops::function::FnOnce<()>>::call_once::{shim:vtable#0}<unknown>
  1407. 218.22 s > at <unknown source file>:<unknown line>
  1408. 218.22 s > 14: <std[5167731717db2e51]::sys::thread::unix::Thread>::new::thread_start<unknown>
  1409. 218.22 s > at <unknown source file>:<unknown line>
  1410. 218.22 s > 15: start_thread<unknown>
  1411. 218.22 s > at <unknown source file>:<unknown line>
  1412. 218.22 s > 16: __clone3<unknown>
  1413. 218.22 s > at <unknown source file>:<unknown line>
  1414. 218.22 s >
  1415. 218.22 s > Run with COLORBT_SHOW_HIDDEN=1 environment variable to disable frame filtering.
  1416. 218.22 s > ... omitted 1 more lines; see full nextest output above
  1417. 218.22 s >
  1418. 218.22 s > 2. gammaloop-integration-tests::test_runs::profile_bulk::box_4e_bulk_profile_passes
  1419. 218.22 s > failure: test failure with exit code 101
  1420. 218.22 s > Error:
  1421. 218.22 s > 0: IR profiling requested arbitrary precision but received a quad-precision result
  1422. 218.22 s >
  1423. 218.22 s > Location:
  1424. 218.22 s > crates/gammalooprs/src/integrands/process/ir.rs:2123
  1425. 218.22 s >
  1426. 218.22 s > ━━━━━━━━━━━━━━━━━━━━━━━━━━━━━━━━━━ BACKTRACE ━━━━━━━━━━━━━━━━━━━━━━━━━━━━━━━━━━━
  1427. 218.22 s > 1: <color_eyre[bb06c27fa12d52c3]::config::EyreHook>::into_eyre_hook::{closure#0}<unknown>
  1428. 218.22 s > at <unknown source file>:<unknown line>
  1429. 218.22 s > 2: eyre[9f660d63ab6a72c5]::capture_handler<unknown>
  1430. 218.22 s > at <unknown source file>:<unknown line>
  1431. 218.22 s > 3: eyre[9f660d63ab6a72c5]::private::format_err<unknown>
  1432. 218.22 s > at <unknown source file>:<unknown line>
  1433. 218.22 s > 4: gammalooprs[1b273202b0029755]::integrands::process::ir::evaluate_profile_momentum_point_arb::<gammalooprs[1b273202b0029755]::integrands::process::amplitude::AmplitudeIntegrand><unknown>
  1434. 218.22 s > at <unknown source file>:<unknown line>
  1435. 218.22 s > 5: <gammalooprs[1b273202b0029755]::integrands::process::amplitude::AmplitudeIntegrand>::test_single_ir_limit_impl<unknown>
  1436. 218.22 s > at <unknown source file>:<unknown line>
  1437. 218.22 s > 6: gammalooprs[1b273202b0029755]::integrands::process::ir::run_ir_profile::<gammalooprs[1b273202b0029755]::integrands::process::amplitude::AmplitudeIntegrand, <gammalooprs[1b273202b0029755]::integrands::process::amplitude::AmplitudeIntegrand>::enumerate_ir_limits, <gammalooprs[1b273202b0029755]::integrands::process::amplitude::AmplitudeIntegrand>::graph_cut_definitions, <gammalooprs[1b273202b0029755]::integrands::process::amplitude::AmplitudeIntegrand>::test_single_ir_limit_impl><unknown>
  1438. 218.22 s > at <unknown source file>:<unknown line>
  1439. 218.22 s > 7: <gammalooprs[1b273202b0029755]::integrands::process::amplitude::AmplitudeIntegrand>::test_ir<unknown>
  1440. 218.22 s > at <unknown source file>:<unknown line>
  1441. 218.22 s > 8: <gammaloop_api[9fdde70dfc7501ea]::commands::profile::Profile>::run<unknown>
  1442. 218.22 s > at <unknown source file>:<unknown line>
  1443. 218.22 s > 9: test_runs[928b8788563090d0]::profile_bulk::box_4e_bulk_profile_passes<unknown>
  1444. 218.22 s > at <unknown source file>:<unknown line>
  1445. 218.22 s > 10: <test_runs[928b8788563090d0]::profile_bulk::box_4e_bulk_profile_passes::{closure#0} as core[8c5ac2f034688f9a]::ops::function::FnOnce<()>>::call_once<unknown>
  1446. 218.22 s > at <unknown source file>:<unknown line>
  1447. 218.22 s > 11: test[7974841f8dbd3561]::__rust_begin_short_backtrace::<core[8c5ac2f034688f9a]::result::Result<(), alloc[93e694a8365d93dd]::string::String>, fn() -> core[8c5ac2f034688f9a]::result::Result<(), alloc[93e694a8365d93dd]::string::String>><unknown>
  1448. 218.22 s > at <unknown source file>:<unknown line>
  1449. 218.22 s > 12: test[7974841f8dbd3561]::run_test::{closure#0}<unknown>
  1450. 218.22 s > at <unknown source file>:<unknown line>
  1451. 218.22 s > 13: std[5167731717db2e51]::sys::backtrace::__rust_begin_short_backtrace::<test[7974841f8dbd3561]::run_test::{closure#1}, ()><unknown>
  1452. 218.22 s > at <unknown source file>:<unknown line>
  1453. 218.22 s > 14: <std[5167731717db2e51]::thread::lifecycle::spawn_unchecked<test[7974841f8dbd3561]::run_test::{closure#1}, ()>::{closure#1} as core[8c5ac2f034688f9a]::ops::function::FnOnce<()>>::call_once::{shim:vtable#0}<unknown>
  1454. 218.22 s > at <unknown source file>:<unknown line>
  1455. 218.22 s > 15: <std[5167731717db2e51]::sys::thread::unix::Thread>::new::thread_start<unknown>
  1456. 218.22 s > at <unknown source file>:<unknown line>
  1457. 218.22 s > 16: start_thread<unknown>
  1458. 218.22 s > at <unknown source file>:<unknown line>
  1459. 218.22 s > 17: __clone3<unknown>
  1460. 218.22 s > at <unknown source file>:<unknown line>
  1461. 218.22 s >
  1462. 218.22 s > Run with COLORBT_SHOW_HIDDEN=1 environment variable to disable frame filtering.
  1463. 218.22 s > Run with RUST_BACKTRACE=full to include source snippets.
  1464. 218.22 s > Warning: SpanTrace capture is Unsupported.
  1465. 218.22 s > Ensure that you've setup a tracing-error ErrorLayer and the semver versions are compatible
  1466. 218.22 s > system-out
  1467. 218.22 s > running 1 test
  1468. 218.22 s > test profile_bulk::box_4e_bulk_profile_passes ... FAILED
  1469. 218.22 s >
  1470. 218.22 s > failures:
  1471. 218.22 s >
  1472. 218.22 s > failures:
  1473. 218.22 s > profile_bulk::box_4e_bulk_profile_passes
  1474. 218.22 s >
  1475. 218.22 s > test result: FAILED. 0 passed; 1 failed; 0 ignored; 0 measured; 82 filtered out; finished in 0.53s
  1476. 218.22 s > system-err
  1477. 218.22 s > [2026-09-02 14:31:41.817] @gammaloop_api::se... INFO : Running command import model ./assets/models/json/scalars/scalars.json
  1478. 218.22 s > [2026-09-02 14:31:41.817] @import::model INFO : Loading JSON model scalars-default from /build/source/assets/models/json/scalars/scalars
  1479. 218.22 s > [2026-09-02 14:31:41.821] @gammalooprs::model INFO : The following 2 external parameters were forced to zero by the restriction card:
  1480. 218.22 s > width_scalar_1, width_scalar_2
  1481. 218.22 s > [2026-09-02 14:31:41.822] @gammaloop_api::se... INFO : Running command import graphs ./tests/resources/graphs/massless_box.dot
  1482. 218.22 s > [2026-09-02 14:31:41.822] @commands::import INFO : Loading graphs from '/build/source/tests/resources/graphs/massless_box.dot'
  1483. 218.22 s > [2026-09-02 14:31:41.832] @gammaloop_api::se... INFO : Running command generate
  1484. 218.22 s > [2026-09-02 14:31:42.176] @commands::generate INFO :
  1485. 218.22 s > Integrand generation summary
  1486. 218.22 s > peak RAM 66.13 MiB | cores 1
  1487. 218.22 s > ╭───────────┬────────────────┬─────────┬─────────────┬─────────────┬────────────────┬─────────────╮
  1488. 218.22 s > │ integrand │ graph │ # evals │ expr build │ spenso │ symbolica eval │ compile │
  1489. 218.22 s > ├───────────┼────────────────┼─────────┼─────────────┼─────────────┼────────────────┼─────────────┤
  1490. 218.22 s > │ default │ massless_box_0 │ 14 │ 267ms (86%) │ 30ms (9.8%) │ 14ms (4.7%) │ 0ms (0.00%) │
  1491. 218.22 s > ├───────────┼────────────────┼─────────┼─────────────┼─────────────┼────────────────┼─────────────┤
  1492. 218.22 s > │ Total │ │ 14 │ 267ms (86%) │ 30ms (9.8%) │ 14ms (4.7%) │ 0ms (0.00%) │
  1493. 218.22 s > ╰───────────┴────────────────┴─────────┴─────────────┴─────────────┴────────────────┴─────────────╯
  1494. 218.22 s > [2026-09-02 14:31:42.179] @process::amplitude INFO : Input is above threshold: 4 existing threshold E-surfaces across 1/1 graph groups
  1495. 218.22 s > [2026-09-02 14:31:42.184] @process::amplitude INFO : overlap structure of group 0: [2: [9(3,5), 11(5,6)], 2: [8(4,6), 11(5,6)], 2: [4(3,4), 9(3,5)], 2: [4(3,4), 8(4,6)]]
  1496. 218.22 s > Error:
  1497. 218.22 s > 0: IR profiling requested arbitrary precision but received a quad-precision result
  1498. 218.22 s >
  1499. 218.22 s > Location:
  1500. 218.22 s > crates/gammalooprs/src/integrands/process/ir.rs:2123
  1501. 218.22 s >
  1502. 218.22 s > ━━━━━━━━━━━━━━━━━━━━━━━━━━━━━━━━━━ BACKTRACE ━━━━━━━━━━━━━━━━━━━━━━━━━━━━━━━━━━━
  1503. 218.22 s > 1: <color_eyre[bb06c27fa12d52c3]::config::EyreHook>::into_eyre_hook::{closure#0}<unknown>
  1504. 218.22 s > at <unknown source file>:<unknown line>
  1505. 218.22 s > 2: eyre[9f660d63ab6a72c5]::capture_handler<unknown>
  1506. 218.22 s > at <unknown source file>:<unknown line>
  1507. 218.22 s > 3: eyre[9f660d63ab6a72c5]::private::format_err<unknown>
  1508. 218.22 s > at <unknown source file>:<unknown line>
  1509. 218.22 s > 4: gammalooprs[1b273202b0029755]::integrands::process::ir::evaluate_profile_momentum_point_arb::<gammalooprs[1b273202b0029755]::integrands::process::amplitude::AmplitudeIntegrand><unknown>
  1510. 218.22 s > at <unknown source file>:<unknown line>
  1511. 218.22 s > 5: <gammalooprs[1b273202b0029755]::integrands::process::amplitude::AmplitudeIntegrand>::test_single_ir_limit_impl<unknown>
  1512. 218.22 s > at <unknown source file>:<unknown line>
  1513. 218.22 s > 6: gammalooprs[1b273202b0029755]::integrands::process::ir::run_ir_profile::<gammalooprs[1b273202b0029755]::integrands::process::amplitude::AmplitudeIntegrand, <gammalooprs[1b273202b0029755]::integrands::process::amplitude::AmplitudeIntegrand>::enumerate_ir_limits, <gammalooprs[1b273202b0029755]::integrands::process::amplitude::AmplitudeIntegrand>::graph_cut_definitions, <gammalooprs[1b273202b0029755]::integrands::process::amplitude::AmplitudeIntegrand>::test_single_ir_limit_impl><unknown>
  1514. 218.22 s > at <unknown source file>:<unknown line>
  1515. 218.22 s > 7: <gammalooprs[1b273202b0029755]::integrands::process::amplitude::AmplitudeIntegrand>::test_ir<unknown>
  1516. 218.22 s > at <unknown source file>:<unknown line>
  1517. 218.22 s > 8: <gammaloop_api[9fdde70dfc7501ea]::commands::profile::Profile>::run<unknown>
  1518. 218.22 s > at <unknown source file>:<unknown line>
  1519. 218.22 s > 9: test_runs[928b8788563090d0]::profile_bulk::box_4e_bulk_profile_passes<unknown>
  1520. 218.22 s > at <unknown source file>:<unknown line>
  1521. 218.22 s > 10: <test_runs[928b8788563090d0]::profile_bulk::box_4e_bulk_profile_passes::{closure#0} as core[8c5ac2f034688f9a]::ops::function::FnOnce<()>>::call_once<unknown>
  1522. 218.22 s > at <unknown source file>:<unknown line>
  1523. 218.22 s > 11: test[7974841f8dbd3561]::__rust_begin_short_backtrace::<core[8c5ac2f034688f9a]::result::Result<(), alloc[93e694a8365d93dd]::string::String>, fn() -> core[8c5ac2f034688f9a]::result::Result<(), alloc[93e694a8365d93dd]::string::String>><unknown>
  1524. 218.22 s > at <unknown source file>:<unknown line>
  1525. 218.22 s > 12: test[7974841f8dbd3561]::run_test::{closure#0}<unknown>
  1526. 218.22 s > at <unknown source file>:<unknown line>
  1527. 218.22 s > 13: std[5167731717db2e51]::sys::backtrace::__rust_begin_short_backtrace::<test[7974841f8dbd3561]::run_test::{closure#1}, ()><unknown>
  1528. 218.22 s > at <unknown source file>:<unknown line>
  1529. 218.22 s > 14: <std[5167731717db2e51]::thread::lifecycle::spawn_unchecked<test[7974841f8dbd3561]::run_test::{closure#1}, ()>::{closure#1} as core[8c5ac2f034688f9a]::ops::function::FnOnce<()>>::call_once::{shim:vtable#0}<unknown>
  1530. 218.22 s > at <unknown source file>:<unknown line>
  1531. 218.22 s > 15: <std[5167731717db2e51]::sys::thread::unix::Thread>::new::thread_start<unknown>
  1532. 218.22 s > at <unknown source file>:<unknown line>
  1533. 218.22 s > 16: start_thread<unknown>
  1534. 218.22 s > at <unknown source file>:<unknown line>
  1535. 218.22 s > 17: __clone3<unknown>
  1536. 218.22 s > at <unknown source file>:<unknown line>
  1537. 218.22 s >
  1538. 218.22 s > Run with COLORBT_SHOW_HIDDEN=1 environment variable to disable frame filtering.
  1539. 218.22 s > Run with RUST_BACKTRACE=full to include source snippets.
  1540. 218.22 s > Warning: SpanTrace capture is Unsupported.
  1541. 218.22 s > Ensure that you've setup a tracing-error ErrorLayer and the semver versions are compatible
  1542. 218.22 s >
  1543. 218.22 s > 3. gammaloop-integration-tests::test_runs::profile_bulk::dotted_bubble_amp_bulk_profile_passes
  1544. 218.22 s > failure: test failure with exit code 101
  1545. 218.22 s > Error:
  1546. 218.22 s > 0: IR profiling requested arbitrary precision but received a quad-precision result
  1547. 218.22 s >
  1548. 218.22 s > Location:
  1549. 218.22 s > crates/gammalooprs/src/integrands/process/ir.rs:2123
  1550. 218.22 s >
  1551. 218.22 s > ━━━━━━━━━━━━━━━━━━━━━━━━━━━━━━━━━━ BACKTRACE ━━━━━━━━━━━━━━━━━━━━━━━━━━━━━━━━━━━
  1552. 218.22 s > 1: <color_eyre[bb06c27fa12d52c3]::config::EyreHook>::into_eyre_hook::{closure#0}<unknown>
  1553. 218.22 s > at <unknown source file>:<unknown line>
  1554. 218.22 s > 2: eyre[9f660d63ab6a72c5]::capture_handler<unknown>
  1555. 218.22 s > at <unknown source file>:<unknown line>
  1556. 218.22 s > 3: eyre[9f660d63ab6a72c5]::private::format_err<unknown>
  1557. 218.22 s > at <unknown source file>:<unknown line>
  1558. 218.22 s > 4: gammalooprs[1b273202b0029755]::integrands::process::ir::evaluate_profile_momentum_point_arb::<gammalooprs[1b273202b0029755]::integrands::process::amplitude::AmplitudeIntegrand><unknown>
  1559. 218.22 s > at <unknown source file>:<unknown line>
  1560. 218.22 s > 5: <gammalooprs[1b273202b0029755]::integrands::process::amplitude::AmplitudeIntegrand>::test_single_ir_limit_impl<unknown>
  1561. 218.22 s > at <unknown source file>:<unknown line>
  1562. 218.22 s > 6: gammalooprs[1b273202b0029755]::integrands::process::ir::run_ir_profile::<gammalooprs[1b273202b0029755]::integrands::process::amplitude::AmplitudeIntegrand, <gammalooprs[1b273202b0029755]::integrands::process::amplitude::AmplitudeIntegrand>::enumerate_ir_limits, <gammalooprs[1b273202b0029755]::integrands::process::amplitude::AmplitudeIntegrand>::graph_cut_definitions, <gammalooprs[1b273202b0029755]::integrands::process::amplitude::AmplitudeIntegrand>::test_single_ir_limit_impl><unknown>
  1563. 218.22 s > at <unknown source file>:<unknown line>
  1564. 218.22 s > 7: <gammalooprs[1b273202b0029755]::integrands::process::amplitude::AmplitudeIntegrand>::test_ir<unknown>
  1565. 218.22 s > at <unknown source file>:<unknown line>
  1566. 218.22 s > 8: <gammaloop_api[9fdde70dfc7501ea]::commands::profile::Profile>::run<unknown>
  1567. 218.22 s > at <unknown source file>:<unknown line>
  1568. 218.22 s > 9: test_runs[928b8788563090d0]::profile_bulk::dotted_bubble_amp_bulk_profile_passes<unknown>
  1569. 218.22 s > at <unknown source file>:<unknown line>
  1570. 218.22 s > 10: <test_runs[928b8788563090d0]::profile_bulk::dotted_bubble_amp_bulk_profile_passes::{closure#0} as core[8c5ac2f034688f9a]::ops::function::FnOnce<()>>::call_once<unknown>
  1571. 218.22 s > at <unknown source file>:<unknown line>
  1572. 218.22 s > 11: test[7974841f8dbd3561]::__rust_begin_short_backtrace::<core[8c5ac2f034688f9a]::result::Result<(), alloc[93e694a8365d93dd]::string::String>, fn() -> core[8c5ac2f034688f9a]::result::Result<(), alloc[93e694a8365d93dd]::string::String>><unknown>
  1573. 218.22 s > at <unknown source file>:<unknown line>
  1574. 218.22 s > 12: test[7974841f8dbd3561]::run_test::{closure#0}<unknown>
  1575. 218.22 s > at <unknown source file>:<unknown line>
  1576. 218.22 s > 13: std[5167731717db2e51]::sys::backtrace::__rust_begin_short_backtrace::<test[7974841f8dbd3561]::run_test::{closure#1}, ()><unknown>
  1577. 218.22 s > at <unknown source file>:<unknown line>
  1578. 218.22 s > 14: <std[5167731717db2e51]::thread::lifecycle::spawn_unchecked<test[7974841f8dbd3561]::run_test::{closure#1}, ()>::{closure#1} as core[8c5ac2f034688f9a]::ops::function::FnOnce<()>>::call_once::{shim:vtable#0}<unknown>
  1579. 218.22 s > at <unknown source file>:<unknown line>
  1580. 218.22 s > 15: <std[5167731717db2e51]::sys::thread::unix::Thread>::new::thread_start<unknown>
  1581. 218.22 s > at <unknown source file>:<unknown line>
  1582. 218.22 s > 16: start_thread<unknown>
  1583. 218.22 s > at <unknown source file>:<unknown line>
  1584. 218.22 s > 17: __clone3<unknown>
  1585. 218.22 s > at <unknown source file>:<unknown line>
  1586. 218.22 s >
  1587. 218.22 s > Run with COLORBT_SHOW_HIDDEN=1 environment variable to disable frame filtering.
  1588. 218.22 s > Run with RUST_BACKTRACE=full to include source snippets.
  1589. 218.22 s > Warning: SpanTrace capture is Unsupported.
  1590. 218.22 s > Ensure that you've setup a tracing-error ErrorLayer and the semver versions are compatible
  1591. 218.22 s > system-out
  1592. 218.22 s > running 1 test
  1593. 218.22 s > test profile_bulk::dotted_bubble_amp_bulk_profile_passes ... FAILED
  1594. 218.22 s >
  1595. 218.22 s > failures:
  1596. 218.22 s >
  1597. 218.22 s > failures:
  1598. 218.22 s > profile_bulk::dotted_bubble_amp_bulk_profile_passes
  1599. 218.22 s >
  1600. 218.22 s > test result: FAILED. 0 passed; 1 failed; 0 ignored; 0 measured; 82 filtered out; finished in 0.52s
  1601. 218.22 s > system-err
  1602. 218.22 s > [2026-09-02 14:31:42.185] @gammaloop_api::se... INFO : Running command import model ./assets/models/json/scalars/scalars_2p_3p.json
  1603. 218.22 s > [2026-09-02 14:31:42.185] @import::model INFO : Loading JSON model scalars_2p_3p-default from /build/source/assets/models/json/scalars/scalars_2p_3p
  1604. 218.22 s > [2026-09-02 14:31:42.187] @gammaloop_api::se... INFO : Running command import graphs ./tests/resources/graphs/dotted_bubble_amp.dot
  1605. 218.22 s > [2026-09-02 14:31:42.187] @commands::import INFO : Loading graphs from '/build/source/tests/resources/graphs/dotted_bubble_amp.dot'
  1606. 218.22 s > [2026-09-02 14:31:42.198] @gammaloop_api::se... INFO : Running command generate
  1607. 218.22 s > [2026-09-02 14:31:42.305] @commands::generate INFO :
  1608. 218.22 s > Integrand generation summary
  1609. 218.22 s > peak RAM 64.23 MiB | cores 1
  1610. 218.22 s > ╭───────────┬───────────────────┬─────────┬────────────┬────────────┬────────────────┬─────────────╮
  1611. 218.22 s > │ integrand │ graph │ # evals │ expr build │ spenso │ symbolica eval │ compile │
  1612. 218.22 s > ├───────────┼───────────────────┼─────────┼────────────┼────────────┼────────────────┼─────────────┤
  1613. 218.22 s > │ default │ dotted_bubble_amp │ 8 │ 25ms (68%) │ 1ms (3.4%) │ 10ms (28%) │ 0ms (0.00%) │
  1614. 218.22 s > ├───────────┼───────────────────┼─────────┼────────────┼────────────┼────────────────┼─────────────┤
  1615. 218.22 s > │ Total │ │ 8 │ 25ms (68%) │ 1ms (3.4%) │ 10ms (28%) │ 0ms (0.00%) │
  1616. 218.22 s > ╰───────────┴───────────────────┴─────────┴────────────┴────────────┴────────────────┴─────────────╯
  1617. 218.22 s > [2026-09-02 14:31:42.307] @process::amplitude INFO : Input is above threshold: 1 existing threshold E-surfaces across 1/1 graph groups
  1618. 218.22 s > [2026-09-02 14:31:42.307] @process::amplitude INFO : overlap structure of group 0: [1: [1(1,3)]]
  1619. 218.22 s > Error:
  1620. 218.22 s > 0: IR profiling requested arbitrary precision but received a quad-precision result
  1621. 218.22 s >
  1622. 218.22 s > Location:
  1623. 218.22 s > crates/gammalooprs/src/integrands/process/ir.rs:2123
  1624. 218.22 s >
  1625. 218.22 s > ━━━━━━━━━━━━━━━━━━━━━━━━━━━━━━━━━━ BACKTRACE ━━━━━━━━━━━━━━━━━━━━━━━━━━━━━━━━━━━
  1626. 218.22 s > 1: <color_eyre[bb06c27fa12d52c3]::config::EyreHook>::into_eyre_hook::{closure#0}<unknown>
  1627. 218.22 s > at <unknown source file>:<unknown line>
  1628. 218.22 s > 2: eyre[9f660d63ab6a72c5]::capture_handler<unknown>
  1629. 218.22 s > at <unknown source file>:<unknown line>
  1630. 218.22 s > 3: eyre[9f660d63ab6a72c5]::private::format_err<unknown>
  1631. 218.22 s > at <unknown source file>:<unknown line>
  1632. 218.22 s > 4: gammalooprs[1b273202b0029755]::integrands::process::ir::evaluate_profile_momentum_point_arb::<gammalooprs[1b273202b0029755]::integrands::process::amplitude::AmplitudeIntegrand><unknown>
  1633. 218.22 s > at <unknown source file>:<unknown line>
  1634. 218.22 s > 5: <gammalooprs[1b273202b0029755]::integrands::process::amplitude::AmplitudeIntegrand>::test_single_ir_limit_impl<unknown>
  1635. 218.22 s > at <unknown source file>:<unknown line>
  1636. 218.22 s > 6: gammalooprs[1b273202b0029755]::integrands::process::ir::run_ir_profile::<gammalooprs[1b273202b0029755]::integrands::process::amplitude::AmplitudeIntegrand, <gammalooprs[1b273202b0029755]::integrands::process::amplitude::AmplitudeIntegrand>::enumerate_ir_limits, <gammalooprs[1b273202b0029755]::integrands::process::amplitude::AmplitudeIntegrand>::graph_cut_definitions, <gammalooprs[1b273202b0029755]::integrands::process::amplitude::AmplitudeIntegrand>::test_single_ir_limit_impl><unknown>
  1637. 218.22 s > at <unknown source file>:<unknown line>
  1638. 218.22 s > 7: <gammalooprs[1b273202b0029755]::integrands::process::amplitude::AmplitudeIntegrand>::test_ir<unknown>
  1639. 218.22 s > at <unknown source file>:<unknown line>
  1640. 218.22 s > 8: <gammaloop_api[9fdde70dfc7501ea]::commands::profile::Profile>::run<unknown>
  1641. 218.22 s > at <unknown source file>:<unknown line>
  1642. 218.22 s > 9: test_runs[928b8788563090d0]::profile_bulk::dotted_bubble_amp_bulk_profile_passes<unknown>
  1643. 218.22 s > at <unknown source file>:<unknown line>
  1644. 218.22 s > 10: <test_runs[928b8788563090d0]::profile_bulk::dotted_bubble_amp_bulk_profile_passes::{closure#0} as core[8c5ac2f034688f9a]::ops::function::FnOnce<()>>::call_once<unknown>
  1645. 218.22 s > at <unknown source file>:<unknown line>
  1646. 218.22 s > 11: test[7974841f8dbd3561]::__rust_begin_short_backtrace::<core[8c5ac2f034688f9a]::result::Result<(), alloc[93e694a8365d93dd]::string::String>, fn() -> core[8c5ac2f034688f9a]::result::Result<(), alloc[93e694a8365d93dd]::string::String>><unknown>
  1647. 218.22 s > at <unknown source file>:<unknown line>
  1648. 218.22 s > 12: test[7974841f8dbd3561]::run_test::{closure#0}<unknown>
  1649. 218.22 s > at <unknown source file>:<unknown line>
  1650. 218.22 s > 13: std[5167731717db2e51]::sys::backtrace::__rust_begin_short_backtrace::<test[7974841f8dbd3561]::run_test::{closure#1}, ()><unknown>
  1651. 218.22 s > at <unknown source file>:<unknown line>
  1652. 218.22 s > 14: <std[5167731717db2e51]::thread::lifecycle::spawn_unchecked<test[7974841f8dbd3561]::run_test::{closure#1}, ()>::{closure#1} as core[8c5ac2f034688f9a]::ops::function::FnOnce<()>>::call_once::{shim:vtable#0}<unknown>
  1653. 218.22 s > at <unknown source file>:<unknown line>
  1654. 218.22 s > 15: <std[5167731717db2e51]::sys::thread::unix::Thread>::new::thread_start<unknown>
  1655. 218.22 s > at <unknown source file>:<unknown line>
  1656. 218.22 s > 16: start_thread<unknown>
  1657. 218.22 s > at <unknown source file>:<unknown line>
  1658. 218.22 s > 17: __clone3<unknown>
  1659. 218.22 s > at <unknown source file>:<unknown line>
  1660. 218.22 s >
  1661. 218.22 s > Run with COLORBT_SHOW_HIDDEN=1 environment variable to disable frame filtering.
  1662. 218.22 s > Run with RUST_BACKTRACE=full to include source snippets.
  1663. 218.22 s > Warning: SpanTrace capture is Unsupported.
  1664. 218.22 s > Ensure that you've setup a tracing-error ErrorLayer and the semver versions are compatible
  1665. 218.22 s >
  1666. 218.22 s > 4. gammaloop-integration-tests::test_runs::profile_bulk::double_dotted_bubble_amp_bulk_profile_passes
  1667. 218.22 s > failure: test failure with exit code 101
  1668. 218.22 s > Error:
  1669. 218.22 s > 0: IR profiling requested arbitrary precision but received a quad-precision result
  1670. 218.22 s >
  1671. 218.22 s > Location:
  1672. 218.22 s > crates/gammalooprs/src/integrands/process/ir.rs:2123
  1673. 218.22 s >
  1674. 218.22 s > ━━━━━━━━━━━━━━━━━━━━━━━━━━━━━━━━━━ BACKTRACE ━━━━━━━━━━━━━━━━━━━━━━━━━━━━━━━━━━━
  1675. 218.22 s > 1: <color_eyre[bb06c27fa12d52c3]::config::EyreHook>::into_eyre_hook::{closure#0}<unknown>
  1676. 218.22 s > at <unknown source file>:<unknown line>
  1677. 218.22 s > 2: eyre[9f660d63ab6a72c5]::capture_handler<unknown>
  1678. 218.22 s > at <unknown source file>:<unknown line>
  1679. 218.22 s > 3: eyre[9f660d63ab6a72c5]::private::format_err<unknown>
  1680. 218.22 s > at <unknown source file>:<unknown line>
  1681. 218.22 s > 4: gammalooprs[1b273202b0029755]::integrands::process::ir::evaluate_profile_momentum_point_arb::<gammalooprs[1b273202b0029755]::integrands::process::amplitude::AmplitudeIntegrand><unknown>
  1682. 218.22 s > at <unknown source file>:<unknown line>
  1683. 218.22 s > 5: <gammalooprs[1b273202b0029755]::integrands::process::amplitude::AmplitudeIntegrand>::test_single_ir_limit_impl<unknown>
  1684. 218.22 s > at <unknown source file>:<unknown line>
  1685. 218.22 s > 6: gammalooprs[1b273202b0029755]::integrands::process::ir::run_ir_profile::<gammalooprs[1b273202b0029755]::integrands::process::amplitude::AmplitudeIntegrand, <gammalooprs[1b273202b0029755]::integrands::process::amplitude::AmplitudeIntegrand>::enumerate_ir_limits, <gammalooprs[1b273202b0029755]::integrands::process::amplitude::AmplitudeIntegrand>::graph_cut_definitions, <gammalooprs[1b273202b0029755]::integrands::process::amplitude::AmplitudeIntegrand>::test_single_ir_limit_impl><unknown>
  1686. 218.22 s > at <unknown source file>:<unknown line>
  1687. 218.22 s > 7: <gammalooprs[1b273202b0029755]::integrands::process::amplitude::AmplitudeIntegrand>::test_ir<unknown>
  1688. 218.22 s > at <unknown source file>:<unknown line>
  1689. 218.22 s > 8: <gammaloop_api[9fdde70dfc7501ea]::commands::profile::Profile>::run<unknown>
  1690. 218.22 s > at <unknown source file>:<unknown line>
  1691. 218.22 s > 9: test_runs[928b8788563090d0]::profile_bulk::double_dotted_bubble_amp_bulk_profile_passes<unknown>
  1692. 218.22 s > at <unknown source file>:<unknown line>
  1693. 218.22 s > 10: <test_runs[928b8788563090d0]::profile_bulk::double_dotted_bubble_amp_bulk_profile_passes::{closure#0} as core[8c5ac2f034688f9a]::ops::function::FnOnce<()>>::call_once<unknown>
  1694. 218.22 s > at <unknown source file>:<unknown line>
  1695. 218.22 s > 11: test[7974841f8dbd3561]::__rust_begin_short_backtrace::<core[8c5ac2f034688f9a]::result::Result<(), alloc[93e694a8365d93dd]::string::String>, fn() -> core[8c5ac2f034688f9a]::result::Result<(), alloc[93e694a8365d93dd]::string::String>><unknown>
  1696. 218.22 s > at <unknown source file>:<unknown line>
  1697. 218.22 s > 12: test[7974841f8dbd3561]::run_test::{closure#0}<unknown>
  1698. 218.22 s > at <unknown source file>:<unknown line>
  1699. 218.22 s > 13: std[5167731717db2e51]::sys::backtrace::__rust_begin_short_backtrace::<test[7974841f8dbd3561]::run_test::{closure#1}, ()><unknown>
  1700. 218.22 s > at <unknown source file>:<unknown line>
  1701. 218.22 s > 14: <std[5167731717db2e51]::thread::lifecycle::spawn_unchecked<test[7974841f8dbd3561]::run_test::{closure#1}, ()>::{closure#1} as core[8c5ac2f034688f9a]::ops::function::FnOnce<()>>::call_once::{shim:vtable#0}<unknown>
  1702. 218.22 s > at <unknown source file>:<unknown line>
  1703. 218.22 s > 15: <std[5167731717db2e51]::sys::thread::unix::Thread>::new::thread_start<unknown>
  1704. 218.22 s > at <unknown source file>:<unknown line>
  1705. 218.22 s > 16: start_thread<unknown>
  1706. 218.22 s > at <unknown source file>:<unknown line>
  1707. 218.22 s > 17: __clone3<unknown>
  1708. 218.22 s > at <unknown source file>:<unknown line>
  1709. 218.22 s >
  1710. 218.22 s > Run with COLORBT_SHOW_HIDDEN=1 environment variable to disable frame filtering.
  1711. 218.22 s > Run with RUST_BACKTRACE=full to include source snippets.
  1712. 218.22 s > Warning: SpanTrace capture is Unsupported.
  1713. 218.22 s > Ensure that you've setup a tracing-error ErrorLayer and the semver versions are compatible
  1714. 218.22 s > system-out
  1715. 218.22 s > running 1 test
  1716. 218.22 s > test profile_bulk::double_dotted_bubble_amp_bulk_profile_passes ... FAILED
  1717. 218.22 s >
  1718. 218.22 s > failures:
  1719. 218.22 s >
  1720. 218.22 s > failures:
  1721. 218.22 s > profile_bulk::double_dotted_bubble_amp_bulk_profile_passes
  1722. 218.22 s >
  1723. 218.22 s > test result: FAILED. 0 passed; 1 failed; 0 ignored; 0 measured; 82 filtered out; finished in 0.45s
  1724. 218.22 s > system-err
  1725. 218.22 s > [2026-09-02 14:31:42.261] @gammaloop_api::se... INFO : Running command import model ./assets/models/json/scalars/scalars_2p_3p.json
  1726. 218.22 s > [2026-09-02 14:31:42.261] @import::model INFO : Loading JSON model scalars_2p_3p-default from /build/source/assets/models/json/scalars/scalars_2p_3p
  1727. 218.22 s > [2026-09-02 14:31:42.263] @gammaloop_api::se... INFO : Running command import graphs ./tests/resources/graphs/double_dotted_bubble_amp.dot
  1728. 218.22 s > [2026-09-02 14:31:42.263] @commands::import INFO : Loading graphs from '/build/source/tests/resources/graphs/double_dotted_bubble_amp.dot'
  1729. 218.22 s > [2026-09-02 14:31:42.275] @gammaloop_api::se... INFO : Running command generate
  1730. 218.22 s > [2026-09-02 14:31:42.388] @commands::generate INFO :
  1731. 218.22 s > Integrand generation summary
  1732. 218.22 s > peak RAM 63.58 MiB | cores 1
  1733. 218.22 s > ╭───────────┬──────────────────────────┬─────────┬────────────┬───────────┬────────────────┬─────────────╮
  1734. 218.22 s > │ integrand │ graph │ # evals │ expr build │ spenso │ symbolica eval │ compile │
  1735. 218.22 s > ├───────────┼──────────────────────────┼─────────┼────────────┼───────────┼────────────────┼─────────────┤
  1736. 218.22 s > │ default │ double_dotted_bubble_amp │ 11 │ 29ms (45%) │ 8ms (12%) │ 28ms (43%) │ 0ms (0.00%) │
  1737. 218.22 s > ├───────────┼──────────────────────────┼─────────┼────────────┼───────────┼────────────────┼─────────────┤
  1738. 218.22 s > │ Total │ │ 11 │ 29ms (45%) │ 8ms (12%) │ 28ms (43%) │ 0ms (0.00%) │
  1739. 218.22 s > ╰───────────┴──────────────────────────┴─────────┴────────────┴───────────┴────────────────┴─────────────╯
  1740. 218.22 s > [2026-09-02 14:31:42.390] @process::amplitude INFO : Input is above threshold: 1 existing threshold E-surfaces across 1/1 graph groups
  1741. 218.22 s > [2026-09-02 14:31:42.390] @process::amplitude INFO : overlap structure of group 0: [1: [1(1,4)]]
  1742. 218.22 s > Error:
  1743. 218.22 s > 0: IR profiling requested arbitrary precision but received a quad-precision result
  1744. 218.22 s >
  1745. 218.22 s > Location:
  1746. 218.22 s > crates/gammalooprs/src/integrands/process/ir.rs:2123
  1747. 218.22 s >
  1748. 218.22 s > ━━━━━━━━━━━━━━━━━━━━━━━━━━━━━━━━━━ BACKTRACE ━━━━━━━━━━━━━━━━━━━━━━━━━━━━━━━━━━━
  1749. 218.22 s > 1: <color_eyre[bb06c27fa12d52c3]::config::EyreHook>::into_eyre_hook::{closure#0}<unknown>
  1750. 218.22 s > at <unknown source file>:<unknown line>
  1751. 218.22 s > 2: eyre[9f660d63ab6a72c5]::capture_handler<unknown>
  1752. 218.22 s > at <unknown source file>:<unknown line>
  1753. 218.22 s > 3: eyre[9f660d63ab6a72c5]::private::format_err<unknown>
  1754. 218.22 s > at <unknown source file>:<unknown line>
  1755. 218.22 s > 4: gammalooprs[1b273202b0029755]::integrands::process::ir::evaluate_profile_momentum_point_arb::<gammalooprs[1b273202b0029755]::integrands::process::amplitude::AmplitudeIntegrand><unknown>
  1756. 218.22 s > at <unknown source file>:<unknown line>
  1757. 218.22 s > 5: <gammalooprs[1b273202b0029755]::integrands::process::amplitude::AmplitudeIntegrand>::test_single_ir_limit_impl<unknown>
  1758. 218.22 s > at <unknown source file>:<unknown line>
  1759. 218.22 s > 6: gammalooprs[1b273202b0029755]::integrands::process::ir::run_ir_profile::<gammalooprs[1b273202b0029755]::integrands::process::amplitude::AmplitudeIntegrand, <gammalooprs[1b273202b0029755]::integrands::process::amplitude::AmplitudeIntegrand>::enumerate_ir_limits, <gammalooprs[1b273202b0029755]::integrands::process::amplitude::AmplitudeIntegrand>::graph_cut_definitions, <gammalooprs[1b273202b0029755]::integrands::process::amplitude::AmplitudeIntegrand>::test_single_ir_limit_impl><unknown>
  1760. 218.22 s > at <unknown source file>:<unknown line>
  1761. 218.22 s > 7: <gammalooprs[1b273202b0029755]::integrands::process::amplitude::AmplitudeIntegrand>::test_ir<unknown>
  1762. 218.22 s > at <unknown source file>:<unknown line>
  1763. 218.22 s > 8: <gammaloop_api[9fdde70dfc7501ea]::commands::profile::Profile>::run<unknown>
  1764. 218.22 s > at <unknown source file>:<unknown line>
  1765. 218.22 s > 9: test_runs[928b8788563090d0]::profile_bulk::double_dotted_bubble_amp_bulk_profile_passes<unknown>
  1766. 218.22 s > at <unknown source file>:<unknown line>
  1767. 218.22 s > 10: <test_runs[928b8788563090d0]::profile_bulk::double_dotted_bubble_amp_bulk_profile_passes::{closure#0} as core[8c5ac2f034688f9a]::ops::function::FnOnce<()>>::call_once<unknown>
  1768. 218.22 s > at <unknown source file>:<unknown line>
  1769. 218.22 s > 11: test[7974841f8dbd3561]::__rust_begin_short_backtrace::<core[8c5ac2f034688f9a]::result::Result<(), alloc[93e694a8365d93dd]::string::String>, fn() -> core[8c5ac2f034688f9a]::result::Result<(), alloc[93e694a8365d93dd]::string::String>><unknown>
  1770. 218.22 s > at <unknown source file>:<unknown line>
  1771. 218.22 s > 12: test[7974841f8dbd3561]::run_test::{closure#0}<unknown>
  1772. 218.22 s > at <unknown source file>:<unknown line>
  1773. 218.22 s > 13: std[5167731717db2e51]::sys::backtrace::__rust_begin_short_backtrace::<test[7974841f8dbd3561]::run_test::{closure#1}, ()><unknown>
  1774. 218.22 s > at <unknown source file>:<unknown line>
  1775. 218.22 s > 14: <std[5167731717db2e51]::thread::lifecycle::spawn_unchecked<test[7974841f8dbd3561]::run_test::{closure#1}, ()>::{closure#1} as core[8c5ac2f034688f9a]::ops::function::FnOnce<()>>::call_once::{shim:vtable#0}<unknown>
  1776. 218.22 s > at <unknown source file>:<unknown line>
  1777. 218.22 s > 15: <std[5167731717db2e51]::sys::thread::unix::Thread>::new::thread_start<unknown>
  1778. 218.22 s > at <unknown source file>:<unknown line>
  1779. 218.22 s > 16: start_thread<unknown>
  1780. 218.22 s > at <unknown source file>:<unknown line>
  1781. 218.22 s > 17: __clone3<unknown>
  1782. 218.22 s > at <unknown source file>:<unknown line>
  1783. 218.22 s >
  1784. 218.22 s > Run with COLORBT_SHOW_HIDDEN=1 environment variable to disable frame filtering.
  1785. 218.22 s > Run with RUST_BACKTRACE=full to include source snippets.
  1786. 218.22 s > Warning: SpanTrace capture is Unsupported.
  1787. 218.22 s > Ensure that you've setup a tracing-error ErrorLayer and the semver versions are compatible
  1788. 218.22 s >
  1789. 218.22 s > 5. gammaloop-integration-tests::test_runs::profile_bulk::massless_triangle_bulk_profile_passes
  1790. 218.22 s > failure: test failure with exit code 101
  1791. 218.22 s > Error:
  1792. 218.22 s > 0: IR profiling requested arbitrary precision but received a quad-precision result
  1793. 218.22 s >
  1794. 218.22 s > Location:
  1795. 218.22 s > crates/gammalooprs/src/integrands/process/ir.rs:2123
  1796. 218.22 s >
  1797. 218.22 s > ━━━━━━━━━━━━━━━━━━━━━━━━━━━━━━━━━━ BACKTRACE ━━━━━━━━━━━━━━━━━━━━━━━━━━━━━━━━━━━
  1798. 218.22 s > 1: <color_eyre[bb06c27fa12d52c3]::config::EyreHook>::into_eyre_hook::{closure#0}<unknown>
  1799. 218.22 s > at <unknown source file>:<unknown line>
  1800. 218.22 s > 2: eyre[9f660d63ab6a72c5]::capture_handler<unknown>
  1801. 218.22 s > at <unknown source file>:<unknown line>
  1802. 218.22 s > 3: eyre[9f660d63ab6a72c5]::private::format_err<unknown>
  1803. 218.22 s > at <unknown source file>:<unknown line>
  1804. 218.22 s > 4: gammalooprs[1b273202b0029755]::integrands::process::ir::evaluate_profile_momentum_point_arb::<gammalooprs[1b273202b0029755]::integrands::process::amplitude::AmplitudeIntegrand><unknown>
  1805. 218.22 s > at <unknown source file>:<unknown line>
  1806. 218.22 s > 5: <gammalooprs[1b273202b0029755]::integrands::process::amplitude::AmplitudeIntegrand>::test_single_ir_limit_impl<unknown>
  1807. 218.22 s > at <unknown source file>:<unknown line>
  1808. 218.22 s > 6: gammalooprs[1b273202b0029755]::integrands::process::ir::run_ir_profile::<gammalooprs[1b273202b0029755]::integrands::process::amplitude::AmplitudeIntegrand, <gammalooprs[1b273202b0029755]::integrands::process::amplitude::AmplitudeIntegrand>::enumerate_ir_limits, <gammalooprs[1b273202b0029755]::integrands::process::amplitude::AmplitudeIntegrand>::graph_cut_definitions, <gammalooprs[1b273202b0029755]::integrands::process::amplitude::AmplitudeIntegrand>::test_single_ir_limit_impl><unknown>
  1809. 218.22 s > at <unknown source file>:<unknown line>
  1810. 218.22 s > 7: <gammalooprs[1b273202b0029755]::integrands::process::amplitude::AmplitudeIntegrand>::test_ir<unknown>
  1811. 218.22 s > at <unknown source file>:<unknown line>
  1812. 218.22 s > 8: <gammaloop_api[9fdde70dfc7501ea]::commands::profile::Profile>::run<unknown>
  1813. 218.22 s > at <unknown source file>:<unknown line>
  1814. 218.22 s > 9: test_runs[928b8788563090d0]::profile_bulk::massless_triangle_bulk_profile_passes<unknown>
  1815. 218.22 s > at <unknown source file>:<unknown line>
  1816. 218.22 s > 10: <test_runs[928b8788563090d0]::profile_bulk::massless_triangle_bulk_profile_passes::{closure#0} as core[8c5ac2f034688f9a]::ops::function::FnOnce<()>>::call_once<unknown>
  1817. 218.22 s > at <unknown source file>:<unknown line>
  1818. 218.22 s > 11: test[7974841f8dbd3561]::__rust_begin_short_backtrace::<core[8c5ac2f034688f9a]::result::Result<(), alloc[93e694a8365d93dd]::string::String>, fn() -> core[8c5ac2f034688f9a]::result::Result<(), alloc[93e694a8365d93dd]::string::String>><unknown>
  1819. 218.22 s > at <unknown source file>:<unknown line>
  1820. 218.22 s > 12: test[7974841f8dbd3561]::run_test::{closure#0}<unknown>
  1821. 218.22 s > at <unknown source file>:<unknown line>
  1822. 218.22 s > 13: std[5167731717db2e51]::sys::backtrace::__rust_begin_short_backtrace::<test[7974841f8dbd3561]::run_test::{closure#1}, ()><unknown>
  1823. 218.22 s > at <unknown source file>:<unknown line>
  1824. 218.22 s > 14: <std[5167731717db2e51]::thread::lifecycle::spawn_unchecked<test[7974841f8dbd3561]::run_test::{closure#1}, ()>::{closure#1} as core[8c5ac2f034688f9a]::ops::function::FnOnce<()>>::call_once::{shim:vtable#0}<unknown>
  1825. 218.22 s > at <unknown source file>:<unknown line>
  1826. 218.22 s > 15: <std[5167731717db2e51]::sys::thread::unix::Thread>::new::thread_start<unknown>
  1827. 218.22 s > at <unknown source file>:<unknown line>
  1828. 218.22 s > 16: start_thread<unknown>
  1829. 218.22 s > at <unknown source file>:<unknown line>
  1830. 218.22 s > 17: __clone3<unknown>
  1831. 218.22 s > at <unknown source file>:<unknown line>
  1832. 218.22 s >
  1833. 218.22 s > Run with COLORBT_SHOW_HIDDEN=1 environment variable to disable frame filtering.
  1834. 218.22 s > Run with RUST_BACKTRACE=full to include source snippets.
  1835. 218.22 s > Warning: SpanTrace capture is Unsupported.
  1836. 218.22 s > Ensure that you've setup a tracing-error ErrorLayer and the semver versions are compatible
  1837. 218.22 s > system-out
  1838. 218.22 s > running 1 test
  1839. 218.22 s > test profile_bulk::massless_triangle_bulk_profile_passes ... FAILED
  1840. 218.22 s >
  1841. 218.22 s > failures:
  1842. 218.22 s >
  1843. 218.22 s > failures:
  1844. 218.22 s > profile_bulk::massless_triangle_bulk_profile_passes
  1845. 218.22 s >
  1846. 218.22 s > test result: FAILED. 0 passed; 1 failed; 0 ignored; 0 measured; 82 filtered out; finished in 0.48s
  1847. 218.22 s > system-err
  1848. 218.22 s > [2026-09-02 14:31:42.400] @gammaloop_api::se... INFO : Running command import model scalars
  1849. 218.22 s > [2026-09-02 14:31:42.400] @import::model INFO : Loading built-in JSON model scalars-default
  1850. 218.22 s > [2026-09-02 14:31:42.407] @gammalooprs::model INFO : The following 2 external parameters were forced to zero by the restriction card:
  1851. 218.22 s > width_scalar_1, width_scalar_2
  1852. 218.22 s > [2026-09-02 14:31:42.408] @gammaloop_api::se... INFO : Running command import graphs ./tests/resources/graphs/massless_triangle.dot
  1853. 218.22 s > [2026-09-02 14:31:42.408] @commands::import INFO : Loading graphs from '/build/source/tests/resources/graphs/massless_triangle.dot'
  1854. 218.22 s > [2026-09-02 14:31:42.415] @gammaloop_api::se... INFO : Running command generate
  1855. 218.22 s > [2026-09-02 14:31:42.525] @commands::generate INFO :
  1856. 218.22 s > Integrand generation summary
  1857. 218.22 s > peak RAM 63.61 MiB | cores 1
  1858. 218.22 s > ╭───────────┬─────────────────────┬─────────┬────────────┬────────────┬────────────────┬─────────────╮
  1859. 218.22 s > │ integrand │ graph │ # evals │ expr build │ spenso │ symbolica eval │ compile │
  1860. 218.22 s > ├───────────┼─────────────────────┼─────────┼────────────┼────────────┼────────────────┼─────────────┤
  1861. 218.22 s > │ default │ massless_triangle_0 │ 9 │ 24ms (64%) │ 1ms (5.1%) │ 12ms (31%) │ 0ms (0.00%) │
  1862. 218.23 s > ├───────────┼─────────────────────┼─────────┼────────────┼────────────┼────────────────┼─────────────┤
  1863. 218.23 s > │ Total │ │ 9 │ 24ms (64%) │ 1ms (5.1%) │ 12ms (31%) │ 0ms (0.00%) │
  1864. 218.23 s > ╰───────────┴─────────────────────┴─────────┴────────────┴────────────┴────────────────┴─────────────╯
  1865. 218.23 s > [2026-09-02 14:31:42.527] @process::amplitude INFO : Input is above threshold: 2 existing threshold E-surfaces across 1/1 graph groups
  1866. 218.23 s > [2026-09-02 14:31:42.527] @process::amplitude INFO : overlap structure of group 0: [2: [0(1,5), 1(1,3)]]
  1867. 218.23 s > Error:
  1868. 218.23 s > 0: IR profiling requested arbitrary precision but received a quad-precision result
  1869. 218.23 s >
  1870. 218.23 s > Location:
  1871. 218.23 s > crates/gammalooprs/src/integrands/process/ir.rs:2123
  1872. 218.23 s >
  1873. 218.23 s > ━━━━━━━━━━━━━━━━━━━━━━━━━━━━━━━━━━ BACKTRACE ━━━━━━━━━━━━━━━━━━━━━━━━━━━━━━━━━━━
  1874. 218.23 s > 1: <color_eyre[bb06c27fa12d52c3]::config::EyreHook>::into_eyre_hook::{closure#0}<unknown>
  1875. 218.23 s > at <unknown source file>:<unknown line>
  1876. 218.23 s > 2: eyre[9f660d63ab6a72c5]::capture_handler<unknown>
  1877. 218.23 s > at <unknown source file>:<unknown line>
  1878. 218.23 s > 3: eyre[9f660d63ab6a72c5]::private::format_err<unknown>
  1879. 218.23 s > at <unknown source file>:<unknown line>
  1880. 218.23 s > 4: gammalooprs[1b273202b0029755]::integrands::process::ir::evaluate_profile_momentum_point_arb::<gammalooprs[1b273202b0029755]::integrands::process::amplitude::AmplitudeIntegrand><unknown>
  1881. 218.23 s > at <unknown source file>:<unknown line>
  1882. 218.23 s > 5: <gammalooprs[1b273202b0029755]::integrands::process::amplitude::AmplitudeIntegrand>::test_single_ir_limit_impl<unknown>
  1883. 218.23 s > at <unknown source file>:<unknown line>
  1884. 218.23 s > 6: gammalooprs[1b273202b0029755]::integrands::process::ir::run_ir_profile::<gammalooprs[1b273202b0029755]::integrands::process::amplitude::AmplitudeIntegrand, <gammalooprs[1b273202b0029755]::integrands::process::amplitude::AmplitudeIntegrand>::enumerate_ir_limits, <gammalooprs[1b273202b0029755]::integrands::process::amplitude::AmplitudeIntegrand>::graph_cut_definitions, <gammalooprs[1b273202b0029755]::integrands::process::amplitude::AmplitudeIntegrand>::test_single_ir_limit_impl><unknown>
  1885. 218.23 s > at <unknown source file>:<unknown line>
  1886. 218.23 s > 7: <gammalooprs[1b273202b0029755]::integrands::process::amplitude::AmplitudeIntegrand>::test_ir<unknown>
  1887. 218.23 s > at <unknown source file>:<unknown line>
  1888. 218.23 s > 8: <gammaloop_api[9fdde70dfc7501ea]::commands::profile::Profile>::run<unknown>
  1889. 218.23 s > at <unknown source file>:<unknown line>
  1890. 218.23 s > 9: test_runs[928b8788563090d0]::profile_bulk::massless_triangle_bulk_profile_passes<unknown>
  1891. 218.23 s > at <unknown source file>:<unknown line>
  1892. 218.23 s > 10: <test_runs[928b8788563090d0]::profile_bulk::massless_triangle_bulk_profile_passes::{closure#0} as core[8c5ac2f034688f9a]::ops::function::FnOnce<()>>::call_once<unknown>
  1893. 218.23 s > at <unknown source file>:<unknown line>
  1894. 218.23 s > 11: test[7974841f8dbd3561]::__rust_begin_short_backtrace::<core[8c5ac2f034688f9a]::result::Result<(), alloc[93e694a8365d93dd]::string::String>, fn() -> core[8c5ac2f034688f9a]::result::Result<(), alloc[93e694a8365d93dd]::string::String>><unknown>
  1895. 218.23 s > at <unknown source file>:<unknown line>
  1896. 218.23 s > 12: test[7974841f8dbd3561]::run_test::{closure#0}<unknown>
  1897. 218.23 s > at <unknown source file>:<unknown line>
  1898. 218.23 s > 13: std[5167731717db2e51]::sys::backtrace::__rust_begin_short_backtrace::<test[7974841f8dbd3561]::run_test::{closure#1}, ()><unknown>
  1899. 218.23 s > at <unknown source file>:<unknown line>
  1900. 218.23 s > 14: <std[5167731717db2e51]::thread::lifecycle::spawn_unchecked<test[7974841f8dbd3561]::run_test::{closure#1}, ()>::{closure#1} as core[8c5ac2f034688f9a]::ops::function::FnOnce<()>>::call_once::{shim:vtable#0}<unknown>
  1901. 218.23 s > at <unknown source file>:<unknown line>
  1902. 218.23 s > 15: <std[5167731717db2e51]::sys::thread::unix::Thread>::new::thread_start<unknown>
  1903. 218.23 s > at <unknown source file>:<unknown line>
  1904. 218.23 s > 16: start_thread<unknown>
  1905. 218.23 s > at <unknown source file>:<unknown line>
  1906. 218.23 s > 17: __clone3<unknown>
  1907. 218.23 s > at <unknown source file>:<unknown line>
  1908. 218.23 s >
  1909. 218.23 s > Run with COLORBT_SHOW_HIDDEN=1 environment variable to disable frame filtering.
  1910. 218.23 s > Run with RUST_BACKTRACE=full to include source snippets.
  1911. 218.23 s > Warning: SpanTrace capture is Unsupported.
  1912. 218.23 s > Ensure that you've setup a tracing-error ErrorLayer and the semver versions are compatible
  1913. 218.23 s >
  1914. 218.23 s > 6. gammaloop-integration-tests::test_runs::profile_bulk::scalar_self_energy_amp_bulk_profile_passes
  1915. 218.23 s > failure: test failure with exit code 101
  1916. 218.23 s > Error:
  1917. 218.23 s > 0: IR profiling requested arbitrary precision but received a quad-precision result
  1918. 218.23 s >
  1919. 218.23 s > Location:
  1920. 218.23 s > crates/gammalooprs/src/integrands/process/ir.rs:2123
  1921. 218.23 s >
  1922. 218.23 s > ━━━━━━━━━━━━━━━━━━━━━━━━━━━━━━━━━━ BACKTRACE ━━━━━━━━━━━━━━━━━━━━━━━━━━━━━━━━━━━
  1923. 218.23 s > 1: <color_eyre[bb06c27fa12d52c3]::config::EyreHook>::into_eyre_hook::{closure#0}<unknown>
  1924. 218.23 s > at <unknown source file>:<unknown line>
  1925. 218.23 s > 2: eyre[9f660d63ab6a72c5]::capture_handler<unknown>
  1926. 218.23 s > at <unknown source file>:<unknown line>
  1927. 218.23 s > 3: eyre[9f660d63ab6a72c5]::private::format_err<unknown>
  1928. 218.23 s > at <unknown source file>:<unknown line>
  1929. 218.23 s > 4: gammalooprs[1b273202b0029755]::integrands::process::ir::evaluate_profile_momentum_point_arb::<gammalooprs[1b273202b0029755]::integrands::process::amplitude::AmplitudeIntegrand><unknown>
  1930. 218.23 s > at <unknown source file>:<unknown line>
  1931. 218.23 s > 5: <gammalooprs[1b273202b0029755]::integrands::process::amplitude::AmplitudeIntegrand>::test_single_ir_limit_impl<unknown>
  1932. 218.23 s > at <unknown source file>:<unknown line>
  1933. 218.23 s > 6: gammalooprs[1b273202b0029755]::integrands::process::ir::run_ir_profile::<gammalooprs[1b273202b0029755]::integrands::process::amplitude::AmplitudeIntegrand, <gammalooprs[1b273202b0029755]::integrands::process::amplitude::AmplitudeIntegrand>::enumerate_ir_limits, <gammalooprs[1b273202b0029755]::integrands::process::amplitude::AmplitudeIntegrand>::graph_cut_definitions, <gammalooprs[1b273202b0029755]::integrands::process::amplitude::AmplitudeIntegrand>::test_single_ir_limit_impl><unknown>
  1934. 218.23 s > at <unknown source file>:<unknown line>
  1935. 218.23 s > 7: <gammalooprs[1b273202b0029755]::integrands::process::amplitude::AmplitudeIntegrand>::test_ir<unknown>
  1936. 218.23 s > at <unknown source file>:<unknown line>
  1937. 218.23 s > 8: <gammaloop_api[9fdde70dfc7501ea]::commands::profile::Profile>::run<unknown>
  1938. 218.23 s > at <unknown source file>:<unknown line>
  1939. 218.23 s > 9: test_runs[928b8788563090d0]::profile_bulk::scalar_self_energy_amp_bulk_profile_passes<unknown>
  1940. 218.23 s > at <unknown source file>:<unknown line>
  1941. 218.23 s > 10: <test_runs[928b8788563090d0]::profile_bulk::scalar_self_energy_amp_bulk_profile_passes::{closure#0} as core[8c5ac2f034688f9a]::ops::function::FnOnce<()>>::call_once<unknown>
  1942. 218.23 s > at <unknown source file>:<unknown line>
  1943. 218.23 s > 11: test[7974841f8dbd3561]::__rust_begin_short_backtrace::<core[8c5ac2f034688f9a]::result::Result<(), alloc[93e694a8365d93dd]::string::String>, fn() -> core[8c5ac2f034688f9a]::result::Result<(), alloc[93e694a8365d93dd]::string::String>><unknown>
  1944. 218.23 s > at <unknown source file>:<unknown line>
  1945. 218.23 s > 12: test[7974841f8dbd3561]::run_test::{closure#0}<unknown>
  1946. 218.23 s > at <unknown source file>:<unknown line>
  1947. 218.23 s > 13: std[5167731717db2e51]::sys::backtrace::__rust_begin_short_backtrace::<test[7974841f8dbd3561]::run_test::{closure#1}, ()><unknown>
  1948. 218.23 s > at <unknown source file>:<unknown line>
  1949. 218.23 s > 14: <std[5167731717db2e51]::thread::lifecycle::spawn_unchecked<test[7974841f8dbd3561]::run_test::{closure#1}, ()>::{closure#1} as core[8c5ac2f034688f9a]::ops::function::FnOnce<()>>::call_once::{shim:vtable#0}<unknown>
  1950. 218.23 s > at <unknown source file>:<unknown line>
  1951. 218.23 s > 15: <std[5167731717db2e51]::sys::thread::unix::Thread>::new::thread_start<unknown>
  1952. 218.23 s > at <unknown source file>:<unknown line>
  1953. 218.23 s > 16: start_thread<unknown>
  1954. 218.23 s > at <unknown source file>:<unknown line>
  1955. 218.23 s > 17: __clone3<unknown>
  1956. 218.23 s > at <unknown source file>:<unknown line>
  1957. 218.23 s >
  1958. 218.23 s > Run with COLORBT_SHOW_HIDDEN=1 environment variable to disable frame filtering.
  1959. 218.23 s > Run with RUST_BACKTRACE=full to include source snippets.
  1960. 218.23 s > Warning: SpanTrace capture is Unsupported.
  1961. 218.23 s > Ensure that you've setup a tracing-error ErrorLayer and the semver versions are compatible
  1962. 218.23 s > system-out
  1963. 218.23 s > running 1 test
  1964. 218.23 s > test profile_bulk::scalar_self_energy_amp_bulk_profile_passes ... FAILED
  1965. 218.23 s >
  1966. 218.23 s > failures:
  1967. 218.23 s >
  1968. 218.23 s > failures:
  1969. 218.23 s > profile_bulk::scalar_self_energy_amp_bulk_profile_passes
  1970. 218.23 s >
  1971. 218.23 s > test result: FAILED. 0 passed; 1 failed; 0 ignored; 0 measured; 82 filtered out; finished in 0.87s
  1972. 218.23 s > system-err
  1973. 218.23 s > [2026-09-02 14:31:42.639] @gammaloop_api::se... INFO : Running command import model ./assets/models/json/scalars/scalars.json
  1974. 218.23 s > [2026-09-02 14:31:42.639] @import::model INFO : Loading JSON model scalars-default from /build/source/assets/models/json/scalars/scalars
  1975. 218.23 s > [2026-09-02 14:31:42.649] @gammalooprs::model INFO : The following 2 external parameters were forced to zero by the restriction card:
  1976. 218.23 s > width_scalar_1, width_scalar_2
  1977. 218.23 s > [2026-09-02 14:31:42.650] @gammaloop_api::se... INFO : Running command import graphs ./tests/resources/graphs/scalar_self_energy_amp.dot
  1978. 218.23 s > [2026-09-02 14:31:42.650] @commands::import INFO : Loading graphs from '/build/source/tests/resources/graphs/scalar_self_energy_amp.dot'
  1979. 218.23 s > [2026-09-02 14:31:42.665] @gammaloop_api::se... INFO : Running command generate
  1980. 218.23 s > [2026-09-02 14:31:43.101] @commands::generate INFO :
  1981. 218.23 s > Integrand generation summary
  1982. 218.23 s > peak RAM 70.27 MiB | cores 1
  1983. 218.23 s > ╭───────────┬────────────────────────┬─────────┬─────────────┬─────────────┬────────────────┬─────────────╮
  1984. 218.23 s > │ integrand │ graph │ # evals │ expr build │ spenso │ symbolica eval │ compile │
  1985. 218.23 s > ├───────────┼────────────────────────┼─────────┼─────────────┼─────────────┼────────────────┼─────────────┤
  1986. 218.23 s > │ default │ scalar_self_energy_amp │ 6 │ 371ms (91%) │ 21ms (5.4%) │ 14ms (3.5%) │ 0ms (0.00%) │
  1987. 218.23 s > ├───────────┼────────────────────────┼─────────┼─────────────┼─────────────┼────────────────┼─────────────┤
  1988. 218.23 s > │ Total │ │ 6 │ 371ms (91%) │ 21ms (5.4%) │ 14ms (3.5%) │ 0ms (0.00%) │
  1989. 218.23 s > ╰───────────┴────────────────────────┴─────────┴─────────────┴─────────────┴────────────────┴─────────────╯
  1990. 218.23 s > [2026-09-02 14:31:43.103] @process::amplitude INFO : Input is above threshold: 2 existing threshold E-surfaces across 1/1 graph groups
  1991. 218.23 s > [2026-09-02 14:31:43.103] @process::amplitude INFO : overlap structure of group 0: [2: [2(1,5), 4(2,3,5)]]
  1992. 218.23 s > Error:
  1993. 218.23 s > 0: IR profiling requested arbitrary precision but received a quad-precision result
  1994. 218.23 s >
  1995. 218.23 s > Location:
  1996. 218.23 s > crates/gammalooprs/src/integrands/process/ir.rs:2123
  1997. 218.23 s >
  1998. 218.23 s > ━━━━━━━━━━━━━━━━━━━━━━━━━━━━━━━━━━ BACKTRACE ━━━━━━━━━━━━━━━━━━━━━━━━━━━━━━━━━━━
  1999. 218.23 s > 1: <color_eyre[bb06c27fa12d52c3]::config::EyreHook>::into_eyre_hook::{closure#0}<unknown>
  2000. 218.23 s > at <unknown source file>:<unknown line>
  2001. 218.23 s > 2: eyre[9f660d63ab6a72c5]::capture_handler<unknown>
  2002. 218.23 s > at <unknown source file>:<unknown line>
  2003. 218.23 s > 3: eyre[9f660d63ab6a72c5]::private::format_err<unknown>
  2004. 218.23 s > at <unknown source file>:<unknown line>
  2005. 218.23 s > 4: gammalooprs[1b273202b0029755]::integrands::process::ir::evaluate_profile_momentum_point_arb::<gammalooprs[1b273202b0029755]::integrands::process::amplitude::AmplitudeIntegrand><unknown>
  2006. 218.23 s > at <unknown source file>:<unknown line>
  2007. 218.23 s > 5: <gammalooprs[1b273202b0029755]::integrands::process::amplitude::AmplitudeIntegrand>::test_single_ir_limit_impl<unknown>
  2008. 218.23 s > at <unknown source file>:<unknown line>
  2009. 218.23 s > 6: gammalooprs[1b273202b0029755]::integrands::process::ir::run_ir_profile::<gammalooprs[1b273202b0029755]::integrands::process::amplitude::AmplitudeIntegrand, <gammalooprs[1b273202b0029755]::integrands::process::amplitude::AmplitudeIntegrand>::enumerate_ir_limits, <gammalooprs[1b273202b0029755]::integrands::process::amplitude::AmplitudeIntegrand>::graph_cut_definitions, <gammalooprs[1b273202b0029755]::integrands::process::amplitude::AmplitudeIntegrand>::test_single_ir_limit_impl><unknown>
  2010. 218.23 s > at <unknown source file>:<unknown line>
  2011. 218.23 s > 7: <gammalooprs[1b273202b0029755]::integrands::process::amplitude::AmplitudeIntegrand>::test_ir<unknown>
  2012. 218.23 s > at <unknown source file>:<unknown line>
  2013. 218.23 s > 8: <gammaloop_api[9fdde70dfc7501ea]::commands::profile::Profile>::run<unknown>
  2014. 218.23 s > at <unknown source file>:<unknown line>
  2015. 218.23 s > 9: test_runs[928b8788563090d0]::profile_bulk::scalar_self_energy_amp_bulk_profile_passes<unknown>
  2016. 218.23 s > at <unknown source file>:<unknown line>
  2017. 218.23 s > 10: <test_runs[928b8788563090d0]::profile_bulk::scalar_self_energy_amp_bulk_profile_passes::{closure#0} as core[8c5ac2f034688f9a]::ops::function::FnOnce<()>>::call_once<unknown>
  2018. 218.23 s > at <unknown source file>:<unknown line>
  2019. 218.23 s > 11: test[7974841f8dbd3561]::__rust_begin_short_backtrace::<core[8c5ac2f034688f9a]::result::Result<(), alloc[93e694a8365d93dd]::string::String>, fn() -> core[8c5ac2f034688f9a]::result::Result<(), alloc[93e694a8365d93dd]::string::String>><unknown>
  2020. 218.23 s > at <unknown source file>:<unknown line>
  2021. 218.23 s > 12: test[7974841f8dbd3561]::run_test::{closure#0}<unknown>
  2022. 218.23 s > at <unknown source file>:<unknown line>
  2023. 218.23 s > 13: std[5167731717db2e51]::sys::backtrace::__rust_begin_short_backtrace::<test[7974841f8dbd3561]::run_test::{closure#1}, ()><unknown>
  2024. 218.23 s > at <unknown source file>:<unknown line>
  2025. 218.23 s > 14: <std[5167731717db2e51]::thread::lifecycle::spawn_unchecked<test[7974841f8dbd3561]::run_test::{closure#1}, ()>::{closure#1} as core[8c5ac2f034688f9a]::ops::function::FnOnce<()>>::call_once::{shim:vtable#0}<unknown>
  2026. 218.23 s > at <unknown source file>:<unknown line>
  2027. 218.23 s > 15: <std[5167731717db2e51]::sys::thread::unix::Thread>::new::thread_start<unknown>
  2028. 218.23 s > at <unknown source file>:<unknown line>
  2029. 218.23 s > 16: start_thread<unknown>
  2030. 218.23 s > at <unknown source file>:<unknown line>
  2031. 218.23 s > 17: __clone3<unknown>
  2032. 218.23 s > at <unknown source file>:<unknown line>
  2033. 218.23 s >
  2034. 218.23 s > Run with COLORBT_SHOW_HIDDEN=1 environment variable to disable frame filtering.
  2035. 218.23 s > Run with RUST_BACKTRACE=full to include source snippets.
  2036. 218.23 s > Warning: SpanTrace capture is Unsupported.
  2037. 218.23 s > Ensure that you've setup a tracing-error ErrorLayer and the semver versions are compatible
  2038. 218.23 s >
  2039. 218.23 s > 7. gammaloop-integration-tests::uv::dod2_bubble_uv
  2040. 218.23 s > failure: test failure with exit code 101
  2041. 218.23 s > system-out
  2042. 218.23 s > running 1 test
  2043. 218.23 s > +-------------+-----------------+---------+--------+----------+-----------------------------------------------------------------------------------------------------------------------+-------+
  2044. 218.23 s > | case | check | graph | status | sigma | threshold | error |
  2045. 218.23 s > +-------------+-----------------+---------+--------+----------+-----------------------------------------------------------------------------------------------------------------------+-------+
  2046. 218.23 s > | dod2_bubble | uv_profile | - | FAIL | - | - | - |
  2047. 218.23 s > +-------------+-----------------+---------+--------+----------+-----------------------------------------------------------------------------------------------------------------------+-------+
  2048. 218.23 s > | dod2_bubble | m_uv.inspect | inspect | pass | - | best inspect relative delta 1.000e0 >= 1000*accuracy 1.000e-7 (accuracy=1.000e-10, exponent=+8.0, seed=0, probes=10) | - |
  2049. 218.23 s > +-------------+-----------------+---------+--------+----------+-----------------------------------------------------------------------------------------------------------------------+-------+
  2050. 218.23 s > | dod2_bubble | m_uv.integrated | GL0 | pass | 0.0sigma | compatible within 2sigma | - |
  2051. 218.23 s > +-------------+-----------------+---------+--------+----------+-----------------------------------------------------------------------------------------------------------------------+-------+
  2052. 218.23 s > | dod2_bubble | rls.inspect | inspect | pass | - | best inspect relative delta 2.822e-3 >= 1000*accuracy 1.000e-7 (accuracy=1.000e-10, exponent=+2.0, seed=1, probes=10) | - |
  2053. 218.23 s > +-------------+-----------------+---------+--------+----------+-----------------------------------------------------------------------------------------------------------------------+-------+
  2054. 218.23 s > | dod2_bubble | rls.integrated | GL0 | pass | 0.0sigma | compatible within 2sigma | - |
  2055. 218.23 s > +-------------+-----------------+---------+--------+----------+-----------------------------------------------------------------------------------------------------------------------+-------+
  2056. 218.23 s > | dod2_bubble | mu_r.inspect | inspect | pass | - | best inspect relative delta 6.951e-1 >= 1000*accuracy 1.000e-7 (accuracy=1.000e-10, exponent=+0.0, seed=0, probes=10) | - |
  2057. 218.23 s > +-------------+-----------------+---------+--------+----------+-----------------------------------------------------------------------------------------------------------------------+-------+
  2058. 218.23 s > | dod2_bubble | target | - | pass | - | 2sigma | - |
  2059. 218.23 s > +-------------+-----------------+---------+--------+----------+-----------------------------------------------------------------------------------------------------------------------+-------+
  2060. 218.23 s > test dod2_bubble_uv ... FAILED
  2061. 218.23 s >
  2062. 218.23 s > failures:
  2063. 218.23 s >
  2064. 218.23 s > failures:
  2065. 218.23 s > dod2_bubble_uv
  2066. 218.23 s >
  2067. 218.23 s > test result: FAILED. 0 passed; 1 failed; 0 ignored; 0 measured; 24 filtered out; finished in 55.87s
  2068. 218.23 s > system-err
  2069. 218.23 s > [2026-09-02 14:31:44.398] @gammaloop_api::se... INFO : Running command run generate
  2070. 218.23 s > [2026-09-02 14:31:44.398] @gammaloop_api::se... INFO : Starting command block generate
  2071. 218.23 s > [2026-09-02 14:31:44.398] @gammaloop_api::se... INFO : Running command import model scalars-default.json
  2072. 218.23 s > [2026-09-02 14:31:44.398] @import::model INFO : Loading built-in JSON model scalars-default
  2073. 218.23 s > [2026-09-02 14:31:44.405] @gammalooprs::model INFO : The following 2 external parameters were forced to zero by the restriction card:
  2074. 218.23 s > width_scalar_1, width_scalar_2
  2075. 218.23 s > [2026-09-02 14:31:44.406] @gammaloop_api::se... INFO : Running command remove processes
  2076. 218.23 s > [2026-09-02 14:31:44.406] @gammaloop_api::se... INFO : Running command set global kv global.generation.uv.generate_integrated=true
  2077. 218.23 s > [2026-09-02 14:31:44.407] @gammaloop_api::se... INFO : Running command import graphs ./tests/resources/graphs/scalar/dod2_bubble.dot -p bubble_dod2 -i scalar_bubble_below_thres
  2078. 218.23 s > [2026-09-02 14:31:44.407] @commands::import INFO : Loading graphs from '/build/source/tests/resources/graphs/scalar/dod2_bubble.dot'
  2079. 218.23 s > [2026-09-02 14:31:44.411] @gammaloop_api::se... INFO : Running command generate existing -p bubble_dod2 -i scalar_bubble_below_thres
  2080. 218.23 s > [2026-09-02 14:31:44.413] @approx::local_4d [{#uv, #inspect, #integrated}] DEBUG : Rescaled momenta expanded
  2081. 218.23 s > field value
  2082. 218.23 s > res n-terms: 1, byte size: 585,expr:
  2083. 218.23 s > -SCALAR_COUPLING²·q₀(αᵉ².¹)·q₀(αᵉ³.¹)·q₂(αᵉ².¹)·q₂(αᵉ³.¹)
  2084. 218.23 s > /(t²·denom(3,-q₀-q₂/t,mass_scalar_2²,-mass_scalar_2²+2·(q₀.q₂)/t+(q₂.q₂)/t²+(q₀.q₀))
  2085. 218.23 s > ·denom(2,q₂/t,mass_scalar_2²,-mass_scalar_2²+(q₂.q₂)/t²))
  2086. 218.23 s > [2026-09-02 14:31:44.419] @approx::local_4d [{#uv, #inspect, #integrated}] DEBUG : Rescaled momenta expanded
  2087. 218.23 s > field value
  2088. 218.23 s > res n-terms: 1, byte size: 3,expr:
  2089. 218.23 s > 1
  2090. 218.23 s > [2026-09-02 14:31:44.420] @approx::final_integrand[{#generation, #profile, #uv, #graph, #summary}] DEBUG : Computed global numerator
  2091. 218.23 s > field value
  2092. 218.23 s > global_num n-terms: 1, byte size: 4,expr:
  2093. 218.23 s > 1/2
  2094. 218.23 s > span build_3d{span_context=true graph=GL0 current=subgraph=0, topo_order=0, dod=0}
  2095. 218.23 s > [2026-09-02 14:31:44.423] @uv::approx [{#generation, #uv, #fourd}] DEBUG : Computing 4D
  2096. 218.23 s > field value
  2097. 218.23 s > simple subgraph(S_11,S_y)*Approx(subgraph(S_y,0)) of GL0
  2098. 218.23 s > span compute_4d{span_context=true graph=GL0 current=subgraph=y, topo_order=1, dod=2 given=subgraph=0, topo_order=0, dod=0 reduced=SubSet { set: BitVec<usize, bitvec::order::Lsb0> { addr: 0x7fffec017290, head: 000000, bits: 6, capacity: 64 } [0, 0, 1, 1, 1, 1], id: PhantomData<linnet::half_edge::involution::Hedge> }}
  2099. 218.23 s > [2026-09-02 14:31:44.424] @approx::local_4d [{#uv, #algebra, #integrated, #start}] DEBUG :
  2100. 218.23 s > field value
  2101. 218.23 s > integrand n-terms: 1, byte size: 409,expr:
  2102. 218.23 s > SCALAR_COUPLING²·(q₀(αᵉ³.¹)+q₃(αᵉ³.¹))·q₀(αᵉ².¹)·q₀(αᵉ³.¹)·q₂(αᵉ².¹)
  2103. 218.23 s > /(denom(2,q₂,mass_scalar_2²,-mass_scalar_2²+(q₂.q₂))·denom(3,q₃,mass_scalar_2²,-mass_scalar_2²+(q₃.q₃)))
  2104. 218.23 s > reduced y
  2105. 218.23 s > span grow{span_context=true current=subgraph=y, topo_order=1, dod=2 given=subgraph=0, topo_order=0, dod=0}
  2106. 218.23 s > [2026-09-02 14:31:44.424] @approx::local_4d [{#uv, #inspect, #integrated}] DEBUG : Rescaled momenta expanded
  2107. 218.23 s > field value
  2108. 218.23 s > res n-terms: 1, byte size: 585,expr:
  2109. 218.23 s > -SCALAR_COUPLING²·q₀(αᵉ².¹)·q₀(αᵉ³.¹)·q₂(αᵉ².¹)·q₂(αᵉ³.¹)
  2110. 218.23 s > /(t²·denom(3,-q₀-q₂/t,mass_scalar_2²,-mass_scalar_2²+2·(q₀.q₂)/t+(q₂.q₂)/t²+(q₀.q₀))
  2111. 218.23 s > ·denom(2,q₂/t,mass_scalar_2²,-mass_scalar_2²+(q₂.q₂)/t²))
  2112. 218.23 s > span t{span_context=true current=subgraph=y, topo_order=1, dod=2 given=subgraph=0, topo_order=0, dod=0}
  2113. 218.23 s > [2026-09-02 14:31:44.424] @approx::local_4d [{#uv, #integrated, #rescaled}] DEBUG : Rescaled expanded
  2114. 218.23 s > field value
  2115. 218.23 s > n_loops 1
  2116. 218.23 s > res n-terms: 1, byte size: 707,expr:
  2117. 218.23 s > -SCALAR_COUPLING²·q₀(αᵉ².¹)·q₀(αᵉ³.¹)·q₂(αᵉ².¹)·q₂(αᵉ³.¹)
  2118. 218.23 s > /(t²·denom(3,-q₂,mUVexp²+t²·mass_scalar_2²,-mUV²+t²·(-mass_scalar_2²+2·(q₀.q₂)/t+(q₂.q₂)/t²+(q₀.q₀))+t²·mUVexp²)
  2119. 218.23 s > ·denom(2,q₂,mUVexp²+t²·mass_scalar_2²,-mUV²+t²·(-mass_scalar_2²+(q₂.q₂)/t²)+t²·mUVexp²))
  2120. 218.23 s > span t{span_context=true current=subgraph=y, topo_order=1, dod=2 given=subgraph=0, topo_order=0, dod=0}
  2121. 218.23 s > [2026-09-02 14:31:44.426] @approx::local_4d [{#uv, #integrated, #series}] DEBUG : Series expanded
  2122. 218.23 s > field value
  2123. 218.23 s > res n-terms: 3, byte size: 1896,expr:
  2124. 218.23 s > (1/2·SCALAR_COUPLING²·(2·mUVexp²-2·mass_scalar_2²)/(denom(2,q₂,mUVexp²,-mUV²+(q₂.q₂))²·denom(3,-q₂,mUVexp²,-mUV²+(q₂.q₂)))
  2125. 218.23 s > -SCALAR_COUPLING²
  2126. 218.23 s > ·(-1/2·(2·mUVexp²-2·mass_scalar_2²+2·(q₀.q₀))/denom(3,-q₂,mUVexp²,-mUV²+(q₂.q₂))
  2127. 218.23 s > +4·(q₀.q₂)²/denom(3,-q₂,mUVexp²,-mUV²+(q₂.q₂))²
  2128. 218.23 s > )/(denom(2,q₂,mUVexp²,-mUV²+(q₂.q₂))·denom(3,-q₂,mUVexp²,-mUV²+(q₂.q₂)))
  2129. 218.23 s > )·q₀(αᵉ².¹)·q₀(αᵉ³.¹)·q₂(αᵉ².¹)·q₂(αᵉ³.¹)
  2130. 218.23 s > +2·SCALAR_COUPLING²·(q₀.q₂)·q₀(αᵉ².¹)·q₀(αᵉ³.¹)·q₂(αᵉ².¹)·q₂(αᵉ³.¹)
  2131. 218.23 s > /(t·denom(2,q₂,mUVexp²,-mUV²+(q₂.q₂))·denom(3,-q₂,mUVexp²,-mUV²+(q₂.q₂))²)
  2132. 218.23 s > -SCALAR_COUPLING²·q₀(αᵉ².¹)·q₀(αᵉ³.¹)·q₂(αᵉ².¹)·q₂(αᵉ³.¹)
  2133. 218.23 s > /(t²·denom(2,q₂,mUVexp²,-mUV²+(q₂.q₂))·denom(3,-q₂,mUVexp²,-mUV²+(q₂.q₂)))
  2134. 218.23 s > span t{span_context=true current=subgraph=y, topo_order=1, dod=2 given=subgraph=0, topo_order=0, dod=0}
  2135. 218.23 s > [2026-09-02 14:31:44.426] @approx::local_4d [{#uv, #integrated, #series}] DEBUG : Evaluated at t = 1
  2136. 218.23 s > field value
  2137. 218.23 s > res n-terms: 3, byte size: 1880,expr:
  2138. 218.23 s > (1/2·SCALAR_COUPLING²·(2·mUVexp²-2·mass_scalar_2²)/(denom(2,q₂,mUVexp²,-mUV²+(q₂.q₂))²·denom(3,-q₂,mUVexp²,-mUV²+(q₂.q₂)))
  2139. 218.23 s > -SCALAR_COUPLING²
  2140. 218.23 s > ·(-1/2·(2·mUVexp²-2·mass_scalar_2²+2·(q₀.q₀))/denom(3,-q₂,mUVexp²,-mUV²+(q₂.q₂))
  2141. 218.23 s > +4·(q₀.q₂)²/denom(3,-q₂,mUVexp²,-mUV²+(q₂.q₂))²
  2142. 218.23 s > )/(denom(2,q₂,mUVexp²,-mUV²+(q₂.q₂))·denom(3,-q₂,mUVexp²,-mUV²+(q₂.q₂)))
  2143. 218.23 s > )·q₀(αᵉ².¹)·q₀(αᵉ³.¹)·q₂(αᵉ².¹)·q₂(αᵉ³.¹)
  2144. 218.23 s > -SCALAR_COUPLING²·q₀(αᵉ².¹)·q₀(αᵉ³.¹)·q₂(αᵉ².¹)·q₂(αᵉ³.¹)
  2145. 218.23 s > /(denom(2,q₂,mUVexp²,-mUV²+(q₂.q₂))·denom(3,-q₂,mUVexp²,-mUV²+(q₂.q₂)))
  2146. 218.23 s > +2·SCALAR_COUPLING²·(q₀.q₂)·q₀(αᵉ².¹)·q₀(αᵉ³.¹)·q₂(αᵉ².¹)·q₂(αᵉ³.¹)
  2147. 218.23 s > /(denom(2,q₂,mUVexp²,-mUV²+(q₂.q₂))·denom(3,-q₂,mUVexp²,-mUV²+(q₂.q₂))²)
  2148. 218.23 s > span t{span_context=true current=subgraph=y, topo_order=1, dod=2 given=subgraph=0, topo_order=0, dod=0}
  2149. 218.23 s > [2026-09-02 14:31:44.428] @approx::local_4d [{#uv, #collect, #integrated}] DEBUG : After gamma chain collection
  2150. 218.23 s > field value
  2151. 218.23 s > expr n-terms: 3, byte size: 1880,expr:
  2152. 218.23 s > (1/2·SCALAR_COUPLING²·(2·mUVexp²-2·mass_scalar_2²)/(denom(2,q₂,mUVexp²,-mUV²+(q₂.q₂))²·denom(3,-q₂,mUVexp²,-mUV²+(q₂.q₂)))
  2153. 218.23 s > -SCALAR_COUPLING²
  2154. 218.23 s > ·(-1/2·(2·mUVexp²-2·mass_scalar_2²+2·(q₀.q₀))/denom(3,-q₂,mUVexp²,-mUV²+(q₂.q₂))
  2155. 218.23 s > +4·(q₀.q₂)²/denom(3,-q₂,mUVexp²,-mUV²+(q₂.q₂))²
  2156. 218.23 s > )/(denom(2,q₂,mUVexp²,-mUV²+(q₂.q₂))·denom(3,-q₂,mUVexp²,-mUV²+(q₂.q₂)))
  2157. 218.23 s > )·q₀(αᵉ².¹)·q₀(αᵉ³.¹)·q₂(αᵉ².¹)·q₂(αᵉ³.¹)
  2158. 218.23 s > -SCALAR_COUPLING²·q₀(αᵉ².¹)·q₀(αᵉ³.¹)·q₂(αᵉ².¹)·q₂(αᵉ³.¹)
  2159. 218.23 s > /(denom(2,q₂,mUVexp²,-mUV²+(q₂.q₂))·denom(3,-q₂,mUVexp²,-mUV²+(q₂.q₂)))
  2160. 218.23 s > +2·SCALAR_COUPLING²·(q₀.q₂)·q₀(αᵉ².¹)·q₀(αᵉ³.¹)·q₂(αᵉ².¹)·q₂(αᵉ³.¹)
  2161. 218.23 s > /(denom(2,q₂,mUVexp²,-mUV²+(q₂.q₂))·denom(3,-q₂,mUVexp²,-mUV²+(q₂.q₂))²)
  2162. 218.23 s > span t{span_context=true current=subgraph=y, topo_order=1, dod=2 given=subgraph=0, topo_order=0, dod=0}
  2163. 218.23 s > [2026-09-02 14:31:44.430] @approx::local_4d [{#profile, #uv, #collect, #integrated, #start, #trace}] DEBUG : After gamma schoonschip
  2164. 218.23 s > field value
  2165. 218.23 s > expr n-terms: 3, byte size: 1631,expr:
  2166. 218.23 s > (1/2·SCALAR_COUPLING²·(2·mUVexp²-2·mass_scalar_2²)/(denom(2,q₂,mUVexp²,-mUV²+(q₂.q₂))²·denom(3,-q₂,mUVexp²,-mUV²+(q₂.q₂)))
  2167. 218.23 s > -SCALAR_COUPLING²
  2168. 218.23 s > ·(-1/2·(2·mUVexp²-2·mass_scalar_2²+2·(q₀.q₀))/denom(3,-q₂,mUVexp²,-mUV²+(q₂.q₂))
  2169. 218.23 s > +4·(q₀.q₂)²/denom(3,-q₂,mUVexp²,-mUV²+(q₂.q₂))²
  2170. 218.23 s > )/(denom(2,q₂,mUVexp²,-mUV²+(q₂.q₂))·denom(3,-q₂,mUVexp²,-mUV²+(q₂.q₂)))
  2171. 218.23 s > )·(q₀.q₂)²
  2172. 218.23 s > -SCALAR_COUPLING²·(q₀.q₂)²/(denom(2,q₂,mUVexp²,-mUV²+(q₂.q₂))·denom(3,-q₂,mUVexp²,-mUV²+(q₂.q₂)))
  2173. 218.23 s > +2·SCALAR_COUPLING²·(q₀.q₂)·(q₀.q₂)²
  2174. 218.23 s > /(denom(2,q₂,mUVexp²,-mUV²+(q₂.q₂))·denom(3,-q₂,mUVexp²,-mUV²+(q₂.q₂))²)
  2175. 218.23 s > span t{span_context=true current=subgraph=y, topo_order=1, dod=2 given=subgraph=0, topo_order=0, dod=0}
  2176. 218.23 s > [2026-09-02 14:31:44.433] @approx::local_4d [{#profile, #uv, #collect, #integrated, #start, #trace}] DEBUG : After gamma collection
  2177. 218.23 s > field value
  2178. 218.23 s > expr n-terms: 1, byte size: 1347,expr:
  2179. 218.23 s > SCALAR_COUPLING²
  2180. 218.23 s > ·(-denom(2,q₂,mUVexp²,-mUV²+(q₂.q₂))·denom(3,-q₂,mUVexp²,-mUV²+(q₂.q₂))²
  2181. 218.23 s > +1/2·(2·mUVexp²-2·mass_scalar_2²)·denom(3,-q₂,mUVexp²,-mUV²+(q₂.q₂))²
  2182. 218.23 s > -(-1/2·(2·mUVexp²-2·mass_scalar_2²+2·(q₀.q₀))·denom(3,-q₂,mUVexp²,-mUV²+(q₂.q₂))+4·(q₀.q₂)²)
  2183. 218.23 s > ·denom(2,q₂,mUVexp²,-mUV²+(q₂.q₂))
  2184. 218.23 s > +2·(q₀.q₂)·denom(2,q₂,mUVexp²,-mUV²+(q₂.q₂))·denom(3,-q₂,mUVexp²,-mUV²+(q₂.q₂))
  2185. 218.23 s > )·(q₀.q₂)²/(denom(2,q₂,mUVexp²,-mUV²+(q₂.q₂))²·denom(3,-q₂,mUVexp²,-mUV²+(q₂.q₂))³)
  2186. 218.23 s > span t{span_context=true current=subgraph=y, topo_order=1, dod=2 given=subgraph=0, topo_order=0, dod=0}
  2187. 218.23 s > [2026-09-02 14:31:44.434] @approx::local_4d [{#profile, #uv, #gamma, #integrated, #start, #trace, #vakint}] DEBUG : After gamma simplification
  2188. 218.23 s > ... omitted 3263 more lines; see full nextest output above
  2189. 218.23 s >
  2190. 218.23 s > 8. gammaloop-integration-tests::uv::sunrise_scalar_1_uv
  2191. 218.23 s > failure: test failure with exit code 101
  2192. 218.23 s > system-out
  2193. 218.23 s > running 1 test
  2194. 218.23 s > test sunrise_scalar_1_uv has been running for over 60 seconds
  2195. 218.23 s > +------------------+------------------------+--------------+--------+----------+----------------------------------------------------------------------------------------------------------------------+-------+
  2196. 218.23 s > | case | check | graph | status | sigma | threshold | error |
  2197. 218.23 s > +------------------+------------------------+--------------+--------+----------+----------------------------------------------------------------------------------------------------------------------+-------+
  2198. 218.23 s > | sunrise_scalar_1 | uv_profile | - | FAIL | - | - | - |
  2199. 218.23 s > +------------------+------------------------+--------------+--------+----------+----------------------------------------------------------------------------------------------------------------------+-------+
  2200. 218.23 s > | sunrise_scalar_1 | m_uv.inspect | inspect | pass | - | best inspect relative delta 1.624e0 >= 1000*accuracy 1.000e-3 (accuracy=1.000e-6, exponent=+1.0, seed=1, probes=10) | - |
  2201. 218.23 s > +------------------+------------------------+--------------+--------+----------+----------------------------------------------------------------------------------------------------------------------+-------+
  2202. 218.23 s > | sunrise_scalar_1 | m_uv.integrated | sunrise | pass | 0.1sigma | compatible within 2sigma | - |
  2203. 218.23 s > +------------------+------------------------+--------------+--------+----------+----------------------------------------------------------------------------------------------------------------------+-------+
  2204. 218.23 s > | sunrise_scalar_1 | rls.inspect | inspect | pass | - | best inspect relative delta 8.682e-1 >= 1000*accuracy 1.000e-3 (accuracy=1.000e-6, exponent=+1.0, seed=1, probes=10) | - |
  2205. 218.23 s > +------------------+------------------------+--------------+--------+----------+----------------------------------------------------------------------------------------------------------------------+-------+
  2206. 218.23 s > | sunrise_scalar_1 | rls.integrated | sunrise | pass | 0.0sigma | compatible within 2sigma | - |
  2207. 218.23 s > +------------------+------------------------+--------------+--------+----------+----------------------------------------------------------------------------------------------------------------------+-------+
  2208. 218.23 s > | sunrise_scalar_1 | mu_r.inspect | inspect | pass | - | best inspect relative delta 1.752e0 >= 1000*accuracy 1.000e-3 (accuracy=1.000e-6, exponent=+1.0, seed=1, probes=10) | - |
  2209. 218.23 s > +------------------+------------------------+--------------+--------+----------+----------------------------------------------------------------------------------------------------------------------+-------+
  2210. 218.23 s > | sunrise_scalar_1 | integrated.relerr | integrated | pass | - | relative error 9.20% <= 10.00% | - |
  2211. 218.23 s > +------------------+------------------------+--------------+--------+----------+----------------------------------------------------------------------------------------------------------------------+-------+
  2212. 218.23 s > | sunrise_scalar_1 | m_uv.integrated.relerr | m_uv-shifted | pass | - | relative error 5.89% <= 10.00% | - |
  2213. 218.23 s > +------------------+------------------------+--------------+--------+----------+----------------------------------------------------------------------------------------------------------------------+-------+
  2214. 218.23 s > | sunrise_scalar_1 | target | - | pass | - | 2sigma | - |
  2215. 218.23 s > +------------------+------------------------+--------------+--------+----------+----------------------------------------------------------------------------------------------------------------------+-------+
  2216. 218.23 s > test sunrise_scalar_1_uv ... FAILED
  2217. 218.23 s >
  2218. 218.23 s > failures:
  2219. 218.23 s >
  2220. 218.23 s > failures:
  2221. 218.23 s > sunrise_scalar_1_uv
  2222. 218.23 s >
  2223. 218.23 s > test result: FAILED. 0 passed; 1 failed; 0 ignored; 0 measured; 24 filtered out; finished in 148.36s
  2224. 218.23 s > system-err
  2225. 218.23 s > [2026-09-02 14:31:52.531] @gammaloop_api::se... INFO : Running command run generate
  2226. 218.23 s > [2026-09-02 14:31:52.531] @gammaloop_api::se... INFO : Starting command block generate
  2227. 218.23 s > [2026-09-02 14:31:52.531] @gammaloop_api::se... INFO : Running command import model scalars-default.json
  2228. 218.23 s > [2026-09-02 14:31:52.531] @import::model INFO : Loading built-in JSON model scalars-default
  2229. 218.23 s > [2026-09-02 14:31:52.544] @gammalooprs::model INFO : The following 2 external parameters were forced to zero by the restriction card:
  2230. 218.23 s > width_scalar_1, width_scalar_2
  2231. 218.23 s > [2026-09-02 14:31:52.545] @gammaloop_api::se... INFO : Running command remove processes
  2232. 218.23 s > [2026-09-02 14:31:52.547] @gammaloop_api::se... INFO : Running command set global kv global.generation.uv.generate_integrated=true
  2233. 218.23 s > [2026-09-02 14:31:52.549] @gammaloop_api::se... INFO : Running command import graphs ./tests/resources/graphs/scalar_sunrise.dot -p sunrise_scalar_1 -i scalar_sunrise
  2234. 218.23 s > [2026-09-02 14:31:52.549] @commands::import INFO : Loading graphs from '/build/source/tests/resources/graphs/scalar_sunrise.dot'
  2235. 218.23 s > [2026-09-02 14:31:52.563] @gammaloop_api::se... INFO : Running command generate existing -p sunrise_scalar_1 -i scalar_sunrise
  2236. 218.23 s > [2026-09-02 14:31:52.564] @approx::local_4d [{#uv, #inspect, #integrated}] DEBUG : Rescaled momenta expanded
  2237. 218.23 s > field value
  2238. 218.23 s > res n-terms: 1, byte size: 3,expr:
  2239. 218.23 s > 1
  2240. 218.23 s > [2026-09-02 14:31:52.568] @approx::local_4d [{#uv, #inspect, #integrated}] DEBUG : Rescaled momenta expanded
  2241. 218.23 s > field value
  2242. 218.23 s > res n-terms: 1, byte size: 611,expr:
  2243. 218.23 s > 1/(denom(1,q₁/t,mass_scalar_1²,-mass_scalar_1²+(q₁.q₁)/t²)
  2244. 218.23 s > ·denom(2,-q₀+q₃-q₁/t,mass_scalar_1²,
  2245. 218.23 s > -mass_scalar_1²+2·(q₀.q₁)/t-2·(q₁.q₃)/t+(q₁.q₁)/t²+(q₀.q₀)
  2246. 218.23 s > -2·(q₀.q₃)+(q₃.q₃)
  2247. 218.23 s > ))
  2248. 218.23 s > [2026-09-02 14:31:52.570] @approx::local_4d [{#uv, #inspect, #integrated}] DEBUG : Rescaled momenta expanded
  2249. 218.23 s > field value
  2250. 218.23 s > res n-terms: 1, byte size: 777,expr:
  2251. 218.23 s > 1/(denom(0,q₀/t,mass_scalar_1²,-mass_scalar_1²+(q₀.q₀)/t²)·denom(1,q₁/t,mass_scalar_1²,-mass_scalar_1²+(q₁.q₁)/t²)
  2252. 218.23 s > ·denom(2,q₄-q₀/t-q₁/t,mass_scalar_1²,
  2253. 218.23 s > -mass_scalar_1²-2·(q₀.q₄)/t-2·(q₁.q₄)/t+(q₀.q₀)/t²+2·(q₀.q₁)/t²
  2254. 218.23 s > +(q₁.q₁)/t²+(q₄.q₄)
  2255. 218.23 s > ))
  2256. 218.23 s > [2026-09-02 14:31:52.584] @approx::local_4d [{#uv, #inspect, #integrated}] DEBUG : Rescaled momenta expanded
  2257. 218.23 s > field value
  2258. 218.23 s > res n-terms: 1, byte size: 611,expr:
  2259. 218.23 s > 1/(denom(0,q₀/t,mass_scalar_1²,-mass_scalar_1²+(q₀.q₀)/t²)
  2260. 218.23 s > ·denom(2,-q₁+q₃-q₀/t,mass_scalar_1²,
  2261. 218.23 s > -mass_scalar_1²+2·(q₀.q₁)/t-2·(q₀.q₃)/t+(q₀.q₀)/t²+(q₁.q₁)
  2262. 218.23 s > -2·(q₁.q₃)+(q₃.q₃)
  2263. 218.23 s > ))
  2264. 218.23 s > [2026-09-02 14:31:52.586] @approx::local_4d [{#uv, #inspect, #integrated}] DEBUG : Rescaled momenta expanded
  2265. 218.23 s > field value
  2266. 218.23 s > res n-terms: 1, byte size: 611,expr:
  2267. 218.23 s > 1/(denom(0,q₀/t,mass_scalar_1²,-mass_scalar_1²+(q₀.q₀)/t²)
  2268. 218.23 s > ·denom(1,-q₂+q₃-q₀/t,mass_scalar_1²,
  2269. 218.23 s > -mass_scalar_1²+2·(q₀.q₂)/t-2·(q₀.q₃)/t+(q₀.q₀)/t²+(q₂.q₂)
  2270. 218.23 s > -2·(q₂.q₃)+(q₃.q₃)
  2271. 218.23 s > ))
  2272. 218.23 s > [2026-09-02 14:31:52.590] @approx::final_integrand[{#generation, #profile, #uv, #graph, #summary}] DEBUG : Computed global numerator
  2273. 218.23 s > field value
  2274. 218.23 s > global_num n-terms: 1, byte size: 3,expr:
  2275. 218.23 s > 1
  2276. 218.23 s > span build_3d{span_context=true graph=sunrise current=subgraph=0, topo_order=0, dod=0}
  2277. 218.23 s > [2026-09-02 14:31:52.593] @uv::approx [{#generation, #uv, #fourd}] DEBUG : Computing 4D
  2278. 218.23 s > field value
  2279. 218.23 s > simple subgraph(S_47,S_3s)*Approx(subgraph(S_3s,0)) of sunrise
  2280. 218.23 s > span compute_4d{span_context=true graph=sunrise current=subgraph=3s, topo_order=1, dod=0 given=subgraph=0, topo_order=0, dod=0 reduced=SubSet { set: BitVec<usize, bitvec::order::Lsb0> { addr: 0x7fffec011050, head: 000000, bits: 8, capacity: 64 } [0, 0, 0, 0, 1, 1, 1, 1], id: PhantomData<linnet::half_edge::involution::Hedge> }}
  2281. 218.23 s > [2026-09-02 14:31:52.599] @approx::local_4d [{#uv, #algebra, #integrated, #start}] DEBUG :
  2282. 218.23 s > field value
  2283. 218.23 s > integrand n-terms: 1, byte size: 217,expr:
  2284. 218.23 s > 1/(denom(1,q₁,mass_scalar_1²,-mass_scalar_1²+(q₁.q₁))·denom(2,q₂,mass_scalar_1²,-mass_scalar_1²+(q₂.q₂)))
  2285. 218.23 s > reduced 3s
  2286. 218.23 s > span grow{span_context=true current=subgraph=3s, topo_order=1, dod=0 given=subgraph=0, topo_order=0, dod=0}
  2287. 218.23 s > [2026-09-02 14:31:52.599] @approx::local_4d [{#uv, #inspect, #integrated}] DEBUG : Rescaled momenta expanded
  2288. 218.23 s > field value
  2289. 218.23 s > res n-terms: 1, byte size: 611,expr:
  2290. 218.23 s > 1/(denom(1,q₁/t,mass_scalar_1²,-mass_scalar_1²+(q₁.q₁)/t²)
  2291. 218.23 s > ·denom(2,-q₀+q₃-q₁/t,mass_scalar_1²,
  2292. 218.23 s > -mass_scalar_1²+2·(q₀.q₁)/t-2·(q₁.q₃)/t+(q₁.q₁)/t²+(q₀.q₀)
  2293. 218.23 s > -2·(q₀.q₃)+(q₃.q₃)
  2294. 218.23 s > ))
  2295. 218.23 s > span t{span_context=true current=subgraph=3s, topo_order=1, dod=0 given=subgraph=0, topo_order=0, dod=0}
  2296. 218.23 s > [2026-09-02 14:31:52.600] @approx::local_4d [{#uv, #integrated, #rescaled}] DEBUG : Rescaled expanded
  2297. 218.24 s > field value
  2298. 218.24 s > n_loops 1
  2299. 218.24 s > res n-terms: 1, byte size: 723,expr:
  2300. 218.24 s > 1/(denom(1,q₁,mUVexp²+t²·mass_scalar_1²,-mUV²+t²·(-mass_scalar_1²+(q₁.q₁)/t²)+t²·mUVexp²)
  2301. 218.24 s > ·denom(2,-q₁,mUVexp²+t²·mass_scalar_1²,
  2302. 218.24 s > -mUV²
  2303. 218.24 s > +t²
  2304. 218.24 s > ·(-mass_scalar_1²+2·(q₀.q₁)/t-2·(q₁.q₃)/t+(q₁.q₁)/t²+(q₀.q₀)
  2305. 218.24 s > -2·(q₀.q₃)+(q₃.q₃)
  2306. 218.24 s > )
  2307. 218.24 s > +t²·mUVexp²
  2308. 218.24 s > ))
  2309. 218.24 s > span t{span_context=true current=subgraph=3s, topo_order=1, dod=0 given=subgraph=0, topo_order=0, dod=0}
  2310. 218.24 s > [2026-09-02 14:31:52.605] @approx::local_4d [{#uv, #integrated, #series}] DEBUG : Series expanded
  2311. 218.24 s > field value
  2312. 218.24 s > res n-terms: 1, byte size: 223,expr:
  2313. 218.24 s > 1/(denom(1,q₁,mUVexp²,-mUV²+(q₁.q₁))·denom(2,-q₁,mUVexp²,-mUV²+(q₁.q₁)))
  2314. 218.24 s > span t{span_context=true current=subgraph=3s, topo_order=1, dod=0 given=subgraph=0, topo_order=0, dod=0}
  2315. 218.24 s > [2026-09-02 14:31:52.605] @approx::local_4d [{#uv, #integrated, #series}] DEBUG : Evaluated at t = 1
  2316. 218.24 s > field value
  2317. 218.24 s > res n-terms: 1, byte size: 223,expr:
  2318. 218.24 s > 1/(denom(1,q₁,mUVexp²,-mUV²+(q₁.q₁))·denom(2,-q₁,mUVexp²,-mUV²+(q₁.q₁)))
  2319. 218.24 s > span t{span_context=true current=subgraph=3s, topo_order=1, dod=0 given=subgraph=0, topo_order=0, dod=0}
  2320. 218.24 s > [2026-09-02 14:31:52.606] @approx::local_4d [{#uv, #collect, #integrated}] DEBUG : After gamma chain collection
  2321. 218.24 s > field value
  2322. 218.24 s > expr n-terms: 1, byte size: 223,expr:
  2323. 218.24 s > 1/(denom(1,q₁,mUVexp²,-mUV²+(q₁.q₁))·denom(2,-q₁,mUVexp²,-mUV²+(q₁.q₁)))
  2324. 218.24 s > span t{span_context=true current=subgraph=3s, topo_order=1, dod=0 given=subgraph=0, topo_order=0, dod=0}
  2325. 218.24 s > [2026-09-02 14:31:52.607] @approx::local_4d [{#profile, #uv, #collect, #integrated, #start, #trace}] DEBUG : After gamma schoonschip
  2326. 218.24 s > field value
  2327. 218.24 s > expr n-terms: 1, byte size: 223,expr:
  2328. 218.24 s > 1/(denom(1,q₁,mUVexp²,-mUV²+(q₁.q₁))·denom(2,-q₁,mUVexp²,-mUV²+(q₁.q₁)))
  2329. 218.24 s > span t{span_context=true current=subgraph=3s, topo_order=1, dod=0 given=subgraph=0, topo_order=0, dod=0}
  2330. 218.24 s > [2026-09-02 14:31:52.612] @approx::local_4d [{#profile, #uv, #collect, #integrated, #start, #trace}] DEBUG : After gamma collection
  2331. 218.24 s > field value
  2332. 218.24 s > expr n-terms: 1, byte size: 223,expr:
  2333. 218.24 s > 1/(denom(1,q₁,mUVexp²,-mUV²+(q₁.q₁))·denom(2,-q₁,mUVexp²,-mUV²+(q₁.q₁)))
  2334. 218.24 s > span t{span_context=true current=subgraph=3s, topo_order=1, dod=0 given=subgraph=0, topo_order=0, dod=0}
  2335. 218.24 s > [2026-09-02 14:31:52.612] @approx::local_4d [{#profile, #uv, #gamma, #integrated, #start, #trace, #vakint}] DEBUG : After gamma simplification
  2336. 218.24 s > field value
  2337. 218.24 s > expr n-terms: 1, byte size: 223,expr:
  2338. 218.24 s > 1/(denom(1,q₁,mUVexp²,-mUV²+(q₁.q₁))·denom(2,-q₁,mUVexp²,-mUV²+(q₁.q₁)))
  2339. 218.24 s > span t{span_context=true current=subgraph=3s, topo_order=1, dod=0 given=subgraph=0, topo_order=0, dod=0}
  2340. 218.24 s > [2026-09-02 14:31:52.614] @approx::local_4d [{#profile, #uv, #integrated, #schoonschip, #start, #trace, #vakint}] DEBUG : After Schoonschip net
  2341. 218.24 s > field value
  2342. 218.24 s > expr n-terms: 1, byte size: 223,expr:
  2343. 218.24 s > 1/(denom(1,q₁,mUVexp²,-mUV²+(q₁.q₁))·denom(2,-q₁,mUVexp²,-mUV²+(q₁.q₁)))
  2344. 218.24 s > ... omitted 20090 more lines; see full nextest output above
  2345. 218.24 s >
  2346. 218.24 s > 9. gammaloop-integration-tests::uv::se1l_uv
  2347. 218.24 s > failure: test failure with exit code 101
  2348. 218.24 s > system-out
  2349. 218.24 s > running 1 test
  2350. 218.24 s > test se1l_uv has been running for over 60 seconds
  2351. 218.24 s > +------+-----------------+---------+--------+----------+-----------------------------------------------------------------------------------------------------------------------+-------+
  2352. 218.24 s > | case | check | graph | status | sigma | threshold | error |
  2353. 218.24 s > +------+-----------------+---------+--------+----------+-----------------------------------------------------------------------------------------------------------------------+-------+
  2354. 218.24 s > | se1l | uv_profile | - | FAIL | - | - | - |
  2355. 218.24 s > +------+-----------------+---------+--------+----------+-----------------------------------------------------------------------------------------------------------------------+-------+
  2356. 218.24 s > | se1l | m_uv.inspect | inspect | pass | - | best inspect relative delta 1.097e-1 >= 1000*accuracy 1.000e-7 (accuracy=1.000e-10, exponent=+2.0, seed=1, probes=10) | - |
  2357. 218.24 s > +------+-----------------+---------+--------+----------+-----------------------------------------------------------------------------------------------------------------------+-------+
  2358. 218.24 s > | se1l | m_uv.integrated | se1l | pass | 0.1sigma | compatible within 2sigma | - |
  2359. 218.24 s > +------+-----------------+---------+--------+----------+-----------------------------------------------------------------------------------------------------------------------+-------+
  2360. 218.24 s > | se1l | rls.inspect | inspect | pass | - | best inspect relative delta 4.499e-2 >= 1000*accuracy 1.000e-7 (accuracy=1.000e-10, exponent=+2.0, seed=1, probes=10) | - |
  2361. 218.24 s > +------+-----------------+---------+--------+----------+-----------------------------------------------------------------------------------------------------------------------+-------+
  2362. 218.24 s > | se1l | rls.integrated | se1l | pass | 0.0sigma | compatible within 2sigma | - |
  2363. 218.24 s > +------+-----------------+---------+--------+----------+-----------------------------------------------------------------------------------------------------------------------+-------+
  2364. 218.24 s > | se1l | mu_r.inspect | inspect | pass | - | best inspect relative delta 1.424e-1 >= 1000*accuracy 1.000e-7 (accuracy=1.000e-10, exponent=+2.0, seed=1, probes=10) | - |
  2365. 218.24 s > +------+-----------------+---------+--------+----------+-----------------------------------------------------------------------------------------------------------------------+-------+
  2366. 218.24 s > | se1l | target | - | pass | - | 2sigma | - |
  2367. 218.24 s > +------+-----------------+---------+--------+----------+-----------------------------------------------------------------------------------------------------------------------+-------+
  2368. 218.24 s > test se1l_uv ... FAILED
  2369. 218.24 s >
  2370. 218.24 s > failures:
  2371. 218.24 s >
  2372. 218.24 s > failures:
  2373. 218.24 s > se1l_uv
  2374. 218.24 s >
  2375. 218.24 s > test result: FAILED. 0 passed; 1 failed; 0 ignored; 0 measured; 24 filtered out; finished in 170.45s
  2376. 218.24 s > system-err
  2377. 218.24 s > [2026-09-02 14:31:50.513] @gammaloop_api::se... INFO : Running command run generate
  2378. 218.24 s > [2026-09-02 14:31:50.513] @gammaloop_api::se... INFO : Starting command block generate
  2379. 218.24 s > [2026-09-02 14:31:50.513] @gammaloop_api::se... INFO : Running command import model sm-default
  2380. 218.24 s > [2026-09-02 14:31:50.513] @import::model INFO : Loading built-in JSON model sm-default
  2381. 218.24 s > [2026-09-02 14:31:50.590] @gammalooprs::model INFO : The following 11 external parameters were forced to zero by the restriction card:
  2382. 218.24 s > lamWS, AWS, rhoWS, etaWS, ymc, yme, ymm, MC, Me, MM, WTau
  2383. 218.24 s > [2026-09-02 14:31:50.590] @gammalooprs::model INFO : The following 34 vertex rules were removed by the restriction card:
  2384. 218.24 s > V_82 -> (c~, d, G+) | V_83 -> (t~, d, G+) | V_84 -> (c~, s, G+) | V_85 -> (t~, s, G+) | V_86 -> (u~, b, G+) | V_87 -> (c~, b, G+) | V_90 -> (c~, d, W+) | V_91 -> (t~, d, W+) | V_92 -> (u~, s, W+) | V_94 -> (t~, s, W+) | V_95 -> (u~, b, W+) | V_96 -> (c~, b, W+) | V_101 -> (e+, e-, G0) | V_102 -> (mu+, mu-, G0) | V_104 -> (e+, e-, H) | V_105 -> (mu+, mu-, H) | V_110 -> (ve~, e-, G+) | V_111 -> (vm~, mu-, G+) | V_116 -> (b~, u, G-) | V_117 -> (d~, c, G-) | V_118 -> (s~, c, G-) | V_119 -> (b~, c, G-) | V_120 -> (d~, t, G-) | V_121 -> (s~, t, G-) | V_124 -> (s~, u, W-) | V_125 -> (b~, u, W-) | V_126 -> (d~, c, W-) | V_128 -> (b~, c, W-) | V_129 -> (d~, t, W-) | V_130 -> (s~, t, W-) | V_138 -> (c~, c, G0) | V_140 -> (c~, c, H) | V_145 -> (e+, ve, G-) | V_146 -> (mu+, vm, G-)
  2385. 218.24 s > [2026-09-02 14:31:50.590] @gammalooprs::model INFO : The following 36 couplings were removed by the restriction card:
  2386. 218.24 s > GC_13, GC_14, GC_16, GC_17, GC_18, GC_19, GC_20, GC_22, GC_23, GC_24, GC_25, GC_26, GC_28, GC_29, GC_42, GC_43, GC_44, GC_46, GC_47, GC_48, GC_84, GC_85, GC_86, GC_87, GC_88, GC_89, GC_90, GC_91, GC_92, GC_93, GC_101, GC_102, GC_103, GC_105, GC_106, GC_107
  2387. 218.24 s > [2026-09-02 14:31:50.591] @gammaloop_api::se... INFO : Running command remove processes
  2388. 218.24 s > [2026-09-02 14:31:50.591] @gammaloop_api::se... INFO : Running command set global kv global.generation.uv.generate_integrated=true
  2389. 218.24 s > [2026-09-02 14:31:50.592] @gammaloop_api::se... INFO : Running command import graphs ./tests/resources/graphs/uv_tests/se1l.dot -p se1l -i se1l
  2390. 218.24 s > [2026-09-02 14:31:50.592] @commands::import INFO : Loading graphs from '/build/source/tests/resources/graphs/uv_tests/se1l.dot'
  2391. 218.24 s > [2026-09-02 14:31:50.597] @gammaloop_api::se... INFO : Running command generate existing -p se1l -i se1l
  2392. 218.24 s > [2026-09-02 14:31:52.091] @commands::generate INFO :
  2393. 218.24 s > Integrand generation summary
  2394. 218.24 s > peak RAM 90.25 MiB | cores 1
  2395. 218.24 s > ╭───────────┬───────┬─────────┬─────────────┬─────────────┬────────────────┬─────────────╮
  2396. 218.24 s > │ integrand │ graph │ # evals │ expr build │ spenso │ symbolica eval │ compile │
  2397. 218.24 s > ├───────────┼───────┼─────────┼─────────────┼─────────────┼────────────────┼─────────────┤
  2398. 218.24 s > │ se1l │ se1l │ 5 │ 1.24s (88%) │ 60ms (4.3%) │ 107ms (7.6%) │ 0ms (0.00%) │
  2399. 218.24 s > ├───────────┼───────┼─────────┼─────────────┼─────────────┼────────────────┼─────────────┤
  2400. 218.24 s > │ Total │ │ 5 │ 1.24s (88%) │ 60ms (4.3%) │ 107ms (7.6%) │ 0ms (0.00%) │
  2401. 218.24 s > ╰───────────┴───────┴─────────┴─────────────┴─────────────┴────────────────┴─────────────╯
  2402. 218.24 s > [2026-09-02 14:31:52.092] @gammaloop_api::se... INFO : Running command set process -p se1l -i se1l kv general.m_uv=0.2
  2403. 218.24 s > [2026-09-02 14:31:52.093] @gammaloop_api::se... INFO : Running command set process -p se1l -i se1l kv general.mu_r=0.2
  2404. 218.24 s > [2026-09-02 14:31:52.098] @gammaloop_api::se... INFO : Running command set process -p se1l -i se1l kv general.renormalization_localization_scale=0.2
  2405. 218.24 s > [2026-09-02 14:31:52.099] @gammaloop_api::se... INFO : Running command duplicate integrand -p se1l -i se1l --output_process_name se1l --output_integrand_name se1l_muv_shifted
  2406. 218.24 s > [2026-09-02 14:31:52.105] @gammaloop_api::se... INFO : Running command set process -p se1l -i se1l_muv_shifted kv general.m_uv=0.5
  2407. 218.24 s > [2026-09-02 14:31:52.109] @gammaloop_api::se... INFO : Running command duplicate integrand -p se1l -i se1l --output_process_name se1l --output_integrand_name se1l_rls_shifted
  2408. 218.24 s > [2026-09-02 14:31:52.116] @gammaloop_api::se... INFO : Running command set process -p se1l -i se1l_rls_shifted kv general.renormalization_localization_scale=1
  2409. 218.24 s > [2026-09-02 14:31:52.117] @gammaloop_api::se... INFO : Running command duplicate integrand -p se1l -i se1l --output_process_name se1l --output_integrand_name se1l_mur_shifted
  2410. 218.24 s > [2026-09-02 14:31:52.127] @gammaloop_api::se... INFO : Running command set process -p se1l -i se1l_mur_shifted kv general.mu_r=0.8
  2411. 218.24 s > [2026-09-02 14:31:52.145] @process::amplitude WARNING : External state 0 ('g', PDG 21, helicity +) is off shell: p^2 = +2.5e5, expected m^2 = +0e0 (|Δ| = +2.5e5). Fixed-helicity spinor/vector/tensor external states may be ill-defined at this kinematic point.
  2412. 218.24 s > field value
  2413. 218.24 s > span warm_up{integrand.name=se1l}
  2414. 218.24 s > [2026-09-02 14:31:52.145] @process::amplitude WARNING : External state 1 ('g', PDG 21, helicity -) is off shell: p^2 = +2.5e5, expected m^2 = +0e0 (|Δ| = +2.5e5). Fixed-helicity spinor/vector/tensor external states may be ill-defined at this kinematic point.
  2415. 218.24 s > field value
  2416. 218.24 s > span warm_up{integrand.name=se1l}
  2417. 218.24 s > [2026-09-02 14:31:52.146] @process::amplitude INFO : Input is above threshold: 1 existing threshold E-surfaces across 1/1 graph groups
  2418. 218.24 s > field value
  2419. 218.24 s > existing_esurfaces 1
  2420. 218.24 s > group_count 1
  2421. 218.24 s > groups_above_threshold 1
  2422. 218.24 s > integrand se1l
  2423. 218.24 s > span warm_up{integrand.name=se1l}
  2424. 218.24 s > threshold_status above threshold
  2425. 218.24 s > [2026-09-02 14:31:52.146] @process::amplitude INFO : overlap structure of group 0: [1: [0(2,3)]]
  2426. 218.24 s > field value
  2427. 218.24 s > span warm_up{integrand.name=se1l}
  2428. 218.24 s > [2026-09-02 14:31:52.641] @commands::profile INFO :
  2429. 218.24 s > ╭───────┬──────┬──────────┬───────┬─────┬──────────┬───────────╮
  2430. 218.24 s > │ fixed │ → ∞ │ slope │ r2 │ DOD │ bare DOD │ inspect │
  2431. 218.24 s > ├───────┼──────┼──────────┼───────┼─────┼──────────┼───────────┤
  2432. 218.24 s > │ {} │ {e3} │ 1.639236 │ 0.904 │ 2 │ 2 │ arb retry │
  2433. 218.24 s > │ {} │ {e2} │ 1.698834 │ 0.902 │ 2 │ 2 │ arb retry │
  2434. 218.24 s > ╰───────┴──────┴──────────┴───────┴─────┴──────────┴───────────╯
  2435. 218.24 s > [2026-09-02 14:31:52.642] @commands::profile INFO :
  2436. 218.24 s > ╭───────┬──────┬─────────────┬──────────┬───────┬─────┬──────────┬───────────╮
  2437. 218.24 s > │ fixed │ → ∞ │ orientation │ slope │ r2 │ DOD │ bare DOD │ inspect │
  2438. 218.24 s > ├───────┼──────┼─────────────┼──────────┼───────┼─────┼──────────┼───────────┤
  2439. 218.24 s > │ {} │ {e3} │ 00-+ │ 0.343429 │ 0.145 │ 0 │ 2 │ arb retry │
  2440. 218.24 s > │ {} │ {e3} │ 00+- │ 0.342577 │ 0.135 │ 0 │ 2 │ arb retry │
  2441. 218.24 s > │ {} │ {e2} │ 00-+ │ 0.385975 │ 0.161 │ 0 │ 2 │ arb retry │
  2442. 218.24 s > │ {} │ {e2} │ 00+- │ 0.384920 │ 0.192 │ 0 │ 2 │ arb retry │
  2443. 218.24 s > ╰───────┴──────┴─────────────┴──────────┴───────┴─────┴──────────┴───────────╯
  2444. 218.24 s > [2026-09-02 14:31:52.649] @gammaloop_api::se... INFO : Running command set process kv integrator.target_relative_accuracy=0.001 integrator.n_increase=0 integrator.n_start=50000 integrator.n_max=400000 integrator.seed=1337
  2445. 218.24 s > [2026-09-02 14:31:52.651] @commands::integrate INFO : Created workspace directory at /build/source/tests/artifacts/se1l/integration_workspace_se1l
  2446. 218.24 s > [2026-09-02 14:31:52.688] @commands::integrate INFO : No integration state found, starting new integration
  2447. 218.24 s > [2026-09-02 14:31:52.688] @commands::integrate INFO : Gammaloop now integrates se1l@se1l, se1l@se1l_muv_shifted, se1l@se1l_rls_shifted
  2448. 218.24 s > [2026-09-02 14:31:52.688] @process::amplitude WARNING : External state 0 ('g', PDG 21, helicity +) is off shell: p^2 = +2.5e5, expected m^2 = +0e0 (|Δ| = +2.5e5). Fixed-helicity spinor/vector/tensor external states may be ill-defined at this kinematic point.
  2449. 218.24 s > field value
  2450. 218.24 s > span warm_up{integrand.name=se1l}
  2451. 218.24 s > [2026-09-02 14:31:52.688] @process::amplitude WARNING : External state 1 ('g', PDG 21, helicity -) is off shell: p^2 = +2.5e5, expected m^2 = +0e0 (|Δ| = +2.5e5). Fixed-helicity spinor/vector/tensor external states may be ill-defined at this kinematic point.
  2452. 218.24 s > field value
  2453. 218.24 s > span warm_up{integrand.name=se1l}
  2454. 218.24 s > [2026-09-02 14:31:52.689] @process::amplitude INFO : Input is above threshold: 1 existing threshold E-surfaces across 1/1 graph groups
  2455. 218.24 s > field value
  2456. 218.24 s > existing_esurfaces 1
  2457. 218.24 s > group_count 1
  2458. 218.24 s > groups_above_threshold 1
  2459. 218.24 s > integrand se1l
  2460. 218.24 s > span warm_up{integrand.name=se1l}
  2461. 218.24 s > threshold_status above threshold
  2462. 218.24 s > [2026-09-02 14:31:52.689] @process::amplitude INFO : overlap structure of group 0: [1: [0(2,3)]]
  2463. 218.24 s > field value
  2464. 218.24 s > span warm_up{integrand.name=se1l}
  2465. 218.24 s > [2026-09-02 14:31:52.690] @process::amplitude WARNING : External state 0 ('g', PDG 21, helicity +) is off shell: p^2 = +2.5e5, expected m^2 = +0e0 (|Δ| = +2.5e5). Fixed-helicity spinor/vector/tensor external states may be ill-defined at this kinematic point.
  2466. 218.24 s > field value
  2467. 218.24 s > span warm_up{integrand.name=se1l_muv_shifted}
  2468. 218.24 s > [2026-09-02 14:31:52.690] @process::amplitude WARNING : External state 1 ('g', PDG 21, helicity -) is off shell: p^2 = +2.5e5, expected m^2 = +0e0 (|Δ| = +2.5e5). Fixed-helicity spinor/vector/tensor external states may be ill-defined at this kinematic point.
  2469. 218.24 s > field value
  2470. 218.24 s > span warm_up{integrand.name=se1l_muv_shifted}
  2471. 218.24 s > [2026-09-02 14:31:52.691] @process::amplitude INFO : Input is above threshold: 1 existing threshold E-surfaces across 1/1 graph groups
  2472. 218.24 s > field value
  2473. 218.24 s > existing_esurfaces 1
  2474. 218.24 s > group_count 1
  2475. 218.24 s > groups_above_threshold 1
  2476. 218.24 s > integrand se1l_muv_shifted
  2477. 218.24 s > span warm_up{integrand.name=se1l_muv_shifted}
  2478. 218.24 s > threshold_status above threshold
  2479. 218.24 s > [2026-09-02 14:31:52.691] @process::amplitude INFO : overlap structure of group 0: [1: [0(2,3)]]
  2480. 218.24 s > field value
  2481. 218.24 s > span warm_up{integrand.name=se1l_muv_shifted}
  2482. 218.24 s > [2026-09-02 14:31:52.694] @process::amplitude WARNING : External state 0 ('g', PDG 21, helicity +) is off shell: p^2 = +2.5e5, expected m^2 = +0e0 (|Δ| = +2.5e5). Fixed-helicity spinor/vector/tensor external states may be ill-defined at this kinematic point.
  2483. 218.24 s > field value
  2484. 218.24 s > span warm_up{integrand.name=se1l_rls_shifted}
  2485. 218.24 s > [2026-09-02 14:31:52.694] @process::amplitude WARNING : External state 1 ('g', PDG 21, helicity -) is off shell: p^2 = +2.5e5, expected m^2 = +0e0 (|Δ| = +2.5e5). Fixed-helicity spinor/vector/tensor external states may be ill-defined at this kinematic point.
  2486. 218.24 s > field value
  2487. 218.24 s > span warm_up{integrand.name=se1l_rls_shifted}
  2488. 218.24 s > [2026-09-02 14:31:52.694] @process::amplitude INFO : Input is above threshold: 1 existing threshold E-surfaces across 1/1 graph groups
  2489. 218.24 s > field value
  2490. 218.24 s > existing_esurfaces 1
  2491. 218.24 s > group_count 1
  2492. 218.24 s > groups_above_threshold 1
  2493. 218.24 s > integrand se1l_rls_shifted
  2494. 218.24 s > span warm_up{integrand.name=se1l_rls_shifted}
  2495. 218.24 s > threshold_status above threshold
  2496. 218.24 s > ... omitted 1410 more lines; see full nextest output above
  2497. 218.24 s > =========================================
  2498. 218.24 s For full logs, run:
  2499. 218.24 s nix log /nix/store/zpyfjihmv7i6ghxwmb5sjv51y6brg4wy-gammaloop-nextest-integration.drv
  2500. 218.59 s [0 built (1 failed)]Run failed.